lucene-dev mailing list archives

Site index · List index
Message view « Date » · « Thread »
Top « Date » · « Thread »
From Policeman Jenkins Server <jenk...@thetaphi.de>
Subject [JENKINS-EA] Lucene-Solr-master-Windows (32bit/jdk-9-ea+181) - Build # 6839 - Still Unstable!
Date Tue, 22 Aug 2017 12:36:57 GMT
Build: https://jenkins.thetaphi.de/job/Lucene-Solr-master-Windows/6839/
Java: 32bit/jdk-9-ea+181 -client -XX:+UseG1GC --illegal-access=deny

2 tests failed.
FAILED:  org.apache.solr.cloud.CdcrBootstrapTest.testBootstrapWithContinousIndexingOnSourceCluster

Error Message:
Document mismatch on target after sync expected:<2000> but was:<0>

Stack Trace:
java.lang.AssertionError: Document mismatch on target after sync expected:<2000> but
was:<0>
	at __randomizedtesting.SeedInfo.seed([F2B60B832A0606C:DB6E2BE1D5F6D397]:0)
	at org.junit.Assert.fail(Assert.java:93)
	at org.junit.Assert.failNotEquals(Assert.java:647)
	at org.junit.Assert.assertEquals(Assert.java:128)
	at org.junit.Assert.assertEquals(Assert.java:472)
	at org.apache.solr.cloud.CdcrBootstrapTest.testBootstrapWithContinousIndexingOnSourceCluster(CdcrBootstrapTest.java:309)
	at java.base/jdk.internal.reflect.NativeMethodAccessorImpl.invoke0(Native Method)
	at java.base/jdk.internal.reflect.NativeMethodAccessorImpl.invoke(NativeMethodAccessorImpl.java:62)
	at java.base/jdk.internal.reflect.DelegatingMethodAccessorImpl.invoke(DelegatingMethodAccessorImpl.java:43)
	at java.base/java.lang.reflect.Method.invoke(Method.java:564)
	at com.carrotsearch.randomizedtesting.RandomizedRunner.invoke(RandomizedRunner.java:1713)
	at com.carrotsearch.randomizedtesting.RandomizedRunner$8.evaluate(RandomizedRunner.java:907)
	at com.carrotsearch.randomizedtesting.RandomizedRunner$9.evaluate(RandomizedRunner.java:943)
	at com.carrotsearch.randomizedtesting.RandomizedRunner$10.evaluate(RandomizedRunner.java:957)
	at com.carrotsearch.randomizedtesting.rules.SystemPropertiesRestoreRule$1.evaluate(SystemPropertiesRestoreRule.java:57)
	at org.apache.lucene.util.TestRuleSetupTeardownChained$1.evaluate(TestRuleSetupTeardownChained.java:49)
	at org.apache.lucene.util.AbstractBeforeAfterRule$1.evaluate(AbstractBeforeAfterRule.java:45)
	at org.apache.lucene.util.TestRuleThreadAndTestName$1.evaluate(TestRuleThreadAndTestName.java:48)
	at org.apache.lucene.util.TestRuleIgnoreAfterMaxFailures$1.evaluate(TestRuleIgnoreAfterMaxFailures.java:64)
	at org.apache.lucene.util.TestRuleMarkFailure$1.evaluate(TestRuleMarkFailure.java:47)
	at com.carrotsearch.randomizedtesting.rules.StatementAdapter.evaluate(StatementAdapter.java:36)
	at com.carrotsearch.randomizedtesting.ThreadLeakControl$StatementRunner.run(ThreadLeakControl.java:368)
	at com.carrotsearch.randomizedtesting.ThreadLeakControl.forkTimeoutingTask(ThreadLeakControl.java:817)
	at com.carrotsearch.randomizedtesting.ThreadLeakControl$3.evaluate(ThreadLeakControl.java:468)
	at com.carrotsearch.randomizedtesting.RandomizedRunner.runSingleTest(RandomizedRunner.java:916)
	at com.carrotsearch.randomizedtesting.RandomizedRunner$5.evaluate(RandomizedRunner.java:802)
	at com.carrotsearch.randomizedtesting.RandomizedRunner$6.evaluate(RandomizedRunner.java:852)
	at com.carrotsearch.randomizedtesting.RandomizedRunner$7.evaluate(RandomizedRunner.java:863)
	at com.carrotsearch.randomizedtesting.rules.StatementAdapter.evaluate(StatementAdapter.java:36)
	at com.carrotsearch.randomizedtesting.rules.SystemPropertiesRestoreRule$1.evaluate(SystemPropertiesRestoreRule.java:57)
	at org.apache.lucene.util.AbstractBeforeAfterRule$1.evaluate(AbstractBeforeAfterRule.java:45)
	at com.carrotsearch.randomizedtesting.rules.StatementAdapter.evaluate(StatementAdapter.java:36)
	at org.apache.lucene.util.TestRuleStoreClassName$1.evaluate(TestRuleStoreClassName.java:41)
	at com.carrotsearch.randomizedtesting.rules.NoShadowingOrOverridesOnMethodsRule$1.evaluate(NoShadowingOrOverridesOnMethodsRule.java:40)
	at com.carrotsearch.randomizedtesting.rules.NoShadowingOrOverridesOnMethodsRule$1.evaluate(NoShadowingOrOverridesOnMethodsRule.java:40)
	at com.carrotsearch.randomizedtesting.rules.StatementAdapter.evaluate(StatementAdapter.java:36)
	at com.carrotsearch.randomizedtesting.rules.StatementAdapter.evaluate(StatementAdapter.java:36)
	at org.apache.lucene.util.TestRuleAssertionsRequired$1.evaluate(TestRuleAssertionsRequired.java:53)
	at org.apache.lucene.util.TestRuleMarkFailure$1.evaluate(TestRuleMarkFailure.java:47)
	at org.apache.lucene.util.TestRuleIgnoreAfterMaxFailures$1.evaluate(TestRuleIgnoreAfterMaxFailures.java:64)
	at org.apache.lucene.util.TestRuleIgnoreTestSuites$1.evaluate(TestRuleIgnoreTestSuites.java:54)
	at com.carrotsearch.randomizedtesting.rules.StatementAdapter.evaluate(StatementAdapter.java:36)
	at com.carrotsearch.randomizedtesting.ThreadLeakControl$StatementRunner.run(ThreadLeakControl.java:368)
	at java.base/java.lang.Thread.run(Thread.java:844)


FAILED:  org.apache.solr.update.processor.UpdateRequestProcessorFactoryTest.testUpdateDistribChainSkipping

Error Message:
Tests must be run with INFO level logging otherwise LogUpdateProcessor isn't used and can't
be tested.

Stack Trace:
java.lang.AssertionError: Tests must be run with INFO level logging otherwise LogUpdateProcessor
isn't used and can't be tested.
	at __randomizedtesting.SeedInfo.seed([F2B60B832A0606C:7ECF9E6E444B47A0]:0)
	at org.junit.Assert.fail(Assert.java:93)
	at org.junit.Assert.assertTrue(Assert.java:43)
	at org.apache.solr.update.processor.UpdateRequestProcessorFactoryTest.testUpdateDistribChainSkipping(UpdateRequestProcessorFactoryTest.java:101)
	at java.base/jdk.internal.reflect.NativeMethodAccessorImpl.invoke0(Native Method)
	at java.base/jdk.internal.reflect.NativeMethodAccessorImpl.invoke(NativeMethodAccessorImpl.java:62)
	at java.base/jdk.internal.reflect.DelegatingMethodAccessorImpl.invoke(DelegatingMethodAccessorImpl.java:43)
	at java.base/java.lang.reflect.Method.invoke(Method.java:564)
	at com.carrotsearch.randomizedtesting.RandomizedRunner.invoke(RandomizedRunner.java:1713)
	at com.carrotsearch.randomizedtesting.RandomizedRunner$8.evaluate(RandomizedRunner.java:907)
	at com.carrotsearch.randomizedtesting.RandomizedRunner$9.evaluate(RandomizedRunner.java:943)
	at com.carrotsearch.randomizedtesting.RandomizedRunner$10.evaluate(RandomizedRunner.java:957)
	at com.carrotsearch.randomizedtesting.rules.SystemPropertiesRestoreRule$1.evaluate(SystemPropertiesRestoreRule.java:57)
	at org.apache.lucene.util.TestRuleSetupTeardownChained$1.evaluate(TestRuleSetupTeardownChained.java:49)
	at org.apache.lucene.util.AbstractBeforeAfterRule$1.evaluate(AbstractBeforeAfterRule.java:45)
	at org.apache.lucene.util.TestRuleThreadAndTestName$1.evaluate(TestRuleThreadAndTestName.java:48)
	at org.apache.lucene.util.TestRuleIgnoreAfterMaxFailures$1.evaluate(TestRuleIgnoreAfterMaxFailures.java:64)
	at org.apache.lucene.util.TestRuleMarkFailure$1.evaluate(TestRuleMarkFailure.java:47)
	at com.carrotsearch.randomizedtesting.rules.StatementAdapter.evaluate(StatementAdapter.java:36)
	at com.carrotsearch.randomizedtesting.ThreadLeakControl$StatementRunner.run(ThreadLeakControl.java:368)
	at com.carrotsearch.randomizedtesting.ThreadLeakControl.forkTimeoutingTask(ThreadLeakControl.java:817)
	at com.carrotsearch.randomizedtesting.ThreadLeakControl$3.evaluate(ThreadLeakControl.java:468)
	at com.carrotsearch.randomizedtesting.RandomizedRunner.runSingleTest(RandomizedRunner.java:916)
	at com.carrotsearch.randomizedtesting.RandomizedRunner$5.evaluate(RandomizedRunner.java:802)
	at com.carrotsearch.randomizedtesting.RandomizedRunner$6.evaluate(RandomizedRunner.java:852)
	at com.carrotsearch.randomizedtesting.RandomizedRunner$7.evaluate(RandomizedRunner.java:863)
	at com.carrotsearch.randomizedtesting.rules.StatementAdapter.evaluate(StatementAdapter.java:36)
	at com.carrotsearch.randomizedtesting.rules.SystemPropertiesRestoreRule$1.evaluate(SystemPropertiesRestoreRule.java:57)
	at org.apache.lucene.util.AbstractBeforeAfterRule$1.evaluate(AbstractBeforeAfterRule.java:45)
	at com.carrotsearch.randomizedtesting.rules.StatementAdapter.evaluate(StatementAdapter.java:36)
	at org.apache.lucene.util.TestRuleStoreClassName$1.evaluate(TestRuleStoreClassName.java:41)
	at com.carrotsearch.randomizedtesting.rules.NoShadowingOrOverridesOnMethodsRule$1.evaluate(NoShadowingOrOverridesOnMethodsRule.java:40)
	at com.carrotsearch.randomizedtesting.rules.NoShadowingOrOverridesOnMethodsRule$1.evaluate(NoShadowingOrOverridesOnMethodsRule.java:40)
	at com.carrotsearch.randomizedtesting.rules.StatementAdapter.evaluate(StatementAdapter.java:36)
	at com.carrotsearch.randomizedtesting.rules.StatementAdapter.evaluate(StatementAdapter.java:36)
	at org.apache.lucene.util.TestRuleAssertionsRequired$1.evaluate(TestRuleAssertionsRequired.java:53)
	at org.apache.lucene.util.TestRuleMarkFailure$1.evaluate(TestRuleMarkFailure.java:47)
	at org.apache.lucene.util.TestRuleIgnoreAfterMaxFailures$1.evaluate(TestRuleIgnoreAfterMaxFailures.java:64)
	at org.apache.lucene.util.TestRuleIgnoreTestSuites$1.evaluate(TestRuleIgnoreTestSuites.java:54)
	at com.carrotsearch.randomizedtesting.rules.StatementAdapter.evaluate(StatementAdapter.java:36)
	at com.carrotsearch.randomizedtesting.ThreadLeakControl$StatementRunner.run(ThreadLeakControl.java:368)
	at java.base/java.lang.Thread.run(Thread.java:844)




Build Log:
[...truncated 11134 lines...]
   [junit4] Suite: org.apache.solr.cloud.CdcrBootstrapTest
   [junit4]   2> Creating dataDir: C:\Users\jenkins\workspace\Lucene-Solr-master-Windows\solr\build\solr-core\test\J1\temp\solr.cloud.CdcrBootstrapTest_F2B60B832A0606C-001\init-core-data-001
   [junit4]   2> 516548 WARN  (SUITE-CdcrBootstrapTest-seed#[F2B60B832A0606C]-worker) [
   ] o.a.s.SolrTestCaseJ4 startTrackingSearchers: numOpens=54 numCloses=54
   [junit4]   2> 516560 ERROR (Thread-1037) [    ] o.a.z.s.ZooKeeperServer ZKShutdownHandler
is not registered, so ZooKeeper server won't take any action on ERROR or SHUTDOWN server state
changes
   [junit4]   2> 516667 ERROR (jetty-launcher-847-thread-1) [    ] o.a.s.u.StartupLoggingUtils
Missing Java Option solr.log.dir. Logging may be missing or incomplete.
   [junit4]   2> 516687 WARN  (NIOServerCxn.Factory:0.0.0.0/0.0.0.0:0) [    ] o.a.z.s.NIOServerCnxn
caught end of stream exception
   [junit4]   2> EndOfStreamException: Unable to read additional data from client sessionid
0x15e09b898510001, likely client has closed socket
   [junit4]   2> 	at org.apache.zookeeper.server.NIOServerCnxn.doIO(NIOServerCnxn.java:239)
   [junit4]   2> 	at org.apache.zookeeper.server.NIOServerCnxnFactory.run(NIOServerCnxnFactory.java:203)
   [junit4]   2> 	at java.base/java.lang.Thread.run(Thread.java:844)
   [junit4]   1> Target zkHost = 127.0.0.1:50804/solr
   [junit4]   2> 517145 ERROR (Thread-1047) [    ] o.a.z.s.ZooKeeperServer ZKShutdownHandler
is not registered, so ZooKeeper server won't take any action on ERROR or SHUTDOWN server state
changes
   [junit4]   2> 517252 ERROR (jetty-launcher-859-thread-1) [    ] o.a.s.u.StartupLoggingUtils
Missing Java Option solr.log.dir. Logging may be missing or incomplete.
   [junit4]   1> Adding 10 docs with commit=true, numDocs=100
   [junit4]   1> Adding 10 docs with commit=true, numDocs=200
   [junit4]   1> Adding 10 docs with commit=true, numDocs=300
   [junit4]   1> Adding 10 docs with commit=true, numDocs=400
   [junit4]   1> Adding 10 docs with commit=true, numDocs=500
   [junit4]   1> Adding 10 docs with commit=true, numDocs=600
   [junit4]   1> Adding 10 docs with commit=true, numDocs=700
   [junit4]   1> Adding 10 docs with commit=true, numDocs=800
   [junit4]   1> Adding 10 docs with commit=true, numDocs=900
   [junit4]   1> Adding 10 docs with commit=true, numDocs=1000
   [junit4]   2> 521228 WARN  (NIOServerCxn.Factory:0.0.0.0/0.0.0.0:0) [    ] o.a.z.s.NIOServerCnxn
caught end of stream exception
   [junit4]   2> EndOfStreamException: Unable to read additional data from client sessionid
0x15e09b89a9b0008, likely client has closed socket
   [junit4]   2> 	at org.apache.zookeeper.server.NIOServerCnxn.doIO(NIOServerCnxn.java:239)
   [junit4]   2> 	at org.apache.zookeeper.server.NIOServerCnxnFactory.run(NIOServerCnxnFactory.java:203)
   [junit4]   2> 	at java.base/java.lang.Thread.run(Thread.java:844)
   [junit4]   2> 521288 WARN  (zkCallback-866-thread-2) [    ] o.a.s.c.c.ZkStateReader
ZooKeeper watch triggered, but Solr cannot talk to ZK: [KeeperErrorCode = Session expired
for /live_nodes]
   [junit4]   2> 521292 ERROR (TEST-CdcrBootstrapTest.testConvertClusterToCdcrAndBootstrap-seed#[F2B60B832A0606C])
[    ] o.a.s.u.StartupLoggingUtils Missing Java Option solr.log.dir. Logging may be missing
or incomplete.
   [junit4]   2> 522812 WARN  (cdcr-update-log-synchronizer-2156-thread-1) [    ] o.a.s.h.CdcrUpdateLogSynchronizer
Caught unexpected exception
   [junit4]   2> org.apache.solr.client.solrj.impl.HttpSolrClient$RemoteSolrException:
Error from server at http://127.0.0.1:50863/solr/cdcr-source_shard1_replica_n1: SolrCore is
loading
   [junit4]   2> 	at org.apache.solr.client.solrj.impl.HttpSolrClient.executeMethod(HttpSolrClient.java:627)
   [junit4]   2> 	at org.apache.solr.client.solrj.impl.HttpSolrClient.request(HttpSolrClient.java:253)
   [junit4]   2> 	at org.apache.solr.client.solrj.impl.HttpSolrClient.request(HttpSolrClient.java:242)
   [junit4]   2> 	at org.apache.solr.client.solrj.SolrClient.request(SolrClient.java:1219)
   [junit4]   2> 	at org.apache.solr.handler.CdcrUpdateLogSynchronizer$UpdateLogSynchronisation.run(CdcrUpdateLogSynchronizer.java:147)
   [junit4]   2> 	at java.base/java.util.concurrent.Executors$RunnableAdapter.call(Executors.java:514)
   [junit4]   2> 	at java.base/java.util.concurrent.FutureTask.runAndReset(FutureTask.java:305)
   [junit4]   2> 	at java.base/java.util.concurrent.ScheduledThreadPoolExecutor$ScheduledFutureTask.run(ScheduledThreadPoolExecutor.java:300)
   [junit4]   2> 	at java.base/java.util.concurrent.ThreadPoolExecutor.runWorker(ThreadPoolExecutor.java:1167)
   [junit4]   2> 	at java.base/java.util.concurrent.ThreadPoolExecutor$Worker.run(ThreadPoolExecutor.java:641)
   [junit4]   2> 	at java.base/java.lang.Thread.run(Thread.java:844)
   [junit4]   1> -
   [junit4]   1> replica:core_node2 rstate:active live:true
   [junit4]   1> no one is recoverying
   [junit4]   2> 523065 ERROR (TEST-CdcrBootstrapTest.testConvertClusterToCdcrAndBootstrap-seed#[F2B60B832A0606C])
[    ] o.a.s.c.s.i.CloudSolrClient Request to collection cdcr-source failed due to (510) org.apache.solr.common.SolrException:
Could not find a healthy node to handle the request., retry? 0
   [junit4]   2> 523065 WARN  (TEST-CdcrBootstrapTest.testConvertClusterToCdcrAndBootstrap-seed#[F2B60B832A0606C])
[    ] o.a.s.c.s.i.CloudSolrClient Re-trying request to  collection(s) cdcr-source after stale
state error from server.
   [junit4]   2> 523079 WARN  (NIOServerCxn.Factory:0.0.0.0/0.0.0.0:0) [    ] o.a.z.s.NIOServerCnxn
caught end of stream exception
   [junit4]   2> EndOfStreamException: Unable to read additional data from client sessionid
0x15e09b898510006, likely client has closed socket
   [junit4]   2> 	at org.apache.zookeeper.server.NIOServerCnxn.doIO(NIOServerCnxn.java:239)
   [junit4]   2> 	at org.apache.zookeeper.server.NIOServerCnxnFactory.run(NIOServerCnxnFactory.java:203)
   [junit4]   2> 	at java.base/java.lang.Thread.run(Thread.java:844)
   [junit4]   1> Cdcr queue response: {responseHeader={status=0,QTime=3},queues={127.0.0.1:50804/solr={cdcr-target={queueSize=-1574961153,lastTimestamp=}}},tlogTotalSize=4773,tlogTotalCount=1,updateLogSynchronizer=stopped}
   [junit4]   2> 528785 WARN  (cdcr-bootstrap-status-885-thread-1) [    ] o.a.s.h.CdcrReplicatorManager
Cancelling waiting for bootstrap on target: cdcr-target shard: shard1 to complete
   [junit4]   2> 528793 WARN  (zkCallback-879-thread-1) [    ] o.a.s.c.c.ZkStateReader
ZooKeeper watch triggered, but Solr cannot talk to ZK: [KeeperErrorCode = Session expired
for /live_nodes]
   [junit4]   2> 528794 ERROR (TEST-CdcrBootstrapTest.testConvertClusterToCdcrAndBootstrap-seed#[F2B60B832A0606C])
[    ] o.a.z.s.ZooKeeperServer ZKShutdownHandler is not registered, so ZooKeeper server won't
take any action on ERROR or SHUTDOWN server state changes
   [junit4]   2> 528798 WARN  (Thread-1047) [    ] o.a.s.c.ZkTestServer Watch limit violations:

   [junit4]   2> Maximum concurrent create/delete watches above limit:
   [junit4]   2> 
   [junit4]   2> 	3	/solr/aliases.json
   [junit4]   2> 	3	/solr/clusterprops.json
   [junit4]   2> 	2	/solr/configs/cdcr-source
   [junit4]   2> 	2	/solr/security.json
   [junit4]   2> 
   [junit4]   2> Maximum concurrent data watches above limit:
   [junit4]   2> 
   [junit4]   2> 	10	/solr/collections/cdcr-source/state.json
   [junit4]   2> 	3	/solr/clusterstate.json
   [junit4]   2> 	2	/solr/collections/cdcr-source/cdcr/state/process
   [junit4]   2> 
   [junit4]   2> Maximum concurrent children watches above limit:
   [junit4]   2> 
   [junit4]   2> 	3	/solr/collections
   [junit4]   2> 	2	/solr/overseer/queue
   [junit4]   2> 	2	/solr/live_nodes
   [junit4]   2> 	2	/solr/overseer/collection-queue-work
   [junit4]   2> 
   [junit4]   2> 528888 ERROR (TEST-CdcrBootstrapTest.testConvertClusterToCdcrAndBootstrap-seed#[F2B60B832A0606C])
[    ] o.a.z.s.ZooKeeperServer ZKShutdownHandler is not registered, so ZooKeeper server won't
take any action on ERROR or SHUTDOWN server state changes
   [junit4]   2> 528944 WARN  (Thread-1037) [    ] o.a.s.c.ZkTestServer Watch limit violations:

   [junit4]   2> Maximum concurrent create/delete watches above limit:
   [junit4]   2> 
   [junit4]   2> 	3	/solr/aliases.json
   [junit4]   2> 	3	/solr/clusterprops.json
   [junit4]   2> 	2	/solr/configs/cdcr-target/managed-schema
   [junit4]   2> 	2	/solr/collections/cdcr-target/leaders/shard1/leader
   [junit4]   2> 
   [junit4]   2> Maximum concurrent data watches above limit:
   [junit4]   2> 
   [junit4]   2> 	6	/solr/collections/cdcr-target/state.json
   [junit4]   2> 	3	/solr/collections/cdcr-target/cdcr/state/process
   [junit4]   2> 	3	/solr/clusterstate.json
   [junit4]   2> 	2	/solr/collections/cdcr-target/cdcr/state/buffer
   [junit4]   2> 
   [junit4]   2> Maximum concurrent children watches above limit:
   [junit4]   2> 
   [junit4]   2> 	3	/solr/live_nodes
   [junit4]   2> 	3	/solr/collections
   [junit4]   2> 
   [junit4]   2> 529002 ERROR (Thread-1070) [    ] o.a.z.s.ZooKeeperServer ZKShutdownHandler
is not registered, so ZooKeeper server won't take any action on ERROR or SHUTDOWN server state
changes
   [junit4]   2> 529064 ERROR (jetty-launcher-888-thread-1) [    ] o.a.s.u.StartupLoggingUtils
Missing Java Option solr.log.dir. Logging may be missing or incomplete.
   [junit4]   2> 529197 WARN  (NIOServerCxn.Factory:0.0.0.0/0.0.0.0:0) [    ] o.a.z.s.NIOServerCnxn
caught end of stream exception
   [junit4]   2> EndOfStreamException: Unable to read additional data from client sessionid
0x15e09b8c8c90001, likely client has closed socket
   [junit4]   2> 	at org.apache.zookeeper.server.NIOServerCnxn.doIO(NIOServerCnxn.java:239)
   [junit4]   2> 	at org.apache.zookeeper.server.NIOServerCnxnFactory.run(NIOServerCnxnFactory.java:203)
   [junit4]   2> 	at java.base/java.lang.Thread.run(Thread.java:844)
   [junit4]   2> 529209 WARN  (NIOServerCxn.Factory:0.0.0.0/0.0.0.0:0) [    ] o.a.z.s.NIOServerCnxn
caught end of stream exception
   [junit4]   2> EndOfStreamException: Unable to read additional data from client sessionid
0x15e09b8c8c90002, likely client has closed socket
   [junit4]   2> 	at org.apache.zookeeper.server.NIOServerCnxn.doIO(NIOServerCnxn.java:239)
   [junit4]   2> 	at org.apache.zookeeper.server.NIOServerCnxnFactory.run(NIOServerCnxnFactory.java:203)
   [junit4]   2> 	at java.base/java.lang.Thread.run(Thread.java:844)
   [junit4]   1> Target zkHost = 127.0.0.1:50898/solr
   [junit4]   2> 529950 WARN  (NIOServerCxn.Factory:0.0.0.0/0.0.0.0:0) [    ] o.a.z.s.NIOServerCnxn
caught end of stream exception
   [junit4]   2> EndOfStreamException: Unable to read additional data from client sessionid
0x15e09b8c8c90005, likely client has closed socket
   [junit4]   2> 	at org.apache.zookeeper.server.NIOServerCnxn.doIO(NIOServerCnxn.java:239)
   [junit4]   2> 	at org.apache.zookeeper.server.NIOServerCnxnFactory.run(NIOServerCnxnFactory.java:203)
   [junit4]   2> 	at java.base/java.lang.Thread.run(Thread.java:844)
   [junit4]   2> 529990 ERROR (Thread-1083) [    ] o.a.z.s.ZooKeeperServer ZKShutdownHandler
is not registered, so ZooKeeper server won't take any action on ERROR or SHUTDOWN server state
changes
   [junit4]   2> 530152 ERROR (jetty-launcher-900-thread-1) [    ] o.a.s.u.StartupLoggingUtils
Missing Java Option solr.log.dir. Logging may be missing or incomplete.
   [junit4]   1> Adding 10 docs with commit=true, numDocs=100
   [junit4]   1> Adding 10 docs with commit=true, numDocs=200
   [junit4]   1> Adding 10 docs with commit=true, numDocs=300
   [junit4]   1> Adding 10 docs with commit=true, numDocs=400
   [junit4]   1> Adding 10 docs with commit=true, numDocs=500
   [junit4]   1> Adding 10 docs with commit=true, numDocs=600
   [junit4]   1> Adding 10 docs with commit=true, numDocs=700
   [junit4]   1> Adding 10 docs with commit=true, numDocs=800
   [junit4]   1> Adding 10 docs with commit=true, numDocs=900
   [junit4]   1> Adding 10 docs with commit=true, numDocs=1000
   [junit4]   2> 535278 WARN  (NIOServerCxn.Factory:0.0.0.0/0.0.0.0:0) [    ] o.a.z.s.NIOServerCnxn
caught end of stream exception
   [junit4]   2> EndOfStreamException: Unable to read additional data from client sessionid
0x15e09b8c8c90006, likely client has closed socket
   [junit4]   2> 	at org.apache.zookeeper.server.NIOServerCnxn.doIO(NIOServerCnxn.java:239)
   [junit4]   2> 	at org.apache.zookeeper.server.NIOServerCnxnFactory.run(NIOServerCnxnFactory.java:203)
   [junit4]   2> 	at java.base/java.lang.Thread.run(Thread.java:844)
   [junit4]   1> Cdcr queue response: {responseHeader={status=0,QTime=1},queues={127.0.0.1:50898/solr={cdcr-target={queueSize=1010,lastTimestamp=}}},tlogTotalSize=47659,tlogTotalCount=10,updateLogSynchronizer=stopped}
   [junit4]   2> 540009 WARN  (cdcr-bootstrap-status-919-thread-1) [    ] o.a.s.h.CdcrReplicatorManager
Cancelling waiting for bootstrap on target: cdcr-target shard: shard1 to complete
   [junit4]   1> Adding 100 docs with commit=true, numDocs=1100
   [junit4]   1> Adding 100 docs with commit=true, numDocs=1200
   [junit4]   1> Adding 100 docs with commit=true, numDocs=1300
   [junit4]   1> Adding 100 docs with commit=true, numDocs=1400
   [junit4]   1> Adding 100 docs with commit=true, numDocs=1500
   [junit4]   1> Adding 100 docs with commit=true, numDocs=1600
   [junit4]   1> Adding 100 docs with commit=true, numDocs=1700
   [junit4]   1> Adding 100 docs with commit=true, numDocs=1800
   [junit4]   1> Adding 100 docs with commit=true, numDocs=1900
   [junit4]   1> Adding 100 docs with commit=true, numDocs=2000
   [junit4]   2> 541978 WARN  (NIOServerCxn.Factory:0.0.0.0/0.0.0.0:0) [    ] o.a.z.s.NIOServerCnxn
caught end of stream exception
   [junit4]   2> EndOfStreamException: Unable to read additional data from client sessionid
0x15e09b8ccc60007, likely client has closed socket
   [junit4]   2> 	at org.apache.zookeeper.server.NIOServerCnxn.doIO(NIOServerCnxn.java:239)
   [junit4]   2> 	at org.apache.zookeeper.server.NIOServerCnxnFactory.run(NIOServerCnxnFactory.java:203)
   [junit4]   2> 	at java.base/java.lang.Thread.run(Thread.java:844)
   [junit4]   2> 542979 WARN  (cdcr-bootstrap-status-922-thread-1) [    ] o.a.s.h.CdcrReplicatorManager
Cancelling waiting for bootstrap on target: cdcr-target shard: shard1 to complete
   [junit4]   2> 542985 WARN  (zkCallback-907-thread-2) [    ] o.a.s.c.c.ZkStateReader
ZooKeeper watch triggered, but Solr cannot talk to ZK: [KeeperErrorCode = Session expired
for /live_nodes]
   [junit4]   2> 542986 ERROR (TEST-CdcrBootstrapTest.testBootstrapWithSourceCluster-seed#[F2B60B832A0606C])
[    ] o.a.z.s.ZooKeeperServer ZKShutdownHandler is not registered, so ZooKeeper server won't
take any action on ERROR or SHUTDOWN server state changes
   [junit4]   2> 542989 WARN  (Thread-1083) [    ] o.a.s.c.ZkTestServer Watch limit violations:

   [junit4]   2> Maximum concurrent create/delete watches above limit:
   [junit4]   2> 
   [junit4]   2> 	2	/solr/aliases.json
   [junit4]   2> 	2	/solr/clusterprops.json
   [junit4]   2> 
   [junit4]   2> Maximum concurrent data watches above limit:
   [junit4]   2> 
   [junit4]   2> 	6	/solr/collections/cdcr-source/state.json
   [junit4]   2> 	4	/solr/collections/cdcr-source/cdcr/state/process
   [junit4]   2> 	3	/solr/collections/cdcr-source/cdcr/state/buffer
   [junit4]   2> 	2	/solr/clusterstate.json
   [junit4]   2> 
   [junit4]   2> Maximum concurrent children watches above limit:
   [junit4]   2> 
   [junit4]   2> 	2	/solr/live_nodes
   [junit4]   2> 	2	/solr/collections
   [junit4]   2> 
   [junit4]   2> 543021 WARN  (zkCallback-895-thread-1) [    ] o.a.s.c.c.ZkStateReader
ZooKeeper watch triggered, but Solr cannot talk to ZK: [KeeperErrorCode = Session expired
for /live_nodes]
   [junit4]   2> 543023 ERROR (TEST-CdcrBootstrapTest.testBootstrapWithSourceCluster-seed#[F2B60B832A0606C])
[    ] o.a.z.s.ZooKeeperServer ZKShutdownHandler is not registered, so ZooKeeper server won't
take any action on ERROR or SHUTDOWN server state changes
   [junit4]   2> 543025 WARN  (Thread-1070) [    ] o.a.s.c.ZkTestServer Watch limit violations:

   [junit4]   2> Maximum concurrent create/delete watches above limit:
   [junit4]   2> 
   [junit4]   2> 	3	/solr/configs/cdcr-target/managed-schema
   [junit4]   2> 	3	/solr/aliases.json
   [junit4]   2> 	3	/solr/clusterprops.json
   [junit4]   2> 	3	/solr/collections/cdcr-target/leaders/shard1/leader
   [junit4]   2> 
   [junit4]   2> Maximum concurrent data watches above limit:
   [junit4]   2> 
   [junit4]   2> 	6	/solr/collections/cdcr-target/state.json
   [junit4]   2> 	4	/solr/collections/cdcr-target/cdcr/state/process
   [junit4]   2> 	3	/solr/collections/cdcr-target/cdcr/state/buffer
   [junit4]   2> 	3	/solr/clusterstate.json
   [junit4]   2> 
   [junit4]   2> Maximum concurrent children watches above limit:
   [junit4]   2> 
   [junit4]   2> 	3	/solr/live_nodes
   [junit4]   2> 	3	/solr/collections
   [junit4]   2> 
   [junit4]   2> 543037 ERROR (Thread-1098) [    ] o.a.z.s.ZooKeeperServer ZKShutdownHandler
is not registered, so ZooKeeper server won't take any action on ERROR or SHUTDOWN server state
changes
   [junit4]   2> 543144 ERROR (jetty-launcher-923-thread-1) [    ] o.a.s.u.StartupLoggingUtils
Missing Java Option solr.log.dir. Logging may be missing or incomplete.
   [junit4]   1> Target zkHost = 127.0.0.1:51104/solr
   [junit4]   2> 543590 ERROR (Thread-1108) [    ] o.a.z.s.ZooKeeperServer ZKShutdownHandler
is not registered, so ZooKeeper server won't take any action on ERROR or SHUTDOWN server state
changes
   [junit4]   2> 543691 WARN  (NIOServerCxn.Factory:0.0.0.0/0.0.0.0:0) [    ] o.a.z.s.NIOServerCnxn
caught end of stream exception
   [junit4]   2> EndOfStreamException: Unable to read additional data from client sessionid
0x15e09b901e70000, likely client has closed socket
   [junit4]   2> 	at org.apache.zookeeper.server.NIOServerCnxn.doIO(NIOServerCnxn.java:239)
   [junit4]   2> 	at org.apache.zookeeper.server.NIOServerCnxnFactory.run(NIOServerCnxnFactory.java:203)
   [junit4]   2> 	at java.base/java.lang.Thread.run(Thread.java:844)
   [junit4]   2> 543694 ERROR (jetty-launcher-935-thread-1) [    ] o.a.s.u.StartupLoggingUtils
Missing Java Option solr.log.dir. Logging may be missing or incomplete.
   [junit4]   1> Adding 10 docs with commit=true, numDocs=100
   [junit4]   1> Adding 10 docs with commit=true, numDocs=200
   [junit4]   1> Adding 10 docs with commit=true, numDocs=300
   [junit4]   1> Adding 10 docs with commit=true, numDocs=400
   [junit4]   1> Adding 10 docs with commit=true, numDocs=500
   [junit4]   1> Adding 10 docs with commit=true, numDocs=600
   [junit4]   1> Adding 10 docs with commit=true, numDocs=700
   [junit4]   1> Adding 10 docs with commit=true, numDocs=800
   [junit4]   1> Adding 10 docs with commit=true, numDocs=900
   [junit4]   1> Adding 10 docs with commit=true, numDocs=1000
   [junit4]   1> Adding 10 docs with commit=true, numDocs=1100
   [junit4]   2> 552019 WARN  (cdcr-bootstrap-status-954-thread-1) [    ] o.a.s.h.CdcrReplicatorManager
Bootstrap process was not found on target collection: cdcr-target shard: shard1, leader: http://127.0.0.1:51108/solr/cdcr-target_shard1_replica_n1/
   [junit4]   1> Adding 10 docs with commit=true, numDocs=1200
   [junit4]   1> Adding 10 docs with commit=true, numDocs=1300
   [junit4]   2> 552621 ERROR (recoveryExecutor-928-thread-1) [    ] o.a.s.h.IndexFetcher
User aborted Replication
   [junit4]   2> 552630 ERROR (updateExecutor-927-thread-1) [    ] o.a.s.h.CdcrRequestHandler
Bootstrap operation failed
   [junit4]   2> java.util.concurrent.ExecutionException: java.lang.AssertionError
   [junit4]   2> 	at java.base/java.util.concurrent.FutureTask.report(FutureTask.java:122)
   [junit4]   2> 	at java.base/java.util.concurrent.FutureTask.get(FutureTask.java:191)
   [junit4]   2> 	at org.apache.solr.handler.CdcrRequestHandler.lambda$handleBootstrapAction$0(CdcrRequestHandler.java:646)
   [junit4]   2> 	at com.codahale.metrics.InstrumentedExecutorService$InstrumentedRunnable.run(InstrumentedExecutorService.java:176)
   [junit4]   2> 	at java.base/java.util.concurrent.Executors$RunnableAdapter.call(Executors.java:514)
   [junit4]   2> 	at java.base/java.util.concurrent.FutureTask.run(FutureTask.java:264)
   [junit4]   2> 	at org.apache.solr.common.util.ExecutorUtil$MDCAwareThreadPoolExecutor.lambda$execute$0(ExecutorUtil.java:188)
   [junit4]   2> 	at java.base/java.util.concurrent.ThreadPoolExecutor.runWorker(ThreadPoolExecutor.java:1167)
   [junit4]   2> 	at java.base/java.util.concurrent.ThreadPoolExecutor$Worker.run(ThreadPoolExecutor.java:641)
   [junit4]   2> 	at java.base/java.lang.Thread.run(Thread.java:844)
   [junit4]   2> Caused by: java.lang.AssertionError
   [junit4]   2> 	at org.apache.solr.handler.CdcrRequestHandler$BootstrapCallable.call(CdcrRequestHandler.java:789)
   [junit4]   2> 	at org.apache.solr.handler.CdcrRequestHandler$BootstrapCallable.call(CdcrRequestHandler.java:716)
   [junit4]   2> 	at com.codahale.metrics.InstrumentedExecutorService$InstrumentedCallable.call(InstrumentedExecutorService.java:197)
   [junit4]   2> 	... 5 more
   [junit4]   1> Adding 10 docs with commit=true, numDocs=1400
   [junit4]   1> Adding 10 docs with commit=true, numDocs=1500
   [junit4]   1> Adding 10 docs with commit=true, numDocs=1600
   [junit4]   1> Adding 10 docs with commit=true, numDocs=1700
   [junit4]   1> Adding 10 docs with commit=true, numDocs=1800
   [junit4]   1> Adding 10 docs with commit=true, numDocs=1900
   [junit4]   1> Adding 10 docs with commit=true, numDocs=2000
   [junit4]   1> Cdcr queue response: {responseHeader={status=0,QTime=2},queues={127.0.0.1:51104/solr={cdcr-target={queueSize=2020,lastTimestamp=}}},tlogTotalSize=96439,tlogTotalCount=20,updateLogSynchronizer=stopped}
   [junit4]   2> 673815 WARN  (cdcr-bootstrap-status-954-thread-1) [    ] o.a.s.h.CdcrReplicatorManager
Cancelling waiting for bootstrap on target: cdcr-target shard: shard1 to complete
   [junit4]   2> 673911 WARN  (zkCallback-942-thread-4) [    ] o.a.s.c.c.ZkStateReader
ZooKeeper watch triggered, but Solr cannot talk to ZK: [KeeperErrorCode = Session expired
for /live_nodes]
   [junit4]   2> 673913 ERROR (TEST-CdcrBootstrapTest.testBootstrapWithContinousIndexingOnSourceCluster-seed#[F2B60B832A0606C])
[    ] o.a.z.s.ZooKeeperServer ZKShutdownHandler is not registered, so ZooKeeper server won't
take any action on ERROR or SHUTDOWN server state changes
   [junit4]   2> 673917 WARN  (Thread-1108) [    ] o.a.s.c.ZkTestServer Watch limit violations:

   [junit4]   2> Maximum concurrent create/delete watches above limit:
   [junit4]   2> 
   [junit4]   2> 	2	/solr/aliases.json
   [junit4]   2> 	2	/solr/clusterprops.json
   [junit4]   2> 
   [junit4]   2> Maximum concurrent data watches above limit:
   [junit4]   2> 
   [junit4]   2> 	6	/solr/collections/cdcr-source/state.json
   [junit4]   2> 	2	/solr/clusterstate.json
   [junit4]   2> 	2	/solr/collections/cdcr-source/cdcr/state/process
   [junit4]   2> 
   [junit4]   2> Maximum concurrent children watches above limit:
   [junit4]   2> 
   [junit4]   2> 	2	/solr/live_nodes
   [junit4]   2> 	2	/solr/collections
   [junit4]   2> 
   [junit4]   2> 673917 WARN  (NIOServerCxn.Factory:0.0.0.0/0.0.0.0:0) [    ] o.a.z.s.NIOServerCnxn
caught end of stream exception
   [junit4]   2> EndOfStreamException: Unable to read additional data from client sessionid
0x15e09b8ffbe0007, likely client has closed socket
   [junit4]   2> 	at org.apache.zookeeper.server.NIOServerCnxn.doIO(NIOServerCnxn.java:239)
   [junit4]   2> 	at org.apache.zookeeper.server.NIOServerCnxnFactory.run(NIOServerCnxnFactory.java:203)
   [junit4]   2> 	at java.base/java.lang.Thread.run(Thread.java:844)
   [junit4]   2> 675471 WARN  (zkCallback-930-thread-5) [    ] o.a.s.c.c.ZkStateReader
ZooKeeper watch triggered, but Solr cannot talk to ZK: [KeeperErrorCode = Session expired
for /live_nodes]
   [junit4]   2> 675473 ERROR (TEST-CdcrBootstrapTest.testBootstrapWithContinousIndexingOnSourceCluster-seed#[F2B60B832A0606C])
[    ] o.a.z.s.ZooKeeperServer ZKShutdownHandler is not registered, so ZooKeeper server won't
take any action on ERROR or SHUTDOWN server state changes
   [junit4]   2> 675476 WARN  (Thread-1098) [    ] o.a.s.c.ZkTestServer Watch limit violations:

   [junit4]   2> Maximum concurrent create/delete watches above limit:
   [junit4]   2> 
   [junit4]   2> 	3	/solr/aliases.json
   [junit4]   2> 	3	/solr/clusterprops.json
   [junit4]   2> 
   [junit4]   2> Maximum concurrent data watches above limit:
   [junit4]   2> 
   [junit4]   2> 	6	/solr/collections/cdcr-target/state.json
   [junit4]   2> 	3	/solr/clusterstate.json
   [junit4]   2> 	2	/solr/collections/cdcr-target/cdcr/state/process
   [junit4]   2> 
   [junit4]   2> Maximum concurrent children watches above limit:
   [junit4]   2> 
   [junit4]   2> 	3	/solr/live_nodes
   [junit4]   2> 	3	/solr/collections
   [junit4]   2> 
   [junit4]   2> NOTE: reproduce with: ant test  -Dtestcase=CdcrBootstrapTest -Dtests.method=testBootstrapWithContinousIndexingOnSourceCluster
-Dtests.seed=F2B60B832A0606C -Dtests.slow=true -Dtests.locale=ru-BY -Dtests.timezone=Europe/Gibraltar
-Dtests.asserts=true -Dtests.file.encoding=ISO-8859-1
   [junit4] FAILURE  132s J1 | CdcrBootstrapTest.testBootstrapWithContinousIndexingOnSourceCluster
<<<
   [junit4]    > Throwable #1: java.lang.AssertionError: Document mismatch on target after
sync expected:<2000> but was:<0>
   [junit4]    > 	at __randomizedtesting.SeedInfo.seed([F2B60B832A0606C:DB6E2BE1D5F6D397]:0)
   [junit4]    > 	at org.apache.solr.cloud.CdcrBootstrapTest.testBootstrapWithContinousIndexingOnSourceCluster(CdcrBootstrapTest.java:309)
   [junit4]    > 	at java.base/jdk.internal.reflect.NativeMethodAccessorImpl.invoke0(Native
Method)
   [junit4]    > 	at java.base/jdk.internal.reflect.NativeMethodAccessorImpl.invoke(NativeMethodAccessorImpl.java:62)
   [junit4]    > 	at java.base/jdk.internal.reflect.DelegatingMethodAccessorImpl.invoke(DelegatingMethodAccessorImpl.java:43)
   [junit4]    > 	at java.base/java.lang.reflect.Method.invoke(Method.java:564)
   [junit4]    > 	at java.base/java.lang.Thread.run(Thread.java:844)
   [junit4]   2> NOTE: leaving temporary files on disk at: C:\Users\jenkins\workspace\Lucene-Solr-master-Windows\solr\build\solr-core\test\J1\temp\solr.cloud.CdcrBootstrapTest_F2B60B832A0606C-001
   [junit4]   2> Aug 22, 2017 11:36:45 AM com.carrotsearch.randomizedtesting.ThreadLeakControl
checkThreadLeaks
   [junit4]   2> WARNING: Will linger awaiting termination of 1 leaked thread(s).
   [junit4]   2> NOTE: test params are: codec=Asserting(Lucene70): {xyz=PostingsFormat(name=Asserting),
id=TestBloomFilteredLucenePostings(BloomFilteringPostingsFormat(Lucene50(blocksize=128)))},
docValues:{}, maxPointsInLeafNode=1148, maxMBSortInHeap=7.525316163816423, sim=RandomSimilarity(queryNorm=false):
{}, locale=ru-BY, timezone=Europe/Gibraltar
   [junit4]   2> NOTE: Windows 10 10.0 x86/Oracle Corporation 9 (32-bit)/cpus=3,threads=1,free=167274784,total=318767104
   [junit4]   2> NOTE: All tests run in this JVM: [PropertiesRequestHandlerTest, TestHighFrequencyDictionaryFactory,
TestSolrCloudSnapshots, BasicZkTest, DistributedMLTComponentTest, DeleteNodeTest, TestSuggestSpellingConverter,
TestSortByMinMaxFunction, TestSolr4Spatial, TestReRankQParserPlugin, BigEndianAscendingWordDeserializerTest,
TestSolrCLIRunExample, TestRecovery, TermsComponentTest, DistributedFacetPivotSmallTest, TestCollectionsAPIViaSolrCloudCluster,
TestFieldSortValues, TestSearchPerf, TestQueryTypes, SolrIndexMetricsTest, SpellCheckCollatorTest,
TestRangeQuery, CacheHeaderTest, TestReload, WrapperMergePolicyFactoryTest, ExitableDirectoryReaderTest,
HdfsSyncSliceTest, TestSolrCloudWithDelegationTokens, BadIndexSchemaTest, PreAnalyzedUpdateProcessorTest,
ForceLeaderTest, TestRemoteStreaming, SortSpecParsingTest, OverseerStatusTest, HdfsDirectoryTest,
TestPushWriter, TestMultiValuedNumericRangeQuery, TestDistribDocBasedVersion, ChaosMonkeySafeLeaderTest,
IgnoreCommitOptimizeUpdateProcessorFactoryTest, SolrJmxReporterTest, ZkFailoverTest, TestCrossCoreJoin,
TestUninvertingReader, SolrMetricManagerTest, LeaderInitiatedRecoveryOnCommitTest, TestCloudManagedSchema,
TestRandomFlRTGCloud, CdcrBootstrapTest]
   [junit4] Completed [121/731 (1!)] on J1 in 159.97s, 3 tests, 1 failure <<< FAILURES!

[...truncated 1063 lines...]
   [junit4] Suite: org.apache.solr.update.processor.UpdateRequestProcessorFactoryTest
   [junit4]   2> Creating dataDir: C:\Users\jenkins\workspace\Lucene-Solr-master-Windows\solr\build\solr-core\test\J1\temp\solr.update.processor.UpdateRequestProcessorFactoryTest_F2B60B832A0606C-001\init-core-data-001
   [junit4]   2> 1774103 WARN  (SUITE-UpdateRequestProcessorFactoryTest-seed#[F2B60B832A0606C]-worker)
[    ] o.a.s.SolrTestCaseJ4 startTrackingSearchers: numOpens=2 numCloses=2
   [junit4]   2> 1774103 INFO  (SUITE-UpdateRequestProcessorFactoryTest-seed#[F2B60B832A0606C]-worker)
[    ] o.a.s.SolrTestCaseJ4 Using PointFields (NUMERIC_POINTS_SYSPROP=true) w/NUMERIC_DOCVALUES_SYSPROP=true
   [junit4]   2> 1774104 INFO  (SUITE-UpdateRequestProcessorFactoryTest-seed#[F2B60B832A0606C]-worker)
[    ] o.a.s.SolrTestCaseJ4 Randomized ssl (false) and clientAuth (false) via: @org.apache.solr.util.RandomizeSSL(reason="",
value=0.0/0.0, ssl=0.0/0.0, clientAuth=0.0/0.0)
   [junit4]   2> 1774105 INFO  (SUITE-UpdateRequestProcessorFactoryTest-seed#[F2B60B832A0606C]-worker)
[    ] o.a.s.SolrTestCaseJ4 SecureRandom sanity checks: test.solr.allowed.securerandom=null
& java.security.egd=file:/dev/./urandom
   [junit4]   2> 1774105 INFO  (SUITE-UpdateRequestProcessorFactoryTest-seed#[F2B60B832A0606C]-worker)
[    ] o.a.s.SolrTestCaseJ4 ####initCore
   [junit4]   2> 1774553 WARN  (coreLoadExecutor-7883-thread-1) [    ] o.a.s.c.RequestHandlers
no default request handler is registered (either '/select' or 'standard')
   [junit4]   2> 1774555 WARN  (coreLoadExecutor-7883-thread-1) [    ] o.a.s.r.ManagedResourceStorage
Cannot write to config directory C:\Users\jenkins\workspace\Lucene-Solr-master-Windows\solr\core\src\test-files\solr\collection1\conf;
switching to use InMemory storage instead.
   [junit4]   2> 1774557 INFO  (SUITE-UpdateRequestProcessorFactoryTest-seed#[F2B60B832A0606C]-worker)
[    ] o.a.s.SolrTestCaseJ4 ####initCore end
   [junit4]   2> 1774559 INFO  (TEST-UpdateRequestProcessorFactoryTest.testUpdateDistribChainSkipping-seed#[F2B60B832A0606C])
[    ] o.a.s.SolrTestCaseJ4 ###Starting testUpdateDistribChainSkipping
   [junit4]   2> 1774559 INFO  (TEST-UpdateRequestProcessorFactoryTest.testUpdateDistribChainSkipping-seed#[F2B60B832A0606C])
[    ] o.a.s.SolrTestCaseJ4 ###Ending testUpdateDistribChainSkipping
   [junit4]   2> NOTE: reproduce with: ant test  -Dtestcase=UpdateRequestProcessorFactoryTest
-Dtests.method=testUpdateDistribChainSkipping -Dtests.seed=F2B60B832A0606C -Dtests.slow=true
-Dtests.locale=en-MU -Dtests.timezone=Mexico/BajaNorte -Dtests.asserts=true -Dtests.file.encoding=ISO-8859-1
   [junit4] FAILURE 0.00s J1 | UpdateRequestProcessorFactoryTest.testUpdateDistribChainSkipping
<<<
   [junit4]    > Throwable #1: java.lang.AssertionError: Tests must be run with INFO level
logging otherwise LogUpdateProcessor isn't used and can't be tested.
   [junit4]    > 	at __randomizedtesting.SeedInfo.seed([F2B60B832A0606C:7ECF9E6E444B47A0]:0)
   [junit4]    > 	at org.apache.solr.update.processor.UpdateRequestProcessorFactoryTest.testUpdateDistribChainSkipping(UpdateRequestProcessorFactoryTest.java:101)
   [junit4]    > 	at java.base/jdk.internal.reflect.NativeMethodAccessorImpl.invoke0(Native
Method)
   [junit4]    > 	at java.base/jdk.internal.reflect.NativeMethodAccessorImpl.invoke(NativeMethodAccessorImpl.java:62)
   [junit4]    > 	at java.base/jdk.internal.reflect.DelegatingMethodAccessorImpl.invoke(DelegatingMethodAccessorImpl.java:43)
   [junit4]    > 	at java.base/java.lang.reflect.Method.invoke(Method.java:564)
   [junit4]    > 	at java.base/java.lang.Thread.run(Thread.java:844)
   [junit4]   2> 1774563 INFO  (TEST-UpdateRequestProcessorFactoryTest.testRequestTimeUrp-seed#[F2B60B832A0606C])
[    ] o.a.s.SolrTestCaseJ4 ###Starting testRequestTimeUrp
   [junit4]   2> 1774563 INFO  (TEST-UpdateRequestProcessorFactoryTest.testRequestTimeUrp-seed#[F2B60B832A0606C])
[    ] o.a.s.SolrTestCaseJ4 ###Ending testRequestTimeUrp
   [junit4]   2> 1774565 INFO  (TEST-UpdateRequestProcessorFactoryTest.testConfiguration-seed#[F2B60B832A0606C])
[    ] o.a.s.SolrTestCaseJ4 ###Starting testConfiguration
   [junit4]   2> 1774565 INFO  (TEST-UpdateRequestProcessorFactoryTest.testConfiguration-seed#[F2B60B832A0606C])
[    ] o.a.s.SolrTestCaseJ4 ###Ending testConfiguration
   [junit4]   2> 1774565 INFO  (SUITE-UpdateRequestProcessorFactoryTest-seed#[F2B60B832A0606C]-worker)
[    ] o.a.s.SolrTestCaseJ4 ###deleteCore
   [junit4]   2> NOTE: leaving temporary files on disk at: C:\Users\jenkins\workspace\Lucene-Solr-master-Windows\solr\build\solr-core\test\J1\temp\solr.update.processor.UpdateRequestProcessorFactoryTest_F2B60B832A0606C-001
   [junit4]   2> NOTE: test params are: codec=Asserting(Lucene70): {}, docValues:{}, maxPointsInLeafNode=808,
maxMBSortInHeap=5.7276417492536424, sim=RandomSimilarity(queryNorm=false): {}, locale=en-MU,
timezone=Mexico/BajaNorte
   [junit4]   2> NOTE: Windows 10 10.0 x86/Oracle Corporation 9 (32-bit)/cpus=3,threads=1,free=305586136,total=536870912
   [junit4]   2> NOTE: All tests run in this JVM: [PropertiesRequestHandlerTest, TestHighFrequencyDictionaryFactory,
TestSolrCloudSnapshots, BasicZkTest, DistributedMLTComponentTest, DeleteNodeTest, TestSuggestSpellingConverter,
TestSortByMinMaxFunction, TestSolr4Spatial, TestReRankQParserPlugin, BigEndianAscendingWordDeserializerTest,
TestSolrCLIRunExample, TestRecovery, TermsComponentTest, DistributedFacetPivotSmallTest, TestCollectionsAPIViaSolrCloudCluster,
TestFieldSortValues, TestSearchPerf, TestQueryTypes, SolrIndexMetricsTest, SpellCheckCollatorTest,
TestRangeQuery, CacheHeaderTest, TestReload, WrapperMergePolicyFactoryTest, ExitableDirectoryReaderTest,
HdfsSyncSliceTest, TestSolrCloudWithDelegationTokens, BadIndexSchemaTest, PreAnalyzedUpdateProcessorTest,
ForceLeaderTest, TestRemoteStreaming, SortSpecParsingTest, OverseerStatusTest, HdfsDirectoryTest,
TestPushWriter, TestMultiValuedNumericRangeQuery, TestDistribDocBasedVersion, ChaosMonkeySafeLeaderTest,
IgnoreCommitOptimizeUpdateProcessorFactoryTest, SolrJmxReporterTest, ZkFailoverTest, TestCrossCoreJoin,
TestUninvertingReader, SolrMetricManagerTest, LeaderInitiatedRecoveryOnCommitTest, TestCloudManagedSchema,
TestRandomFlRTGCloud, CdcrBootstrapTest, CdcrVersionReplicationTest, TestDistributedGrouping,
TestStressLucene, SpellCheckComponentTest, TestNumericRangeQuery64, TestFieldResource, EnumFieldTest,
ConfigSetsAPITest, TestSolrFieldCacheBean, MoveReplicaHDFSTest, TestTlogReplica, TestLuceneMatchVersion,
ChaosMonkeySafeLeaderWithPullReplicasTest, TestHttpShardHandlerFactory, TestIntervalFaceting,
LoggingHandlerTest, TestNumericTerms32, TestSolrQueryParser, TestSimpleTrackingShardHandler,
SolrCmdDistributorTest, TestBlobHandler, SolrGraphiteReporterTest, MetricsConfigTest, TestConfigsApi,
TolerantUpdateProcessorTest, TestReloadDeadlock, CursorMarkTest, SimpleCollectionCreateDeleteTest,
HttpSolrCallGetCoreTest, TestCryptoKeys, TestFastOutputStream, InfixSuggestersTest, TestRandomCollapseQParserPlugin,
TestSQLHandler, TestRequestForwarding, SearchHandlerTest, BlockDirectoryTest, BadCopyFieldTest,
TestRandomFaceting, FullHLLTest, DistributedFacetPivotLongTailTest, TestCollapseQParserPlugin,
TestExclusionRuleCollectionAccess, TestGraphTermsQParserPlugin, HdfsNNFailoverTest, TestClusterProperties,
CollectionReloadTest, DeleteInactiveReplicaTest, TestSolrConfigHandler, RemoteQueryErrorTest,
TestUniqueKeyFieldResource, LeaderElectionIntegrationTest, TestElisionMultitermQuery, TestRebalanceLeaders,
V2StandaloneTest, BasicDistributedZk2Test, BlobRepositoryCloudTest, TestEmbeddedSolrServerConstructors,
TestScoreJoinQPNoScore, TestLegacyField, TestConfigSetProperties, MetricUtilsTest, DistribCursorPagingTest,
BadComponentTest, HdfsBasicDistributedZkTest, TestSSLRandomization, BitVectorTest, TestPullReplica,
SpatialRPTFieldTypeTest, TestDistributedStatsComponentCardinality, HdfsTlogReplayBufferedWhileIndexingTest,
SpellingQueryConverterTest, ChangedSchemaMergeTest, TemplateUpdateProcessorTest, ZkNodePropsTest,
TestExceedMaxTermLength, TestPostingsSolrHighlighter, TestFieldCacheReopen, TestDistributedMissingSort,
TestFieldCacheSortRandom, TestAnalyzeInfixSuggestions, BasicFunctionalityTest, TestConfigSetsAPIExclusivity,
AtomicUpdatesTest, SubstringBytesRefFilterTest, DistributedTermsComponentTest, TestComponentsName,
SegmentsInfoRequestHandlerTest, SuggestComponentContextFilterQueryTest, ZkStateWriterTest,
TestCloudNestedDocsSort, TestFastLRUCache, AnalysisErrorHandlingTest, TestInfoStreamLogging,
SampleTest, ShowFileRequestHandlerTest, TestLMJelinekMercerSimilarityFactory, TestCorePropertiesReload,
SolrMetricsIntegrationTest, CopyFieldTest, TestInitQParser, TestJettySolrRunner, TestManagedResource,
PolyFieldTest, QueryEqualityTest, MoreLikeThisHandlerTest, TestLeaderInitiatedRecoveryThread,
TestExactSharedStatsCache, TestSolrCloudWithSecureImpersonation, OpenCloseCoreStressTest,
MergeStrategyTest, SystemInfoHandlerTest, CachingDirectoryFactoryTest, ShardRoutingCustomTest,
SchemaVersionSpecificBehaviorTest, MigrateRouteKeyTest, TestManagedSchemaThreadSafety, TestRealTimeGet,
TestFileDictionaryLookup, FileUtilsTest, TestSchemaResource, SolrCloudReportersTest, TestMaxScoreQueryParser,
TestJsonFacetRefinement, TestLegacyNumericUtils, ClassificationUpdateProcessorIntegrationTest,
DocumentAnalysisRequestHandlerTest, JsonLoaderTest, TestPerFieldSimilarity, UpdateLogTest,
AutoCommitTest, TestFaceting, TestHashPartitioner, TermVectorComponentDistributedTest, ZkControllerTest,
TestJoin, SimpleFacetsTest, SolrCoreTest, QueryElevationComponentTest, ConvertedLegacyTest,
TestFiltering, DirectUpdateHandlerTest, TestBadConfig, HighlighterTest, SolrIndexSplitterTest,
TestCoreDiscovery, SignatureUpdateProcessorFactoryTest, DocValuesTest, SortByFunctionTest,
DocValuesMultiTest, TestSolrDeletionPolicy1, DebugComponentTest, LukeRequestHandlerTest, XmlUpdateRequestHandlerTest,
TestValueSourceCache, TermVectorComponentTest, IndexSchemaRuntimeFieldTest, SolrPluginUtilsTest,
TestCollationField, UpdateRequestProcessorFactoryTest]
   [junit4] Completed [437/731 (2!)] on J1 in 0.52s, 3 tests, 1 failure <<< FAILURES!

[...truncated 37481 lines...]

Mime
View raw message