lucene-dev mailing list archives

Site index · List index
Message view « Date » · « Thread »
Top « Date » · « Thread »
From Policeman Jenkins Server <jenk...@thetaphi.de>
Subject [JENKINS-EA] Lucene-Solr-6.6-Linux (64bit/jdk-9-ea+181) - Build # 98 - Unstable!
Date Sat, 26 Aug 2017 14:57:39 GMT
Build: https://jenkins.thetaphi.de/job/Lucene-Solr-6.6-Linux/98/
Java: 64bit/jdk-9-ea+181 -XX:-UseCompressedOops -XX:+UseConcMarkSweepGC --illegal-access=deny

1 tests failed.
FAILED:  org.apache.solr.update.AutoCommitTest.testMaxDocs

Error Message:
Exception during query

Stack Trace:
java.lang.RuntimeException: Exception during query
	at __randomizedtesting.SeedInfo.seed([E340D1DD29F96FEA:5AC1070205136B60]:0)
	at org.apache.solr.SolrTestCaseJ4.assertQ(SolrTestCaseJ4.java:895)
	at org.apache.solr.update.AutoCommitTest.testMaxDocs(AutoCommitTest.java:225)
	at java.base/jdk.internal.reflect.NativeMethodAccessorImpl.invoke0(Native Method)
	at java.base/jdk.internal.reflect.NativeMethodAccessorImpl.invoke(NativeMethodAccessorImpl.java:62)
	at java.base/jdk.internal.reflect.DelegatingMethodAccessorImpl.invoke(DelegatingMethodAccessorImpl.java:43)
	at java.base/java.lang.reflect.Method.invoke(Method.java:564)
	at com.carrotsearch.randomizedtesting.RandomizedRunner.invoke(RandomizedRunner.java:1713)
	at com.carrotsearch.randomizedtesting.RandomizedRunner$8.evaluate(RandomizedRunner.java:907)
	at com.carrotsearch.randomizedtesting.RandomizedRunner$9.evaluate(RandomizedRunner.java:943)
	at com.carrotsearch.randomizedtesting.RandomizedRunner$10.evaluate(RandomizedRunner.java:957)
	at com.carrotsearch.randomizedtesting.rules.SystemPropertiesRestoreRule$1.evaluate(SystemPropertiesRestoreRule.java:57)
	at org.apache.lucene.util.TestRuleSetupTeardownChained$1.evaluate(TestRuleSetupTeardownChained.java:49)
	at org.apache.lucene.util.AbstractBeforeAfterRule$1.evaluate(AbstractBeforeAfterRule.java:45)
	at org.apache.lucene.util.TestRuleThreadAndTestName$1.evaluate(TestRuleThreadAndTestName.java:48)
	at org.apache.lucene.util.TestRuleIgnoreAfterMaxFailures$1.evaluate(TestRuleIgnoreAfterMaxFailures.java:64)
	at org.apache.lucene.util.TestRuleMarkFailure$1.evaluate(TestRuleMarkFailure.java:47)
	at com.carrotsearch.randomizedtesting.rules.StatementAdapter.evaluate(StatementAdapter.java:36)
	at com.carrotsearch.randomizedtesting.ThreadLeakControl$StatementRunner.run(ThreadLeakControl.java:368)
	at com.carrotsearch.randomizedtesting.ThreadLeakControl.forkTimeoutingTask(ThreadLeakControl.java:817)
	at com.carrotsearch.randomizedtesting.ThreadLeakControl$3.evaluate(ThreadLeakControl.java:468)
	at com.carrotsearch.randomizedtesting.RandomizedRunner.runSingleTest(RandomizedRunner.java:916)
	at com.carrotsearch.randomizedtesting.RandomizedRunner$5.evaluate(RandomizedRunner.java:802)
	at com.carrotsearch.randomizedtesting.RandomizedRunner$6.evaluate(RandomizedRunner.java:852)
	at com.carrotsearch.randomizedtesting.RandomizedRunner$7.evaluate(RandomizedRunner.java:863)
	at com.carrotsearch.randomizedtesting.rules.StatementAdapter.evaluate(StatementAdapter.java:36)
	at com.carrotsearch.randomizedtesting.rules.SystemPropertiesRestoreRule$1.evaluate(SystemPropertiesRestoreRule.java:57)
	at org.apache.lucene.util.AbstractBeforeAfterRule$1.evaluate(AbstractBeforeAfterRule.java:45)
	at com.carrotsearch.randomizedtesting.rules.StatementAdapter.evaluate(StatementAdapter.java:36)
	at org.apache.lucene.util.TestRuleStoreClassName$1.evaluate(TestRuleStoreClassName.java:41)
	at com.carrotsearch.randomizedtesting.rules.NoShadowingOrOverridesOnMethodsRule$1.evaluate(NoShadowingOrOverridesOnMethodsRule.java:40)
	at com.carrotsearch.randomizedtesting.rules.NoShadowingOrOverridesOnMethodsRule$1.evaluate(NoShadowingOrOverridesOnMethodsRule.java:40)
	at com.carrotsearch.randomizedtesting.rules.StatementAdapter.evaluate(StatementAdapter.java:36)
	at com.carrotsearch.randomizedtesting.rules.StatementAdapter.evaluate(StatementAdapter.java:36)
	at org.apache.lucene.util.TestRuleAssertionsRequired$1.evaluate(TestRuleAssertionsRequired.java:53)
	at org.apache.lucene.util.TestRuleMarkFailure$1.evaluate(TestRuleMarkFailure.java:47)
	at org.apache.lucene.util.TestRuleIgnoreAfterMaxFailures$1.evaluate(TestRuleIgnoreAfterMaxFailures.java:64)
	at org.apache.lucene.util.TestRuleIgnoreTestSuites$1.evaluate(TestRuleIgnoreTestSuites.java:54)
	at com.carrotsearch.randomizedtesting.rules.StatementAdapter.evaluate(StatementAdapter.java:36)
	at com.carrotsearch.randomizedtesting.ThreadLeakControl$StatementRunner.run(ThreadLeakControl.java:368)
	at java.base/java.lang.Thread.run(Thread.java:844)
Caused by: java.lang.RuntimeException: REQUEST FAILED: xpath=//result[@numFound=1]
	xml response was: <?xml version="1.0" encoding="UTF-8"?>
<response>
<lst name="responseHeader"><int name="status">0</int><int name="QTime">0</int></lst><result name="response" numFound="0" start="0"></result>
</response>

	request was:q=id:14&qt=standard&start=0&rows=20&version=2.2
	at org.apache.solr.SolrTestCaseJ4.assertQ(SolrTestCaseJ4.java:888)
	... 39 more




Build Log:
[...truncated 1708 lines...]
   [junit4] JVM J2: stderr was not empty, see: /home/jenkins/workspace/Lucene-Solr-6.6-Linux/lucene/build/core/test/temp/junit4-J2-20170826_135459_76416974410672345479781.syserr
   [junit4] >>> JVM J2 emitted unexpected output (verbatim) ----
   [junit4] Java HotSpot(TM) 64-Bit Server VM warning: Option UseConcMarkSweepGC was deprecated in version 9.0 and will likely be removed in a future release.
   [junit4] <<< JVM J2: EOF ----

[...truncated 3 lines...]
   [junit4] JVM J0: stderr was not empty, see: /home/jenkins/workspace/Lucene-Solr-6.6-Linux/lucene/build/core/test/temp/junit4-J0-20170826_135459_7752780642822507526782.syserr
   [junit4] >>> JVM J0 emitted unexpected output (verbatim) ----
   [junit4] Java HotSpot(TM) 64-Bit Server VM warning: Option UseConcMarkSweepGC was deprecated in version 9.0 and will likely be removed in a future release.
   [junit4] <<< JVM J0: EOF ----

[...truncated 3 lines...]
   [junit4] JVM J1: stderr was not empty, see: /home/jenkins/workspace/Lucene-Solr-6.6-Linux/lucene/build/core/test/temp/junit4-J1-20170826_135459_759150542645122659529.syserr
   [junit4] >>> JVM J1 emitted unexpected output (verbatim) ----
   [junit4] Java HotSpot(TM) 64-Bit Server VM warning: Option UseConcMarkSweepGC was deprecated in version 9.0 and will likely be removed in a future release.
   [junit4] <<< JVM J1: EOF ----

[...truncated 289 lines...]
   [junit4] JVM J2: stderr was not empty, see: /home/jenkins/workspace/Lucene-Solr-6.6-Linux/lucene/build/test-framework/test/temp/junit4-J2-20170826_140033_2444670984625326521780.syserr
   [junit4] >>> JVM J2 emitted unexpected output (verbatim) ----
   [junit4] Java HotSpot(TM) 64-Bit Server VM warning: Option UseConcMarkSweepGC was deprecated in version 9.0 and will likely be removed in a future release.
   [junit4] <<< JVM J2: EOF ----

   [junit4] JVM J1: stderr was not empty, see: /home/jenkins/workspace/Lucene-Solr-6.6-Linux/lucene/build/test-framework/test/temp/junit4-J1-20170826_140033_24312991569909004697528.syserr
   [junit4] >>> JVM J1 emitted unexpected output (verbatim) ----
   [junit4] Java HotSpot(TM) 64-Bit Server VM warning: Option UseConcMarkSweepGC was deprecated in version 9.0 and will likely be removed in a future release.
   [junit4] <<< JVM J1: EOF ----

[...truncated 3 lines...]
   [junit4] JVM J0: stderr was not empty, see: /home/jenkins/workspace/Lucene-Solr-6.6-Linux/lucene/build/test-framework/test/temp/junit4-J0-20170826_140033_2436075636033712378800.syserr
   [junit4] >>> JVM J0 emitted unexpected output (verbatim) ----
   [junit4] Java HotSpot(TM) 64-Bit Server VM warning: Option UseConcMarkSweepGC was deprecated in version 9.0 and will likely be removed in a future release.
   [junit4] <<< JVM J0: EOF ----

[...truncated 1027 lines...]
   [junit4] JVM J1: stderr was not empty, see: /home/jenkins/workspace/Lucene-Solr-6.6-Linux/lucene/build/analysis/common/test/temp/junit4-J1-20170826_140141_96018217761043931051170.syserr
   [junit4] >>> JVM J1 emitted unexpected output (verbatim) ----
   [junit4] Java HotSpot(TM) 64-Bit Server VM warning: Option UseConcMarkSweepGC was deprecated in version 9.0 and will likely be removed in a future release.
   [junit4] <<< JVM J1: EOF ----

[...truncated 3 lines...]
   [junit4] JVM J0: stderr was not empty, see: /home/jenkins/workspace/Lucene-Solr-6.6-Linux/lucene/build/analysis/common/test/temp/junit4-J0-20170826_140141_9608365834193688733353.syserr
   [junit4] >>> JVM J0 emitted unexpected output (verbatim) ----
   [junit4] Java HotSpot(TM) 64-Bit Server VM warning: Option UseConcMarkSweepGC was deprecated in version 9.0 and will likely be removed in a future release.
   [junit4] <<< JVM J0: EOF ----

[...truncated 3 lines...]
   [junit4] JVM J2: stderr was not empty, see: /home/jenkins/workspace/Lucene-Solr-6.6-Linux/lucene/build/analysis/common/test/temp/junit4-J2-20170826_140141_96017092718466881530987.syserr
   [junit4] >>> JVM J2 emitted unexpected output (verbatim) ----
   [junit4] Java HotSpot(TM) 64-Bit Server VM warning: Option UseConcMarkSweepGC was deprecated in version 9.0 and will likely be removed in a future release.
   [junit4] <<< JVM J2: EOF ----

[...truncated 213 lines...]
   [junit4] JVM J1: stderr was not empty, see: /home/jenkins/workspace/Lucene-Solr-6.6-Linux/lucene/build/analysis/icu/test/temp/junit4-J1-20170826_140318_21610759064088020134341.syserr
   [junit4] >>> JVM J1 emitted unexpected output (verbatim) ----
   [junit4] Java HotSpot(TM) 64-Bit Server VM warning: Option UseConcMarkSweepGC was deprecated in version 9.0 and will likely be removed in a future release.
   [junit4] <<< JVM J1: EOF ----

[...truncated 3 lines...]
   [junit4] JVM J0: stderr was not empty, see: /home/jenkins/workspace/Lucene-Solr-6.6-Linux/lucene/build/analysis/icu/test/temp/junit4-J0-20170826_140318_2162202537635659684159.syserr
   [junit4] >>> JVM J0 emitted unexpected output (verbatim) ----
   [junit4] Java HotSpot(TM) 64-Bit Server VM warning: Option UseConcMarkSweepGC was deprecated in version 9.0 and will likely be removed in a future release.
   [junit4] <<< JVM J0: EOF ----

[...truncated 5 lines...]
   [junit4] JVM J2: stderr was not empty, see: /home/jenkins/workspace/Lucene-Solr-6.6-Linux/lucene/build/analysis/icu/test/temp/junit4-J2-20170826_140318_2164279474818197624561.syserr
   [junit4] >>> JVM J2 emitted unexpected output (verbatim) ----
   [junit4] Java HotSpot(TM) 64-Bit Server VM warning: Option UseConcMarkSweepGC was deprecated in version 9.0 and will likely be removed in a future release.
   [junit4] <<< JVM J2: EOF ----

[...truncated 237 lines...]
   [junit4] JVM J0: stderr was not empty, see: /home/jenkins/workspace/Lucene-Solr-6.6-Linux/lucene/build/analysis/kuromoji/test/temp/junit4-J0-20170826_140328_8778251783360953777777.syserr
   [junit4] >>> JVM J0 emitted unexpected output (verbatim) ----
   [junit4] Java HotSpot(TM) 64-Bit Server VM warning: Option UseConcMarkSweepGC was deprecated in version 9.0 and will likely be removed in a future release.
   [junit4] <<< JVM J0: EOF ----

[...truncated 3 lines...]
   [junit4] JVM J2: stderr was not empty, see: /home/jenkins/workspace/Lucene-Solr-6.6-Linux/lucene/build/analysis/kuromoji/test/temp/junit4-J2-20170826_140328_8787506096994687683972.syserr
   [junit4] >>> JVM J2 emitted unexpected output (verbatim) ----
   [junit4] Java HotSpot(TM) 64-Bit Server VM warning: Option UseConcMarkSweepGC was deprecated in version 9.0 and will likely be removed in a future release.
   [junit4] <<< JVM J2: EOF ----

[...truncated 3 lines...]
   [junit4] JVM J1: stderr was not empty, see: /home/jenkins/workspace/Lucene-Solr-6.6-Linux/lucene/build/analysis/kuromoji/test/temp/junit4-J1-20170826_140328_87711296076782555503086.syserr
   [junit4] >>> JVM J1 emitted unexpected output (verbatim) ----
   [junit4] Java HotSpot(TM) 64-Bit Server VM warning: Option UseConcMarkSweepGC was deprecated in version 9.0 and will likely be removed in a future release.
   [junit4] <<< JVM J1: EOF ----

[...truncated 146 lines...]
   [junit4] JVM J1: stderr was not empty, see: /home/jenkins/workspace/Lucene-Solr-6.6-Linux/lucene/build/analysis/morfologik/test/temp/junit4-J1-20170826_140359_16713820815840212398995.syserr
   [junit4] >>> JVM J1 emitted unexpected output (verbatim) ----
   [junit4] Java HotSpot(TM) 64-Bit Server VM warning: Option UseConcMarkSweepGC was deprecated in version 9.0 and will likely be removed in a future release.
   [junit4] <<< JVM J1: EOF ----

[...truncated 3 lines...]
   [junit4] JVM J0: stderr was not empty, see: /home/jenkins/workspace/Lucene-Solr-6.6-Linux/lucene/build/analysis/morfologik/test/temp/junit4-J0-20170826_140359_16713617502862409361134.syserr
   [junit4] >>> JVM J0 emitted unexpected output (verbatim) ----
   [junit4] Java HotSpot(TM) 64-Bit Server VM warning: Option UseConcMarkSweepGC was deprecated in version 9.0 and will likely be removed in a future release.
   [junit4] <<< JVM J0: EOF ----

[...truncated 3 lines...]
   [junit4] JVM J2: stderr was not empty, see: /home/jenkins/workspace/Lucene-Solr-6.6-Linux/lucene/build/analysis/morfologik/test/temp/junit4-J2-20170826_140359_1682532703209875420160.syserr
   [junit4] >>> JVM J2 emitted unexpected output (verbatim) ----
   [junit4] Java HotSpot(TM) 64-Bit Server VM warning: Option UseConcMarkSweepGC was deprecated in version 9.0 and will likely be removed in a future release.
   [junit4] <<< JVM J2: EOF ----

[...truncated 158 lines...]
   [junit4] JVM J0: stderr was not empty, see: /home/jenkins/workspace/Lucene-Solr-6.6-Linux/lucene/build/analysis/phonetic/test/temp/junit4-J0-20170826_140403_1267115245185165298383.syserr
   [junit4] >>> JVM J0 emitted unexpected output (verbatim) ----
   [junit4] Java HotSpot(TM) 64-Bit Server VM warning: Option UseConcMarkSweepGC was deprecated in version 9.0 and will likely be removed in a future release.
   [junit4] <<< JVM J0: EOF ----

[...truncated 3 lines...]
   [junit4] JVM J2: stderr was not empty, see: /home/jenkins/workspace/Lucene-Solr-6.6-Linux/lucene/build/analysis/phonetic/test/temp/junit4-J2-20170826_140403_12611220528008594527622.syserr
   [junit4] >>> JVM J2 emitted unexpected output (verbatim) ----
   [junit4] Java HotSpot(TM) 64-Bit Server VM warning: Option UseConcMarkSweepGC was deprecated in version 9.0 and will likely be removed in a future release.
   [junit4] <<< JVM J2: EOF ----

[...truncated 3 lines...]
   [junit4] JVM J1: stderr was not empty, see: /home/jenkins/workspace/Lucene-Solr-6.6-Linux/lucene/build/analysis/phonetic/test/temp/junit4-J1-20170826_140403_12614386165837043160679.syserr
   [junit4] >>> JVM J1 emitted unexpected output (verbatim) ----
   [junit4] Java HotSpot(TM) 64-Bit Server VM warning: Option UseConcMarkSweepGC was deprecated in version 9.0 and will likely be removed in a future release.
   [junit4] <<< JVM J1: EOF ----

[...truncated 145 lines...]
   [junit4] JVM J0: stderr was not empty, see: /home/jenkins/workspace/Lucene-Solr-6.6-Linux/lucene/build/analysis/smartcn/test/temp/junit4-J0-20170826_140413_58512387766983380552074.syserr
   [junit4] >>> JVM J0 emitted unexpected output (verbatim) ----
   [junit4] Java HotSpot(TM) 64-Bit Server VM warning: Option UseConcMarkSweepGC was deprecated in version 9.0 and will likely be removed in a future release.
   [junit4] <<< JVM J0: EOF ----

[...truncated 3 lines...]
   [junit4] JVM J1: stderr was not empty, see: /home/jenkins/workspace/Lucene-Solr-6.6-Linux/lucene/build/analysis/smartcn/test/temp/junit4-J1-20170826_140413_58512204522829812299365.syserr
   [junit4] >>> JVM J1 emitted unexpected output (verbatim) ----
   [junit4] Java HotSpot(TM) 64-Bit Server VM warning: Option UseConcMarkSweepGC was deprecated in version 9.0 and will likely be removed in a future release.
   [junit4] <<< JVM J1: EOF ----

[...truncated 149 lines...]
   [junit4] JVM J1: stderr was not empty, see: /home/jenkins/workspace/Lucene-Solr-6.6-Linux/lucene/build/analysis/stempel/test/temp/junit4-J1-20170826_140421_85416913759665448913651.syserr
   [junit4] >>> JVM J1 emitted unexpected output (verbatim) ----
   [junit4] Java HotSpot(TM) 64-Bit Server VM warning: Option UseConcMarkSweepGC was deprecated in version 9.0 and will likely be removed in a future release.
   [junit4] <<< JVM J1: EOF ----

   [junit4] JVM J2: stderr was not empty, see: /home/jenkins/workspace/Lucene-Solr-6.6-Linux/lucene/build/analysis/stempel/test/temp/junit4-J2-20170826_140421_8547756999762710066488.syserr
   [junit4] >>> JVM J2 emitted unexpected output (verbatim) ----
   [junit4] Java HotSpot(TM) 64-Bit Server VM warning: Option UseConcMarkSweepGC was deprecated in version 9.0 and will likely be removed in a future release.
   [junit4] <<< JVM J2: EOF ----

[...truncated 3 lines...]
   [junit4] JVM J0: stderr was not empty, see: /home/jenkins/workspace/Lucene-Solr-6.6-Linux/lucene/build/analysis/stempel/test/temp/junit4-J0-20170826_140421_85413653128510321929928.syserr
   [junit4] >>> JVM J0 emitted unexpected output (verbatim) ----
   [junit4] Java HotSpot(TM) 64-Bit Server VM warning: Option UseConcMarkSweepGC was deprecated in version 9.0 and will likely be removed in a future release.
   [junit4] <<< JVM J0: EOF ----

[...truncated 161 lines...]
   [junit4] JVM J0: stderr was not empty, see: /home/jenkins/workspace/Lucene-Solr-6.6-Linux/lucene/build/analysis/uima/test/temp/junit4-J0-20170826_140424_39013210736913222144551.syserr
   [junit4] >>> JVM J0 emitted unexpected output (verbatim) ----
   [junit4] Java HotSpot(TM) 64-Bit Server VM warning: Option UseConcMarkSweepGC was deprecated in version 9.0 and will likely be removed in a future release.
   [junit4] <<< JVM J0: EOF ----

[...truncated 154 lines...]
   [junit4] JVM J1: stderr was not empty, see: /home/jenkins/workspace/Lucene-Solr-6.6-Linux/lucene/build/backward-codecs/test/temp/junit4-J1-20170826_140431_1625733198491390835296.syserr
   [junit4] >>> JVM J1 emitted unexpected output (verbatim) ----
   [junit4] Java HotSpot(TM) 64-Bit Server VM warning: Option UseConcMarkSweepGC was deprecated in version 9.0 and will likely be removed in a future release.
   [junit4] <<< JVM J1: EOF ----

[...truncated 17 lines...]
   [junit4] JVM J2: stderr was not empty, see: /home/jenkins/workspace/Lucene-Solr-6.6-Linux/lucene/build/backward-codecs/test/temp/junit4-J2-20170826_140431_1633270532040007716003.syserr
   [junit4] >>> JVM J2 emitted unexpected output (verbatim) ----
   [junit4] Java HotSpot(TM) 64-Bit Server VM warning: Option UseConcMarkSweepGC was deprecated in version 9.0 and will likely be removed in a future release.
   [junit4] <<< JVM J2: EOF ----

[...truncated 12 lines...]
   [junit4] JVM J0: stderr was not empty, see: /home/jenkins/workspace/Lucene-Solr-6.6-Linux/lucene/build/backward-codecs/test/temp/junit4-J0-20170826_140431_16211789637015917871264.syserr
   [junit4] >>> JVM J0 emitted unexpected output (verbatim) ----
   [junit4] Java HotSpot(TM) 64-Bit Server VM warning: Option UseConcMarkSweepGC was deprecated in version 9.0 and will likely be removed in a future release.
   [junit4] <<< JVM J0: EOF ----

[...truncated 1341 lines...]
   [junit4] JVM J2: stderr was not empty, see: /home/jenkins/workspace/Lucene-Solr-6.6-Linux/lucene/build/benchmark/test/temp/junit4-J2-20170826_140613_1546200765567037103822.syserr
   [junit4] >>> JVM J2 emitted unexpected output (verbatim) ----
   [junit4] Java HotSpot(TM) 64-Bit Server VM warning: Option UseConcMarkSweepGC was deprecated in version 9.0 and will likely be removed in a future release.
   [junit4] <<< JVM J2: EOF ----

[...truncated 3 lines...]
   [junit4] JVM J1: stderr was not empty, see: /home/jenkins/workspace/Lucene-Solr-6.6-Linux/lucene/build/benchmark/test/temp/junit4-J1-20170826_140613_15411005294839497282549.syserr
   [junit4] >>> JVM J1 emitted unexpected output (verbatim) ----
   [junit4] Java HotSpot(TM) 64-Bit Server VM warning: Option UseConcMarkSweepGC was deprecated in version 9.0 and will likely be removed in a future release.
   [junit4] <<< JVM J1: EOF ----

[...truncated 3 lines...]
   [junit4] JVM J0: stderr was not empty, see: /home/jenkins/workspace/Lucene-Solr-6.6-Linux/lucene/build/benchmark/test/temp/junit4-J0-20170826_140613_15417315659173455304617.syserr
   [junit4] >>> JVM J0 emitted unexpected output (verbatim) ----
   [junit4] Java HotSpot(TM) 64-Bit Server VM warning: Option UseConcMarkSweepGC was deprecated in version 9.0 and will likely be removed in a future release.
   [junit4] <<< JVM J0: EOF ----

[...truncated 226 lines...]
   [junit4] JVM J0: stderr was not empty, see: /home/jenkins/workspace/Lucene-Solr-6.6-Linux/lucene/build/classification/test/temp/junit4-J0-20170826_140621_5966975319800652064777.syserr
   [junit4] >>> JVM J0 emitted unexpected output (verbatim) ----
   [junit4] Java HotSpot(TM) 64-Bit Server VM warning: Option UseConcMarkSweepGC was deprecated in version 9.0 and will likely be removed in a future release.
   [junit4] <<< JVM J0: EOF ----

   [junit4] JVM J1: stderr was not empty, see: /home/jenkins/workspace/Lucene-Solr-6.6-Linux/lucene/build/classification/test/temp/junit4-J1-20170826_140621_59615150681477581540240.syserr
   [junit4] >>> JVM J1 emitted unexpected output (verbatim) ----
   [junit4] Java HotSpot(TM) 64-Bit Server VM warning: Option UseConcMarkSweepGC was deprecated in version 9.0 and will likely be removed in a future release.
   [junit4] <<< JVM J1: EOF ----

[...truncated 3 lines...]
   [junit4] JVM J2: stderr was not empty, see: /home/jenkins/workspace/Lucene-Solr-6.6-Linux/lucene/build/classification/test/temp/junit4-J2-20170826_140621_59611276740095652407000.syserr
   [junit4] >>> JVM J2 emitted unexpected output (verbatim) ----
   [junit4] Java HotSpot(TM) 64-Bit Server VM warning: Option UseConcMarkSweepGC was deprecated in version 9.0 and will likely be removed in a future release.
   [junit4] <<< JVM J2: EOF ----

[...truncated 239 lines...]
   [junit4] JVM J1: stderr was not empty, see: /home/jenkins/workspace/Lucene-Solr-6.6-Linux/lucene/build/codecs/test/temp/junit4-J1-20170826_140629_4099355620070382959438.syserr
   [junit4] >>> JVM J1 emitted unexpected output (verbatim) ----
   [junit4] Java HotSpot(TM) 64-Bit Server VM warning: Option UseConcMarkSweepGC was deprecated in version 9.0 and will likely be removed in a future release.
   [junit4] <<< JVM J1: EOF ----

[...truncated 3 lines...]
   [junit4] JVM J2: stderr was not empty, see: /home/jenkins/workspace/Lucene-Solr-6.6-Linux/lucene/build/codecs/test/temp/junit4-J2-20170826_140629_409396397133506608029.syserr
   [junit4] >>> JVM J2 emitted unexpected output (verbatim) ----
   [junit4] Java HotSpot(TM) 64-Bit Server VM warning: Option UseConcMarkSweepGC was deprecated in version 9.0 and will likely be removed in a future release.
   [junit4] <<< JVM J2: EOF ----

[...truncated 14 lines...]
   [junit4] JVM J0: stderr was not empty, see: /home/jenkins/workspace/Lucene-Solr-6.6-Linux/lucene/build/codecs/test/temp/junit4-J0-20170826_140629_40918015218919308438383.syserr
   [junit4] >>> JVM J0 emitted unexpected output (verbatim) ----
   [junit4] Java HotSpot(TM) 64-Bit Server VM warning: Option UseConcMarkSweepGC was deprecated in version 9.0 and will likely be removed in a future release.
   [junit4] <<< JVM J0: EOF ----

[...truncated 223 lines...]
   [junit4] JVM J2: stderr was not empty, see: /home/jenkins/workspace/Lucene-Solr-6.6-Linux/lucene/build/demo/test/temp/junit4-J2-20170826_140820_41014101442426682285141.syserr
   [junit4] >>> JVM J2 emitted unexpected output (verbatim) ----
   [junit4] Java HotSpot(TM) 64-Bit Server VM warning: Option UseConcMarkSweepGC was deprecated in version 9.0 and will likely be removed in a future release.
   [junit4] <<< JVM J2: EOF ----

[...truncated 6 lines...]
   [junit4] JVM J1: stderr was not empty, see: /home/jenkins/workspace/Lucene-Solr-6.6-Linux/lucene/build/demo/test/temp/junit4-J1-20170826_140820_41014840579102413062734.syserr
   [junit4] >>> JVM J1 emitted unexpected output (verbatim) ----
   [junit4] Java HotSpot(TM) 64-Bit Server VM warning: Option UseConcMarkSweepGC was deprecated in version 9.0 and will likely be removed in a future release.
   [junit4] <<< JVM J1: EOF ----

   [junit4] JVM J0: stderr was not empty, see: /home/jenkins/workspace/Lucene-Solr-6.6-Linux/lucene/build/demo/test/temp/junit4-J0-20170826_140820_410188057856470441833.syserr
   [junit4] >>> JVM J0 emitted unexpected output (verbatim) ----
   [junit4] Java HotSpot(TM) 64-Bit Server VM warning: Option UseConcMarkSweepGC was deprecated in version 9.0 and will likely be removed in a future release.
   [junit4] <<< JVM J0: EOF ----

[...truncated 162 lines...]
   [junit4] JVM J1: stderr was not empty, see: /home/jenkins/workspace/Lucene-Solr-6.6-Linux/lucene/build/expressions/test/temp/junit4-J1-20170826_140823_92811778618204747439718.syserr
   [junit4] >>> JVM J1 emitted unexpected output (verbatim) ----
   [junit4] Java HotSpot(TM) 64-Bit Server VM warning: Option UseConcMarkSweepGC was deprecated in version 9.0 and will likely be removed in a future release.
   [junit4] <<< JVM J1: EOF ----

   [junit4] JVM J2: stderr was not empty, see: /home/jenkins/workspace/Lucene-Solr-6.6-Linux/lucene/build/expressions/test/temp/junit4-J2-20170826_140823_9275412603884648918314.syserr
   [junit4] >>> JVM J2 emitted unexpected output (verbatim) ----
   [junit4] Java HotSpot(TM) 64-Bit Server VM warning: Option UseConcMarkSweepGC was deprecated in version 9.0 and will likely be removed in a future release.
   [junit4] <<< JVM J2: EOF ----

[...truncated 6 lines...]
   [junit4] JVM J0: stderr was not empty, see: /home/jenkins/workspace/Lucene-Solr-6.6-Linux/lucene/build/expressions/test/temp/junit4-J0-20170826_140823_9269664758366962206467.syserr
   [junit4] >>> JVM J0 emitted unexpected output (verbatim) ----
   [junit4] Java HotSpot(TM) 64-Bit Server VM warning: Option UseConcMarkSweepGC was deprecated in version 9.0 and will likely be removed in a future release.
   [junit4] <<< JVM J0: EOF ----

[...truncated 209 lines...]
   [junit4] JVM J2: stderr was not empty, see: /home/jenkins/workspace/Lucene-Solr-6.6-Linux/lucene/build/facet/test/temp/junit4-J2-20170826_140830_10714291806960660930287.syserr
   [junit4] >>> JVM J2 emitted unexpected output (verbatim) ----
   [junit4] Java HotSpot(TM) 64-Bit Server VM warning: Option UseConcMarkSweepGC was deprecated in version 9.0 and will likely be removed in a future release.
   [junit4] <<< JVM J2: EOF ----

[...truncated 3 lines...]
   [junit4] JVM J1: stderr was not empty, see: /home/jenkins/workspace/Lucene-Solr-6.6-Linux/lucene/build/facet/test/temp/junit4-J1-20170826_140830_10712952618474285615937.syserr
   [junit4] >>> JVM J1 emitted unexpected output (verbatim) ----
   [junit4] Java HotSpot(TM) 64-Bit Server VM warning: Option UseConcMarkSweepGC was deprecated in version 9.0 and will likely be removed in a future release.
   [junit4] <<< JVM J1: EOF ----

[...truncated 3 lines...]
   [junit4] JVM J0: stderr was not empty, see: /home/jenkins/workspace/Lucene-Solr-6.6-Linux/lucene/build/facet/test/temp/junit4-J0-20170826_140830_1077061173541277598062.syserr
   [junit4] >>> JVM J0 emitted unexpected output (verbatim) ----
   [junit4] Java HotSpot(TM) 64-Bit Server VM warning: Option UseConcMarkSweepGC was deprecated in version 9.0 and will likely be removed in a future release.
   [junit4] <<< JVM J0: EOF ----

[...truncated 159 lines...]
   [junit4] JVM J2: stderr was not empty, see: /home/jenkins/workspace/Lucene-Solr-6.6-Linux/lucene/build/grouping/test/temp/junit4-J2-20170826_140901_2029695255280963155280.syserr
   [junit4] >>> JVM J2 emitted unexpected output (verbatim) ----
   [junit4] Java HotSpot(TM) 64-Bit Server VM warning: Option UseConcMarkSweepGC was deprecated in version 9.0 and will likely be removed in a future release.
   [junit4] <<< JVM J2: EOF ----

   [junit4] JVM J1: stderr was not empty, see: /home/jenkins/workspace/Lucene-Solr-6.6-Linux/lucene/build/grouping/test/temp/junit4-J1-20170826_140901_20211974905671295546183.syserr
   [junit4] >>> JVM J1 emitted unexpected output (verbatim) ----
   [junit4] Java HotSpot(TM) 64-Bit Server VM warning: Option UseConcMarkSweepGC was deprecated in version 9.0 and will likely be removed in a future release.
   [junit4] <<< JVM J1: EOF ----

[...truncated 3 lines...]
   [junit4] JVM J0: stderr was not empty, see: /home/jenkins/workspace/Lucene-Solr-6.6-Linux/lucene/build/grouping/test/temp/junit4-J0-20170826_140901_20213128599513386479834.syserr
   [junit4] >>> JVM J0 emitted unexpected output (verbatim) ----
   [junit4] Java HotSpot(TM) 64-Bit Server VM warning: Option UseConcMarkSweepGC was deprecated in version 9.0 and will likely be removed in a future release.
   [junit4] <<< JVM J0: EOF ----

[...truncated 241 lines...]
   [junit4] JVM J1: stderr was not empty, see: /home/jenkins/workspace/Lucene-Solr-6.6-Linux/lucene/build/highlighter/test/temp/junit4-J1-20170826_140909_9123298141241188772852.syserr
   [junit4] >>> JVM J1 emitted unexpected output (verbatim) ----
   [junit4] Java HotSpot(TM) 64-Bit Server VM warning: Option UseConcMarkSweepGC was deprecated in version 9.0 and will likely be removed in a future release.
   [junit4] <<< JVM J1: EOF ----

[...truncated 3 lines...]
   [junit4] JVM J0: stderr was not empty, see: /home/jenkins/workspace/Lucene-Solr-6.6-Linux/lucene/build/highlighter/test/temp/junit4-J0-20170826_140909_91210726410503491128470.syserr
   [junit4] >>> JVM J0 emitted unexpected output (verbatim) ----
   [junit4] Java HotSpot(TM) 64-Bit Server VM warning: Option UseConcMarkSweepGC was deprecated in version 9.0 and will likely be removed in a future release.
   [junit4] <<< JVM J0: EOF ----

[...truncated 6 lines...]
   [junit4] JVM J2: stderr was not empty, see: /home/jenkins/workspace/Lucene-Solr-6.6-Linux/lucene/build/highlighter/test/temp/junit4-J2-20170826_140909_91211939221990624546378.syserr
   [junit4] >>> JVM J2 emitted unexpected output (verbatim) ----
   [junit4] Java HotSpot(TM) 64-Bit Server VM warning: Option UseConcMarkSweepGC was deprecated in version 9.0 and will likely be removed in a future release.
   [junit4] <<< JVM J2: EOF ----

[...truncated 149 lines...]
   [junit4] JVM J2: stderr was not empty, see: /home/jenkins/workspace/Lucene-Solr-6.6-Linux/lucene/build/join/test/temp/junit4-J2-20170826_140931_59710620719085689189413.syserr
   [junit4] >>> JVM J2 emitted unexpected output (verbatim) ----
   [junit4] Java HotSpot(TM) 64-Bit Server VM warning: Option UseConcMarkSweepGC was deprecated in version 9.0 and will likely be removed in a future release.
   [junit4] <<< JVM J2: EOF ----

[...truncated 3 lines...]
   [junit4] JVM J0: stderr was not empty, see: /home/jenkins/workspace/Lucene-Solr-6.6-Linux/lucene/build/join/test/temp/junit4-J0-20170826_140931_59712273585642683117551.syserr
   [junit4] >>> JVM J0 emitted unexpected output (verbatim) ----
   [junit4] Java HotSpot(TM) 64-Bit Server VM warning: Option UseConcMarkSweepGC was deprecated in version 9.0 and will likely be removed in a future release.
   [junit4] <<< JVM J0: EOF ----

[...truncated 6 lines...]
   [junit4] JVM J1: stderr was not empty, see: /home/jenkins/workspace/Lucene-Solr-6.6-Linux/lucene/build/join/test/temp/junit4-J1-20170826_140931_5979115890929203969755.syserr
   [junit4] >>> JVM J1 emitted unexpected output (verbatim) ----
   [junit4] Java HotSpot(TM) 64-Bit Server VM warning: Option UseConcMarkSweepGC was deprecated in version 9.0 and will likely be removed in a future release.
   [junit4] <<< JVM J1: EOF ----

[...truncated 143 lines...]
   [junit4] JVM J0: stderr was not empty, see: /home/jenkins/workspace/Lucene-Solr-6.6-Linux/lucene/build/memory/test/temp/junit4-J0-20170826_140946_3834727846381457342431.syserr
   [junit4] >>> JVM J0 emitted unexpected output (verbatim) ----
   [junit4] Java HotSpot(TM) 64-Bit Server VM warning: Option UseConcMarkSweepGC was deprecated in version 9.0 and will likely be removed in a future release.
   [junit4] <<< JVM J0: EOF ----

[...truncated 3 lines...]
   [junit4] JVM J1: stderr was not empty, see: /home/jenkins/workspace/Lucene-Solr-6.6-Linux/lucene/build/memory/test/temp/junit4-J1-20170826_140946_38311786436978049088147.syserr
   [junit4] >>> JVM J1 emitted unexpected output (verbatim) ----
   [junit4] Java HotSpot(TM) 64-Bit Server VM warning: Option UseConcMarkSweepGC was deprecated in version 9.0 and will likely be removed in a future release.
   [junit4] <<< JVM J1: EOF ----

[...truncated 210 lines...]
   [junit4] JVM J2: stderr was not empty, see: /home/jenkins/workspace/Lucene-Solr-6.6-Linux/lucene/build/misc/test/temp/junit4-J2-20170826_140955_046752734166264142477.syserr
   [junit4] >>> JVM J2 emitted unexpected output (verbatim) ----
   [junit4] Java HotSpot(TM) 64-Bit Server VM warning: Option UseConcMarkSweepGC was deprecated in version 9.0 and will likely be removed in a future release.
   [junit4] <<< JVM J2: EOF ----

[...truncated 5 lines...]
   [junit4] JVM J1: stderr was not empty, see: /home/jenkins/workspace/Lucene-Solr-6.6-Linux/lucene/build/misc/test/temp/junit4-J1-20170826_140955_0467855474351058303017.syserr
   [junit4] >>> JVM J1 emitted unexpected output (verbatim) ----
   [junit4] Java HotSpot(TM) 64-Bit Server VM warning: Option UseConcMarkSweepGC was deprecated in version 9.0 and will likely be removed in a future release.
   [junit4] <<< JVM J1: EOF ----

[...truncated 3 lines...]
   [junit4] JVM J0: stderr was not empty, see: /home/jenkins/workspace/Lucene-Solr-6.6-Linux/lucene/build/misc/test/temp/junit4-J0-20170826_140955_0469814031077064804733.syserr
   [junit4] >>> JVM J0 emitted unexpected output (verbatim) ----
   [junit4] Java HotSpot(TM) 64-Bit Server VM warning: Option UseConcMarkSweepGC was deprecated in version 9.0 and will likely be removed in a future release.
   [junit4] <<< JVM J0: EOF ----

[...truncated 309 lines...]
   [junit4] JVM J2: stderr was not empty, see: /home/jenkins/workspace/Lucene-Solr-6.6-Linux/lucene/build/queries/test/temp/junit4-J2-20170826_141016_22015662332694468836886.syserr
   [junit4] >>> JVM J2 emitted unexpected output (verbatim) ----
   [junit4] Java HotSpot(TM) 64-Bit Server VM warning: Option UseConcMarkSweepGC was deprecated in version 9.0 and will likely be removed in a future release.
   [junit4] <<< JVM J2: EOF ----

[...truncated 6 lines...]
   [junit4] JVM J0: stderr was not empty, see: /home/jenkins/workspace/Lucene-Solr-6.6-Linux/lucene/build/queries/test/temp/junit4-J0-20170826_141016_2201525361480503880165.syserr
   [junit4] >>> JVM J0 emitted unexpected output (verbatim) ----
   [junit4] Java HotSpot(TM) 64-Bit Server VM warning: Option UseConcMarkSweepGC was deprecated in version 9.0 and will likely be removed in a future release.
   [junit4] <<< JVM J0: EOF ----

   [junit4] JVM J1: stderr was not empty, see: /home/jenkins/workspace/Lucene-Solr-6.6-Linux/lucene/build/queries/test/temp/junit4-J1-20170826_141016_22013448245253568287250.syserr
   [junit4] >>> JVM J1 emitted unexpected output (verbatim) ----
   [junit4] Java HotSpot(TM) 64-Bit Server VM warning: Option UseConcMarkSweepGC was deprecated in version 9.0 and will likely be removed in a future release.
   [junit4] <<< JVM J1: EOF ----

[...truncated 230 lines...]
   [junit4] JVM J2: stderr was not empty, see: /home/jenkins/workspace/Lucene-Solr-6.6-Linux/lucene/build/queryparser/test/temp/junit4-J2-20170826_141025_4501768139643654779394.syserr
   [junit4] >>> JVM J2 emitted unexpected output (verbatim) ----
   [junit4] Java HotSpot(TM) 64-Bit Server VM warning: Option UseConcMarkSweepGC was deprecated in version 9.0 and will likely be removed in a future release.
   [junit4] <<< JVM J2: EOF ----

   [junit4] JVM J1: stderr was not empty, see: /home/jenkins/workspace/Lucene-Solr-6.6-Linux/lucene/build/queryparser/test/temp/junit4-J1-20170826_141025_4506157905589688734998.syserr
   [junit4] >>> JVM J1 emitted unexpected output (verbatim) ----
   [junit4] Java HotSpot(TM) 64-Bit Server VM warning: Option UseConcMarkSweepGC was deprecated in version 9.0 and will likely be removed in a future release.
   [junit4] <<< JVM J1: EOF ----

[...truncated 3 lines...]
   [junit4] JVM J0: stderr was not empty, see: /home/jenkins/workspace/Lucene-Solr-6.6-Linux/lucene/build/queryparser/test/temp/junit4-J0-20170826_141025_45018259495402582780186.syserr
   [junit4] >>> JVM J0 emitted unexpected output (verbatim) ----
   [junit4] Java HotSpot(TM) 64-Bit Server VM warning: Option UseConcMarkSweepGC was deprecated in version 9.0 and will likely be removed in a future release.
   [junit4] <<< JVM J0: EOF ----

[...truncated 199 lines...]
   [junit4] JVM J1: stderr was not empty, see: /home/jenkins/workspace/Lucene-Solr-6.6-Linux/lucene/build/replicator/test/temp/junit4-J1-20170826_141033_5637184558226620803413.syserr
   [junit4] >>> JVM J1 emitted unexpected output (verbatim) ----
   [junit4] Java HotSpot(TM) 64-Bit Server VM warning: Option UseConcMarkSweepGC was deprecated in version 9.0 and will likely be removed in a future release.
   [junit4] <<< JVM J1: EOF ----

[...truncated 3 lines...]
   [junit4] JVM J0: stderr was not empty, see: /home/jenkins/workspace/Lucene-Solr-6.6-Linux/lucene/build/replicator/test/temp/junit4-J0-20170826_141033_5634767065341511381391.syserr
   [junit4] >>> JVM J0 emitted unexpected output (verbatim) ----
   [junit4] Java HotSpot(TM) 64-Bit Server VM warning: Option UseConcMarkSweepGC was deprecated in version 9.0 and will likely be removed in a future release.
   [junit4] <<< JVM J0: EOF ----

[...truncated 3 lines...]
   [junit4] JVM J2: stderr was not empty, see: /home/jenkins/workspace/Lucene-Solr-6.6-Linux/lucene/build/replicator/test/temp/junit4-J2-20170826_141033_56311278299092691152893.syserr
   [junit4] >>> JVM J2 emitted unexpected output (verbatim) ----
   [junit4] Java HotSpot(TM) 64-Bit Server VM warning: Option UseConcMarkSweepGC was deprecated in version 9.0 and will likely be removed in a future release.
   [junit4] <<< JVM J2: EOF ----

[...truncated 203 lines...]
   [junit4] JVM J0: stderr was not empty, see: /home/jenkins/workspace/Lucene-Solr-6.6-Linux/lucene/build/sandbox/test/temp/junit4-J0-20170826_141047_3027958881171644388693.syserr
   [junit4] >>> JVM J0 emitted unexpected output (verbatim) ----
   [junit4] Java HotSpot(TM) 64-Bit Server VM warning: Option UseConcMarkSweepGC was deprecated in version 9.0 and will likely be removed in a future release.
   [junit4] <<< JVM J0: EOF ----

[...truncated 13 lines...]
   [junit4] JVM J1: stderr was not empty, see: /home/jenkins/workspace/Lucene-Solr-6.6-Linux/lucene/build/sandbox/test/temp/junit4-J1-20170826_141047_3022990757570661642129.syserr
   [junit4] >>> JVM J1 emitted unexpected output (verbatim) ----
   [junit4] Java HotSpot(TM) 64-Bit Server VM warning: Option UseConcMarkSweepGC was deprecated in version 9.0 and will likely be removed in a future release.
   [junit4] <<< JVM J1: EOF ----

[...truncated 3 lines...]
   [junit4] JVM J2: stderr was not empty, see: /home/jenkins/workspace/Lucene-Solr-6.6-Linux/lucene/build/sandbox/test/temp/junit4-J2-20170826_141047_30211357343186551933195.syserr
   [junit4] >>> JVM J2 emitted unexpected output (verbatim) ----
   [junit4] Java HotSpot(TM) 64-Bit Server VM warning: Option UseConcMarkSweepGC was deprecated in version 9.0 and will likely be removed in a future release.
   [junit4] <<< JVM J2: EOF ----

[...truncated 208 lines...]
   [junit4] JVM J0: stderr was not empty, see: /home/jenkins/workspace/Lucene-Solr-6.6-Linux/lucene/build/spatial-extras/test/temp/junit4-J0-20170826_141127_7095047449650351718003.syserr
   [junit4] >>> JVM J0 emitted unexpected output (verbatim) ----
   [junit4] Java HotSpot(TM) 64-Bit Server VM warning: Option UseConcMarkSweepGC was deprecated in version 9.0 and will likely be removed in a future release.
   [junit4] <<< JVM J0: EOF ----

[...truncated 3 lines...]
   [junit4] JVM J1: stderr was not empty, see: /home/jenkins/workspace/Lucene-Solr-6.6-Linux/lucene/build/spatial-extras/test/temp/junit4-J1-20170826_141127_7097771162346833247695.syserr
   [junit4] >>> JVM J1 emitted unexpected output (verbatim) ----
   [junit4] Java HotSpot(TM) 64-Bit Server VM warning: Option UseConcMarkSweepGC was deprecated in version 9.0 and will likely be removed in a future release.
   [junit4] <<< JVM J1: EOF ----

[...truncated 3 lines...]
   [junit4] JVM J2: stderr was not empty, see: /home/jenkins/workspace/Lucene-Solr-6.6-Linux/lucene/build/spatial-extras/test/temp/junit4-J2-20170826_141127_70918374081586236286523.syserr
   [junit4] >>> JVM J2 emitted unexpected output (verbatim) ----
   [junit4] Java HotSpot(TM) 64-Bit Server VM warning: Option UseConcMarkSweepGC was deprecated in version 9.0 and will likely be removed in a future release.
   [junit4] <<< JVM J2: EOF ----

[...truncated 151 lines...]
   [junit4] JVM J2: stderr was not empty, see: /home/jenkins/workspace/Lucene-Solr-6.6-Linux/lucene/build/spatial/test/temp/junit4-J2-20170826_141142_930229356498940913486.syserr
   [junit4] >>> JVM J2 emitted unexpected output (verbatim) ----
   [junit4] Java HotSpot(TM) 64-Bit Server VM warning: Option UseConcMarkSweepGC was deprecated in version 9.0 and will likely be removed in a future release.
   [junit4] <<< JVM J2: EOF ----

[...truncated 7 lines...]
   [junit4] JVM J0: stderr was not empty, see: /home/jenkins/workspace/Lucene-Solr-6.6-Linux/lucene/build/spatial/test/temp/junit4-J0-20170826_141142_92914153278482262997779.syserr
   [junit4] >>> JVM J0 emitted unexpected output (verbatim) ----
   [junit4] Java HotSpot(TM) 64-Bit Server VM warning: Option UseConcMarkSweepGC was deprecated in version 9.0 and will likely be removed in a future release.
   [junit4] <<< JVM J0: EOF ----

[...truncated 11 lines...]
   [junit4] JVM J1: stderr was not empty, see: /home/jenkins/workspace/Lucene-Solr-6.6-Linux/lucene/build/spatial/test/temp/junit4-J1-20170826_141142_9304485719386166782723.syserr
   [junit4] >>> JVM J1 emitted unexpected output (verbatim) ----
   [junit4] Java HotSpot(TM) 64-Bit Server VM warning: Option UseConcMarkSweepGC was deprecated in version 9.0 and will likely be removed in a future release.
   [junit4] <<< JVM J1: EOF ----

[...truncated 158 lines...]
   [junit4] JVM J2: stderr was not empty, see: /home/jenkins/workspace/Lucene-Solr-6.6-Linux/lucene/build/spatial3d/test/temp/junit4-J2-20170826_141248_2996145069790197429949.syserr
   [junit4] >>> JVM J2 emitted unexpected output (verbatim) ----
   [junit4] Java HotSpot(TM) 64-Bit Server VM warning: Option UseConcMarkSweepGC was deprecated in version 9.0 and will likely be removed in a future release.
   [junit4] <<< JVM J2: EOF ----

[...truncated 3 lines...]
   [junit4] JVM J0: stderr was not empty, see: /home/jenkins/workspace/Lucene-Solr-6.6-Linux/lucene/build/spatial3d/test/temp/junit4-J0-20170826_141248_2958699679191889746905.syserr
   [junit4] >>> JVM J0 emitted unexpected output (verbatim) ----
   [junit4] Java HotSpot(TM) 64-Bit Server VM warning: Option UseConcMarkSweepGC was deprecated in version 9.0 and will likely be removed in a future release.
   [junit4] <<< JVM J0: EOF ----

[...truncated 8 lines...]
   [junit4] JVM J1: stderr was not empty, see: /home/jenkins/workspace/Lucene-Solr-6.6-Linux/lucene/build/spatial3d/test/temp/junit4-J1-20170826_141248_29615737169400664871885.syserr
   [junit4] >>> JVM J1 emitted unexpected output (verbatim) ----
   [junit4] Java HotSpot(TM) 64-Bit Server VM warning: Option UseConcMarkSweepGC was deprecated in version 9.0 and will likely be removed in a future release.
   [junit4] <<< JVM J1: EOF ----

[...truncated 305 lines...]
   [junit4] JVM J1: stderr was not empty, see: /home/jenkins/workspace/Lucene-Solr-6.6-Linux/lucene/build/suggest/test/temp/junit4-J1-20170826_141349_6091262096114940900730.syserr
   [junit4] >>> JVM J1 emitted unexpected output (verbatim) ----
   [junit4] Java HotSpot(TM) 64-Bit Server VM warning: Option UseConcMarkSweepGC was deprecated in version 9.0 and will likely be removed in a future release.
   [junit4] <<< JVM J1: EOF ----

[...truncated 3 lines...]
   [junit4] JVM J2: stderr was not empty, see: /home/jenkins/workspace/Lucene-Solr-6.6-Linux/lucene/build/suggest/test/temp/junit4-J2-20170826_141349_60912530554218725957165.syserr
   [junit4] >>> JVM J2 emitted unexpected output (verbatim) ----
   [junit4] Java HotSpot(TM) 64-Bit Server VM warning: Option UseConcMarkSweepGC was deprecated in version 9.0 and will likely be removed in a future release.
   [junit4] <<< JVM J2: EOF ----

[...truncated 3 lines...]
   [junit4] JVM J0: stderr was not empty, see: /home/jenkins/workspace/Lucene-Solr-6.6-Linux/lucene/build/suggest/test/temp/junit4-J0-20170826_141349_609594879269454878010.syserr
   [junit4] >>> JVM J0 emitted unexpected output (verbatim) ----
   [junit4] Java HotSpot(TM) 64-Bit Server VM warning: Option UseConcMarkSweepGC was deprecated in version 9.0 and will likely be removed in a future release.
   [junit4] <<< JVM J0: EOF ----

[...truncated 1342 lines...]
   [junit4] Suite: org.apache.solr.update.AutoCommitTest
   [junit4]   2> Creating dataDir: /home/jenkins/workspace/Lucene-Solr-6.6-Linux/solr/build/solr-core/test/J2/temp/solr.update.AutoCommitTest_E340D1DD29F96FEA-001/init-core-data-001
   [junit4]   2> 11677 WARN  (SUITE-AutoCommitTest-seed#[E340D1DD29F96FEA]-worker) [    ] o.a.s.SolrTestCaseJ4 startTrackingSearchers: numOpens=1 numCloses=1
   [junit4]   2> 11677 INFO  (SUITE-AutoCommitTest-seed#[E340D1DD29F96FEA]-worker) [    ] o.a.s.SolrTestCaseJ4 Using TrieFields
   [junit4]   2> 11678 INFO  (SUITE-AutoCommitTest-seed#[E340D1DD29F96FEA]-worker) [    ] o.a.s.SolrTestCaseJ4 Randomized ssl (true) and clientAuth (true) via: @org.apache.solr.util.RandomizeSSL(reason="", ssl=0.0/0.0, value=0.0/0.0, clientAuth=0.0/0.0)
   [junit4]   2> 11679 INFO  (SUITE-AutoCommitTest-seed#[E340D1DD29F96FEA]-worker) [    ] o.a.s.SolrTestCaseJ4 ####initCore
   [junit4]   2> 11679 INFO  (SUITE-AutoCommitTest-seed#[E340D1DD29F96FEA]-worker) [    ] o.a.s.c.SolrResourceLoader [null] Added 2 libs to classloader, from paths: [/home/jenkins/workspace/Lucene-Solr-6.6-Linux/solr/core/src/test-files/solr/collection1/lib, /home/jenkins/workspace/Lucene-Solr-6.6-Linux/solr/core/src/test-files/solr/collection1/lib/classes]
   [junit4]   2> 11717 WARN  (SUITE-AutoCommitTest-seed#[E340D1DD29F96FEA]-worker) [    ] o.a.s.c.Config Beginning with Solr 5.5, <mergePolicy> is deprecated, use <mergePolicyFactory> instead.
   [junit4]   2> 11721 INFO  (SUITE-AutoCommitTest-seed#[E340D1DD29F96FEA]-worker) [    ] o.a.s.c.SolrConfig Using Lucene MatchVersion: 6.6.1
   [junit4]   2> 11772 INFO  (SUITE-AutoCommitTest-seed#[E340D1DD29F96FEA]-worker) [    ] o.a.s.s.IndexSchema [null] Schema name=test
   [junit4]   2> 11798 WARN  (SUITE-AutoCommitTest-seed#[E340D1DD29F96FEA]-worker) [    ] o.a.s.c.SolrResourceLoader Solr loaded a deprecated plugin/analysis class [solr.WordDelimiterFilterFactory]. Please consult documentation how to replace it accordingly.
   [junit4]   2> 11850 INFO  (SUITE-AutoCommitTest-seed#[E340D1DD29F96FEA]-worker) [    ] o.a.s.s.IndexSchema Loaded schema test/1.0 with uniqueid field id
   [junit4]   2> 11881 INFO  (SUITE-AutoCommitTest-seed#[E340D1DD29F96FEA]-worker) [    ] o.a.s.u.UpdateShardHandler Creating UpdateShardHandler HTTP client with params: socketTimeout=30000&connTimeout=30000&retry=true
   [junit4]   2> 11904 WARN  (SUITE-AutoCommitTest-seed#[E340D1DD29F96FEA]-worker) [    ] o.a.s.m.r.SolrJmxReporter No JMX server found. Not exposing Solr metrics via JMX.
   [junit4]   2> 11904 WARN  (SUITE-AutoCommitTest-seed#[E340D1DD29F96FEA]-worker) [    ] o.a.s.m.r.SolrJmxReporter No JMX server found. Not exposing Solr metrics via JMX.
   [junit4]   2> 11904 WARN  (SUITE-AutoCommitTest-seed#[E340D1DD29F96FEA]-worker) [    ] o.a.s.m.r.SolrJmxReporter No JMX server found. Not exposing Solr metrics via JMX.
   [junit4]   2> 11906 INFO  (coreLoadExecutor-151-thread-1) [    ] o.a.s.c.SolrResourceLoader [null] Added 2 libs to classloader, from paths: [/home/jenkins/workspace/Lucene-Solr-6.6-Linux/solr/core/src/test-files/solr/collection1/lib, /home/jenkins/workspace/Lucene-Solr-6.6-Linux/solr/core/src/test-files/solr/collection1/lib/classes]
   [junit4]   2> 11931 WARN  (coreLoadExecutor-151-thread-1) [    ] o.a.s.c.Config Beginning with Solr 5.5, <mergePolicy> is deprecated, use <mergePolicyFactory> instead.
   [junit4]   2> 11933 INFO  (coreLoadExecutor-151-thread-1) [    ] o.a.s.c.SolrConfig Using Lucene MatchVersion: 6.6.1
   [junit4]   2> 11955 INFO  (coreLoadExecutor-151-thread-1) [    ] o.a.s.s.IndexSchema [collection1] Schema name=test
   [junit4]   2> 12081 INFO  (coreLoadExecutor-151-thread-1) [    ] o.a.s.s.IndexSchema Loaded schema test/1.0 with uniqueid field id
   [junit4]   2> 12107 INFO  (coreLoadExecutor-151-thread-1) [    ] o.a.s.c.CoreContainer Creating SolrCore 'collection1' using configuration from instancedir /home/jenkins/workspace/Lucene-Solr-6.6-Linux/solr/core/src/test-files/solr/collection1, trusted=true
   [junit4]   2> 12108 WARN  (coreLoadExecutor-151-thread-1) [    ] o.a.s.m.r.SolrJmxReporter No JMX server found. Not exposing Solr metrics via JMX.
   [junit4]   2> 12108 INFO  (coreLoadExecutor-151-thread-1) [    ] o.a.s.c.SolrCore solr.RecoveryStrategy.Builder
   [junit4]   2> 12108 INFO  (coreLoadExecutor-151-thread-1) [    ] o.a.s.c.SolrCore [[collection1] ] Opening new SolrCore at [/home/jenkins/workspace/Lucene-Solr-6.6-Linux/solr/core/src/test-files/solr/collection1], dataDir=[/home/jenkins/workspace/Lucene-Solr-6.6-Linux/solr/build/solr-core/test/J2/temp/solr.update.AutoCommitTest_E340D1DD29F96FEA-001/init-core-data-001/]
   [junit4]   2> 12124 INFO  (coreLoadExecutor-151-thread-1) [    ] o.a.s.u.RandomMergePolicy RandomMergePolicy wrapping class org.apache.lucene.index.TieredMergePolicy: [TieredMergePolicy: maxMergeAtOnce=28, maxMergeAtOnceExplicit=29, maxMergedSegmentMB=5.0556640625, floorSegmentMB=1.7744140625, forceMergeDeletesPctAllowed=7.8582262292070615, segmentsPerTier=26.0, maxCFSSegmentSizeMB=8.796093022207999E12, noCFSRatio=0.6258836966729552
   [junit4]   2> 12206 INFO  (coreLoadExecutor-151-thread-1) [    ] o.a.s.u.UpdateHandler Using UpdateLog implementation: org.apache.solr.update.UpdateLog
   [junit4]   2> 12206 INFO  (coreLoadExecutor-151-thread-1) [    ] o.a.s.u.UpdateLog Initializing UpdateLog: dataDir= defaultSyncLevel=FLUSH numRecordsToKeep=100 maxNumLogsToKeep=10 numVersionBuckets=65536
   [junit4]   2> 12208 INFO  (coreLoadExecutor-151-thread-1) [    ] o.a.s.u.CommitTracker Hard AutoCommit: disabled
   [junit4]   2> 12208 INFO  (coreLoadExecutor-151-thread-1) [    ] o.a.s.u.CommitTracker Soft AutoCommit: disabled
   [junit4]   2> 12209 INFO  (coreLoadExecutor-151-thread-1) [    ] o.a.s.u.RandomMergePolicy RandomMergePolicy wrapping class org.apache.lucene.index.TieredMergePolicy: [TieredMergePolicy: maxMergeAtOnce=24, maxMergeAtOnceExplicit=47, maxMergedSegmentMB=5.814453125, floorSegmentMB=0.470703125, forceMergeDeletesPctAllowed=16.386577498957624, segmentsPerTier=25.0, maxCFSSegmentSizeMB=8.796093022207999E12, noCFSRatio=0.8181483007183947
   [junit4]   2> 12209 INFO  (coreLoadExecutor-151-thread-1) [    ] o.a.s.s.SolrIndexSearcher Opening [Searcher@1bfeb9e3[collection1] main]
   [junit4]   2> 12210 INFO  (coreLoadExecutor-151-thread-1) [    ] o.a.s.h.c.SpellCheckComponent Initializing spell checkers
   [junit4]   2> 12263 INFO  (coreLoadExecutor-151-thread-1) [    ] o.a.s.s.DirectSolrSpellChecker init: {name=direct,classname=DirectSolrSpellChecker,field=lowerfilt,minQueryLength=3}
   [junit4]   2> 12387 INFO  (coreLoadExecutor-151-thread-1) [    ] o.a.s.h.ReplicationHandler Commits will be reserved for  10000
   [junit4]   2> 12388 INFO  (searcherExecutor-152-thread-1) [    ] o.a.s.h.c.SpellCheckComponent Loading spell index for spellchecker: default
   [junit4]   2> 12388 INFO  (searcherExecutor-152-thread-1) [    ] o.a.s.h.c.SpellCheckComponent Loading spell index for spellchecker: direct
   [junit4]   2> 12388 INFO  (searcherExecutor-152-thread-1) [    ] o.a.s.h.c.SpellCheckComponent Loading spell index for spellchecker: wordbreak
   [junit4]   2> 12388 INFO  (searcherExecutor-152-thread-1) [    ] o.a.s.h.c.SpellCheckComponent Loading spell index for spellchecker: multipleFields
   [junit4]   2> 12388 INFO  (coreLoadExecutor-151-thread-1) [    ] o.a.s.u.UpdateLog Could not find max version in index or recent updates, using new clock 1576803387432763392
   [junit4]   2> 12389 INFO  (searcherExecutor-152-thread-1) [    ] o.a.s.h.c.SpellCheckComponent Loading spell index for spellchecker: jarowinkler
   [junit4]   2> 12389 INFO  (searcherExecutor-152-thread-1) [    ] o.a.s.h.c.SpellCheckComponent Loading spell index for spellchecker: external
   [junit4]   2> 12389 INFO  (searcherExecutor-152-thread-1) [    ] o.a.s.h.c.SpellCheckComponent Loading spell index for spellchecker: freq
   [junit4]   2> 12390 INFO  (searcherExecutor-152-thread-1) [    ] o.a.s.h.c.SpellCheckComponent Loading spell index for spellchecker: fqcn
   [junit4]   2> 12390 INFO  (searcherExecutor-152-thread-1) [    ] o.a.s.h.c.SpellCheckComponent Loading spell index for spellchecker: perDict
   [junit4]   2> 12390 INFO  (searcherExecutor-152-thread-1) [    ] o.a.s.c.SolrCore [collection1] Registered new searcher Searcher@1bfeb9e3[collection1] main{ExitableDirectoryReader(UninvertingDirectoryReader())}
   [junit4]   2> 12391 INFO  (SUITE-AutoCommitTest-seed#[E340D1DD29F96FEA]-worker) [    ] o.a.s.SolrTestCaseJ4 ####initCore end
   [junit4]   2> 12394 INFO  (TEST-AutoCommitTest.testMaxDocs-seed#[E340D1DD29F96FEA]) [    ] o.a.s.SolrTestCaseJ4 ###Starting testMaxDocs
   [junit4]   2> 12394 INFO  (TEST-AutoCommitTest.testMaxDocs-seed#[E340D1DD29F96FEA]) [    ] o.a.s.u.DirectUpdateHandler2 [collection1] REMOVING ALL DOCUMENTS FROM INDEX
   [junit4]   2> 12397 INFO  (TEST-AutoCommitTest.testMaxDocs-seed#[E340D1DD29F96FEA]) [    ] o.a.s.s.SolrIndexSearcher Opening [Searcher@7aa92d02[collection1] realtime]
   [junit4]   2> 12397 INFO  (TEST-AutoCommitTest.testMaxDocs-seed#[E340D1DD29F96FEA]) [    ] o.a.s.u.p.LogUpdateProcessorFactory [collection1]  webapp=null path=null params={_version_=-9223372036854775807&update.distrib=FROMLEADER&versions=true&wt=json&indent=true}{deleteByQuery=*:* (-9223372036854775807)} 0 3
   [junit4]   2> 12398 ERROR (TEST-AutoCommitTest.testMaxDocs-seed#[E340D1DD29F96FEA]) [    ] o.a.s.c.CorePropertiesLocator Couldn't load core descriptor from /home/jenkins/workspace/Lucene-Solr-6.6-Linux/solr/core/src/test-files/solr/collection1/core.properties:java.nio.file.NoSuchFileException: /home/jenkins/workspace/Lucene-Solr-6.6-Linux/solr/core/src/test-files/solr/collection1/core.properties
   [junit4]   2> 12398 INFO  (TEST-AutoCommitTest.testMaxDocs-seed#[E340D1DD29F96FEA]) [    ] o.a.s.c.SolrResourceLoader [null] Added 2 libs to classloader, from paths: [/home/jenkins/workspace/Lucene-Solr-6.6-Linux/solr/core/src/test-files/solr/collection1/lib, /home/jenkins/workspace/Lucene-Solr-6.6-Linux/solr/core/src/test-files/solr/collection1/lib/classes]
   [junit4]   2> 12422 WARN  (TEST-AutoCommitTest.testMaxDocs-seed#[E340D1DD29F96FEA]) [    ] o.a.s.c.Config Beginning with Solr 5.5, <mergePolicy> is deprecated, use <mergePolicyFactory> instead.
   [junit4]   2> 12424 INFO  (TEST-AutoCommitTest.testMaxDocs-seed#[E340D1DD29F96FEA]) [    ] o.a.s.c.SolrConfig Using Lucene MatchVersion: 6.6.1
   [junit4]   2> 12455 INFO  (TEST-AutoCommitTest.testMaxDocs-seed#[E340D1DD29F96FEA]) [    ] o.a.s.s.IndexSchema [collection1] Schema name=test
   [junit4]   2> 12573 INFO  (TEST-AutoCommitTest.testMaxDocs-seed#[E340D1DD29F96FEA]) [    ] o.a.s.s.IndexSchema Loaded schema test/1.0 with uniqueid field id
   [junit4]   2> 12581 INFO  (TEST-AutoCommitTest.testMaxDocs-seed#[E340D1DD29F96FEA]) [    ] o.a.s.c.CoreContainer Reloading SolrCore 'collection1' using configuration from instancedir /home/jenkins/workspace/Lucene-Solr-6.6-Linux/solr/core/src/test-files/solr/collection1
   [junit4]   2> 12581 WARN  (TEST-AutoCommitTest.testMaxDocs-seed#[E340D1DD29F96FEA]) [    ] o.a.s.m.r.SolrJmxReporter No JMX server found. Not exposing Solr metrics via JMX.
   [junit4]   2> 12581 INFO  (TEST-AutoCommitTest.testMaxDocs-seed#[E340D1DD29F96FEA]) [    ] o.a.s.m.SolrMetricManager Replacing existing reporter 'default' in registry 'solr.core.collection1': [org.apache.solr.metrics.reporters.SolrJmxReporter@c92a910: rootName = null, domain = solr.core.collection1, service url = null, agent id = null]
   [junit4]   2> 12582 INFO  (TEST-AutoCommitTest.testMaxDocs-seed#[E340D1DD29F96FEA]) [    ] o.a.s.m.r.SolrJmxReporter Closing reporter [org.apache.solr.metrics.reporters.SolrJmxReporter@c92a910: rootName = null, domain = solr.core.collection1, service url = null, agent id = null] for registry solr.core.collection1 / null
   [junit4]   2> 12582 INFO  (TEST-AutoCommitTest.testMaxDocs-seed#[E340D1DD29F96FEA]) [    ] o.a.s.c.SolrCore [[collection1] ] Opening new SolrCore at [/home/jenkins/workspace/Lucene-Solr-6.6-Linux/solr/core/src/test-files/solr/collection1], dataDir=[/home/jenkins/workspace/Lucene-Solr-6.6-Linux/solr/build/solr-core/test/J2/temp/solr.update.AutoCommitTest_E340D1DD29F96FEA-001/init-core-data-001/]
   [junit4]   2> 12625 INFO  (TEST-AutoCommitTest.testMaxDocs-seed#[E340D1DD29F96FEA]) [    ] o.a.s.u.CommitTracker Hard AutoCommit: disabled
   [junit4]   2> 12625 INFO  (TEST-AutoCommitTest.testMaxDocs-seed#[E340D1DD29F96FEA]) [    ] o.a.s.u.CommitTracker Soft AutoCommit: disabled
   [junit4]   2> 12625 INFO  (TEST-AutoCommitTest.testMaxDocs-seed#[E340D1DD29F96FEA]) [    ] o.a.s.s.SolrIndexSearcher Opening [Searcher@35f7eca8[collection1] main]
   [junit4]   2> 12626 INFO  (TEST-AutoCommitTest.testMaxDocs-seed#[E340D1DD29F96FEA]) [    ] o.a.s.h.c.SpellCheckComponent Initializing spell checkers
   [junit4]   2> 12626 INFO  (TEST-AutoCommitTest.testMaxDocs-seed#[E340D1DD29F96FEA]) [    ] o.a.s.s.DirectSolrSpellChecker init: {name=direct,classname=DirectSolrSpellChecker,field=lowerfilt,minQueryLength=3}
   [junit4]   2> 12629 INFO  (TEST-AutoCommitTest.testMaxDocs-seed#[E340D1DD29F96FEA]) [    ] o.a.s.h.ReplicationHandler Commits will be reserved for  10000
   [junit4]   2> 12629 INFO  (TEST-AutoCommitTest.testMaxDocs-seed#[E340D1DD29F96FEA]) [    ] o.a.s.u.UpdateLog Could not find max version in index or recent updates, using new clock 1576803387685470208
   [junit4]   2> 12633 INFO  (TEST-AutoCommitTest.testMaxDocs-seed#[E340D1DD29F96FEA]) [    ] o.a.s.u.RandomMergePolicy RandomMergePolicy wrapping class org.apache.lucene.index.TieredMergePolicy: [TieredMergePolicy: maxMergeAtOnce=50, maxMergeAtOnceExplicit=35, maxMergedSegmentMB=67.90234375, floorSegmentMB=2.1865234375, forceMergeDeletesPctAllowed=7.40558603660597, segmentsPerTier=10.0, maxCFSSegmentSizeMB=8.796093022207999E12, noCFSRatio=0.35281227474089694
   [junit4]   2> 12633 INFO  (TEST-AutoCommitTest.testMaxDocs-seed#[E340D1DD29F96FEA]) [    ] o.a.s.u.DefaultSolrCoreState New IndexWriter is ready to be used.
   [junit4]   2> 12633 INFO  (searcherExecutor-157-thread-1) [    ] o.a.s.h.c.SpellCheckComponent Loading spell index for spellchecker: default
   [junit4]   2> 12634 INFO  (searcherExecutor-157-thread-1) [    ] o.a.s.h.c.SpellCheckComponent Loading spell index for spellchecker: direct
   [junit4]   2> 12634 INFO  (searcherExecutor-157-thread-1) [    ] o.a.s.h.c.SpellCheckComponent Loading spell index for spellchecker: wordbreak
   [junit4]   2> 12634 INFO  (searcherExecutor-157-thread-1) [    ] o.a.s.h.c.SpellCheckComponent Loading spell index for spellchecker: multipleFields
   [junit4]   2> 12634 INFO  (searcherExecutor-157-thread-1) [    ] o.a.s.h.c.SpellCheckComponent Loading spell index for spellchecker: jarowinkler
   [junit4]   2> 12636 INFO  (searcherExecutor-157-thread-1) [    ] o.a.s.h.c.SpellCheckComponent Loading spell index for spellchecker: external
   [junit4]   2> 12636 INFO  (searcherExecutor-157-thread-1) [    ] o.a.s.h.c.SpellCheckComponent Loading spell index for spellchecker: freq
   [junit4]   2> 12637 INFO  (searcherExecutor-157-thread-1) [    ] o.a.s.h.c.SpellCheckComponent Loading spell index for spellchecker: fqcn
   [junit4]   2> 12638 INFO  (searcherExecutor-157-thread-1) [    ] o.a.s.h.c.SpellCheckComponent Loading spell index for spellchecker: perDict
   [junit4]   2> 12638 INFO  (searcherExecutor-157-thread-1) [    ] o.a.s.c.SolrCore [collection1] Registered new searcher Searcher@35f7eca8[collection1] main{ExitableDirectoryReader(UninvertingDirectoryReader())}
   [junit4]   2> 12639 INFO  (TEST-AutoCommitTest.testMaxDocs-seed#[E340D1DD29F96FEA]) [    ] o.a.s.s.SolrIndexSearcher Opening [Searcher@2db7ca54[collection1] main]
   [junit4]   2> 12640 INFO  (TEST-AutoCommitTest.testMaxDocs-seed#[E340D1DD29F96FEA]) [    ] o.a.s.c.SolrCore [collection1]  CLOSING SolrCore org.apache.solr.core.SolrCore@3bfd1557
   [junit4]   2> 12640 INFO  (TEST-AutoCommitTest.testMaxDocs-seed#[E340D1DD29F96FEA]) [    ] o.a.s.m.SolrMetricManager Closing metric reporters for: solr.core.collection1
   [junit4]   2> 12640 INFO  (TEST-AutoCommitTest.testMaxDocs-seed#[E340D1DD29F96FEA]) [    ] o.a.s.m.r.SolrJmxReporter Closing reporter [org.apache.solr.metrics.reporters.SolrJmxReporter@1a667b3: rootName = null, domain = solr.core.collection1, service url = null, agent id = null] for registry solr.core.collection1 / null
   [junit4]   2> 12642 INFO  (searcherExecutor-157-thread-1) [    ] o.a.s.c.SolrCore [collection1] Registered new searcher Searcher@2db7ca54[collection1] main{ExitableDirectoryReader(UninvertingDirectoryReader())}
   [junit4]   2> 12671 INFO  (TEST-AutoCommitTest.testMaxDocs-seed#[E340D1DD29F96FEA]) [    ] o.a.s.u.p.LogUpdateProcessorFactory [collection1] {add=[0 (1576803387702247424)]} 0 28
   [junit4]   2> 12672 INFO  (TEST-AutoCommitTest.testMaxDocs-seed#[E340D1DD29F96FEA]) [    ] o.a.s.u.p.LogUpdateProcessorFactory [collection1] {add=[1 (1576803387729510400)]} 0 29
   [junit4]   2> 12673 INFO  (TEST-AutoCommitTest.testMaxDocs-seed#[E340D1DD29F96FEA]) [    ] o.a.s.u.p.LogUpdateProcessorFactory [collection1] {add=[2 (1576803387730558976)]} 0 30
   [junit4]   2> 12674 INFO  (TEST-AutoCommitTest.testMaxDocs-seed#[E340D1DD29F96FEA]) [    ] o.a.s.u.p.LogUpdateProcessorFactory [collection1] {add=[3 (1576803387731607552)]} 0 31
   [junit4]   2> 12674 INFO  (TEST-AutoCommitTest.testMaxDocs-seed#[E340D1DD29F96FEA]) [    ] o.a.s.u.p.LogUpdateProcessorFactory [collection1] {add=[4 (1576803387732656128)]} 0 32
   [junit4]   2> 12675 INFO  (TEST-AutoCommitTest.testMaxDocs-seed#[E340D1DD29F96FEA]) [    ] o.a.s.u.p.LogUpdateProcessorFactory [collection1] {add=[5 (1576803387733704704)]} 0 32
   [junit4]   2> 12676 INFO  (TEST-AutoCommitTest.testMaxDocs-seed#[E340D1DD29F96FEA]) [    ] o.a.s.u.p.LogUpdateProcessorFactory [collection1] {add=[6 (1576803387733704705)]} 0 33
   [junit4]   2> 12676 INFO  (TEST-AutoCommitTest.testMaxDocs-seed#[E340D1DD29F96FEA]) [    ] o.a.s.u.p.LogUpdateProcessorFactory [collection1] {add=[7 (1576803387734753280)]} 0 34
   [junit4]   2> 12677 INFO  (TEST-AutoCommitTest.testMaxDocs-seed#[E340D1DD29F96FEA]) [    ] o.a.s.u.p.LogUpdateProcessorFactory [collection1] {add=[8 (1576803387735801856)]} 0 34
   [junit4]   2> 12678 INFO  (TEST-AutoCommitTest.testMaxDocs-seed#[E340D1DD29F96FEA]) [    ] o.a.s.u.p.LogUpdateProcessorFactory [collection1] {add=[9 (1576803387735801857)]} 0 35
   [junit4]   2> 12679 INFO  (TEST-AutoCommitTest.testMaxDocs-seed#[E340D1DD29F96FEA]) [    ] o.a.s.u.p.LogUpdateProcessorFactory [collection1] {add=[10 (1576803387736850432)]} 0 36
   [junit4]   2> 12680 INFO  (TEST-AutoCommitTest.testMaxDocs-seed#[E340D1DD29F96FEA]) [    ] o.a.s.u.p.LogUpdateProcessorFactory [collection1] {add=[11 (1576803387737899008)]} 0 37
   [junit4]   2> 12680 INFO  (TEST-AutoCommitTest.testMaxDocs-seed#[E340D1DD29F96FEA]) [    ] o.a.s.u.p.LogUpdateProcessorFactory [collection1] {add=[12 (1576803387738947584)]} 0 37
   [junit4]   2> 12681 INFO  (TEST-AutoCommitTest.testMaxDocs-seed#[E340D1DD29F96FEA]) [    ] o.a.s.u.p.LogUpdateProcessorFactory [collection1] {add=[13 (1576803387738947585)]} 0 38
   [junit4]   2> 12682 INFO  (TEST-AutoCommitTest.testMaxDocs-seed#[E340D1DD29F96FEA]) [    ] o.a.s.c.S.Request [collection1]  webapp=null path=null params={q=id:1&qt=standard&start=0&rows=20&version=2.2} hits=0 status=0 QTime=0
   [junit4]   2> 12691 INFO  (TEST-AutoCommitTest.testMaxDocs-seed#[E340D1DD29F96FEA]) [    ] o.a.s.u.p.LogUpdateProcessorFactory [collection1] {add=[14 (1576803387743141888)]} 0 48
   [junit4]   2> 12691 INFO  (commitScheduler-160-thread-1) [    ] o.a.s.u.DirectUpdateHandler2 start commit{,optimize=false,openSearcher=true,waitSearcher=true,expungeDeletes=false,softCommit=true,prepareCommit=false}
   [junit4]   2> 12694 INFO  (TEST-AutoCommitTest.testMaxDocs-seed#[E340D1DD29F96FEA]) [    ] o.a.s.u.p.LogUpdateProcessorFactory [collection1] {add=[15 (1576803387751530496)]} 0 51
   [junit4]   2> 12694 INFO  (TEST-AutoCommitTest.testMaxDocs-seed#[E340D1DD29F96FEA]) [    ] o.a.s.c.S.Request [collection1]  webapp=null path=null params={q=id:14&qt=standard&start=0&rows=20&version=2.2} hits=0 status=0 QTime=0
   [junit4]   2> 12697 ERROR (TEST-AutoCommitTest.testMaxDocs-seed#[E340D1DD29F96FEA]) [    ] o.a.s.SolrTestCaseJ4 REQUEST FAILED: xpath=//result[@numFound=1]
   [junit4]   2> 	xml response was: <?xml version="1.0" encoding="UTF-8"?>
   [junit4]   2> <response>
   [junit4]   2> <lst name="responseHeader"><int name="status">0</int><int name="QTime">0</int></lst><result name="response" numFound="0" start="0"></result>
   [junit4]   2> </response>
   [junit4]   2> 
   [junit4]   2> 	request was:q=id:14&qt=standard&start=0&rows=20&version=2.2
   [junit4]   2> 12698 ERROR (TEST-AutoCommitTest.testMaxDocs-seed#[E340D1DD29F96FEA]) [    ] o.a.s.SolrTestCaseJ4 REQUEST FAILED: q=id:14&qt=standard&start=0&rows=20&version=2.2:java.lang.RuntimeException: REQUEST FAILED: xpath=//result[@numFound=1]
   [junit4]   2> 	xml response was: <?xml version="1.0" encoding="UTF-8"?>
   [junit4]   2> <response>
   [junit4]   2> <lst name="responseHeader"><int name="status">0</int><int name="QTime">0</int></lst><result name="response" numFound="0" start="0"></result>
   [junit4]   2> </response>
   [junit4]   2> 
   [junit4]   2> 	request was:q=id:14&qt=standard&start=0&rows=20&version=2.2
   [junit4]   2> 	at org.apache.solr.SolrTestCaseJ4.assertQ(SolrTestCaseJ4.java:888)
   [junit4]   2> 	at org.apache.solr.update.AutoCommitTest.testMaxDocs(AutoCommitTest.java:225)
   [junit4]   2> 	at java.base/jdk.internal.reflect.NativeMethodAccessorImpl.invoke0(Native Method)
   [junit4]   2> 	at java.base/jdk.internal.reflect.NativeMethodAccessorImpl.invoke(NativeMethodAccessorImpl.java:62)
   [junit4]   2> 	at java.base/jdk.internal.reflect.DelegatingMethodAccessorImpl.invoke(DelegatingMethodAccessorImpl.java:43)
   [junit4]   2> 	at java.base/java.lang.reflect.Method.invoke(Method.java:564)
   [junit4]   2> 	at com.carrotsearch.randomizedtesting.RandomizedRunner.invoke(RandomizedRunner.java:1713)
   [junit4]   2> 	at com.carrotsearch.randomizedtesting.RandomizedRunner$8.evaluate(RandomizedRunner.java:907)
   [junit4]   2> 	at com.carrotsearch.randomizedtesting.RandomizedRunner$9.evaluate(RandomizedRunner.java:943)
   [junit4]   2> 	at com.carrotsearch.randomizedtesting.RandomizedRunner$10.evaluate(RandomizedRunner.java:957)
   [junit4]   2> 	at com.carrotsearch.randomizedtesting.rules.SystemPropertiesRestoreRule$1.evaluate(SystemPropertiesRestoreRule.java:57)
   [junit4]   2> 	at org.apache.lucene.util.TestRuleSetupTeardownChained$1.evaluate(TestRuleSetupTeardownChained.java:49)
   [junit4]   2> 	at org.apache.lucene.util.AbstractBeforeAfterRule$1.evaluate(AbstractBeforeAfterRule.java:45)
   [junit4]   2> 	at org.apache.lucene.util.TestRuleThreadAndTestName$1.evaluate(TestRuleThreadAndTestName.java:48)
   [junit4]   2> 	at org.apache.lucene.util.TestRuleIgnoreAfterMaxFailures$1.evaluate(TestRuleIgnoreAfterMaxFailures.java:64)
   [junit4]   2> 	at org.apache.lucene.util.TestRuleMarkFailure$1.evaluate(TestRuleMarkFailure.java:47)
   [junit4]   2> 	at com.carrotsearch.randomizedtesting.rules.StatementAdapter.evaluate(StatementAdapter.java:36)
   [junit4]   2> 	at com.carrotsearch.randomizedtesting.ThreadLeakControl$StatementRunner.run(ThreadLeakControl.java:368)
   [junit4]   2> 	at com.carrotsearch.randomizedtesting.ThreadLeakControl.forkTimeoutingTask(ThreadLeakControl.java:817)
   [junit4]   2> 	at com.carrotsearch.randomizedtesting.ThreadLeakControl$3.evaluate(ThreadLeakControl.java:468)
   [junit4]   2> 	at com.carrotsearch.randomizedtesting.RandomizedRunner.runSingleTest(RandomizedRunner.java:916)
   [junit4]   2> 	at com.carrotsearch.randomizedtesting.RandomizedRunner$5.evaluate(RandomizedRunner.java:802)
   [junit4]   2> 	at com.carrotsearch.randomizedtesting.RandomizedRunner$6.evaluate(RandomizedRunner.java:852)
   [junit4]   2> 	at com.carrotsearch.randomizedtesting.RandomizedRunner$7.evaluate(RandomizedRunner.java:863)
   [junit4]   2> 	at com.carrotsearch.randomizedtesting.rules.StatementAdapter.evaluate(StatementAdapter.java:36)
   [junit4]   2> 	at com.carrotsearch.randomizedtesting.rules.SystemPropertiesRestoreRule$1.evaluate(SystemPropertiesRestoreRule.java:57)
   [junit4]   2> 	at org.apache.lucene.util.AbstractBeforeAfterRule$1.evaluate(AbstractBeforeAfterRule.java:45)
   [junit4]   2> 	at com.carrotsearch.randomizedtesting.rules.StatementAdapter.evaluate(StatementAdapter.java:36)
   [junit4]   2> 	at org.apache.lucene.util.TestRuleStoreClassName$1.evaluate(TestRuleStoreClassName.java:41)
   [junit4]   2> 	at com.carrotsearch.randomizedtesting.rules.NoShadowingOrOverridesOnMethodsRule$1.evaluate(NoShadowingOrOverridesOnMethodsRule.java:40)
   [junit4]   2> 	at com.carrotsearch.randomizedtesting.rules.NoShadowingOrOverridesOnMethodsRule$1.evaluate(NoShadowingOrOverridesOnMethodsRule.java:40)
   [junit4]   2> 	at com.carrotsearch.randomizedtesting.rules.StatementAdapter.evaluate(StatementAdapter.java:36)
   [junit4]   2> 	at com.carrotsearch.randomizedtesting.rules.StatementAdapter.evaluate(StatementAdapter.java:36)
   [junit4]   2> 	at org.apache.lucene.util.TestRuleAssertionsRequired$1.evaluate(TestRuleAssertionsRequired.java:53)
   [junit4]   2> 	at org.apache.lucene.util.TestRuleMarkFailure$1.evaluate(TestRuleMarkFailure.java:47)
   [junit4]   2> 	at org.apache.lucene.util.TestRuleIgnoreAfterMaxFailures$1.evaluate(TestRuleIgnoreAfterMaxFailures.java:64)
   [junit4]   2> 	at org.apache.lucene.util.TestRuleIgnoreTestSuites$1.evaluate(TestRuleIgnoreTestSuites.java:54)
   [junit4]   2> 	at com.carrotsearch.randomizedtesting.rules.StatementAdapter.evaluate(StatementAdapter.java:36)
   [junit4]   2> 	at com.carrotsearch.randomizedtesting.ThreadLeakControl$StatementRunner.run(ThreadLeakControl.java:368)
   [junit4]   2> 	at java.base/java.lang.Thread.run(Thread.java:844)
   [junit4]   2> 
   [junit4]   2> 12698 INFO  (TEST-AutoCommitTest.testMaxDocs-seed#[E340D1DD29F96FEA]) [    ] o.a.s.SolrTestCaseJ4 ###Ending testMaxDocs
   [junit4]   2> NOTE: reproduce with: ant test  -Dtestcase=AutoCommitTest -Dtests.method=testMaxDocs -Dtests.seed=E340D1DD29F96FEA -Dtests.multiplier=3 -Dtests.slow=true -Dtests.locale=nb -Dtests.timezone=Africa/Tripoli -Dtests.asserts=true -Dtests.file.encoding=US-ASCII
   [junit4] ERROR   0.31s J2 | AutoCommitTest.testMaxDocs <<<
   [junit4]    > Throwable #1: java.lang.RuntimeException: Exception during query
   [junit4]    > 	at __randomizedtesting.SeedInfo.seed([E340D1DD29F96FEA:5AC1070205136B60]:0)
   [junit4]    > 	at org.apache.solr.SolrTestCaseJ4.assertQ(SolrTestCaseJ4.java:895)
   [junit4]    > 	at org.apache.solr.update.AutoCommitTest.testMaxDocs(AutoCommitTest.java:225)
   [junit4]    > 	at java.base/jdk.internal.reflect.NativeMethodAccessorImpl.invoke0(Native Method)
   [junit4]    > 	at java.base/jdk.internal.reflect.NativeMethodAccessorImpl.invoke(NativeMethodAccessorImpl.java:62)
   [junit4]    > 	at java.base/jdk.internal.reflect.DelegatingMethodAccessorImpl.invoke(DelegatingMethodAccessorImpl.java:43)
   [junit4]    > 	at java.base/java.lang.reflect.Method.invoke(Method.java:564)
   [junit4]    > 	at java.base/java.lang.Thread.run(Thread.java:844)
   [junit4]    > Caused by: java.lang.RuntimeException: REQUEST FAILED: xpath=//result[@numFound=1]
   [junit4]    > 	xml response was: <?xml version="1.0" encoding="UTF-8"?>
   [junit4]    > <response>
   [junit4]    > <lst name="responseHeader"><int name="status">0</int><int name="QTime">0</int></lst><result name="response" numFound="0" start="0"></result>
   [junit4]    > </response>
   [junit4]    > 	request was:q=id:14&qt=standard&start=0&rows=20&version=2.2
   [junit4]    > 	at org.apache.solr.SolrTestCaseJ4.assertQ(SolrTestCaseJ4.java:888)
   [junit4]    > 	... 39 more
   [junit4]   2> 12707 INFO  (TEST-AutoCommitTest.testCommitWithin-seed#[E340D1DD29F96FEA]) [    ] o.a.s.SolrTestCaseJ4 ###Starting testCommitWithin
   [junit4]   2> 12735 INFO  (commitScheduler-160-thread-1) [    ] o.a.s.s.SolrIndexSearcher Opening [Searcher@5e4934fb[collection1] main]
   [junit4]   2> 12736 INFO  (commitScheduler-160-thread-1) [    ] o.a.s.u.DirectUpdateHandler2 end_commit_flush
   [junit4]   2> 12738 INFO  (searcherExecutor-157-thread-1) [    ] o.a.s.c.SolrCore [collection1] Registered new searcher Searcher@5e4934fb[collection1] main{ExitableDirectoryReader(UninvertingDirectoryReader(Uninverting(_0(6.6.1):c15)))}
   [junit4]   2> 12738 INFO  (TEST-AutoCommitTest.testCommitWithin-seed#[E340D1DD29F96FEA]) [    ] o.a.s.u.DirectUpdateHandler2 [collection1] REMOVING ALL DOCUMENTS FROM INDEX
   [junit4]   2> 12738 INFO  (TEST-AutoCommitTest.testCommitWithin-seed#[E340D1DD29F96FEA]) [    ] o.a.s.s.SolrIndexSearcher Opening [Searcher@5dcc5aba[collection1] realtime]
   [junit4]   2> 12739 INFO  (TEST-AutoCommitTest.testCommitWithin-seed#[E340D1DD29F96FEA]) [    ] o.a.s.u.p.LogUpdateProcessorFactory [collection1]  webapp=null path=null params={_version_=-9223372036854775807&update.distrib=FROMLEADER&versions=true&wt=json&indent=true}{deleteByQuery=*:* (-9223372036854775807)} 0 31
   [junit4]   2> 12739 ERROR (TEST-AutoCommitTest.testCommitWithin-seed#[E340D1DD29F96FEA]) [    ] o.a.s.c.CorePropertiesLocator Couldn't load core descriptor from /home/jenkins/workspace/Lucene-Solr-6.6-Linux/solr/core/src/test-files/solr/collection1/core.properties:java.nio.file.NoSuchFileException: /home/jenkins/workspace/Lucene-Solr-6.6-Linux/solr/core/src/test-files/solr/collection1/core.properties
   [junit4]   2> 12740 INFO  (TEST-AutoCommitTest.testCommitWithin-seed#[E340D1DD29F96FEA]) [    ] o.a.s.c.SolrResourceLoader [null] Added 2 libs to classloader, from paths: [/home/jenkins/workspace/Lucene-Solr-6.6-Linux/solr/core/src/test-files/solr/collection1/lib, /home/jenkins/workspace/Lucene-Solr-6.6-Linux/solr/core/src/test-files/solr/collection1/lib/classes]
   [junit4]   2> 12761 WARN  (TEST-AutoCommitTest.testCommitWithin-seed#[E340D1DD29F96FEA]) [    ] o.a.s.c.Config Beginning with Solr 5.5, <mergePolicy> is deprecated, use <mergePolicyFactory> instead.
   [junit4]   2> 12762 INFO  (TEST-AutoCommitTest.testCommitWithin-seed#[E340D1DD29F96FEA]) [    ] o.a.s.c.SolrConfig Using Lucene MatchVersion: 6.6.1
   [junit4]   2> 12786 INFO  (TEST-AutoCommitTest.testCommitWithin-seed#[E340D1DD29F96FEA]) [    ] o.a.s.s.IndexSchema [collection1] Schema name=test
   [junit4]   2> 12913 INFO  (TEST-AutoCommitTest.testCommitWithin-seed#[E340D1DD29F96FEA]) [    ] o.a.s.s.IndexSchema Loaded schema test/1.0 with uniqueid field id
   [junit4]   2> 12924 INFO  (TEST-AutoCommitTest.testCommitWithin-seed#[E340D1DD29F96FEA]) [    ] o.a.s.c.CoreContainer Reloading SolrCore 'collection1' using configuration from instancedir /home/jenkins/workspace/Lucene-Solr-6.6-Linux/solr/core/src/test-files/solr/collection1
   [junit4]   2> 12925 WARN  (TEST-AutoCommitTest.testCommitWithin-seed#[E340D1DD29F96FEA]) [    ] o.a.s.m.r.SolrJmxReporter No JMX server found. Not exposing Solr metrics via JMX.
   [junit4]   2> 12925 INFO  (TEST-AutoCommitTest.testCommitWithin-seed#[E340D1DD29F96FEA]) [    ] o.a.s.c.SolrCore [[collection1] ] Opening new SolrCore at [/home/jenkins/workspace/Lucene-Solr-6.6-Linux/solr/core/src/test-files/solr/collection1], dataDir=[/home/jenkins/workspace/Lucene-Solr-6.6-Linux/solr/build/solr-core/test/J2/temp/solr.update.AutoCommitTest_E340D1DD29F96FEA-001/init-core-data-001/]
   [junit4]   2> 12961 INFO  (TEST-AutoCommitTest.testCommitWithin-seed#[E340D1DD29F96FEA]) [    ] o.a.s.u.CommitTracker Hard AutoCommit: disabled
   [junit4]   2> 12961 INFO  (TEST-AutoCommitTest.testCommitWithin-seed#[E340D1DD29F96FEA]) [    ] o.a.s.u.CommitTracker Soft AutoCommit: disabled
   [junit4]   2> 12961 INFO  (TEST-AutoCommitTest.testCommitWithin-seed#[E340D1DD29F96FEA]) [    ] o.a.s.s.SolrIndexSearcher Opening [Searcher@6ac080bb[collection1] main]
   [junit4]   2> 12962 INFO  (TEST-AutoCommitTest.testCommitWithin-seed#[E340D1DD29F96FEA]) [    ] o.a.s.h.c.SpellCheckComponent Initializing spell checkers
   [junit4]   2> 12963 INFO  (TEST-AutoCommitTest.testCommitWithin-seed#[E340D1DD29F96FEA]) [    ] o.a.s.s.DirectSolrSpellChecker init: {name=direct,classname=DirectSolrSpellChecker,field=lowerfilt,minQueryLength=3}
   [junit4]   2> 12965 INFO  (TEST-AutoCommitTest.testCommitWithin-seed#[E340D1DD29F96FEA]) [    ] o.a.s.h.ReplicationHandler Commits will be reserved for  10000
   [junit4]   2> 12965 INFO  (searcherExecutor-161-thread-1) [    ] o.a.s.h.c.SpellCheckComponent Loading spell index for spellchecker: default
   [junit4]   2> 12967 INFO  (searcherExecutor-161-thread-1) [    ] o.a.s.h.c.SpellCheckComponent Loading spell index for spellchecker: direct
   [junit4]   2> 12967 INFO  (searcherExecutor-161-thread-1) [    ] o.a.s.h.c.SpellCheckComponent Loading spell index for spellchecker: wordbreak
   [junit4]   2> 12967 INFO  (searcherExecutor-161-thread-1) [    ] o.a.s.h.c.SpellCheckComponent Loading spell index for spellchecker: multipleFields
   [junit4]   2> 12968 INFO  (searcherExecutor-161-thread-1) [    ] o.a.s.h.c.SpellCheckComponent Loading spell index for spellchecker: jarowinkler
   [junit4]   2> 12968 INFO  (searcherExecutor-161-thread-1) [    ] o.a.s.h.c.SpellCheckComponent Loading spell index for spellchecker: external
   [junit4]   2> 12968 INFO  (TEST-AutoCommitTest.testCommitWithin-seed#[E340D1DD29F96FEA]) [    ] o.a.s.u.RandomMergePolicy RandomMergePolicy wrapping class org.apache.lucene.index.TieredMergePolicy: [TieredMergePolicy: maxMergeAtOnce=25, maxMergeAtOnceExplicit=49, maxMergedSegmentMB=58.0498046875, floorSegmentMB=2.142578125, forceMergeDeletesPctAllowed=28.601901132901663, segmentsPerTier=20.0, maxCFSSegmentSizeMB=8.796093022207999E12, noCFSRatio=0.0
   [junit4]   2> 12968 INFO  (searcherExecutor-161-thread-1) [    ] o.a.s.h.c.SpellCheckComponent Loading spell index for spellchecker: freq
   [junit4]   2> 12968 INFO  (searcherExecutor-161-thread-1) [    ] o.a.s.h.c.SpellCheckComponent Loading spell index for spellchecker: fqcn
   [junit4]   2> 12969 INFO  (searcherExecutor-161-thread-1) [    ] o.a.s.h.c.SpellCheckComponent Loading spell index for spellchecker: perDict
   [junit4]   2> 12969 INFO  (searcherExecutor-161-thread-1) [    ] o.a.s.c.SolrCore [collection1] Registered new searcher Searcher@6ac080bb[collection1] main{ExitableDirectoryReader(UninvertingDirectoryReader())}
   [junit4]   2> 12969 INFO  (TEST-AutoCommitTest.testCommitWithin-seed#[E340D1DD29F96FEA]) [    ] o.a.s.u.DefaultSolrCoreState New IndexWriter is ready to be used.
   [junit4]   2> 12969 INFO  (TEST-AutoCommitTest.testCommitWithin-seed#[E340D1DD29F96FEA]) [    ] o.a.s.s.SolrIndexSearcher Opening [Searcher@526e4b78[collection1] main]
   [junit4]   2> 12969 INFO  (TEST-AutoCommitTest.testCommitWithin-seed#[E340D1DD29F96FEA]) [    ] o.a.s.c.SolrCore [collection1]  CLOSING SolrCore org.apache.solr.core.SolrCore@784aab17
   [junit4]   2> 12969 INFO  (searcherExecutor-161-thread-1) [    ] o.a.s.c.SolrCore [collection1] Registered new searcher Searcher@526e4b78[collection1] main{ExitableDirectoryReader(UninvertingDirectoryReader())}
   [junit4]   2> 12970 INFO  (TEST-AutoCommitTest.testCommitWithin-seed#[E340D1DD29F96FEA]) [    ] o.a.s.m.SolrMetricManager Closing metric reporters for: solr.core.collection1
   [junit4]   2> 12970 INFO  (TEST-AutoCommitTest.testCommitWithin-seed#[E340D1DD29F96FEA]) [    ] o.a.s.m.r.SolrJmxReporter Closing reporter [org.apache.solr.metrics.reporters.SolrJmxReporter@336d529d: rootName = null, domain = solr.core.collection1, service url = null, agent id = null] for registry solr.core.collection1 / null
   [junit4]   2> 12973 INFO  (TEST-AutoCommitTest.testCommitWithin-seed#[E340D1DD29F96FEA]) [    ] o.a.s.u.p.LogUpdateProcessorFactory [collection1] {add=[529 (1576803388044083200)]} 0 1
   [junit4]   2> 12973 INFO  (TEST-AutoCommitTest.testCommitWithin-seed#[E340D1DD29F96FEA]) [    ] o.a.s.c.S.Request [collection1]  webapp=null path=null params={q=id:529&qt=standard&start=0&rows=20&version=2.2} hits=0 status=0 QTime=0
   [junit4]   2> 16973 INFO  (commitScheduler-164-thread-1) [    ] o.a.s.u.DirectUpdateHandler2 start commit{,optimize=false,openSearcher=true,waitSearcher=true,expungeDeletes=false,softCommit=true,prepareCommit=false}
   [junit4]   2> 16982 INFO  (commitScheduler-164-thread-1) [    ] o.a.s.s.SolrIndexSearcher Opening [Searcher@4dc606df[collection1] main]
   [junit4]   2> 16982 INFO  (commitScheduler-164-thread-1) [    ] o.a.s.u.DirectUpdateHandler2 end_commit_flush
   [junit4]   2> 16983 INFO  (searcherExecutor-161-thread-1) [    ] o.a.s.c.SolrCore [collection1] Registered new searcher Searcher@4dc606df[collection1] main{ExitableDirectoryReader(UninvertingDirectoryReader(Uninverting(_2(6.6.1):c1)))}
   [junit4]   2> 17228 INFO  (TEST-AutoCommitTest.testCommitWithin-seed#[E340D1DD29F96FEA]) [    ] o.a.s.u.p.LogUpdateProcessorFactory [collection1] {add=[530 (1576803392505774080)]} 0 4256
   [junit4]   2> 17229 INFO  (TEST-AutoCommitTest.testCommitWithin-seed#[E340D1DD29F96FEA]) [    ] o.a.s.c.S.Request [collection1]  webapp=null path=null params={q=id:530&qt=standard&start=0&rows=20&version=2.2} hits=0 status=0 QTime=0
   [junit4]   2> 17231 INFO  (TEST-AutoCommitTest.testCommitWithin-seed#[E340D1DD29F96FEA]) [    ] o.a.s.u.p.LogUpdateProcessorFactory [collection1] {delete=[529 (-1576803392509968384)]} 0 4259
   [junit4]   2> 17231 INFO  (TEST-AutoCommitTest.testCommitWithin-seed#[E340D1DD29F96FEA]) [    ] o.a.s.c.S.Request [collection1]  webapp=null path=null params={q=id:529&qt=standard&start=0&rows=20&version=2.2} hits=1 status=0 QTime=0
   [junit4]   2> 18231 INFO  (commitScheduler-164-thread-1) [    ] o.a.s.u.DirectUpdateHandler2 start commit{,optimize=false,openSearcher=true,waitSearcher=true,expungeDeletes=false,softCommit=true,prepareCommit=false}
   [junit4]   2> 18244 INFO  (commitScheduler-164-thread-1) [    ] o.a.s.s.SolrIndexSearcher Opening [Searcher@46d7bf98[collection1] main]
   [junit4]   2> 18245 INFO  (commitScheduler-164-thread-1) [    ] o.a.s.u.DirectUpdateHandler2 end_commit_flush
   [junit4]   2> 18246 INFO  (searcherExecutor-161-thread-1) [    ] o.a.s.c.SolrCore [collection1] Registered new searcher Searcher@46d7bf98[collection1] main{ExitableDirectoryReader(UninvertingDirectoryReader(Uninverting(_3(6.6.1):c1)))}
   [junit4]   2> 18488 INFO  (TEST-AutoCommitTest.testCommitWithin-seed#[E340D1DD29F96FEA]) [    ] o.a.s.c.S.Request [collection1]  webapp=null path=null params={q=id:529&qt=standard&start=0&rows=20&version=2.2} hits=0 status=0 QTime=0
   [junit4]   2> 18489 INFO  (TEST-AutoCommitTest.testCommitWithin-seed#[E340D1DD29F96FEA]) [    ] o.a.s.c.S.Request [collection1]  webapp=null path=null params={q=id:530&qt=standard&start=0&rows=20&version=2.2} hits=1 status=0 QTime=0
   [junit4]   2> 18490 INFO  (TEST-AutoCommitTest.testCommitWithin-seed#[E340D1DD29F96FEA]) [    ] o.a.s.u.p.LogUpdateProcessorFactory [collection1] {add=[500 (1576803393830125568)]} 0 5519
   [junit4]   2> 18490 INFO  (TEST-AutoCommitTest.testCommitWithin-seed#[E340D1DD29F96FEA]) [    ] o.a.s.u.p.LogUpdateProcessorFactory [collection1] {add=[500 (1576803393831174144)]} 0 5519
   [junit4]   2> 18491 INFO  (TEST-AutoCommitTest.testCommitWithin-seed#[E340D1DD29F96FEA]) [    ] o.a.s.u.p.LogUpdateProcessorFactory [collection1] {add=[500 (1576803393832222720)]} 0 5519
   [junit4]   2> 18491 INFO  (TEST-AutoCommitTest.testCommitWithin-seed#[E340D1DD29F96FEA]) [    ] o.a.s.u.p.LogUpdateProcessorFactory [collection1] {add=[500 (1576803393832222721)]} 0 5520
   [junit4]   2> 18491 INFO  (TEST-AutoCommitTest.testCommitWithin-seed#[E340D1DD29F96FEA]) [    ] o.a.s.u.p.LogUpdateProcessorFactory [collection1] {add=[500 (1576803393832222722)]} 0 5520
   [junit4]   2> 18492 INFO  (TEST-AutoCommitTest.testCommitWithin-seed#[E340D1DD29F96FEA]) [    ] o.a.s.u.p.LogUpdateProcessorFactory [collection1] {add=[500 (1576803393832222723)]} 0 5520
   [junit4]   2> 18492 INFO  (TEST-AutoCommitTest.testCommitWithin-seed#[E340D1DD29F96FEA]) [    ] o.a.s.u.p.LogUpdateProcessorFactory [collection1] {add=[500 (1576803393833271296)]} 0 5521
   [junit4]   2> 18492 INFO  (TEST-AutoCommitTest.testCommitWithin-seed#[E340D1DD29F96FEA]) [    ] o.a.s.u.p.LogUpdateProcessorFactory [collection1] {add=[500 (1576803393833271297)]} 0 5521
   [junit4]   2> 18493 INFO  (TEST-AutoCommitTest.testCommitWithin-seed#[E340D1DD29F96FEA]) [    ] o.a.s.u.p.LogUpdateProcessorFactory [collection1] {add=[500 (1576803393833271298)]} 0 5521
   [junit4]   2> 18493 INFO  (TEST-AutoCommitTest.testCommitWithin-seed#[E340D1DD29F96FEA]) [    ] o.a.s.u.p.LogUpdateProcessorFactory [collection1] {add=[500 (1576803393834319872)]} 0 5521
   [junit4]   2> 18493 INFO  (TEST-AutoCommitTest.testCommitWithin-seed#[E340D1DD29F96FEA]) [    ] o.a.s.c.S.Request [collection1]  webapp=null path=null params={q=id:500&qt=standard&start=0&rows=20&version=2.2} hits=0 status=0 QTime=0
   [junit4]   2> 18494 INFO  (TEST-AutoCommitTest.testCommitWithin-seed#[E340D1DD29F96FEA]) [    ] o.a.s.u.p.LogUpdateProcessorFactory [collection1] {delete=[530 (-1576803393835368448)]} 0 5522
   [junit4]   2> 18494 INFO  (TEST-AutoCommitTest.testCommitWithin-seed#[E340D1DD29F96FEA]) [    ] o.a.s.u.p.LogUpdateProcessorFactory [collection1] {delete=[530 (-1576803393835368449)]} 0 5523
   [junit4]   2> 18494 INFO  (TEST-AutoCommitTest.testCommitWithin-seed#[E340D1DD29F96FEA]) [    ] o.a.s.u.p.LogUpdateProcessorFactory [collection1] {delete=[530 (-1576803393835368450)]} 0 5523
   [junit4]   2> 18494 INFO  (TEST-AutoCommitTest.testCommitWithin-seed#[E340D1DD29F96FEA]) [    ] o.a.s.u.p.LogUpdateProcessorFactory [collection1] {delete=[530 (-1576803393835368451)]} 0 5523
   [junit4]   2> 18495 INFO  (TEST-AutoCommitTest.testCommitWithin-seed#[E340D1DD29F96FEA]) [    ] o.a.s.u.p.LogUpdateProcessorFactory [collection1] {delete=[530 (-1576803393835368452)]} 0 5523
   [junit4]   2> 18495 INFO  (TEST-AutoCommitTest.testCommitWithin-seed#[E340D1DD29F96FEA]) [    ] o.a.s.u.p.LogUpdateProcessorFactory [collection1] {delete=[530 (-1576803393836417024)]} 0 5523
   [junit4]   2> 18495 INFO  (TEST-AutoCommitTest.testCommitWithin-seed#[E340D1DD29F96FEA]) [    ] o.a.s.u.p.LogUpdateProcessorFactory [collection1] {delete=[530 (-1576803393836417025)]} 0 5523
   [junit4]   2> 18495 INFO  (TEST-AutoCommitTest.testCommitWithin-seed#[E340D1DD29F96FEA]) [    ] o.a.s.u.p.LogUpdateProcessorFactory [collection1] {delete=[530 (-1576803393836417026)]} 0 5524
   [junit4]   2> 18495 INFO  (TEST-AutoCommitTest.testCommitWithin-seed#[E340D1DD29F96FEA]) [    ] o.a.s.u.p.LogUpdateProcessorFactory [collection1] {delete=[530 (-1576803393836417027)]} 0 5524
   [junit4]   2> 18495 INFO  (TEST-AutoCommitTest.testCommitWithin-seed#[E340D1DD29F96FEA]) [    ] o.a.s.u.p.LogUpdateProcessorFactory [collection1] {delete=[530 (-1576803393836417028)]} 0 5524
   [junit4]   2> 18496 INFO  (TEST-AutoCommitTest.testCommitWithin-seed#[E340D1DD29F96FEA]) [    ] o.a.s.c.S.Request [collection1]  webapp=null path=null params={q=id:530&qt=standard&start=0&rows=20&version=2.2} hits=1 status=0 QTime=0
   [junit4]   2> 19494 INFO  (commitScheduler-164-thread-1) [    ] o.a.s.u.DirectUpdateHandler2 start commit{,optimize=false,openSearcher=true,waitSearcher=true,expungeDeletes=false,softCommit=true,prepareCommit=false}
   [junit4]   2> 19503 INFO  (commitScheduler-164-thread-1) [    ] o.a.s.s.SolrIndexSearcher Opening [Searcher@14823675[collection1] main]
   [junit4]   2> 19504 INFO  (commitScheduler-164-thread-1) [    ] o.a.s.u.DirectUpdateHandler2 end_commit_flush
   [junit4]   2> 19505 INFO  (searcherExecutor-161-thread-1) [    ] o.a.s.c.SolrCore [collection1] Registered new searcher Searcher@14823675[collection1] main{ExitableDirectoryReader(UninvertingDirectoryReader(Uninverting(_4(6.6.1):c10/9:delGen=1)))}
   [junit4]   2> 19747 INFO  (TEST-AutoCommitTest.testCommitWithin-seed#[E340D1DD29F96FEA]) [    ] o.a.s.c.S.Request [collection1]  webapp=null path=null params={q=id:500&qt=standard&start=0&rows=20&version=2.2} hits=1 status=0 QTime=0
   [junit4]   2> 19749 INFO  (TEST-AutoCommitTest.testCommitWithin-seed#[E340D1DD29F96FEA]) [    ] o.a.s.c.S.Request [collection1]  webapp=null path=null params={q=id:530&qt=standard&start=0&rows=20&version=2.2} hits=0 status=0 QTime=0
   [junit4]   2> 19750 INFO  (TEST-AutoCommitTest.testCommitWithin-seed#[E340D1DD29F96FEA]) [    ] o.a.s.SolrTestCaseJ4 ###Ending testCommitWithin
   [junit4]   2> 19753 INFO  (TEST-AutoCommitTest.testMaxTime-seed#[E340D1DD29F96FEA]) [    ] o.a.s.SolrTestCaseJ4 ###Starting testMaxTime
   [junit4]   2> 19754 INFO  (TEST-AutoCommitTest.testMaxTime-seed#[E340D1DD29F96FEA]) [    ] o.a.s.u.DirectUpdateHandler2 [collection1] REMOVING ALL DOCUMENTS FROM INDEX
   [junit4]   2> 19754 INFO  (TEST-AutoCommitTest.testMaxTime-seed#[E340D1DD29F96FEA]) [    ] o.a.s.s.SolrIndexSearcher Opening [Searcher@20763273[collection1] realtime]
   [junit4]   2> 19755 INFO  (TEST-AutoCommitTest.testMaxTime-seed#[

[...truncated too long message...]

[...truncated 3 lines...]
   [junit4] JVM J0: stderr was not empty, see: /home/jenkins/workspace/Lucene-Solr-6.6-Linux/solr/build/contrib/solr-analytics/test/temp/junit4-J0-20170826_145338_47613088274992352287224.syserr
   [junit4] >>> JVM J0 emitted unexpected output (verbatim) ----
   [junit4] Java HotSpot(TM) 64-Bit Server VM warning: Option UseConcMarkSweepGC was deprecated in version 9.0 and will likely be removed in a future release.
   [junit4] <<< JVM J0: EOF ----

[...truncated 3 lines...]
   [junit4] JVM J1: stderr was not empty, see: /home/jenkins/workspace/Lucene-Solr-6.6-Linux/solr/build/contrib/solr-analytics/test/temp/junit4-J1-20170826_145338_47611979584770619699131.syserr
   [junit4] >>> JVM J1 emitted unexpected output (verbatim) ----
   [junit4] Java HotSpot(TM) 64-Bit Server VM warning: Option UseConcMarkSweepGC was deprecated in version 9.0 and will likely be removed in a future release.
   [junit4] <<< JVM J1: EOF ----

[...truncated 499 lines...]
   [junit4] JVM J2: stderr was not empty, see: /home/jenkins/workspace/Lucene-Solr-6.6-Linux/solr/build/contrib/solr-clustering/test/temp/junit4-J2-20170826_145351_83211497226738493373188.syserr
   [junit4] >>> JVM J2 emitted unexpected output (verbatim) ----
   [junit4] Java HotSpot(TM) 64-Bit Server VM warning: Option UseConcMarkSweepGC was deprecated in version 9.0 and will likely be removed in a future release.
   [junit4] <<< JVM J2: EOF ----

[...truncated 3 lines...]
   [junit4] JVM J1: stderr was not empty, see: /home/jenkins/workspace/Lucene-Solr-6.6-Linux/solr/build/contrib/solr-clustering/test/temp/junit4-J1-20170826_145351_8324243340176158980816.syserr
   [junit4] >>> JVM J1 emitted unexpected output (verbatim) ----
   [junit4] Java HotSpot(TM) 64-Bit Server VM warning: Option UseConcMarkSweepGC was deprecated in version 9.0 and will likely be removed in a future release.
   [junit4] <<< JVM J1: EOF ----

[...truncated 3 lines...]
   [junit4] JVM J0: stderr was not empty, see: /home/jenkins/workspace/Lucene-Solr-6.6-Linux/solr/build/contrib/solr-clustering/test/temp/junit4-J0-20170826_145351_83215834932501391339282.syserr
   [junit4] >>> JVM J0 emitted unexpected output (verbatim) ----
   [junit4] Java HotSpot(TM) 64-Bit Server VM warning: Option UseConcMarkSweepGC was deprecated in version 9.0 and will likely be removed in a future release.
   [junit4] <<< JVM J0: EOF ----

[...truncated 1136 lines...]
   [junit4] JVM J1: stderr was not empty, see: /home/jenkins/workspace/Lucene-Solr-6.6-Linux/solr/build/contrib/solr-dataimporthandler-extras/test/temp/junit4-J1-20170826_145408_3297331294311807752069.syserr
   [junit4] >>> JVM J1 emitted unexpected output (verbatim) ----
   [junit4] Java HotSpot(TM) 64-Bit Server VM warning: Option UseConcMarkSweepGC was deprecated in version 9.0 and will likely be removed in a future release.
   [junit4] <<< JVM J1: EOF ----

[...truncated 3 lines...]
   [junit4] JVM J0: stderr was not empty, see: /home/jenkins/workspace/Lucene-Solr-6.6-Linux/solr/build/contrib/solr-dataimporthandler-extras/test/temp/junit4-J0-20170826_145408_3291093946573684069472.syserr
   [junit4] >>> JVM J0 emitted unexpected output (verbatim) ----
   [junit4] Java HotSpot(TM) 64-Bit Server VM warning: Option UseConcMarkSweepGC was deprecated in version 9.0 and will likely be removed in a future release.
   [junit4] <<< JVM J0: EOF ----

[...truncated 590 lines...]
   [junit4] JVM J2: stderr was not empty, see: /home/jenkins/workspace/Lucene-Solr-6.6-Linux/solr/build/contrib/solr-dataimporthandler/test/temp/junit4-J2-20170826_145414_19910999084789278429318.syserr
   [junit4] >>> JVM J2 emitted unexpected output (verbatim) ----
   [junit4] Java HotSpot(TM) 64-Bit Server VM warning: Option UseConcMarkSweepGC was deprecated in version 9.0 and will likely be removed in a future release.
   [junit4] <<< JVM J2: EOF ----

[...truncated 6 lines...]
   [junit4] JVM J0: stderr was not empty, see: /home/jenkins/workspace/Lucene-Solr-6.6-Linux/solr/build/contrib/solr-dataimporthandler/test/temp/junit4-J0-20170826_145414_1998546783634138841751.syserr
   [junit4] >>> JVM J0 emitted unexpected output (verbatim) ----
   [junit4] Java HotSpot(TM) 64-Bit Server VM warning: Option UseConcMarkSweepGC was deprecated in version 9.0 and will likely be removed in a future release.
   [junit4] <<< JVM J0: EOF ----

   [junit4] JVM J1: stderr was not empty, see: /home/jenkins/workspace/Lucene-Solr-6.6-Linux/solr/build/contrib/solr-dataimporthandler/test/temp/junit4-J1-20170826_145414_1995654206545657441266.syserr
   [junit4] >>> JVM J1 emitted unexpected output (verbatim) ----
   [junit4] Java HotSpot(TM) 64-Bit Server VM warning: Option UseConcMarkSweepGC was deprecated in version 9.0 and will likely be removed in a future release.
   [junit4] <<< JVM J1: EOF ----

[...truncated 503 lines...]
   [junit4] JVM J0: stderr was not empty, see: /home/jenkins/workspace/Lucene-Solr-6.6-Linux/solr/build/contrib/solr-cell/test/temp/junit4-J0-20170826_145435_6288854289179971736500.syserr
   [junit4] >>> JVM J0 emitted unexpected output (verbatim) ----
   [junit4] Java HotSpot(TM) 64-Bit Server VM warning: Option UseConcMarkSweepGC was deprecated in version 9.0 and will likely be removed in a future release.
   [junit4] <<< JVM J0: EOF ----

[...truncated 3 lines...]
   [junit4] JVM J2: stderr was not empty, see: /home/jenkins/workspace/Lucene-Solr-6.6-Linux/solr/build/contrib/solr-cell/test/temp/junit4-J2-20170826_145435_6289002919130321953633.syserr
   [junit4] >>> JVM J2 emitted unexpected output (verbatim) ----
   [junit4] Java HotSpot(TM) 64-Bit Server VM warning: Option UseConcMarkSweepGC was deprecated in version 9.0 and will likely be removed in a future release.
   [junit4] <<< JVM J2: EOF ----

[...truncated 3 lines...]
   [junit4] JVM J1: stderr was not empty, see: /home/jenkins/workspace/Lucene-Solr-6.6-Linux/solr/build/contrib/solr-cell/test/temp/junit4-J1-20170826_145435_6288624980029536891726.syserr
   [junit4] >>> JVM J1 emitted unexpected output (verbatim) ----
   [junit4] Java HotSpot(TM) 64-Bit Server VM warning: Option UseConcMarkSweepGC was deprecated in version 9.0 and will likely be removed in a future release.
   [junit4] <<< JVM J1: EOF ----

[...truncated 507 lines...]
   [junit4] JVM J0: stderr was not empty, see: /home/jenkins/workspace/Lucene-Solr-6.6-Linux/solr/build/contrib/solr-langid/test/temp/junit4-J0-20170826_145444_8641785166700760270096.syserr
   [junit4] >>> JVM J0 emitted unexpected output (verbatim) ----
   [junit4] Java HotSpot(TM) 64-Bit Server VM warning: Option UseConcMarkSweepGC was deprecated in version 9.0 and will likely be removed in a future release.
   [junit4] <<< JVM J0: EOF ----

   [junit4] JVM J1: stderr was not empty, see: /home/jenkins/workspace/Lucene-Solr-6.6-Linux/solr/build/contrib/solr-langid/test/temp/junit4-J1-20170826_145444_86437943184060950918.syserr
   [junit4] >>> JVM J1 emitted unexpected output (verbatim) ----
   [junit4] Java HotSpot(TM) 64-Bit Server VM warning: Option UseConcMarkSweepGC was deprecated in version 9.0 and will likely be removed in a future release.
   [junit4] <<< JVM J1: EOF ----

[...truncated 587 lines...]
   [junit4] JVM J2: stderr was not empty, see: /home/jenkins/workspace/Lucene-Solr-6.6-Linux/solr/build/contrib/solr-ltr/test/temp/junit4-J2-20170826_145451_1143582855390460981560.syserr
   [junit4] >>> JVM J2 emitted unexpected output (verbatim) ----
   [junit4] Java HotSpot(TM) 64-Bit Server VM warning: Option UseConcMarkSweepGC was deprecated in version 9.0 and will likely be removed in a future release.
   [junit4] <<< JVM J2: EOF ----

   [junit4] JVM J1: stderr was not empty, see: /home/jenkins/workspace/Lucene-Solr-6.6-Linux/solr/build/contrib/solr-ltr/test/temp/junit4-J1-20170826_145451_11412660764288226962665.syserr
   [junit4] >>> JVM J1 emitted unexpected output (verbatim) ----
   [junit4] Java HotSpot(TM) 64-Bit Server VM warning: Option UseConcMarkSweepGC was deprecated in version 9.0 and will likely be removed in a future release.
   [junit4] <<< JVM J1: EOF ----

[...truncated 9 lines...]
   [junit4] JVM J0: stderr was not empty, see: /home/jenkins/workspace/Lucene-Solr-6.6-Linux/solr/build/contrib/solr-ltr/test/temp/junit4-J0-20170826_145451_11410486132000483272745.syserr
   [junit4] >>> JVM J0 emitted unexpected output (verbatim) ----
   [junit4] Java HotSpot(TM) 64-Bit Server VM warning: Option UseConcMarkSweepGC was deprecated in version 9.0 and will likely be removed in a future release.
   [junit4] <<< JVM J0: EOF ----

[...truncated 540 lines...]
   [junit4] JVM J1: stderr was not empty, see: /home/jenkins/workspace/Lucene-Solr-6.6-Linux/solr/build/contrib/solr-uima/test/temp/junit4-J1-20170826_145525_86510886261079233759400.syserr
   [junit4] >>> JVM J1 emitted unexpected output (verbatim) ----
   [junit4] Java HotSpot(TM) 64-Bit Server VM warning: Option UseConcMarkSweepGC was deprecated in version 9.0 and will likely be removed in a future release.
   [junit4] <<< JVM J1: EOF ----

[...truncated 3 lines...]
   [junit4] JVM J0: stderr was not empty, see: /home/jenkins/workspace/Lucene-Solr-6.6-Linux/solr/build/contrib/solr-uima/test/temp/junit4-J0-20170826_145525_86512725046476012286347.syserr
   [junit4] >>> JVM J0 emitted unexpected output (verbatim) ----
   [junit4] Java HotSpot(TM) 64-Bit Server VM warning: Option UseConcMarkSweepGC was deprecated in version 9.0 and will likely be removed in a future release.
   [junit4] <<< JVM J0: EOF ----

[...truncated 494 lines...]
   [junit4] JVM J0: stderr was not empty, see: /home/jenkins/workspace/Lucene-Solr-6.6-Linux/solr/build/contrib/solr-velocity/test/temp/junit4-J0-20170826_145535_63414440814664969278727.syserr
   [junit4] >>> JVM J0 emitted unexpected output (verbatim) ----
   [junit4] Java HotSpot(TM) 64-Bit Server VM warning: Option UseConcMarkSweepGC was deprecated in version 9.0 and will likely be removed in a future release.
   [junit4] <<< JVM J0: EOF ----

[...truncated 28890 lines...]

Mime
View raw message