lucene-dev mailing list archives

Site index · List index
Message view « Date » · « Thread »
Top « Date » · « Thread »
From Policeman Jenkins Server <jenk...@thetaphi.de>
Subject [JENKINS] Lucene-Solr-7.x-Linux (32bit/jdk1.8.0_144) - Build # 266 - Still Unstable!
Date Tue, 15 Aug 2017 20:53:57 GMT
Build: https://jenkins.thetaphi.de/job/Lucene-Solr-7.x-Linux/266/
Java: 32bit/jdk1.8.0_144 -server -XX:+UseParallelGC

3 tests failed.
FAILED:  org.apache.solr.cloud.ForceLeaderTest.testReplicasInLIRNoLeader

Error Message:
Doc with id=1 not found in http://127.0.0.1:46775/wz_ogc/u/forceleader_test_collection due to: Path not found: /id; rsp={doc=null}

Stack Trace:
java.lang.AssertionError: Doc with id=1 not found in http://127.0.0.1:46775/wz_ogc/u/forceleader_test_collection due to: Path not found: /id; rsp={doc=null}
	at __randomizedtesting.SeedInfo.seed([BB6040DD3B4B702F:5DF7741D02C9894E]:0)
	at org.junit.Assert.fail(Assert.java:93)
	at org.junit.Assert.assertTrue(Assert.java:43)
	at org.apache.solr.cloud.HttpPartitionTest.assertDocExists(HttpPartitionTest.java:603)
	at org.apache.solr.cloud.HttpPartitionTest.assertDocsExistInAllReplicas(HttpPartitionTest.java:556)
	at org.apache.solr.cloud.ForceLeaderTest.testReplicasInLIRNoLeader(ForceLeaderTest.java:142)
	at sun.reflect.NativeMethodAccessorImpl.invoke0(Native Method)
	at sun.reflect.NativeMethodAccessorImpl.invoke(NativeMethodAccessorImpl.java:62)
	at sun.reflect.DelegatingMethodAccessorImpl.invoke(DelegatingMethodAccessorImpl.java:43)
	at java.lang.reflect.Method.invoke(Method.java:498)
	at com.carrotsearch.randomizedtesting.RandomizedRunner.invoke(RandomizedRunner.java:1713)
	at com.carrotsearch.randomizedtesting.RandomizedRunner$8.evaluate(RandomizedRunner.java:907)
	at com.carrotsearch.randomizedtesting.RandomizedRunner$9.evaluate(RandomizedRunner.java:943)
	at com.carrotsearch.randomizedtesting.RandomizedRunner$10.evaluate(RandomizedRunner.java:957)
	at org.apache.solr.BaseDistributedSearchTestCase$ShardsRepeatRule$ShardsFixedStatement.callStatement(BaseDistributedSearchTestCase.java:993)
	at org.apache.solr.BaseDistributedSearchTestCase$ShardsRepeatRule$ShardsStatement.evaluate(BaseDistributedSearchTestCase.java:968)
	at com.carrotsearch.randomizedtesting.rules.SystemPropertiesRestoreRule$1.evaluate(SystemPropertiesRestoreRule.java:57)
	at org.apache.lucene.util.TestRuleSetupTeardownChained$1.evaluate(TestRuleSetupTeardownChained.java:49)
	at org.apache.lucene.util.AbstractBeforeAfterRule$1.evaluate(AbstractBeforeAfterRule.java:45)
	at org.apache.lucene.util.TestRuleThreadAndTestName$1.evaluate(TestRuleThreadAndTestName.java:48)
	at org.apache.lucene.util.TestRuleIgnoreAfterMaxFailures$1.evaluate(TestRuleIgnoreAfterMaxFailures.java:64)
	at org.apache.lucene.util.TestRuleMarkFailure$1.evaluate(TestRuleMarkFailure.java:47)
	at com.carrotsearch.randomizedtesting.rules.StatementAdapter.evaluate(StatementAdapter.java:36)
	at com.carrotsearch.randomizedtesting.ThreadLeakControl$StatementRunner.run(ThreadLeakControl.java:368)
	at com.carrotsearch.randomizedtesting.ThreadLeakControl.forkTimeoutingTask(ThreadLeakControl.java:817)
	at com.carrotsearch.randomizedtesting.ThreadLeakControl$3.evaluate(ThreadLeakControl.java:468)
	at com.carrotsearch.randomizedtesting.RandomizedRunner.runSingleTest(RandomizedRunner.java:916)
	at com.carrotsearch.randomizedtesting.RandomizedRunner$5.evaluate(RandomizedRunner.java:802)
	at com.carrotsearch.randomizedtesting.RandomizedRunner$6.evaluate(RandomizedRunner.java:852)
	at com.carrotsearch.randomizedtesting.RandomizedRunner$7.evaluate(RandomizedRunner.java:863)
	at com.carrotsearch.randomizedtesting.rules.StatementAdapter.evaluate(StatementAdapter.java:36)
	at com.carrotsearch.randomizedtesting.rules.SystemPropertiesRestoreRule$1.evaluate(SystemPropertiesRestoreRule.java:57)
	at org.apache.lucene.util.AbstractBeforeAfterRule$1.evaluate(AbstractBeforeAfterRule.java:45)
	at com.carrotsearch.randomizedtesting.rules.StatementAdapter.evaluate(StatementAdapter.java:36)
	at org.apache.lucene.util.TestRuleStoreClassName$1.evaluate(TestRuleStoreClassName.java:41)
	at com.carrotsearch.randomizedtesting.rules.NoShadowingOrOverridesOnMethodsRule$1.evaluate(NoShadowingOrOverridesOnMethodsRule.java:40)
	at com.carrotsearch.randomizedtesting.rules.NoShadowingOrOverridesOnMethodsRule$1.evaluate(NoShadowingOrOverridesOnMethodsRule.java:40)
	at com.carrotsearch.randomizedtesting.rules.StatementAdapter.evaluate(StatementAdapter.java:36)
	at com.carrotsearch.randomizedtesting.rules.StatementAdapter.evaluate(StatementAdapter.java:36)
	at com.carrotsearch.randomizedtesting.rules.StatementAdapter.evaluate(StatementAdapter.java:36)
	at org.apache.lucene.util.TestRuleAssertionsRequired$1.evaluate(TestRuleAssertionsRequired.java:53)
	at org.apache.lucene.util.TestRuleMarkFailure$1.evaluate(TestRuleMarkFailure.java:47)
	at org.apache.lucene.util.TestRuleIgnoreAfterMaxFailures$1.evaluate(TestRuleIgnoreAfterMaxFailures.java:64)
	at org.apache.lucene.util.TestRuleIgnoreTestSuites$1.evaluate(TestRuleIgnoreTestSuites.java:54)
	at com.carrotsearch.randomizedtesting.rules.StatementAdapter.evaluate(StatementAdapter.java:36)
	at com.carrotsearch.randomizedtesting.ThreadLeakControl$StatementRunner.run(ThreadLeakControl.java:368)
	at java.lang.Thread.run(Thread.java:748)


FAILED:  org.apache.solr.cloud.HttpPartitionTest.test

Error Message:
Doc with id=1 not found in http://127.0.0.1:39653/collMinRf_1x3 due to: Path not found: /id; rsp={doc=null}

Stack Trace:
java.lang.AssertionError: Doc with id=1 not found in http://127.0.0.1:39653/collMinRf_1x3 due to: Path not found: /id; rsp={doc=null}
	at __randomizedtesting.SeedInfo.seed([BB6040DD3B4B702F:33347F0795B71DD7]:0)
	at org.junit.Assert.fail(Assert.java:93)
	at org.junit.Assert.assertTrue(Assert.java:43)
	at org.apache.solr.cloud.HttpPartitionTest.assertDocExists(HttpPartitionTest.java:603)
	at org.apache.solr.cloud.HttpPartitionTest.assertDocsExistInAllReplicas(HttpPartitionTest.java:558)
	at org.apache.solr.cloud.HttpPartitionTest.testMinRf(HttpPartitionTest.java:249)
	at org.apache.solr.cloud.HttpPartitionTest.test(HttpPartitionTest.java:127)
	at sun.reflect.NativeMethodAccessorImpl.invoke0(Native Method)
	at sun.reflect.NativeMethodAccessorImpl.invoke(NativeMethodAccessorImpl.java:62)
	at sun.reflect.DelegatingMethodAccessorImpl.invoke(DelegatingMethodAccessorImpl.java:43)
	at java.lang.reflect.Method.invoke(Method.java:498)
	at com.carrotsearch.randomizedtesting.RandomizedRunner.invoke(RandomizedRunner.java:1713)
	at com.carrotsearch.randomizedtesting.RandomizedRunner$8.evaluate(RandomizedRunner.java:907)
	at com.carrotsearch.randomizedtesting.RandomizedRunner$9.evaluate(RandomizedRunner.java:943)
	at com.carrotsearch.randomizedtesting.RandomizedRunner$10.evaluate(RandomizedRunner.java:957)
	at org.apache.solr.BaseDistributedSearchTestCase$ShardsRepeatRule$ShardsFixedStatement.callStatement(BaseDistributedSearchTestCase.java:993)
	at org.apache.solr.BaseDistributedSearchTestCase$ShardsRepeatRule$ShardsStatement.evaluate(BaseDistributedSearchTestCase.java:968)
	at com.carrotsearch.randomizedtesting.rules.SystemPropertiesRestoreRule$1.evaluate(SystemPropertiesRestoreRule.java:57)
	at org.apache.lucene.util.TestRuleSetupTeardownChained$1.evaluate(TestRuleSetupTeardownChained.java:49)
	at org.apache.lucene.util.AbstractBeforeAfterRule$1.evaluate(AbstractBeforeAfterRule.java:45)
	at org.apache.lucene.util.TestRuleThreadAndTestName$1.evaluate(TestRuleThreadAndTestName.java:48)
	at org.apache.lucene.util.TestRuleIgnoreAfterMaxFailures$1.evaluate(TestRuleIgnoreAfterMaxFailures.java:64)
	at org.apache.lucene.util.TestRuleMarkFailure$1.evaluate(TestRuleMarkFailure.java:47)
	at com.carrotsearch.randomizedtesting.rules.StatementAdapter.evaluate(StatementAdapter.java:36)
	at com.carrotsearch.randomizedtesting.ThreadLeakControl$StatementRunner.run(ThreadLeakControl.java:368)
	at com.carrotsearch.randomizedtesting.ThreadLeakControl.forkTimeoutingTask(ThreadLeakControl.java:817)
	at com.carrotsearch.randomizedtesting.ThreadLeakControl$3.evaluate(ThreadLeakControl.java:468)
	at com.carrotsearch.randomizedtesting.RandomizedRunner.runSingleTest(RandomizedRunner.java:916)
	at com.carrotsearch.randomizedtesting.RandomizedRunner$5.evaluate(RandomizedRunner.java:802)
	at com.carrotsearch.randomizedtesting.RandomizedRunner$6.evaluate(RandomizedRunner.java:852)
	at com.carrotsearch.randomizedtesting.RandomizedRunner$7.evaluate(RandomizedRunner.java:863)
	at com.carrotsearch.randomizedtesting.rules.StatementAdapter.evaluate(StatementAdapter.java:36)
	at com.carrotsearch.randomizedtesting.rules.SystemPropertiesRestoreRule$1.evaluate(SystemPropertiesRestoreRule.java:57)
	at org.apache.lucene.util.AbstractBeforeAfterRule$1.evaluate(AbstractBeforeAfterRule.java:45)
	at com.carrotsearch.randomizedtesting.rules.StatementAdapter.evaluate(StatementAdapter.java:36)
	at org.apache.lucene.util.TestRuleStoreClassName$1.evaluate(TestRuleStoreClassName.java:41)
	at com.carrotsearch.randomizedtesting.rules.NoShadowingOrOverridesOnMethodsRule$1.evaluate(NoShadowingOrOverridesOnMethodsRule.java:40)
	at com.carrotsearch.randomizedtesting.rules.NoShadowingOrOverridesOnMethodsRule$1.evaluate(NoShadowingOrOverridesOnMethodsRule.java:40)
	at com.carrotsearch.randomizedtesting.rules.StatementAdapter.evaluate(StatementAdapter.java:36)
	at com.carrotsearch.randomizedtesting.rules.StatementAdapter.evaluate(StatementAdapter.java:36)
	at com.carrotsearch.randomizedtesting.rules.StatementAdapter.evaluate(StatementAdapter.java:36)
	at org.apache.lucene.util.TestRuleAssertionsRequired$1.evaluate(TestRuleAssertionsRequired.java:53)
	at org.apache.lucene.util.TestRuleMarkFailure$1.evaluate(TestRuleMarkFailure.java:47)
	at org.apache.lucene.util.TestRuleIgnoreAfterMaxFailures$1.evaluate(TestRuleIgnoreAfterMaxFailures.java:64)
	at org.apache.lucene.util.TestRuleIgnoreTestSuites$1.evaluate(TestRuleIgnoreTestSuites.java:54)
	at com.carrotsearch.randomizedtesting.rules.StatementAdapter.evaluate(StatementAdapter.java:36)
	at com.carrotsearch.randomizedtesting.ThreadLeakControl$StatementRunner.run(ThreadLeakControl.java:368)
	at java.lang.Thread.run(Thread.java:748)


FAILED:  org.apache.solr.cloud.TestAuthenticationFramework.testBasics

Error Message:
Error from server at http://127.0.0.1:36345/solr/testcollection_shard1_replica_n2: Expected mime type application/octet-stream but got text/html. <html> <head> <meta http-equiv="Content-Type" content="text/html;charset=ISO-8859-1"/> <title>Error 404 </title> </head> <body> <h2>HTTP ERROR: 404</h2> <p>Problem accessing /solr/testcollection_shard1_replica_n2/update. Reason: <pre>    Can not find: /solr/testcollection_shard1_replica_n2/update</pre></p> <hr /><a href="http://eclipse.org/jetty">Powered by Jetty:// 9.3.14.v20161028</a><hr/> </body> </html> 

Stack Trace:
org.apache.solr.client.solrj.impl.CloudSolrClient$RouteException: Error from server at http://127.0.0.1:36345/solr/testcollection_shard1_replica_n2: Expected mime type application/octet-stream but got text/html. <html>
<head>
<meta http-equiv="Content-Type" content="text/html;charset=ISO-8859-1"/>
<title>Error 404 </title>
</head>
<body>
<h2>HTTP ERROR: 404</h2>
<p>Problem accessing /solr/testcollection_shard1_replica_n2/update. Reason:
<pre>    Can not find: /solr/testcollection_shard1_replica_n2/update</pre></p>
<hr /><a href="http://eclipse.org/jetty">Powered by Jetty:// 9.3.14.v20161028</a><hr/>
</body>
</html>

	at __randomizedtesting.SeedInfo.seed([BB6040DD3B4B702F:86B8EEF103A52E5F]:0)
	at org.apache.solr.client.solrj.impl.CloudSolrClient.directUpdate(CloudSolrClient.java:539)
	at org.apache.solr.client.solrj.impl.CloudSolrClient.sendRequest(CloudSolrClient.java:993)
	at org.apache.solr.client.solrj.impl.CloudSolrClient.requestWithRetryOnStaleState(CloudSolrClient.java:862)
	at org.apache.solr.client.solrj.impl.CloudSolrClient.request(CloudSolrClient.java:793)
	at org.apache.solr.client.solrj.SolrRequest.process(SolrRequest.java:178)
	at org.apache.solr.client.solrj.request.UpdateRequest.commit(UpdateRequest.java:233)
	at org.apache.solr.cloud.TestAuthenticationFramework.collectionCreateSearchDeleteTwice(TestAuthenticationFramework.java:126)
	at org.apache.solr.cloud.TestAuthenticationFramework.testBasics(TestAuthenticationFramework.java:74)
	at sun.reflect.NativeMethodAccessorImpl.invoke0(Native Method)
	at sun.reflect.NativeMethodAccessorImpl.invoke(NativeMethodAccessorImpl.java:62)
	at sun.reflect.DelegatingMethodAccessorImpl.invoke(DelegatingMethodAccessorImpl.java:43)
	at java.lang.reflect.Method.invoke(Method.java:498)
	at com.carrotsearch.randomizedtesting.RandomizedRunner.invoke(RandomizedRunner.java:1713)
	at com.carrotsearch.randomizedtesting.RandomizedRunner$8.evaluate(RandomizedRunner.java:907)
	at com.carrotsearch.randomizedtesting.RandomizedRunner$9.evaluate(RandomizedRunner.java:943)
	at com.carrotsearch.randomizedtesting.RandomizedRunner$10.evaluate(RandomizedRunner.java:957)
	at com.carrotsearch.randomizedtesting.rules.SystemPropertiesRestoreRule$1.evaluate(SystemPropertiesRestoreRule.java:57)
	at org.apache.lucene.util.TestRuleSetupTeardownChained$1.evaluate(TestRuleSetupTeardownChained.java:49)
	at org.apache.lucene.util.AbstractBeforeAfterRule$1.evaluate(AbstractBeforeAfterRule.java:45)
	at org.apache.lucene.util.TestRuleThreadAndTestName$1.evaluate(TestRuleThreadAndTestName.java:48)
	at org.apache.lucene.util.TestRuleIgnoreAfterMaxFailures$1.evaluate(TestRuleIgnoreAfterMaxFailures.java:64)
	at org.apache.lucene.util.TestRuleMarkFailure$1.evaluate(TestRuleMarkFailure.java:47)
	at com.carrotsearch.randomizedtesting.rules.StatementAdapter.evaluate(StatementAdapter.java:36)
	at com.carrotsearch.randomizedtesting.ThreadLeakControl$StatementRunner.run(ThreadLeakControl.java:368)
	at com.carrotsearch.randomizedtesting.ThreadLeakControl.forkTimeoutingTask(ThreadLeakControl.java:817)
	at com.carrotsearch.randomizedtesting.ThreadLeakControl$3.evaluate(ThreadLeakControl.java:468)
	at com.carrotsearch.randomizedtesting.RandomizedRunner.runSingleTest(RandomizedRunner.java:916)
	at com.carrotsearch.randomizedtesting.RandomizedRunner$5.evaluate(RandomizedRunner.java:802)
	at com.carrotsearch.randomizedtesting.RandomizedRunner$6.evaluate(RandomizedRunner.java:852)
	at com.carrotsearch.randomizedtesting.RandomizedRunner$7.evaluate(RandomizedRunner.java:863)
	at com.carrotsearch.randomizedtesting.rules.StatementAdapter.evaluate(StatementAdapter.java:36)
	at com.carrotsearch.randomizedtesting.rules.SystemPropertiesRestoreRule$1.evaluate(SystemPropertiesRestoreRule.java:57)
	at org.apache.lucene.util.AbstractBeforeAfterRule$1.evaluate(AbstractBeforeAfterRule.java:45)
	at com.carrotsearch.randomizedtesting.rules.StatementAdapter.evaluate(StatementAdapter.java:36)
	at org.apache.lucene.util.TestRuleStoreClassName$1.evaluate(TestRuleStoreClassName.java:41)
	at com.carrotsearch.randomizedtesting.rules.NoShadowingOrOverridesOnMethodsRule$1.evaluate(NoShadowingOrOverridesOnMethodsRule.java:40)
	at com.carrotsearch.randomizedtesting.rules.NoShadowingOrOverridesOnMethodsRule$1.evaluate(NoShadowingOrOverridesOnMethodsRule.java:40)
	at com.carrotsearch.randomizedtesting.rules.StatementAdapter.evaluate(StatementAdapter.java:36)
	at com.carrotsearch.randomizedtesting.rules.StatementAdapter.evaluate(StatementAdapter.java:36)
	at com.carrotsearch.randomizedtesting.rules.StatementAdapter.evaluate(StatementAdapter.java:36)
	at org.apache.lucene.util.TestRuleAssertionsRequired$1.evaluate(TestRuleAssertionsRequired.java:53)
	at org.apache.lucene.util.TestRuleMarkFailure$1.evaluate(TestRuleMarkFailure.java:47)
	at org.apache.lucene.util.TestRuleIgnoreAfterMaxFailures$1.evaluate(TestRuleIgnoreAfterMaxFailures.java:64)
	at org.apache.lucene.util.TestRuleIgnoreTestSuites$1.evaluate(TestRuleIgnoreTestSuites.java:54)
	at com.carrotsearch.randomizedtesting.rules.StatementAdapter.evaluate(StatementAdapter.java:36)
	at com.carrotsearch.randomizedtesting.ThreadLeakControl$StatementRunner.run(ThreadLeakControl.java:368)
	at java.lang.Thread.run(Thread.java:748)
Caused by: org.apache.solr.client.solrj.impl.HttpSolrClient$RemoteSolrException: Error from server at http://127.0.0.1:36345/solr/testcollection_shard1_replica_n2: Expected mime type application/octet-stream but got text/html. <html>
<head>
<meta http-equiv="Content-Type" content="text/html;charset=ISO-8859-1"/>
<title>Error 404 </title>
</head>
<body>
<h2>HTTP ERROR: 404</h2>
<p>Problem accessing /solr/testcollection_shard1_replica_n2/update. Reason:
<pre>    Can not find: /solr/testcollection_shard1_replica_n2/update</pre></p>
<hr /><a href="http://eclipse.org/jetty">Powered by Jetty:// 9.3.14.v20161028</a><hr/>
</body>
</html>

	at org.apache.solr.client.solrj.impl.HttpSolrClient.executeMethod(HttpSolrClient.java:591)
	at org.apache.solr.client.solrj.impl.HttpSolrClient.request(HttpSolrClient.java:253)
	at org.apache.solr.client.solrj.impl.HttpSolrClient.request(HttpSolrClient.java:242)
	at org.apache.solr.client.solrj.impl.LBHttpSolrClient.doRequest(LBHttpSolrClient.java:483)
	at org.apache.solr.client.solrj.impl.LBHttpSolrClient.request(LBHttpSolrClient.java:413)
	at org.apache.solr.client.solrj.impl.CloudSolrClient.lambda$directUpdate$0(CloudSolrClient.java:516)
	at java.util.concurrent.FutureTask.run(FutureTask.java:266)
	at org.apache.solr.common.util.ExecutorUtil$MDCAwareThreadPoolExecutor.lambda$execute$0(ExecutorUtil.java:188)
	at java.util.concurrent.ThreadPoolExecutor.runWorker(ThreadPoolExecutor.java:1149)
	at java.util.concurrent.ThreadPoolExecutor$Worker.run(ThreadPoolExecutor.java:624)
	... 1 more




Build Log:
[...truncated 11221 lines...]
   [junit4] Suite: org.apache.solr.cloud.ForceLeaderTest
   [junit4]   2> Creating dataDir: /home/jenkins/workspace/Lucene-Solr-7.x-Linux/solr/build/solr-core/test/J0/temp/solr.cloud.ForceLeaderTest_BB6040DD3B4B702F-001/init-core-data-001
   [junit4]   2> 233613 WARN  (SUITE-ForceLeaderTest-seed#[BB6040DD3B4B702F]-worker) [    ] o.a.s.SolrTestCaseJ4 startTrackingSearchers: numOpens=4 numCloses=4
   [junit4]   2> 233613 INFO  (SUITE-ForceLeaderTest-seed#[BB6040DD3B4B702F]-worker) [    ] o.a.s.SolrTestCaseJ4 Using PointFields (NUMERIC_POINTS_SYSPROP=true) w/NUMERIC_DOCVALUES_SYSPROP=false
   [junit4]   2> 233615 INFO  (SUITE-ForceLeaderTest-seed#[BB6040DD3B4B702F]-worker) [    ] o.a.s.SolrTestCaseJ4 Randomized ssl (false) and clientAuth (false) via: @org.apache.solr.SolrTestCaseJ4$SuppressSSL(bugUrl=https://issues.apache.org/jira/browse/SOLR-5776)
   [junit4]   2> 233615 INFO  (SUITE-ForceLeaderTest-seed#[BB6040DD3B4B702F]-worker) [    ] o.a.s.SolrTestCaseJ4 SecureRandom sanity checks: test.solr.allowed.securerandom=null & java.security.egd=file:/dev/./urandom
   [junit4]   2> 233615 INFO  (SUITE-ForceLeaderTest-seed#[BB6040DD3B4B702F]-worker) [    ] o.a.s.BaseDistributedSearchTestCase Setting hostContext system property: /wz_ogc/u
   [junit4]   2> 233617 INFO  (TEST-ForceLeaderTest.testLastPublishedStateIsActive-seed#[BB6040DD3B4B702F]) [    ] o.a.s.c.ZkTestServer STARTING ZK TEST SERVER
   [junit4]   2> 233617 INFO  (Thread-594) [    ] o.a.s.c.ZkTestServer client port:0.0.0.0/0.0.0.0:0
   [junit4]   2> 233617 INFO  (Thread-594) [    ] o.a.s.c.ZkTestServer Starting server
   [junit4]   2> 233628 ERROR (Thread-594) [    ] o.a.z.s.ZooKeeperServer ZKShutdownHandler is not registered, so ZooKeeper server won't take any action on ERROR or SHUTDOWN server state changes
   [junit4]   2> 233717 INFO  (TEST-ForceLeaderTest.testLastPublishedStateIsActive-seed#[BB6040DD3B4B702F]) [    ] o.a.s.c.ZkTestServer start zk server on port:43031
   [junit4]   2> 233725 INFO  (TEST-ForceLeaderTest.testLastPublishedStateIsActive-seed#[BB6040DD3B4B702F]) [    ] o.a.s.c.AbstractZkTestCase put /home/jenkins/workspace/Lucene-Solr-7.x-Linux/solr/core/src/test-files/solr/collection1/conf/solrconfig-tlog.xml to /configs/conf1/solrconfig.xml
   [junit4]   2> 233725 INFO  (TEST-ForceLeaderTest.testLastPublishedStateIsActive-seed#[BB6040DD3B4B702F]) [    ] o.a.s.c.AbstractZkTestCase put /home/jenkins/workspace/Lucene-Solr-7.x-Linux/solr/core/src/test-files/solr/collection1/conf/schema.xml to /configs/conf1/schema.xml
   [junit4]   2> 233726 INFO  (TEST-ForceLeaderTest.testLastPublishedStateIsActive-seed#[BB6040DD3B4B702F]) [    ] o.a.s.c.AbstractZkTestCase put /home/jenkins/workspace/Lucene-Solr-7.x-Linux/solr/core/src/test-files/solr/collection1/conf/solrconfig.snippet.randomindexconfig.xml to /configs/conf1/solrconfig.snippet.randomindexconfig.xml
   [junit4]   2> 233727 INFO  (TEST-ForceLeaderTest.testLastPublishedStateIsActive-seed#[BB6040DD3B4B702F]) [    ] o.a.s.c.AbstractZkTestCase put /home/jenkins/workspace/Lucene-Solr-7.x-Linux/solr/core/src/test-files/solr/collection1/conf/stopwords.txt to /configs/conf1/stopwords.txt
   [junit4]   2> 233727 INFO  (TEST-ForceLeaderTest.testLastPublishedStateIsActive-seed#[BB6040DD3B4B702F]) [    ] o.a.s.c.AbstractZkTestCase put /home/jenkins/workspace/Lucene-Solr-7.x-Linux/solr/core/src/test-files/solr/collection1/conf/protwords.txt to /configs/conf1/protwords.txt
   [junit4]   2> 233728 INFO  (TEST-ForceLeaderTest.testLastPublishedStateIsActive-seed#[BB6040DD3B4B702F]) [    ] o.a.s.c.AbstractZkTestCase put /home/jenkins/workspace/Lucene-Solr-7.x-Linux/solr/core/src/test-files/solr/collection1/conf/currency.xml to /configs/conf1/currency.xml
   [junit4]   2> 233728 INFO  (TEST-ForceLeaderTest.testLastPublishedStateIsActive-seed#[BB6040DD3B4B702F]) [    ] o.a.s.c.AbstractZkTestCase put /home/jenkins/workspace/Lucene-Solr-7.x-Linux/solr/core/src/test-files/solr/collection1/conf/enumsConfig.xml to /configs/conf1/enumsConfig.xml
   [junit4]   2> 233729 INFO  (TEST-ForceLeaderTest.testLastPublishedStateIsActive-seed#[BB6040DD3B4B702F]) [    ] o.a.s.c.AbstractZkTestCase put /home/jenkins/workspace/Lucene-Solr-7.x-Linux/solr/core/src/test-files/solr/collection1/conf/open-exchange-rates.json to /configs/conf1/open-exchange-rates.json
   [junit4]   2> 233729 INFO  (TEST-ForceLeaderTest.testLastPublishedStateIsActive-seed#[BB6040DD3B4B702F]) [    ] o.a.s.c.AbstractZkTestCase put /home/jenkins/workspace/Lucene-Solr-7.x-Linux/solr/core/src/test-files/solr/collection1/conf/mapping-ISOLatin1Accent.txt to /configs/conf1/mapping-ISOLatin1Accent.txt
   [junit4]   2> 233730 INFO  (TEST-ForceLeaderTest.testLastPublishedStateIsActive-seed#[BB6040DD3B4B702F]) [    ] o.a.s.c.AbstractZkTestCase put /home/jenkins/workspace/Lucene-Solr-7.x-Linux/solr/core/src/test-files/solr/collection1/conf/old_synonyms.txt to /configs/conf1/old_synonyms.txt
   [junit4]   2> 233730 INFO  (TEST-ForceLeaderTest.testLastPublishedStateIsActive-seed#[BB6040DD3B4B702F]) [    ] o.a.s.c.AbstractZkTestCase put /home/jenkins/workspace/Lucene-Solr-7.x-Linux/solr/core/src/test-files/solr/collection1/conf/synonyms.txt to /configs/conf1/synonyms.txt
   [junit4]   2> 233731 INFO  (TEST-ForceLeaderTest.testLastPublishedStateIsActive-seed#[BB6040DD3B4B702F]) [    ] o.a.s.c.AbstractFullDistribZkTestBase Will use TLOG replicas unless explicitly asked otherwise
   [junit4]   2> 233819 INFO  (TEST-ForceLeaderTest.testLastPublishedStateIsActive-seed#[BB6040DD3B4B702F]) [    ] o.e.j.s.Server jetty-9.3.14.v20161028
   [junit4]   2> 233826 INFO  (TEST-ForceLeaderTest.testLastPublishedStateIsActive-seed#[BB6040DD3B4B702F]) [    ] o.e.j.s.h.ContextHandler Started o.e.j.s.ServletContextHandler@1d3b131{/wz_ogc/u,null,AVAILABLE}
   [junit4]   2> 233829 INFO  (TEST-ForceLeaderTest.testLastPublishedStateIsActive-seed#[BB6040DD3B4B702F]) [    ] o.e.j.s.AbstractConnector Started ServerConnector@289fa2{HTTP/1.1,[http/1.1]}{127.0.0.1:35041}
   [junit4]   2> 233829 INFO  (TEST-ForceLeaderTest.testLastPublishedStateIsActive-seed#[BB6040DD3B4B702F]) [    ] o.e.j.s.Server Started @235180ms
   [junit4]   2> 233829 INFO  (TEST-ForceLeaderTest.testLastPublishedStateIsActive-seed#[BB6040DD3B4B702F]) [    ] o.a.s.c.s.e.JettySolrRunner Jetty properties: {solr.data.dir=/home/jenkins/workspace/Lucene-Solr-7.x-Linux/solr/build/solr-core/test/J0/temp/solr.cloud.ForceLeaderTest_BB6040DD3B4B702F-001/tempDir-001/control/data, hostContext=/wz_ogc/u, hostPort=33069, coreRootDirectory=/home/jenkins/workspace/Lucene-Solr-7.x-Linux/solr/build/solr-core/test/J0/temp/solr.cloud.ForceLeaderTest_BB6040DD3B4B702F-001/control-001/cores}
   [junit4]   2> 233830 ERROR (TEST-ForceLeaderTest.testLastPublishedStateIsActive-seed#[BB6040DD3B4B702F]) [    ] o.a.s.s.StartupLoggingUtils Missing Java Option solr.log.dir. Logging may be missing or incomplete.
   [junit4]   2> 233830 INFO  (TEST-ForceLeaderTest.testLastPublishedStateIsActive-seed#[BB6040DD3B4B702F]) [    ] o.a.s.s.SolrDispatchFilter  ___      _       Welcome to Apache Solr™ version 7.1.0
   [junit4]   2> 233830 INFO  (TEST-ForceLeaderTest.testLastPublishedStateIsActive-seed#[BB6040DD3B4B702F]) [    ] o.a.s.s.SolrDispatchFilter / __| ___| |_ _   Starting in cloud mode on port null
   [junit4]   2> 233830 INFO  (TEST-ForceLeaderTest.testLastPublishedStateIsActive-seed#[BB6040DD3B4B702F]) [    ] o.a.s.s.SolrDispatchFilter \__ \/ _ \ | '_|  Install dir: null, Default config dir: null
   [junit4]   2> 233830 INFO  (TEST-ForceLeaderTest.testLastPublishedStateIsActive-seed#[BB6040DD3B4B702F]) [    ] o.a.s.s.SolrDispatchFilter |___/\___/_|_|    Start time: 2017-08-15T20:04:27.876Z
   [junit4]   2> 233847 INFO  (TEST-ForceLeaderTest.testLastPublishedStateIsActive-seed#[BB6040DD3B4B702F]) [    ] o.a.s.s.SolrDispatchFilter Loading solr.xml from SolrHome (not found in ZooKeeper)
   [junit4]   2> 233848 INFO  (TEST-ForceLeaderTest.testLastPublishedStateIsActive-seed#[BB6040DD3B4B702F]) [    ] o.a.s.c.SolrXmlConfig Loading container configuration from /home/jenkins/workspace/Lucene-Solr-7.x-Linux/solr/build/solr-core/test/J0/temp/solr.cloud.ForceLeaderTest_BB6040DD3B4B702F-001/control-001/solr.xml
   [junit4]   2> 233852 INFO  (TEST-ForceLeaderTest.testLastPublishedStateIsActive-seed#[BB6040DD3B4B702F]) [    ] o.a.s.c.SolrXmlConfig MBean server found: com.sun.jmx.mbeanserver.JmxMBeanServer@1955fe5, but no JMX reporters were configured - adding default JMX reporter.
   [junit4]   2> 233855 INFO  (TEST-ForceLeaderTest.testLastPublishedStateIsActive-seed#[BB6040DD3B4B702F]) [    ] o.a.s.c.ZkContainer Zookeeper client=127.0.0.1:43031/solr
   [junit4]   2> 233933 INFO  (TEST-ForceLeaderTest.testLastPublishedStateIsActive-seed#[BB6040DD3B4B702F]) [n:127.0.0.1:33069_wz_ogc%2Fu    ] o.a.s.c.Overseer Overseer (id=null) closing
   [junit4]   2> 233934 INFO  (TEST-ForceLeaderTest.testLastPublishedStateIsActive-seed#[BB6040DD3B4B702F]) [n:127.0.0.1:33069_wz_ogc%2Fu    ] o.a.s.c.OverseerElectionContext I am going to be the leader 127.0.0.1:33069_wz_ogc%2Fu
   [junit4]   2> 233934 INFO  (TEST-ForceLeaderTest.testLastPublishedStateIsActive-seed#[BB6040DD3B4B702F]) [n:127.0.0.1:33069_wz_ogc%2Fu    ] o.a.s.c.Overseer Overseer (id=98489300920827908-127.0.0.1:33069_wz_ogc%2Fu-n_0000000000) starting
   [junit4]   2> 233943 INFO  (TEST-ForceLeaderTest.testLastPublishedStateIsActive-seed#[BB6040DD3B4B702F]) [n:127.0.0.1:33069_wz_ogc%2Fu    ] o.a.s.c.ZkController Register node as live in ZooKeeper:/live_nodes/127.0.0.1:33069_wz_ogc%2Fu
   [junit4]   2> 233950 INFO  (zkCallback-212-thread-1-processing-n:127.0.0.1:33069_wz_ogc%2Fu) [n:127.0.0.1:33069_wz_ogc%2Fu    ] o.a.s.c.c.ZkStateReader Updated live nodes from ZooKeeper... (0) -> (1)
   [junit4]   2> 233991 INFO  (TEST-ForceLeaderTest.testLastPublishedStateIsActive-seed#[BB6040DD3B4B702F]) [n:127.0.0.1:33069_wz_ogc%2Fu    ] o.a.s.m.r.SolrJmxReporter JMX monitoring for 'solr.node' (registry 'solr.node') enabled at server: com.sun.jmx.mbeanserver.JmxMBeanServer@1955fe5
   [junit4]   2> 233999 INFO  (TEST-ForceLeaderTest.testLastPublishedStateIsActive-seed#[BB6040DD3B4B702F]) [n:127.0.0.1:33069_wz_ogc%2Fu    ] o.a.s.m.r.SolrJmxReporter JMX monitoring for 'solr.jvm' (registry 'solr.jvm') enabled at server: com.sun.jmx.mbeanserver.JmxMBeanServer@1955fe5
   [junit4]   2> 233999 INFO  (TEST-ForceLeaderTest.testLastPublishedStateIsActive-seed#[BB6040DD3B4B702F]) [n:127.0.0.1:33069_wz_ogc%2Fu    ] o.a.s.m.r.SolrJmxReporter JMX monitoring for 'solr.jetty' (registry 'solr.jetty') enabled at server: com.sun.jmx.mbeanserver.JmxMBeanServer@1955fe5
   [junit4]   2> 234000 INFO  (TEST-ForceLeaderTest.testLastPublishedStateIsActive-seed#[BB6040DD3B4B702F]) [n:127.0.0.1:33069_wz_ogc%2Fu    ] o.a.s.c.CorePropertiesLocator Found 0 core definitions underneath /home/jenkins/workspace/Lucene-Solr-7.x-Linux/solr/build/solr-core/test/J0/temp/solr.cloud.ForceLeaderTest_BB6040DD3B4B702F-001/control-001/cores
   [junit4]   2> 234062 INFO  (TEST-ForceLeaderTest.testLastPublishedStateIsActive-seed#[BB6040DD3B4B702F]) [    ] o.a.s.c.c.ZkStateReader Updated live nodes from ZooKeeper... (0) -> (1)
   [junit4]   2> 234062 INFO  (TEST-ForceLeaderTest.testLastPublishedStateIsActive-seed#[BB6040DD3B4B702F]) [    ] o.a.s.c.s.i.ZkClientClusterStateProvider Cluster at 127.0.0.1:43031/solr ready
   [junit4]   2> 234063 INFO  (SocketProxy-Acceptor-33069) [    ] o.a.s.c.SocketProxy accepted Socket[addr=/127.0.0.1,port=52626,localport=33069], receiveBufferSize:531000
   [junit4]   2> 234096 INFO  (SocketProxy-Acceptor-33069) [    ] o.a.s.c.SocketProxy proxy connection Socket[addr=/127.0.0.1,port=35041,localport=45526], receiveBufferSize=530904
   [junit4]   2> 234097 INFO  (qtp6090807-1730) [n:127.0.0.1:33069_wz_ogc%2Fu    ] o.a.s.h.a.CollectionsHandler Invoked Collection Action :create with params replicationFactor=1&collection.configName=conf1&name=control_collection&nrtReplicas=1&action=CREATE&numShards=1&createNodeSet=127.0.0.1:33069_wz_ogc%252Fu&wt=javabin&version=2 and sendToOCPQueue=true
   [junit4]   2> 234101 INFO  (OverseerThreadFactory-621-thread-1-processing-n:127.0.0.1:33069_wz_ogc%2Fu) [n:127.0.0.1:33069_wz_ogc%2Fu    ] o.a.s.c.CreateCollectionCmd Create collection control_collection
   [junit4]   2> 234216 INFO  (SocketProxy-Acceptor-33069) [    ] o.a.s.c.SocketProxy accepted Socket[addr=/127.0.0.1,port=52630,localport=33069], receiveBufferSize:531000
   [junit4]   2> 234230 INFO  (SocketProxy-Acceptor-33069) [    ] o.a.s.c.SocketProxy proxy connection Socket[addr=/127.0.0.1,port=35041,localport=45530], receiveBufferSize=530904
   [junit4]   2> 234239 INFO  (qtp6090807-1732) [n:127.0.0.1:33069_wz_ogc%2Fu    ] o.a.s.h.a.CoreAdminOperation core create command qt=/admin/cores&collection.configName=conf1&newCollection=true&name=control_collection_shard1_replica_n1&action=CREATE&numShards=1&collection=control_collection&shard=shard1&wt=javabin&version=2&replicaType=NRT
   [junit4]   2> 234239 INFO  (qtp6090807-1732) [n:127.0.0.1:33069_wz_ogc%2Fu    ] o.a.s.c.TransientSolrCoreCacheDefault Allocating transient cache for 4 transient cores
   [junit4]   2> 234347 INFO  (zkCallback-212-thread-1-processing-n:127.0.0.1:33069_wz_ogc%2Fu) [n:127.0.0.1:33069_wz_ogc%2Fu    ] o.a.s.c.c.ZkStateReader A cluster state change: [WatchedEvent state:SyncConnected type:NodeDataChanged path:/collections/control_collection/state.json] for collection [control_collection] has occurred - updating... (live nodes size: [1])
   [junit4]   2> 235264 INFO  (qtp6090807-1732) [n:127.0.0.1:33069_wz_ogc%2Fu c:control_collection s:shard1  x:control_collection_shard1_replica_n1] o.a.s.c.SolrConfig Using Lucene MatchVersion: 7.1.0
   [junit4]   2> 235278 INFO  (qtp6090807-1732) [n:127.0.0.1:33069_wz_ogc%2Fu c:control_collection s:shard1  x:control_collection_shard1_replica_n1] o.a.s.s.IndexSchema [control_collection_shard1_replica_n1] Schema name=test
   [junit4]   2> 235374 INFO  (qtp6090807-1732) [n:127.0.0.1:33069_wz_ogc%2Fu c:control_collection s:shard1  x:control_collection_shard1_replica_n1] o.a.s.s.IndexSchema Loaded schema test/1.0 with uniqueid field id
   [junit4]   2> 235382 INFO  (qtp6090807-1732) [n:127.0.0.1:33069_wz_ogc%2Fu c:control_collection s:shard1  x:control_collection_shard1_replica_n1] o.a.s.c.CoreContainer Creating SolrCore 'control_collection_shard1_replica_n1' using configuration from collection control_collection, trusted=true
   [junit4]   2> 235382 INFO  (qtp6090807-1732) [n:127.0.0.1:33069_wz_ogc%2Fu c:control_collection s:shard1  x:control_collection_shard1_replica_n1] o.a.s.m.r.SolrJmxReporter JMX monitoring for 'solr.core.control_collection.shard1.replica_n1' (registry 'solr.core.control_collection.shard1.replica_n1') enabled at server: com.sun.jmx.mbeanserver.JmxMBeanServer@1955fe5
   [junit4]   2> 235382 INFO  (qtp6090807-1732) [n:127.0.0.1:33069_wz_ogc%2Fu c:control_collection s:shard1  x:control_collection_shard1_replica_n1] o.a.s.c.SolrCore solr.RecoveryStrategy.Builder
   [junit4]   2> 235382 INFO  (qtp6090807-1732) [n:127.0.0.1:33069_wz_ogc%2Fu c:control_collection s:shard1  x:control_collection_shard1_replica_n1] o.a.s.c.SolrCore [[control_collection_shard1_replica_n1] ] Opening new SolrCore at [/home/jenkins/workspace/Lucene-Solr-7.x-Linux/solr/build/solr-core/test/J0/temp/solr.cloud.ForceLeaderTest_BB6040DD3B4B702F-001/control-001/cores/control_collection_shard1_replica_n1], dataDir=[/home/jenkins/workspace/Lucene-Solr-7.x-Linux/solr/build/solr-core/test/J0/temp/solr.cloud.ForceLeaderTest_BB6040DD3B4B702F-001/control-001/cores/control_collection_shard1_replica_n1/data/]
   [junit4]   2> 235384 INFO  (qtp6090807-1732) [n:127.0.0.1:33069_wz_ogc%2Fu c:control_collection s:shard1  x:control_collection_shard1_replica_n1] o.a.s.u.RandomMergePolicy RandomMergePolicy wrapping class org.apache.lucene.index.LogDocMergePolicy: [LogDocMergePolicy: minMergeSize=1000, mergeFactor=31, maxMergeSize=9223372036854775807, maxMergeSizeForForcedMerge=9223372036854775807, calibrateSizeByDeletes=false, maxMergeDocs=2147483647, maxCFSSegmentSizeMB=8.796093022207999E12, noCFSRatio=0.5246353515381408]
   [junit4]   2> 235385 WARN  (qtp6090807-1732) [n:127.0.0.1:33069_wz_ogc%2Fu c:control_collection s:shard1  x:control_collection_shard1_replica_n1] o.a.s.c.RequestHandlers INVALID paramSet a in requestHandler {type = requestHandler,name = /dump,class = DumpRequestHandler,attributes = {initParams=a, name=/dump, class=DumpRequestHandler},args = {defaults={a=A,b=B}}}
   [junit4]   2> 235417 INFO  (qtp6090807-1732) [n:127.0.0.1:33069_wz_ogc%2Fu c:control_collection s:shard1  x:control_collection_shard1_replica_n1] o.a.s.u.UpdateHandler Using UpdateLog implementation: org.apache.solr.update.UpdateLog
   [junit4]   2> 235417 INFO  (qtp6090807-1732) [n:127.0.0.1:33069_wz_ogc%2Fu c:control_collection s:shard1  x:control_collection_shard1_replica_n1] o.a.s.u.UpdateLog Initializing UpdateLog: dataDir= defaultSyncLevel=FLUSH numRecordsToKeep=100 maxNumLogsToKeep=10 numVersionBuckets=65536
   [junit4]   2> 235418 INFO  (qtp6090807-1732) [n:127.0.0.1:33069_wz_ogc%2Fu c:control_collection s:shard1  x:control_collection_shard1_replica_n1] o.a.s.u.CommitTracker Hard AutoCommit: disabled
   [junit4]   2> 235418 INFO  (qtp6090807-1732) [n:127.0.0.1:33069_wz_ogc%2Fu c:control_collection s:shard1  x:control_collection_shard1_replica_n1] o.a.s.u.CommitTracker Soft AutoCommit: disabled
   [junit4]   2> 235419 INFO  (qtp6090807-1732) [n:127.0.0.1:33069_wz_ogc%2Fu c:control_collection s:shard1  x:control_collection_shard1_replica_n1] o.a.s.u.RandomMergePolicy RandomMergePolicy wrapping class org.apache.lucene.index.TieredMergePolicy: [TieredMergePolicy: maxMergeAtOnce=33, maxMergeAtOnceExplicit=37, maxMergedSegmentMB=82.8974609375, floorSegmentMB=1.0107421875, forceMergeDeletesPctAllowed=9.081021609809001, segmentsPerTier=21.0, maxCFSSegmentSizeMB=8.796093022207999E12, noCFSRatio=0.0
   [junit4]   2> 235420 INFO  (qtp6090807-1732) [n:127.0.0.1:33069_wz_ogc%2Fu c:control_collection s:shard1  x:control_collection_shard1_replica_n1] o.a.s.s.SolrIndexSearcher Opening [Searcher@1ebaa89[control_collection_shard1_replica_n1] main]
   [junit4]   2> 235421 INFO  (qtp6090807-1732) [n:127.0.0.1:33069_wz_ogc%2Fu c:control_collection s:shard1  x:control_collection_shard1_replica_n1] o.a.s.r.ManagedResourceStorage Configured ZooKeeperStorageIO with znodeBase: /configs/conf1
   [junit4]   2> 235421 INFO  (qtp6090807-1732) [n:127.0.0.1:33069_wz_ogc%2Fu c:control_collection s:shard1  x:control_collection_shard1_replica_n1] o.a.s.r.ManagedResourceStorage Loaded null at path _rest_managed.json using ZooKeeperStorageIO:path=/configs/conf1
   [junit4]   2> 235421 INFO  (qtp6090807-1732) [n:127.0.0.1:33069_wz_ogc%2Fu c:control_collection s:shard1  x:control_collection_shard1_replica_n1] o.a.s.h.ReplicationHandler Commits will be reserved for  10000
   [junit4]   2> 235422 INFO  (qtp6090807-1732) [n:127.0.0.1:33069_wz_ogc%2Fu c:control_collection s:shard1  x:control_collection_shard1_replica_n1] o.a.s.u.UpdateLog Could not find max version in index or recent updates, using new clock 1575828816624877568
   [junit4]   2> 235423 INFO  (searcherExecutor-624-thread-1-processing-n:127.0.0.1:33069_wz_ogc%2Fu x:control_collection_shard1_replica_n1 s:shard1 c:control_collection) [n:127.0.0.1:33069_wz_ogc%2Fu c:control_collection s:shard1  x:control_collection_shard1_replica_n1] o.a.s.c.SolrCore [control_collection_shard1_replica_n1] Registered new searcher Searcher@1ebaa89[control_collection_shard1_replica_n1] main{ExitableDirectoryReader(UninvertingDirectoryReader())}
   [junit4]   2> 235425 INFO  (qtp6090807-1732) [n:127.0.0.1:33069_wz_ogc%2Fu c:control_collection s:shard1  x:control_collection_shard1_replica_n1] o.a.s.c.ShardLeaderElectionContext Enough replicas found to continue.
   [junit4]   2> 235425 INFO  (qtp6090807-1732) [n:127.0.0.1:33069_wz_ogc%2Fu c:control_collection s:shard1  x:control_collection_shard1_replica_n1] o.a.s.c.ShardLeaderElectionContext I may be the new leader - try and sync
   [junit4]   2> 235425 INFO  (qtp6090807-1732) [n:127.0.0.1:33069_wz_ogc%2Fu c:control_collection s:shard1  x:control_collection_shard1_replica_n1] o.a.s.c.SyncStrategy Sync replicas to http://127.0.0.1:33069/wz_ogc/u/control_collection_shard1_replica_n1/
   [junit4]   2> 235425 INFO  (qtp6090807-1732) [n:127.0.0.1:33069_wz_ogc%2Fu c:control_collection s:shard1  x:control_collection_shard1_replica_n1] o.a.s.c.SyncStrategy Sync Success - now sync replicas to me
   [junit4]   2> 235425 INFO  (qtp6090807-1732) [n:127.0.0.1:33069_wz_ogc%2Fu c:control_collection s:shard1  x:control_collection_shard1_replica_n1] o.a.s.c.SyncStrategy http://127.0.0.1:33069/wz_ogc/u/control_collection_shard1_replica_n1/ has no replicas
   [junit4]   2> 235425 INFO  (qtp6090807-1732) [n:127.0.0.1:33069_wz_ogc%2Fu c:control_collection s:shard1  x:control_collection_shard1_replica_n1] o.a.s.c.ShardLeaderElectionContext Found all replicas participating in election, clear LIR
   [junit4]   2> 235427 INFO  (qtp6090807-1732) [n:127.0.0.1:33069_wz_ogc%2Fu c:control_collection s:shard1  x:control_collection_shard1_replica_n1] o.a.s.c.ShardLeaderElectionContext I am the new leader: http://127.0.0.1:33069/wz_ogc/u/control_collection_shard1_replica_n1/ shard1
   [junit4]   2> 235528 INFO  (zkCallback-212-thread-1-processing-n:127.0.0.1:33069_wz_ogc%2Fu) [n:127.0.0.1:33069_wz_ogc%2Fu    ] o.a.s.c.c.ZkStateReader A cluster state change: [WatchedEvent state:SyncConnected type:NodeDataChanged path:/collections/control_collection/state.json] for collection [control_collection] has occurred - updating... (live nodes size: [1])
   [junit4]   2> 235577 INFO  (qtp6090807-1732) [n:127.0.0.1:33069_wz_ogc%2Fu c:control_collection s:shard1  x:control_collection_shard1_replica_n1] o.a.s.c.ZkController I am the leader, no recovery necessary
   [junit4]   2> 235578 INFO  (qtp6090807-1732) [n:127.0.0.1:33069_wz_ogc%2Fu c:control_collection s:shard1  x:control_collection_shard1_replica_n1] o.a.s.s.HttpSolrCall [admin] webapp=null path=/admin/cores params={qt=/admin/cores&collection.configName=conf1&newCollection=true&name=control_collection_shard1_replica_n1&action=CREATE&numShards=1&collection=control_collection&shard=shard1&wt=javabin&version=2&replicaType=NRT} status=0 QTime=1339
   [junit4]   2> 235580 INFO  (qtp6090807-1730) [n:127.0.0.1:33069_wz_ogc%2Fu    ] o.a.s.h.a.CollectionsHandler Wait for new collection to be active for at most 30 seconds. Check all shard replicas
   [junit4]   2> 235680 INFO  (zkCallback-212-thread-1-processing-n:127.0.0.1:33069_wz_ogc%2Fu) [n:127.0.0.1:33069_wz_ogc%2Fu    ] o.a.s.c.c.ZkStateReader A cluster state change: [WatchedEvent state:SyncConnected type:NodeDataChanged path:/collections/control_collection/state.json] for collection [control_collection] has occurred - updating... (live nodes size: [1])
   [junit4]   2> 236104 INFO  (OverseerCollectionConfigSetProcessor-98489300920827908-127.0.0.1:33069_wz_ogc%2Fu-n_0000000000) [n:127.0.0.1:33069_wz_ogc%2Fu    ] o.a.s.c.OverseerTaskQueue Response ZK path: /overseer/collection-queue-work/qnr-0000000000 doesn't exist.  Requestor may have disconnected from ZooKeeper
   [junit4]   2> 236580 INFO  (qtp6090807-1730) [n:127.0.0.1:33069_wz_ogc%2Fu    ] o.a.s.s.HttpSolrCall [admin] webapp=null path=/admin/collections params={replicationFactor=1&collection.configName=conf1&name=control_collection&nrtReplicas=1&action=CREATE&numShards=1&createNodeSet=127.0.0.1:33069_wz_ogc%252Fu&wt=javabin&version=2} status=0 QTime=2483
   [junit4]   2> 236585 INFO  (TEST-ForceLeaderTest.testLastPublishedStateIsActive-seed#[BB6040DD3B4B702F]) [    ] o.a.s.c.c.ZkStateReader Updated live nodes from ZooKeeper... (0) -> (1)
   [junit4]   2> 236586 INFO  (TEST-ForceLeaderTest.testLastPublishedStateIsActive-seed#[BB6040DD3B4B702F]) [    ] o.a.s.c.s.i.ZkClientClusterStateProvider Cluster at 127.0.0.1:43031/solr ready
   [junit4]   2> 236586 INFO  (TEST-ForceLeaderTest.testLastPublishedStateIsActive-seed#[BB6040DD3B4B702F]) [    ] o.a.s.c.ChaosMonkey monkey: init - expire sessions:false cause connection loss:false
   [junit4]   2> 236586 INFO  (SocketProxy-Acceptor-33069) [    ] o.a.s.c.SocketProxy accepted Socket[addr=/127.0.0.1,port=52672,localport=33069], receiveBufferSize:531000
   [junit4]   2> 236586 INFO  (SocketProxy-Acceptor-33069) [    ] o.a.s.c.SocketProxy proxy connection Socket[addr=/127.0.0.1,port=35041,localport=45572], receiveBufferSize=530904
   [junit4]   2> 236587 INFO  (qtp6090807-1730) [n:127.0.0.1:33069_wz_ogc%2Fu    ] o.a.s.h.a.CollectionsHandler Invoked Collection Action :create with params replicationFactor=1&collection.configName=conf1&name=collection1&nrtReplicas=1&action=CREATE&numShards=2&createNodeSet=&stateFormat=2&wt=javabin&version=2 and sendToOCPQueue=true
   [junit4]   2> 236588 INFO  (OverseerThreadFactory-621-thread-2-processing-n:127.0.0.1:33069_wz_ogc%2Fu) [n:127.0.0.1:33069_wz_ogc%2Fu    ] o.a.s.c.CreateCollectionCmd Create collection collection1
   [junit4]   2> 236588 WARN  (OverseerThreadFactory-621-thread-2-processing-n:127.0.0.1:33069_wz_ogc%2Fu) [n:127.0.0.1:33069_wz_ogc%2Fu    ] o.a.s.c.CreateCollectionCmd It is unusual to create a collection (collection1) without cores.
   [junit4]   2> 236792 INFO  (qtp6090807-1730) [n:127.0.0.1:33069_wz_ogc%2Fu    ] o.a.s.h.a.CollectionsHandler Wait for new collection to be active for at most 30 seconds. Check all shard replicas
   [junit4]   2> 236792 INFO  (qtp6090807-1730) [n:127.0.0.1:33069_wz_ogc%2Fu    ] o.a.s.s.HttpSolrCall [admin] webapp=null path=/admin/collections params={replicationFactor=1&collection.configName=conf1&name=collection1&nrtReplicas=1&action=CREATE&numShards=2&createNodeSet=&stateFormat=2&wt=javabin&version=2} status=0 QTime=205
   [junit4]   2> 236876 INFO  (TEST-ForceLeaderTest.testLastPublishedStateIsActive-seed#[BB6040DD3B4B702F]) [    ] o.a.s.c.AbstractFullDistribZkTestBase create jetty 1 in directory /home/jenkins/workspace/Lucene-Solr-7.x-Linux/solr/build/solr-core/test/J0/temp/solr.cloud.ForceLeaderTest_BB6040DD3B4B702F-001/shard-1-001 of type TLOG
   [junit4]   2> 236877 INFO  (TEST-ForceLeaderTest.testLastPublishedStateIsActive-seed#[BB6040DD3B4B702F]) [    ] o.e.j.s.Server jetty-9.3.14.v20161028
   [junit4]   2> 236878 INFO  (TEST-ForceLeaderTest.testLastPublishedStateIsActive-seed#[BB6040DD3B4B702F]) [    ] o.e.j.s.h.ContextHandler Started o.e.j.s.ServletContextHandler@550cb5{/wz_ogc/u,null,AVAILABLE}
   [junit4]   2> 236878 INFO  (TEST-ForceLeaderTest.testLastPublishedStateIsActive-seed#[BB6040DD3B4B702F]) [    ] o.e.j.s.AbstractConnector Started ServerConnector@1f29067{HTTP/1.1,[http/1.1]}{127.0.0.1:45009}
   [junit4]   2> 236878 INFO  (TEST-ForceLeaderTest.testLastPublishedStateIsActive-seed#[BB6040DD3B4B702F]) [    ] o.e.j.s.Server Started @238230ms
   [junit4]   2> 236879 INFO  (TEST-ForceLeaderTest.testLastPublishedStateIsActive-seed#[BB6040DD3B4B702F]) [    ] o.a.s.c.s.e.JettySolrRunner Jetty properties: {solr.data.dir=/home/jenkins/workspace/Lucene-Solr-7.x-Linux/solr/build/solr-core/test/J0/temp/solr.cloud.ForceLeaderTest_BB6040DD3B4B702F-001/tempDir-001/jetty1, replicaType=TLOG, solrconfig=solrconfig.xml, hostContext=/wz_ogc/u, hostPort=34675, coreRootDirectory=/home/jenkins/workspace/Lucene-Solr-7.x-Linux/solr/build/solr-core/test/J0/temp/solr.cloud.ForceLeaderTest_BB6040DD3B4B702F-001/shard-1-001/cores}
   [junit4]   2> 236879 ERROR (TEST-ForceLeaderTest.testLastPublishedStateIsActive-seed#[BB6040DD3B4B702F]) [    ] o.a.s.s.StartupLoggingUtils Missing Java Option solr.log.dir. Logging may be missing or incomplete.
   [junit4]   2> 236879 INFO  (TEST-ForceLeaderTest.testLastPublishedStateIsActive-seed#[BB6040DD3B4B702F]) [    ] o.a.s.s.SolrDispatchFilter  ___      _       Welcome to Apache Solr™ version 7.1.0
   [junit4]   2> 236879 INFO  (TEST-ForceLeaderTest.testLastPublishedStateIsActive-seed#[BB6040DD3B4B702F]) [    ] o.a.s.s.SolrDispatchFilter / __| ___| |_ _   Starting in cloud mode on port null
   [junit4]   2> 236879 INFO  (TEST-ForceLeaderTest.testLastPublishedStateIsActive-seed#[BB6040DD3B4B702F]) [    ] o.a.s.s.SolrDispatchFilter \__ \/ _ \ | '_|  Install dir: null, Default config dir: null
   [junit4]   2> 236879 INFO  (TEST-ForceLeaderTest.testLastPublishedStateIsActive-seed#[BB6040DD3B4B702F]) [    ] o.a.s.s.SolrDispatchFilter |___/\___/_|_|    Start time: 2017-08-15T20:04:30.925Z
   [junit4]   2> 236881 INFO  (TEST-ForceLeaderTest.testLastPublishedStateIsActive-seed#[BB6040DD3B4B702F]) [    ] o.a.s.s.SolrDispatchFilter Loading solr.xml from SolrHome (not found in ZooKeeper)
   [junit4]   2> 236881 INFO  (TEST-ForceLeaderTest.testLastPublishedStateIsActive-seed#[BB6040DD3B4B702F]) [    ] o.a.s.c.SolrXmlConfig Loading container configuration from /home/jenkins/workspace/Lucene-Solr-7.x-Linux/solr/build/solr-core/test/J0/temp/solr.cloud.ForceLeaderTest_BB6040DD3B4B702F-001/shard-1-001/solr.xml
   [junit4]   2> 236890 INFO  (TEST-ForceLeaderTest.testLastPublishedStateIsActive-seed#[BB6040DD3B4B702F]) [    ] o.a.s.c.SolrXmlConfig MBean server found: com.sun.jmx.mbeanserver.JmxMBeanServer@1955fe5, but no JMX reporters were configured - adding default JMX reporter.
   [junit4]   2> 236892 INFO  (TEST-ForceLeaderTest.testLastPublishedStateIsActive-seed#[BB6040DD3B4B702F]) [    ] o.a.s.c.ZkContainer Zookeeper client=127.0.0.1:43031/solr
   [junit4]   2> 236897 INFO  (TEST-ForceLeaderTest.testLastPublishedStateIsActive-seed#[BB6040DD3B4B702F]) [n:127.0.0.1:34675_wz_ogc%2Fu    ] o.a.s.c.c.ZkStateReader Updated live nodes from ZooKeeper... (0) -> (1)
   [junit4]   2> 236898 INFO  (TEST-ForceLeaderTest.testLastPublishedStateIsActive-seed#[BB6040DD3B4B702F]) [n:127.0.0.1:34675_wz_ogc%2Fu    ] o.a.s.c.Overseer Overseer (id=null) closing
   [junit4]   2> 236899 INFO  (TEST-ForceLeaderTest.testLastPublishedStateIsActive-seed#[BB6040DD3B4B702F]) [n:127.0.0.1:34675_wz_ogc%2Fu    ] o.a.s.c.ZkController Register node as live in ZooKeeper:/live_nodes/127.0.0.1:34675_wz_ogc%2Fu
   [junit4]   2> 236899 INFO  (zkCallback-224-thread-1-processing-n:127.0.0.1:34675_wz_ogc%2Fu) [n:127.0.0.1:34675_wz_ogc%2Fu    ] o.a.s.c.c.ZkStateReader Updated live nodes from ZooKeeper... (1) -> (2)
   [junit4]   2> 236899 INFO  (zkCallback-219-thread-1) [    ] o.a.s.c.c.ZkStateReader Updated live nodes from ZooKeeper... (1) -> (2)
   [junit4]   2> 236899 INFO  (zkCallback-212-thread-1-processing-n:127.0.0.1:33069_wz_ogc%2Fu) [n:127.0.0.1:33069_wz_ogc%2Fu    ] o.a.s.c.c.ZkStateReader Updated live nodes from ZooKeeper... (1) -> (2)
   [junit4]   2> 236964 INFO  (TEST-ForceLeaderTest.testLastPublishedStateIsActive-seed#[BB6040DD3B4B702F]) [n:127.0.0.1:34675_wz_ogc%2Fu    ] o.a.s.m.r.SolrJmxReporter JMX monitoring for 'solr.node' (registry 'solr.node') enabled at server: com.sun.jmx.mbeanserver.JmxMBeanServer@1955fe5
   [junit4]   2> 236973 INFO  (TEST-ForceLeaderTest.testLastPublishedStateIsActive-seed#[BB6040DD3B4B702F]) [n:127.0.0.1:34675_wz_ogc%2Fu    ] o.a.s.m.r.SolrJmxReporter JMX monitoring for 'solr.jvm' (registry 'solr.jvm') enabled at server: com.sun.jmx.mbeanserver.JmxMBeanServer@1955fe5
   [junit4]   2> 236973 INFO  (TEST-ForceLeaderTest.testLastPublishedStateIsActive-seed#[BB6040DD3B4B702F]) [n:127.0.0.1:34675_wz_ogc%2Fu    ] o.a.s.m.r.SolrJmxReporter JMX monitoring for 'solr.jetty' (registry 'solr.jetty') enabled at server: com.sun.jmx.mbeanserver.JmxMBeanServer@1955fe5
   [junit4]   2> 236974 INFO  (TEST-ForceLeaderTest.testLastPublishedStateIsActive-seed#[BB6040DD3B4B702F]) [n:127.0.0.1:34675_wz_ogc%2Fu    ] o.a.s.c.CorePropertiesLocator Found 0 core definitions underneath /home/jenkins/workspace/Lucene-Solr-7.x-Linux/solr/build/solr-core/test/J0/temp/solr.cloud.ForceLeaderTest_BB6040DD3B4B702F-001/shard-1-001/cores
   [junit4]   2> 236995 INFO  (SocketProxy-Acceptor-34675) [    ] o.a.s.c.SocketProxy accepted Socket[addr=/127.0.0.1,port=47414,localport=34675], receiveBufferSize:531000
   [junit4]   2> 236995 INFO  (SocketProxy-Acceptor-34675) [    ] o.a.s.c.SocketProxy proxy connection Socket[addr=/127.0.0.1,port=45009,localport=34338], receiveBufferSize=530904
   [junit4]   2> 236997 INFO  (qtp13559873-1778) [n:127.0.0.1:34675_wz_ogc%2Fu    ] o.a.s.h.a.CollectionsHandler Invoked Collection Action :addreplica with params node=127.0.0.1:34675_wz_ogc%252Fu&action=ADDREPLICA&collection=collection1&shard=shard2&type=TLOG&wt=javabin&version=2 and sendToOCPQueue=true
   [junit4]   2> 236999 INFO  (OverseerCollectionConfigSetProcessor-98489300920827908-127.0.0.1:33069_wz_ogc%2Fu-n_0000000000) [n:127.0.0.1:33069_wz_ogc%2Fu    ] o.a.s.c.OverseerTaskQueue Response ZK path: /overseer/collection-queue-work/qnr-0000000002 doesn't exist.  Requestor may have disconnected from ZooKeeper
   [junit4]   2> 236999 INFO  (OverseerThreadFactory-621-thread-3-processing-n:127.0.0.1:33069_wz_ogc%2Fu) [n:127.0.0.1:33069_wz_ogc%2Fu    ] o.a.s.c.AddReplicaCmd Node Identified 127.0.0.1:34675_wz_ogc%2Fu for creating new replica
   [junit4]   2> 237000 INFO  (SocketProxy-Acceptor-34675) [    ] o.a.s.c.SocketProxy accepted Socket[addr=/127.0.0.1,port=47418,localport=34675], receiveBufferSize:531000
   [junit4]   2> 237000 INFO  (SocketProxy-Acceptor-34675) [    ] o.a.s.c.SocketProxy proxy connection Socket[addr=/127.0.0.1,port=45009,localport=34342], receiveBufferSize=530904
   [junit4]   2> 237001 INFO  (qtp13559873-1780) [n:127.0.0.1:34675_wz_ogc%2Fu    ] o.a.s.h.a.CoreAdminOperation core create command qt=/admin/cores&collection.configName=conf1&name=collection1_shard2_replica_t41&action=CREATE&collection=collection1&shard=shard2&wt=javabin&version=2&replicaType=TLOG
   [junit4]   2> 237002 INFO  (qtp13559873-1780) [n:127.0.0.1:34675_wz_ogc%2Fu    ] o.a.s.c.TransientSolrCoreCacheDefault Allocating transient cache for 4 transient cores
   [junit4]   2> 237105 INFO  (zkCallback-224-thread-1-processing-n:127.0.0.1:34675_wz_ogc%2Fu) [n:127.0.0.1:34675_wz_ogc%2Fu    ] o.a.s.c.c.ZkStateReader A cluster state change: [WatchedEvent state:SyncConnected type:NodeDataChanged path:/collections/collection1/state.json] for collection [collection1] has occurred - updating... (live nodes size: [2])
   [junit4]   2> 238018 INFO  (qtp13559873-1780) [n:127.0.0.1:34675_wz_ogc%2Fu c:collection1 s:shard2  x:collection1_shard2_replica_t41] o.a.s.c.SolrConfig Using Lucene MatchVersion: 7.1.0
   [junit4]   2> 238038 INFO  (qtp13559873-1780) [n:127.0.0.1:34675_wz_ogc%2Fu c:collection1 s:shard2  x:collection1_shard2_replica_t41] o.a.s.s.IndexSchema [collection1_shard2_replica_t41] Schema name=test
   [junit4]   2> 238096 INFO  (qtp13559873-1780) [n:127.0.0.1:34675_wz_ogc%2Fu c:collection1 s:shard2  x:collection1_shard2_replica_t41] o.a.s.s.IndexSchema Loaded schema test/1.0 with uniqueid field id
   [junit4]   2> 238102 INFO  (qtp13559873-1780) [n:127.0.0.1:34675_wz_ogc%2Fu c:collection1 s:shard2  x:collection1_shard2_replica_t41] o.a.s.c.CoreContainer Creating SolrCore 'collection1_shard2_replica_t41' using configuration from collection collection1, trusted=true
   [junit4]   2> 238102 INFO  (qtp13559873-1780) [n:127.0.0.1:34675_wz_ogc%2Fu c:collection1 s:shard2  x:collection1_shard2_replica_t41] o.a.s.m.r.SolrJmxReporter JMX monitoring for 'solr.core.collection1.shard2.replica_t41' (registry 'solr.core.collection1.shard2.replica_t41') enabled at server: com.sun.jmx.mbeanserver.JmxMBeanServer@1955fe5
   [junit4]   2> 238102 INFO  (qtp13559873-1780) [n:127.0.0.1:34675_wz_ogc%2Fu c:collection1 s:shard2  x:collection1_shard2_replica_t41] o.a.s.c.SolrCore solr.RecoveryStrategy.Builder
   [junit4]   2> 238102 INFO  (qtp13559873-1780) [n:127.0.0.1:34675_wz_ogc%2Fu c:collection1 s:shard2  x:collection1_shard2_replica_t41] o.a.s.c.SolrCore [[collection1_shard2_replica_t41] ] Opening new SolrCore at [/home/jenkins/workspace/Lucene-Solr-7.x-Linux/solr/build/solr-core/test/J0/temp/solr.cloud.ForceLeaderTest_BB6040DD3B4B702F-001/shard-1-001/cores/collection1_shard2_replica_t41], dataDir=[/home/jenkins/workspace/Lucene-Solr-7.x-Linux/solr/build/solr-core/test/J0/temp/solr.cloud.ForceLeaderTest_BB6040DD3B4B702F-001/shard-1-001/cores/collection1_shard2_replica_t41/data/]
   [junit4]   2> 238104 INFO  (qtp13559873-1780) [n:127.0.0.1:34675_wz_ogc%2Fu c:collection1 s:shard2  x:collection1_shard2_replica_t41] o.a.s.u.RandomMergePolicy RandomMergePolicy wrapping class org.apache.lucene.index.LogDocMergePolicy: [LogDocMergePolicy: minMergeSize=1000, mergeFactor=31, maxMergeSize=9223372036854775807, maxMergeSizeForForcedMerge=9223372036854775807, calibrateSizeByDeletes=false, maxMergeDocs=2147483647, maxCFSSegmentSizeMB=8.796093022207999E12, noCFSRatio=0.5246353515381408]
   [junit4]   2> 238106 WARN  (qtp13559873-1780) [n:127.0.0.1:34675_wz_ogc%2Fu c:collection1 s:shard2  x:collection1_shard2_replica_t41] o.a.s.c.RequestHandlers INVALID paramSet a in requestHandler {type = requestHandler,name = /dump,class = DumpRequestHandler,attributes = {initParams=a, name=/dump, class=DumpRequestHandler},args = {defaults={a=A,b=B}}}
   [junit4]   2> 238129 INFO  (qtp13559873-1780) [n:127.0.0.1:34675_wz_ogc%2Fu c:collection1 s:shard2  x:collection1_shard2_replica_t41] o.a.s.u.UpdateHandler Using UpdateLog implementation: org.apache.solr.update.UpdateLog
   [junit4]   2> 238129 INFO  (qtp13559873-1780) [n:127.0.0.1:34675_wz_ogc%2Fu c:collection1 s:shard2  x:collection1_shard2_replica_t41] o.a.s.u.UpdateLog Initializing UpdateLog: dataDir= defaultSyncLevel=FLUSH numRecordsToKeep=100 maxNumLogsToKeep=10 numVersionBuckets=65536
   [junit4]   2> 238130 INFO  (qtp13559873-1780) [n:127.0.0.1:34675_wz_ogc%2Fu c:collection1 s:shard2  x:collection1_shard2_replica_t41] o.a.s.u.CommitTracker Hard AutoCommit: disabled
   [junit4]   2> 238130 INFO  (qtp13559873-1780) [n:127.0.0.1:34675_wz_ogc%2Fu c:collection1 s:shard2  x:collection1_shard2_replica_t41] o.a.s.u.CommitTracker Soft AutoCommit: disabled
   [junit4]   2> 238131 INFO  (qtp13559873-1780) [n:127.0.0.1:34675_wz_ogc%2Fu c:collection1 s:shard2  x:collection1_shard2_replica_t41] o.a.s.u.RandomMergePolicy RandomMergePolicy wrapping class org.apache.lucene.index.TieredMergePolicy: [TieredMergePolicy: maxMergeAtOnce=33, maxMergeAtOnceExplicit=37, maxMergedSegmentMB=82.8974609375, floorSegmentMB=1.0107421875, forceMergeDeletesPctAllowed=9.081021609809001, segmentsPerTier=21.0, maxCFSSegmentSizeMB=8.796093022207999E12, noCFSRatio=0.0
   [junit4]   2> 238131 INFO  (qtp13559873-1780) [n:127.0.0.1:34675_wz_ogc%2Fu c:collection1 s:shard2  x:collection1_shard2_replica_t41] o.a.s.s.SolrIndexSearcher Opening [Searcher@886c79[collection1_shard2_replica_t41] main]
   [junit4]   2> 238132 INFO  (qtp13559873-1780) [n:127.0.0.1:34675_wz_ogc%2Fu c:collection1 s:shard2  x:collection1_shard2_replica_t41] o.a.s.r.ManagedResourceStorage Configured ZooKeeperStorageIO with znodeBase: /configs/conf1
   [junit4]   2> 238132 INFO  (qtp13559873-1780) [n:127.0.0.1:34675_wz_ogc%2Fu c:collection1 s:shard2  x:collection1_shard2_replica_t41] o.a.s.r.ManagedResourceStorage Loaded null at path _rest_managed.json using ZooKeeperStorageIO:path=/configs/conf1
   [junit4]   2> 238132 INFO  (qtp13559873-1780) [n:127.0.0.1:34675_wz_ogc%2Fu c:collection1 s:shard2  x:collection1_shard2_replica_t41] o.a.s.h.ReplicationHandler Commits will be reserved for  10000
   [junit4]   2> 238132 INFO  (qtp13559873-1780) [n:127.0.0.1:34675_wz_ogc%2Fu c:collection1 s:shard2  x:collection1_shard2_replica_t41] o.a.s.u.UpdateLog Could not find max version in index or recent updates, using new clock 1575828819466518528
   [junit4]   2> 238133 INFO  (searcherExecutor-635-thread-1-processing-n:127.0.0.1:34675_wz_ogc%2Fu x:collection1_shard2_replica_t41 s:shard2 c:collection1) [n:127.0.0.1:34675_wz_ogc%2Fu c:collection1 s:shard2  x:collection1_shard2_replica_t41] o.a.s.c.SolrCore [collection1_shard2_replica_t41] Registered new searcher Searcher@886c79[collection1_shard2_replica_t41] main{ExitableDirectoryReader(UninvertingDirectoryReader())}
   [junit4]   2> 238135 INFO  (qtp13559873-1780) [n:127.0.0.1:34675_wz_ogc%2Fu c:collection1 s:shard2  x:collection1_shard2_replica_t41] o.a.s.c.ShardLeaderElectionContext Enough replicas found to continue.
   [junit4]   2> 238135 INFO  (qtp13559873-1780) [n:127.0.0.1:34675_wz_ogc%2Fu c:collection1 s:shard2  x:collection1_shard2_replica_t41] o.a.s.c.ShardLeaderElectionContext I may be the new leader - try and sync
   [junit4]   2> 238135 INFO  (qtp13559873-1780) [n:127.0.0.1:34675_wz_ogc%2Fu c:collection1 s:shard2  x:collection1_shard2_replica_t41] o.a.s.c.SyncStrategy Sync replicas to http://127.0.0.1:34675/wz_ogc/u/collection1_shard2_replica_t41/
   [junit4]   2> 238135 INFO  (qtp13559873-1780) [n:127.0.0.1:34675_wz_ogc%2Fu c:collection1 s:shard2  x:collection1_shard2_replica_t41] o.a.s.c.SyncStrategy Sync Success - now sync replicas to me
   [junit4]   2> 238135 INFO  (qtp13559873-1780) [n:127.0.0.1:34675_wz_ogc%2Fu c:collection1 s:shard2  x:collection1_shard2_replica_t41] o.a.s.c.SyncStrategy http://127.0.0.1:34675/wz_ogc/u/collection1_shard2_replica_t41/ has no replicas
   [junit4]   2> 238135 INFO  (qtp13559873-1780) [n:127.0.0.1:34675_wz_ogc%2Fu c:collection1 s:shard2  x:collection1_shard2_replica_t41] o.a.s.c.ShardLeaderElectionContext Found all replicas participating in election, clear LIR
   [junit4]   2> 238136 INFO  (qtp13559873-1780) [n:127.0.0.1:34675_wz_ogc%2Fu c:collection1 s:shard2  x:collection1_shard2_replica_t41] o.a.s.c.ZkController collection1_shard2_replica_t41 stopping background replication from leader
   [junit4]   2> 238137 INFO  (qtp13559873-1780) [n:127.0.0.1:34675_wz_ogc%2Fu c:collection1 s:shard2  x:collection1_shard2_replica_t41] o.a.s.c.ShardLeaderElectionContext I am the new leader: http://127.0.0.1:34675/wz_ogc/u/collection1_shard2_replica_t41/ shard2
   [junit4]   2> 238238 INFO  (zkCallback-224-thread-1-processing-n:127.0.0.1:34675_wz_ogc%2Fu) [n:127.0.0.1:34675_wz_ogc%2Fu    ] o.a.s.c.c.ZkStateReader A cluster state change: [WatchedEvent state:SyncConnected type:NodeDataChanged path:/collections/collection1/state.json] for collection [collection1] has occurred - updating... (live nodes size: [2])
   [junit4]   2> 238287 INFO  (qtp13559873-1780) [n:127.0.0.1:34675_wz_ogc%2Fu c:collection1 s:shard2  x:collection1_shard2_replica_t41] o.a.s.c.ZkController I am the leader, no recovery necessary
   [junit4]   2> 238288 INFO  (qtp13559873-1780) [n:127.0.0.1:34675_wz_ogc%2Fu c:collection1 s:shard2  x:collection1_shard2_replica_t41] o.a.s.s.HttpSolrCall [admin] webapp=null path=/admin/cores params={qt=/admin/cores&collection.configName=conf1&name=collection1_shard2_replica_t41&action=CREATE&collection=collection1&shard=shard2&wt=javabin&version=2&replicaType=TLOG} status=0 QTime=1286
   [junit4]   2> 238290 INFO  (qtp13559873-1778) [n:127.0.0.1:34675_wz_ogc%2Fu    ] o.a.s.s.HttpSolrCall [admin] webapp=null path=/admin/collections params={node=127.0.0.1:34675_wz_ogc%252Fu&action=ADDREPLICA&collection=collection1&shard=shard2&type=TLOG&wt=javabin&version=2} status=0 QTime=1293
   [junit4]   2> 238375 INFO  (TEST-ForceLeaderTest.testLastPublishedStateIsActive-seed#[BB6040DD3B4B702F]) [    ] o.a.s.c.AbstractFullDistribZkTestBase create jetty 2 in directory /home/jenkins/workspace/Lucene-Solr-7.x-Linux/solr/build/solr-core/test/J0/temp/solr.cloud.ForceLeaderTest_BB6040DD3B4B702F-001/shard-2-001 of type TLOG
   [junit4]   2> 238376 INFO  (TEST-ForceLeaderTest.testLastPublishedStateIsActive-seed#[BB6040DD3B4B702F]) [    ] o.e.j.s.Server jetty-9.3.14.v20161028
   [junit4]   2> 238377 INFO  (TEST-ForceLeaderTest.testLastPublishedStateIsActive-seed#[BB6040DD3B4B702F]) [    ] o.e.j.s.h.ContextHandler Started o.e.j.s.ServletContextHandler@9ca932{/wz_ogc/u,null,AVAILABLE}
   [junit4]   2> 238377 INFO  (TEST-ForceLeaderTest.testLastPublishedStateIsActive-seed#[BB6040DD3B4B702F]) [    ] o.e.j.s.AbstractConnector Started ServerConnector@155705f{HTTP/1.1,[http/1.1]}{127.0.0.1:34437}
   [junit4]   2> 238377 INFO  (TEST-ForceLeaderTest.testLastPublishedStateIsActive-seed#[BB6040DD3B4B702F]) [    ] o.e.j.s.Server Started @239728ms
   [junit4]   2> 238377 INFO  (TEST-ForceLeaderTest.testLastPublishedStateIsActive-seed#[BB6040DD3B4B702F]) [    ] o.a.s.c.s.e.JettySolrRunner Jetty properties: {solr.data.dir=/home/jenkins/workspace/Lucene-Solr-7.x-Linux/solr/build/solr-core/test/J0/temp/solr.cloud.ForceLeaderTest_BB6040DD3B4B702F-001/tempDir-001/jetty2, replicaType=TLOG, solrconfig=solrconfig.xml, hostContext=/wz_ogc/u, hostPort=36785, coreRootDirectory=/home/jenkins/workspace/Lucene-Solr-7.x-Linux/solr/build/solr-core/test/J0/temp/solr.cloud.ForceLeaderTest_BB6040DD3B4B702F-001/shard-2-001/cores}
   [junit4]   2> 238377 ERROR (TEST-ForceLeaderTest.testLastPublishedStateIsActive-seed#[BB6040DD3B4B702F]) [    ] o.a.s.s.StartupLoggingUtils Missing Java Option solr.log.dir. Logging may be missing or incomplete.
   [junit4]   2> 238378 INFO  (TEST-ForceLeaderTest.testLastPublishedStateIsActive-seed#[BB6040DD3B4B702F]) [    ] o.a.s.s.SolrDispatchFilter  ___      _       Welcome to Apache Solr™ version 7.1.0
   [junit4]   2> 238378 INFO  (TEST-ForceLeaderTest.testLastPublishedStateIsActive-seed#[BB6040DD3B4B702F]) [    ] o.a.s.s.SolrDispatchFilter / __| ___| |_ _   Starting in cloud mode on port null
   [junit4]   2> 238378 INFO  (TEST-ForceLeaderTest.testLastPublishedStateIsActive-seed#[BB6040DD3B4B702F]) [    ] o.a.s.s.SolrDispatchFilter \__ \/ _ \ | '_|  Install dir: null, Default config dir: null
   [junit4]   2> 238378 INFO  (TEST-ForceLeaderTest.testLastPublishedStateIsActive-seed#[BB6040DD3B4B702F]) [    ] o.a.s.s.SolrDispatchFilter |___/\___/_|_|    Start time: 2017-08-15T20:04:32.424Z
   [junit4]   2> 238380 INFO  (TEST-ForceLeaderTest.testLastPublishedStateIsActive-seed#[BB6040DD3B4B702F]) [    ] o.a.s.s.SolrDispatchFilter Loading solr.xml from SolrHome (not found in ZooKeeper)
   [junit4]   2> 238380 INFO  (TEST-ForceLeaderTest.testLastPublishedStateIsActive-seed#[BB6040DD3B4B702F]) [    ] o.a.s.c.SolrXmlConfig Loading container configuration from /home/jenkins/workspace/Lucene-Solr-7.x-Linux/solr/build/solr-core/test/J0/temp/solr.cloud.ForceLeaderTest_BB6040DD3B4B702F-001/shard-2-001/solr.xml
   [junit4]   2> 238384 INFO  (TEST-ForceLeaderTest.testLastPublishedStateIsActive-seed#[BB6040DD3B4B702F]) [    ] o.a.s.c.SolrXmlConfig MBean server found: com.sun.jmx.mbeanserver.JmxMBeanServer@1955fe5, but no JMX reporters were configured - adding default JMX reporter.
   [junit4]   2> 238386 INFO  (TEST-ForceLeaderTest.testLastPublishedStateIsActive-seed#[BB6040DD3B4B702F]) [    ] o.a.s.c.ZkContainer Zookeeper client=127.0.0.1:43031/solr
   [junit4]   2> 238391 INFO  (zkCallback-224-thread-1-processing-n:127.0.0.1:34675_wz_ogc%2Fu) [n:127.0.0.1:34675_wz_ogc%2Fu    ] o.a.s.c.c.ZkStateReader A cluster state change: [WatchedEvent state:SyncConnected type:NodeDataChanged path:/collections/collection1/state.json] for collection [collection1] has occurred - updating... (live nodes size: [2])
   [junit4]   2> 238396 INFO  (TEST-ForceLeaderTest.testLastPublishedStateIsActive-seed#[BB6040DD3B4B702F]) [n:127.0.0.1:36785_wz_ogc%2Fu    ] o.a.s.c.c.ZkStateReader Updated live nodes from ZooKeeper... (0) -> (2)
   [junit4]   2> 238396 INFO  (TEST-ForceLeaderTest.testLastPublishedStateIsActive-seed#[BB6040DD3B4B702F]) [n:127.0.0.1:36785_wz_ogc%2Fu    ] o.a.s.c.Overseer Overseer (id=null) closing
   [junit4]   2> 238397 INFO  (TEST-ForceLeaderTest.testLastPublishedStateIsActive-seed#[BB6040DD3B4B702F]) [n:127.0.0.1:36785_wz_ogc%2Fu    ] o.a.s.c.ZkController Register node as live in ZooKeeper:/live_nodes/127.0.0.1:36785_wz_ogc%2Fu
   [junit4]   2> 238398 INFO  (zkCallback-230-thread-1-processing-n:127.0.0.1:36785_wz_ogc%2Fu) [n:127.0.0.1:36785_wz_ogc%2Fu    ] o.a.s.c.c.ZkStateReader Updated live nodes from ZooKeeper... (2) -> (3)
   [junit4]   2> 238398 INFO  (zkCallback-212-thread-2-processing-n:127.0.0.1:33069_wz_ogc%2Fu) [n:127.0.0.1:33069_wz_ogc%2Fu    ] o.a.s.c.c.ZkStateReader Updated live nodes from ZooKeeper... (2) -> (3)
   [junit4]   2> 238398 INFO  (zkCallback-224-thread-1-processing-n:127.0.0.1:34675_wz_ogc%2Fu) [n:127.0.0.1:34675_wz_ogc%2Fu    ] o.a.s.c.c.ZkStateReader Updated live nodes from ZooKeeper... (2) -> (3)
   [junit4]   2> 238398 INFO  (zkCallback-219-thread-1) [    ] o.a.s.c.c.ZkStateReader Updated live nodes from ZooKeeper... (2) -> (3)
   [junit4]   2> 238463 INFO  (TEST-ForceLeaderTest.testLastPublishedStateIsActive-seed#[BB6040DD3B4B702F]) [n:127.0.0.1:36785_wz_ogc%2Fu    ] o.a.s.m.r.SolrJmxReporter JMX monitoring for 'solr.node' (registry 'solr.node') enabled at server: com.sun.jmx.mbeanserver.JmxMBeanServer@1955fe5
   [junit4]   2> 238473 INFO  (TEST-ForceLeaderTest.testLastPublishedStateIsActive-seed#[BB6040DD3B4B702F]) [n:127.0.0.1:36785_wz_ogc%2Fu    ] o.a.s.m.r.SolrJmxReporter JMX monitoring for 'solr.jvm' (registry 'solr.jvm') enabled at server: com.sun.jmx.mbeanserver.JmxMBeanServer@1955fe5
   [junit4]   2> 238473 INFO  (TEST-ForceLeaderTest.testLastPublishedStateIsActive-seed#[BB6040DD3B4B702F]) [n:127.0.0.1:36785_wz_ogc%2Fu    ] o.a.s.m.r.SolrJmxReporter JMX monitoring for 'solr.jetty' (registry 'solr.jetty') enabled at server: com.sun.jmx.mbeanserver.JmxMBeanServer@1955fe5
   [junit4]   2> 238474 INFO  (TEST-ForceLeaderTest.testLastPublishedStateIsActive-seed#[BB6040DD3B4B702F]) [n:127.0.0.1:36785_wz_ogc%2Fu    ] o.a.s.c.CorePropertiesLocator Found 0 core definitions underneath /home/jenkins/workspace/Lucene-Solr-7.x-Linux/solr/build/solr-core/test/J0/temp/solr.cloud.ForceLeaderTest_BB6040DD3B4B702F-001/shard-2-001/cores
   [junit4]   2> 238503 INFO  (qtp13559873-1779) [n:127.0.0.1:34675_wz_ogc%2Fu    ] o.a.s.h.a.CollectionsHandler Invoked Collection Action :addreplica with params node=127.0.0.1:36785_wz_ogc%252Fu&action=ADDREPLICA&collection=collection1&shard=shard1&type=TLOG&wt=javabin&version=2 and sendToOCPQueue=true
   [junit4]   2> 238504 INFO  (OverseerCollectionConfigSetProcessor-98489300920827908-127.0.0.1:33069_wz_ogc%2Fu-n_0000000000) [n:127.0.0.1:33069_wz_ogc%2Fu    ] o.a.s.c.OverseerTaskQueue Response ZK path: /overseer/collection-queue-work/qnr-0000000004 doesn't exist.  Requestor may have disconnected from ZooKeeper
   [junit4]   2> 238504 INFO  (OverseerThreadFactory-621-thread-4-processing-n:127.0.0.1:33069_wz_ogc%2Fu) [n:127.0.0.1:33069_wz_ogc%2Fu    ] o.a.s.c.AddReplicaCmd Node Identified 127.0.0.1:36785_wz_ogc%2Fu for creating new replica
   [junit4]   2> 238505 INFO  (SocketProxy-Acceptor-36785) [    ] o.a.s.c.SocketProxy accepted Socket[addr=/127.0.0.1,port=46156,localport=36785], receiveBufferSize:531000
   [junit4]   2> 238506 INFO  (SocketProxy-Acceptor-36785) [    ] o.a.s.c.SocketProxy proxy connection Socket[addr=/127.0.0.1,port=34437,localport=52614], receiveBufferSize=530904
   [junit4]   2> 238507 INFO  (qtp29001365-1813) [n:127.0.0.1:36785_wz_ogc%2Fu    ] o.a.s.h.a.CoreAdminOperation core create command qt=/admin/cores&collection.configName=conf1&name=collection1_shard1_replica_t43&action=CREATE&collection=collection1&shard=shard1&wt=javabin&version=2&replicaType=TLOG
   [junit4]   2> 238508 INFO  (qtp29001365-1813) [n:127.0.0.1:36785_wz_ogc%2Fu    ] o.a.s.c.TransientSolrCoreCacheDefault Allocating transient cache for 4 transient cores
   [junit4]   2> 238612 INFO  (zkCallback-230-thread-1-processing-n:127.0.0.1:36785_wz_ogc%2Fu) [n:127.0.0.1:36785_wz_ogc%2Fu    ] o.a.s.c.c.ZkStateReader A cluster state change: [WatchedEvent state:SyncConnected type:NodeDataChanged path:/collections/collection1/state.json] for collection [collection1] has occurred - updating... (live nodes size: [3])
   [junit4]   2> 238612 INFO  (zkCallback-224-thread-1-processing-n:127.0.0.1:34675_wz_ogc%2Fu) [n:127.0.0.1:34675_wz_ogc%2Fu    ] o.a.s.c.c.ZkStateReader A cluster state change: [WatchedEvent state:SyncConnected type:NodeDataChanged path:/collections/collection1/state.json] for collection [collection1] has occurred - updating... (live nodes size: [3])
   [junit4]   2> 239524 INFO  (qtp29001365-1813) [n:127.0.0.1:36785_wz_ogc%2Fu c:collection1 s:shard1  x:collection1_shard1_replica_t43] o.a.s.c.SolrConfig Using Lucene MatchVersion: 7.1.0
   [junit4]   2> 239548 INFO  (qtp29001365-1813) [n:127.0.0.1:36785_wz_ogc%2Fu c:collection1 s:shard1  x:collection1_shard1_replica_t43] o.a.s.s.IndexSchema [collection1_shard1_replica_t43] Schema name=test
   [junit4]   2> 239603 INFO  (qtp29001365-1813) [n:127.0.0.1:36785_wz_ogc%2Fu c:collection1 s:shard1  x:collection1_shard1_replica_t43] o.a.s.s.IndexSchema Loaded schema test/1.0 with uniqueid field id
   [junit4]   2> 239615 INFO  (qtp29001365-1813) [n:127.0.0.1:36785_wz_ogc%2Fu c:collection1 s:shard1  x:collection1_shard1_replica_t43] o.a.s.c.CoreContainer Creating SolrCore 'collection1_shard1_replica_t43' using configuration from collection collection1, trusted=true
   [junit4]   2> 239616 INFO  (qtp29001365-1813) [n:127.0.0.1:36785_wz_ogc%2Fu c:collection1 s:shard1  x:collection1_shard1_replica_t43] o.a.s.m.r.SolrJmxReporter JMX monitoring for 'solr.core.collection1.shard1.replica_t43' (registry 'solr.core.collection1.shard1.replica_t43') enabled at server: com.sun.jmx.mbeanserver.JmxMBeanServer@1955fe5
   [junit4]   2> 239616 INFO  (qtp29001365-1813) [n:127.0.0.1:36785_wz_ogc%2Fu c:collection1 s:shard1  x:collection1_shard1_replica_t43] o.a.s.c.SolrCore solr.RecoveryStrategy.Builder
   [junit4]   2> 239616 INFO  (qtp29001365-1813) [n:127.0.0.1:36785_wz_ogc%2Fu c:collection1 s:shard1  x:collection1_shard1_replica_t43] o.a.s.c.SolrCore [[collection1_shard1_replica_t43] ] Opening new SolrCore at [/home/jenkins/workspace/Lucene-Solr-7.x-Linux/solr/build/solr-core/test/J0/temp/solr.cloud.ForceLeaderTest_BB6040DD3B4B702F-001/shard-2-001/cores/collection1_shard1_replica_t43], dataDir=[/home/jenkins/workspace/Lucene-Solr-7.x-Linux/solr/build/solr-core/test/J0/temp/solr.cloud.ForceLeaderTest_BB6040DD3B4B702F-001/shard-2-001/cores/collection1_shard1_replica_t43/data/]
   [junit4]   2> 239618 INFO  (qtp29001365-1813) [n:127.0.0.1:36785_wz_ogc%2Fu c:collection1 s:shard1  x:collection1_shard1_replica_t43] o.a.s.u.RandomMergePolicy RandomMergePolicy wrapping class org.apache.lucene.index.LogDocMergePolicy: [LogDocMergePolicy: minMergeSize=1000, mergeFactor=31, maxMergeSize=9223372036854775807, maxMergeSizeForForcedMerge=9223372036854775807, calibrateSizeByDeletes=false, maxMergeDocs=2147483647, maxCFSSegmentSizeMB=8.796093022207999E12, noCFSRatio=0.5246353515381408]
   [junit4]   2> 239620 WARN  (qtp29001365-1813) [n:127.0.0.1:36785_wz_ogc%2Fu c:collection1 s:shard1  x:collection1_shard1_replica_t43] o.a.s.c.RequestHandlers INVALID paramSet a in requestHandler {type = requestHandler,name = /dump,class = DumpRequestHandler,attributes = {initParams=a, name=/dump, class=DumpRequestHandler},args = {defaults={a=A,b=B}}}
   [junit4]   2> 239645 INFO  (qtp29001365-1813) [n:127.0.0.1:36785_wz_ogc%2Fu c:collection1 s:shard1  x:collection1_shard1_replica_t43] o.a.s.u.UpdateHandler Using UpdateLog implementation: org.apache.solr.update.UpdateLog
   [junit4]   2> 239645 INFO  (qtp29001365-1813) [n:127.0.0.1:36785_wz_ogc%2Fu c:collection1 s:shard1  x:collection1_shard1_replica_t43] o.a.s.u.UpdateLog Initializing UpdateLog: dataDir= defaultSyncLevel=FLUSH numRecordsToKeep=100 maxNumLogsToKeep=10 numVersionBuckets=65536
   [junit4]   2> 239646 INFO  (qtp29001365-1813) [n:127.0.0.1:36785_wz_ogc%2Fu c:collection1 s:shard1  x:collection1_shard1_replica_t43] o.a.s.u.CommitTracker Hard AutoCommit: disabled
   [junit4]   2> 239646 INFO  (qtp29001365-1813) [n:127.0.0.1:36785_wz_ogc%2Fu c:collection1 s:shard1  x:collection1_shard1_replica_t43] o.a.s.u.CommitTracker Soft AutoCommit: disabled
   [junit4]   2> 239647 INFO  (qtp29001365-1813) [n:127.0.0.1:36785_wz_ogc%2Fu c:collection1 s:shard1  x:collection1_shard1_replica_t43] o.a.s.u.RandomMergePolicy RandomMergePolicy wrapping class org.apache.lucene.index.TieredMergePolicy: [TieredMergePolicy: maxMergeAtOnce=33, maxMergeAtOnceExplicit=37, maxMergedSegmentMB=82.8974609375, floorSegmentMB=1.0107421875, forceMergeDeletesPctAllowed=9.081021609809001, segmentsPerTier=21.0, maxCFSSegmentSizeMB=8.796093022207999E12, noCFSRatio=0.0
   [junit4]   2> 239647 INFO  (qtp29001365-1813) [n:127.0.0.1:36785_wz_ogc%2Fu c:collection1 s:shard1  x:collection1_shard1_replica_t43] o.a.s.s.SolrIndexSearcher Opening [Searcher@4c588c[collection1_shard1_replica_t43] main]
   [junit4]   2> 239648 INFO  (qtp29001365-1813) [n:127.0.0.1:36785_wz_ogc%2Fu c:collection1 s:shard1  x:collection1_shard1_replica_t43] o.a.s.r.ManagedResourceStorage Configured ZooKeeperStorageIO with znodeBase: /configs/conf1
   [junit4]   2> 239648 INFO  (qtp29001365-1813) [n:127.0.0.1:36785_wz_ogc%2Fu c:collection1 s:shard1  x:collection1_shard1_replica_t43] o.a.s.r.ManagedResourceStorage Loaded null at path _rest_managed.json using ZooKeeperStorageIO:path=/configs/conf1
   [junit4]   2> 239648 INFO  (qtp29001365-1813) [n:127.0.0.1:36785_wz_ogc%2Fu c:collection1 s:shard1  x:collection1_shard1_replica_t43] o.a.s.h.ReplicationHandler Commits will be reserved for  10000
   [junit4]   2> 239650 INFO  (searcherExecutor-646-thread-1-processing-n:127.0.0.1:36785_wz_ogc%2Fu x:collection1_shard1_replica_t43 s:shard1 c:collection1) [n:127.0.0.1:36785_wz_ogc%2Fu c:collection1 s:shard1  x:collection1_shard1_replica_t43] o.a.s.c.SolrCore [collection1_shard1_replica_t43] Registered new searcher Searcher@4c588c[collection1_shard1_replica_t43] main{ExitableDirectoryReader(UninvertingDirectoryReader())}
   [junit4]   2> 239650 INFO  (qtp29001365-1813) [n:127.0.0.1:36785_wz_ogc%2Fu c:collection1 s:shard1  x:collection1_shard1_replica_t43] o.a.s.u.UpdateLog Could not find max version in index or recent updates, using new clock 1575828821058256896
   [junit4]   2> 239653 INFO  (qtp29001365-1813) [n:127.0.0.1:36785_wz_ogc%2Fu c:collection1 s:shard1  x:collection1_shard1_replica_t43] o.a.s.c.ShardLeaderElectionContext Enough replicas found to continue.
   [junit4]   2> 239653 INFO  (qtp29001365-1813) [n:127.0.0.1:36785_wz_ogc%2Fu c:collection1 s:shard1  x:collection1_shard1_replica_t43] o.a.s.c.ShardLeaderElectionContext I may be the new leader - try and sync
   [junit4]   2> 239653 INFO  (qtp29001365-1813) [n:127.0.0.1:36785_wz_ogc%2Fu c:collection1 s:shard1  x:collection1_shard1_replica_t43] o.a.s.c.SyncStrategy Sync replicas to http://127.0.0.1:36785/wz_ogc/u/collection1_shard1_replica_t43/
   [junit4]   2> 239653 INFO  (qtp29001365-1813) [n:127.0.0.1:36785_wz_ogc%2Fu c:collection1 s:shard1  x:collection1_shard1_replica_t43] o.a.s.c.SyncStrategy Sync Success - now sync replicas to me
   [junit4]   2> 239653 INFO  (qtp29001365-1813) [n:127.0.0.1:36785_wz_ogc%2Fu c:collection1 s:shard1  x:collection1_shard1_replica_t43] o.a.s.c.SyncStrategy http://127.0.0.1:36785/wz_ogc/u/collection1_shard1_replica_t43/ has no replicas
   [junit4]   2> 239653 INFO  (qtp29001365-1813) [n:127.0.0.1:36785_wz_ogc%2Fu c:collection1 s:shard1  x:collection1_shard1_replica_t43] o.a.s.c.ShardLeaderElectionContext Found all replicas participating in election, clear LIR
   [junit4]   2> 239653 INFO  (qtp29001365-1813) [n:127.0.0.1:36785_wz_ogc%2Fu c:collection1 s:shard1  x:collection1_shard1_replica_t43] o.a.s.c.ZkController collection1_shard1_replica_t43 stopping background replication from leader
   [junit4]   2> 239654 INFO  (qtp29001365-1813) [n:127.0.0.1:36785_wz_ogc%2Fu c:collection1 s:shard1  x:collection1_shard1_replica_t43] o.a.s.c.ShardLeaderElectionContext I am the new leader: http://127.0.0.1:36785/wz_ogc/u/collection1_shard1_replica_t43/ shard1
   [junit4]   2> 239755 INFO  (zkCallback-224-thread-1-processing-n:127.0.0.1:34675_wz_ogc%2Fu) [n:127.0.0.1:34675_wz_ogc%2Fu    ] o.a.s.c.c.ZkStateReader A cluster state change: [WatchedEvent state:SyncConnected type:NodeDataChanged path:/collections/collection1/state.json] for collection [collection1] has occurred - updating... (live nodes size: [3])
   [junit4]   2> 239755 INFO  (zkCallback-230-thread-1-processing-n:127.0.0.1:36785_wz_ogc%2Fu) [n:127.0.0.1:36785_wz_ogc%2Fu    ] o.a.s.c.c.ZkStateReader A cluster state change: [WatchedEvent state:SyncConnected type:NodeDataChanged path:/collections/collection1/state.json] for collection [collection1] has occurred - updating... (live nodes size: [3])
   [junit4]   2> 239805 INFO  (qtp29001365-1813) [n:127.0.0.1:36785_wz_ogc%2Fu c:collection1 s:shard1  x:collection1_shard1_replica_t43] o.a.s.c.ZkController I am the leader, no recovery necessary
   [junit4]   2> 239806 INFO  (qtp29001365-1813) [n:127.0.0.1:36785_wz_ogc%2Fu c:collection1 s:shard1  x:collection1_shard1_replica_t43] o.a.s.s.HttpSolrCall [admin] webapp=null path=/admin/cores params={qt=/admin/cores&collection.configName=conf1&name=collection1_shard1_replica_t43&action=CREATE&collection=collection1&shard=shard1&wt=javabin&version=2&replicaType=TLOG} status=0 QTime=1298
   [junit4]   2> 239807 INFO  (qtp13559873-1779) [n:127.0.0.1:34675_wz_ogc%2Fu    ] o.a.s.s.HttpSolrCall [admin] webapp=null path=/admin/collections params={node=127.0.0.1:36785_wz_ogc%252Fu&action=ADDREPLICA&collection=collection1&shard=shard1&type=TLOG&wt=javabin&version=2} status=0 QTime=1304
   [junit4]   2> 239890 INFO  (TEST-ForceLeaderTest.testLastPublishedStateIsActive-seed#[BB6040DD3B4B702F]) [    ] o.a.s.c.AbstractFullDistribZkTestBase create jetty 3 in directory /home/jenkins/workspace/Lucene-Solr-7.x-Linux/solr/build/solr-core/test/J0/temp/solr.cloud.ForceLeaderTest_BB6040DD3B4B702F-001/shard-3-001 of type TLOG
   [junit4]   2> 239890 INFO  (TEST-ForceLeaderTest.testLastPublishedStateIsActive-seed#[BB6040DD3B4B702F]) [    ] o.e.j.s.Server jetty-9.3.14.v20161028
   [junit4]   2> 239891 INFO  (TEST-ForceLeaderTest.testLastPublishedStateIsActive-seed#[BB6040DD3B4B702F]) [    ] o.e.j.s.h.ContextHandler Started o.e.j.s.ServletContextHandler@14a3242{/wz_ogc/u,null,AVAILABLE}
   [junit4]   2> 239891 INFO  (TEST-ForceLeaderTest.testLastPublishedStateIsActive-seed#[BB6040DD3B4B702F]) [    ] o.e.j.s.AbstractConnector Started ServerConnector@1e9cd76{HTTP/1.1,[http/1.1]}{127.0.0.1:33305}
   [junit4]   2> 239891 INFO  (TEST-ForceLeaderTest.testLastPublishedStateIsActive-seed#[BB6040DD3B4B702F]) [    ] o.e.j.s.Server Started @241242ms
   [junit4]   2> 239892 INFO  (TEST-ForceLeaderTest.testLastPublishedStateIsActive-seed#[BB6040DD3B4B702F]) [    ] o.a.s.c.s.e.JettySolrRunner Jetty properties: {solr.data.dir=/home/jenkins/workspace/Lucene-Solr-7.x-Linux/solr/build/solr-core/test/J0/temp/solr.cloud.ForceLeaderTest_BB6040DD3B4B702F-001/tempDir-001/jetty3, replicaType=TLOG, solrconfig=solrconfig.xml, hostContext=/wz_ogc/u, hostPort=33399, coreRootDirectory=/home/jenkins/workspace/Lucene-Solr-7.x-Linux/solr/build/solr-core/test/J0/temp/solr.cloud.ForceLeaderTest_BB6040DD3B4B702F-001/shard-3-001/cores}
   [junit4]   2> 239892 ERROR (TEST-ForceLeaderTest.testLastPublishedStateIsActive-seed#[BB6040DD3B4B702F]) [    ] o.a.s.s.StartupLoggingUtils Missing Java Option solr.log.dir. Logging may be missing or incomplete.
   [junit4]   2> 239892 INFO  (TEST-ForceLeaderTest.testLastPublishedStateIsActive-seed#[BB6040DD3B4B702F]) [    ] o.a.s.s.SolrDispatchFilter  ___      _       Welcome to Apache Solr™ version 7.1.0
   [junit4]   2> 239892 INFO  (TEST-ForceLeaderTest.testLastPublishedStateIsActive-seed#[BB6040DD3B4B702F]) [    ] o.a.s.s.SolrDispatchFilter / __| ___| |_ _   Starting in cloud mode on port null
   [junit4]   2> 239892 INFO  (TEST-ForceLeaderTest.testLastPublishedStateIsActive-seed#[BB6040DD3B4B702F]) [    ] o.a.s.s.SolrDispatchFilter \__ \/ _ \ | '_|  Install dir: null, Default config dir: null
   [junit4]   2> 239892 INFO  (TEST-ForceLeaderTest.testLastPublishedStateIsActive-seed#[BB6040DD3B4B702F]) [    ] o.a.s.s.SolrDispatchFilter |___/\___/_|_|    Start time: 2017-08-15T20:04:33.938Z
   [junit4]   2> 239895 INFO  (TEST-ForceLeaderTest.testLastPublishedStateIsActive-seed#[BB6040DD3B4B702F]) [    ] o.a.s.s.SolrDispatchFilter Loading solr.xml from SolrHome (not found in ZooKeeper)
   [junit4]   2> 239895 INFO  (TEST-ForceLeaderTest.testLastPublishedStateIsActive-seed#[BB6040DD3B4B702F]) [    ] o.a.s.c.SolrXmlConfig Loading container configuration from /home/jenkins/workspace/Lucene-Solr-7.x-Linux/solr/build/solr-core/test/J0/temp/solr.cloud.ForceLeaderTest_BB6040DD3B4B702F-001/shard-3-001/solr.xml
   [junit4]   2> 239898 INFO  (TEST-ForceLeaderTest.testLastPublishedStateIsActive-seed#[BB6040DD3B4B702F]) [    ] o.a.s.c.SolrXmlConfig MBean server found: com.sun.jmx.mbeanserver.JmxMBeanServer@1955fe5, but no JMX reporters were configured - adding default JMX reporter.
   [junit4]   2> 239901 INFO  (TEST-ForceLeaderTest.testLastPublishedStateIsActive-seed#[BB6040DD3B4B702F]) [    ] o.a.s.c.ZkContainer Zookeeper client=127.0.0.1:43031/solr
   [junit4]   2> 239907 INFO  (TEST-ForceLeaderTest.testLastPublishedStateIsActive-seed#[BB6040DD3B4B702F]) [n:127.0.0.1:33399_wz_ogc%2Fu    ] o.a.s.c.c.ZkStateReader Updated live nodes from ZooKeeper... (0) -> (3)
   [junit4]   2> 239907 INFO  (zkCallback-224-thread-1-processing-n:127.0.0.1:34675_wz_ogc%2Fu) [n:127.0.0.1:34675_wz_ogc%2Fu    ] o.a.s.c.c.ZkStateReader A cluster state change: [WatchedEvent state:SyncConnected type:NodeDataChanged path:/collections/collection1/state.json] for collection [collection1] has occurred - updating... (live nodes size: [3])
   [junit4]   2> 239907 INFO  (zkCallback-230-thread-1-processing-n:127.0.0.1:36785_wz_ogc%2Fu) [n:127.0.0.1:36785_wz_ogc%2Fu    ] o.a.s.c.c.ZkStateReader A cluster state change: [WatchedEvent state:SyncConnected type:NodeDataChanged path:/collections/collection1/state.json] for collection [collection1] has occurred - updating... (live nodes size: [3])
   [junit4]   2> 239908 INFO  (TEST-ForceLeaderTest.testLastPublishedStateIsActive-seed#[BB6040DD3B4B702F]) [n:127.0.0.1:33399_wz_ogc%2Fu    ] o.a.s.c.Overseer Overseer (id=null) closing
   [junit4]   2> 239909 INFO  (TEST-ForceLeaderTest.testLastPublishedStateIsActive-seed#[BB6040DD3B4B702F]) [n:127.0.0.1:33399_wz_ogc%2Fu    ] o.a.s.c.ZkController Register node as live in ZooKeeper:/live_nodes/127.0.0.1:33399_wz_ogc%2Fu
   [junit4]   2> 239909 INFO  (zkCallback-212-thread-2-processing-n:127.0.0.1:33069_wz_ogc%2Fu) [n:127.0.0.1:33069_wz_ogc%2Fu    ] o.a.s.c.c.ZkStateReader Updated live nodes from ZooKeeper... (3) -> (4)
   [junit4]   2> 239909 INFO  (zkCallback-230-thread-1-processing-n:127.0.0.1:36785_wz_ogc%2Fu) [n:127.0.0.1:36785_wz_ogc%2Fu    ] o.a.s.c.c.ZkStateReader Updated live nodes from ZooKeeper... (3) -> (4)
   [junit4]   2> 239909 INFO  (zkCallback-224-thread-1-processing-n:127.0.0.1:34675_wz_ogc%2Fu) [n:127.0.0.1:34675_wz_ogc%2Fu    ] o.a.s.c.c.ZkStateReader Updated live nodes from ZooKeeper... (3) -> (4)
   [junit4]   2> 239909 INFO  (zkCallback-219-thread-1) [    ] o.a.s.c.c.ZkStateReader Updated live nodes from ZooKeeper... (3) -> (4)
   [junit4]   2> 239910 INFO  (zkCallback-236-thread-1-processing-n:127.0.0.1:33399_wz_ogc%2Fu) [n:127.0.0.1:33399_wz_ogc%2Fu    ] o.a.s.c.c.ZkStateReader Updated live nodes from ZooKeeper... (3) -> (4)
   [junit4]   2> 239958 INFO  (TEST-ForceLeaderTest.testLastPublishedStateIsActive-seed#[BB6040DD3B4B702F]) [n:127.0.0.1:33399_wz_ogc%2Fu    ] o.a.s.m.r.SolrJmxReporter JMX monitoring for 'solr.node' (registry 'solr.node') enabled at server: com.sun.jmx.mbeanserver.JmxMBeanServer@1955fe5
   [junit4]   2> 239967 INFO  (TEST-ForceLeaderTest.testLastPublishedStateIsActive-seed#[BB6040DD3B4B702F]) [n:127.0.0.1:33399_wz_ogc%2Fu    ] o.a.s.m.r.SolrJmxReporter JMX monitoring for 'solr.jvm' (registry 'solr.jvm') enabled at server: com.sun.jmx.mbeanserver.JmxMBeanServer@1955fe5
   [junit4]   2> 239967 INFO  (TEST-ForceLeaderTest.testLastPublishedStateIsActive-seed#[BB6040DD3B4B702F]) [n:127.0.0.1:33399_wz_ogc%2Fu    ] o.a.s.m.r.SolrJmxReporter JMX monitoring for 'solr.jetty' (registry 'solr.jetty') enabled at server: com.sun.jmx.mbeanserver.JmxMBeanServer@1955fe5
   [junit4]   2> 239968 INFO  (TEST-ForceLeaderTest.testLastPublishedStateIsActive-seed#[BB6040DD3B4B702F]) [n:127.0.0.1:33399_wz_ogc%2Fu    ] o.a.s.c.CorePropertiesLocator Found 0 core definitions underneath /home/jenkins/workspace/Lucene-Solr-7.x-Linux/solr/build/solr-core/test/J0/temp/solr.cloud.ForceLeaderTest_BB6040DD3B4B702F-001/shard-3-001/cores
   [junit4]   2> 240005 INFO  (qtp13559873-1774) [n:127.0.0.1:34675_wz_ogc%2Fu    ] o.a.s.h.a.CollectionsHandler Invoked Collection Action :addreplica with params node=127.0.0.1:33399_wz_ogc%252Fu&action=ADDREPLICA&collection=collection1&shard=shard2&type=TLOG&wt=javabin&version=2 and sendToOCPQueue=true
   [junit4]   2> 240006 INFO  (OverseerCollectionConfigSetProcessor-98489300920827908-127.0.0.1:33069_wz_ogc%2Fu-n_0000000000) [n:127.0.0.1:33069_wz_ogc%2Fu    ] o.a.s.c.OverseerTaskQueue Response ZK path: /overseer/collection-queue-work/qnr-0000000006 doesn't exist.  Requestor may have disconnected from ZooKeeper
   [junit4]   2> 240006 INFO  (OverseerThreadFactory-621-thread-5-processing-n:127.0.0.1:33069_wz_ogc%2Fu) [n:127.0.0.1:33069_wz_ogc%2Fu    ] o.a.s.c.AddReplicaCmd Node Identified 127.0.0.1:33399_wz_ogc%2Fu for creating new replica
   [junit4]   2> 240007 INFO  (SocketProxy-Acceptor-33399) [    ] o.a.s.c.SocketProxy accepted Socket[addr=/127.0.0.1,port=44626,localport=33399], receiveBufferSize:531000
   [junit4]   2> 240007 INFO  (SocketProxy-Acceptor-33399) [    ] o.a.s.c.SocketProxy proxy connection Socket[addr=/127.0.0.1,port=33305,localport=37038], receiveBufferSize=530904
   [junit4]   2> 240008 INFO  (qtp8582811-1845) [n:127.0.0.1:33399_wz_ogc%2Fu    ] o.a.s.h.a.CoreAdminOperation core create command qt=/admin/cores&collection.configName=conf1&name=collection1_shard2_replica_t45&action=CREATE&collection=collection1&shard=shard2&wt=javabin&version=2&replicaType=TLOG
   [junit4]   2> 240009 INFO  (qtp8582811-1845) [n:127.0.0.1:33399_wz_ogc%2Fu    ] o.a.s.c.TransientSolrCoreCacheDefault Allocating transient cache for 4 transient cores
   [junit4]   2> 240112 INFO  (zkCallback-230-thread-1-processing-n:127.0.0.1:36785_wz_ogc%2Fu) [n:127.0.0.1:36785_wz_ogc%2Fu    ] o.a.s.c.c.ZkStateReader A cluster state change: [WatchedEvent state:SyncConnected type:NodeDataChanged path:/collections/collection1/state.json] for collection [collection1] has occurred - updating... (live nodes size: [4])
   [junit4]   2> 240112 INFO  (zkCallback-224-thread-1-processing-n:127.0.0.1:34675_wz_ogc%2Fu) [n:127.0.0.1:34675_wz_ogc%2Fu    ] o.a.s.c.c.ZkStateReader A cluster state change: [WatchedEvent state:SyncConnected type:NodeDataChanged path:/collections/collection1/state.json] for collection [collection1] has occurred - updating... (live nodes size: [4])
   [junit4]   2> 240112 INFO  (zkCallback-236-thread-1-processing-n:127.0.0.1:33399_wz_ogc%2Fu) [n:127.0.0.1:33399_wz_ogc%2Fu    ] o.a.s.c.c.ZkStateReader A cluster state change: [WatchedEvent state:SyncConnected type:NodeDataChanged path:/collections/collection1/state.json] for collection [collection1] has occurred - updating... (live nodes size: [4])
   [junit4]   2> 241027 INFO  (qtp8582811-1845) [n:127.0.0.1:33399_wz_ogc%2Fu c:collection1 s:shard2  x:collection1_shard2_replica_t45] o.a.s.c.SolrConfig Using Lucene MatchVersion: 7.1.0
   [junit4]   2> 241043 INFO  (qtp8582811-1845) [n:127.0.0.1:33399_wz_ogc%2Fu c:collection1 s:shard2  x:collection1_shard2_replica_t45] o.a.s.s.IndexSchema [collection1_shard2_replica_t45] Schema name=test
   [junit4]   2> 241104 INFO  (qtp8582811-1845) [n:127.0.0.1:33399_wz_ogc%2Fu c:collection1 s:shard2  x:collection1_shard2_replica_t45] o.a.s.s.IndexSchema Loaded schema test/1.0 with uniqueid field id
   [junit4]   2> 241111 INFO  (qtp8582811-1845) [n:127.0.0.1:33399_wz_ogc%2Fu c:collection1 s:shard2  x:collection1_shard2_replica_t45] o.a.s.c.CoreContainer Creating SolrCore 'collection1_shard2_replica_t45' using configuration from collection collection1, trusted=true
   [junit4]   2> 241112 INFO  (qtp8582811-1845) [n:127.0.0.1:33399_wz_ogc%2Fu c:collection1 s:shard2  x:collection1_shard2_replica_t45] o.a.s.m.r.SolrJmxReporter JMX monitoring for 'solr.core.collection1.shard2.replica_t45' (registry 'solr.core.collection1.shard2.replica_t45') enabled at server: com.sun.jmx.mbeanserver.JmxMBeanServer@1955fe5
   [junit4]   2> 241112 INFO  (qtp8582811-1845) [n:127.0.0.1:33399_wz_ogc%2Fu c:collection1 s:shard2  x:collection1_shard2_replica_t45] o.a.s.c.SolrCore solr.RecoveryStrategy.Builder
   [junit4]   2> 241112 INFO  (qtp8582811-1845) [n:127.0.0.1:33399_wz_ogc%2Fu c:collection1 s:shard2  x:collection1_shard2_replica_t45] o.a.s.

[...truncated too long message...]

3584
   [junit4]   2> 1833429 INFO  (coreCloseExecutor-6683-thread-2) [n:127.0.0.1:36345_solr c:testcollection s:shard2 r:core_node8 x:testcollection_shard2_replica_n6] o.a.s.c.SolrCore [testcollection_shard2_replica_n6]  CLOSING SolrCore org.apache.solr.core.SolrCore@c38918
   [junit4]   2> 1833430 INFO  (coreCloseExecutor-6682-thread-2) [n:127.0.0.1:45345_solr c:testcollection s:shard2 r:core_node7 x:testcollection_shard2_replica_n4] o.a.s.m.r.SolrJmxReporter Closing reporter [org.apache.solr.metrics.reporters.SolrJmxReporter@70a8bd: rootName = solr_45345, domain = solr.core.testcollection.shard2.replica_n4, service url = null, agent id = null] for registry solr.core.testcollection.shard2.replica_n4 / null
   [junit4]   2> 1833431 INFO  (coreCloseExecutor-6683-thread-2) [n:127.0.0.1:36345_solr c:testcollection s:shard2 r:core_node8 x:testcollection_shard2_replica_n6] o.a.s.m.SolrMetricManager Closing metric reporters for registry=solr.core.testcollection.shard2.replica_n6, tag=12814616
   [junit4]   2> 1833432 INFO  (coreCloseExecutor-6682-thread-1) [n:127.0.0.1:45345_solr c:testcollection s:shard1 r:core_node2 x:testcollection_shard1_replica_n1] o.a.s.m.SolrMetricManager Closing metric reporters for registry=solr.collection.testcollection.shard1.leader, tag=14414373
   [junit4]   2> 1833432 INFO  (coreCloseExecutor-6683-thread-2) [n:127.0.0.1:36345_solr c:testcollection s:shard2 r:core_node8 x:testcollection_shard2_replica_n6] o.a.s.m.r.SolrJmxReporter Closing reporter [org.apache.solr.metrics.reporters.SolrJmxReporter@1da1975: rootName = solr_36345, domain = solr.core.testcollection.shard2.replica_n6, service url = null, agent id = null] for registry solr.core.testcollection.shard2.replica_n6 / null
   [junit4]   2> 1833432 INFO  (coreCloseExecutor-6682-thread-2) [n:127.0.0.1:45345_solr c:testcollection s:shard2 r:core_node7 x:testcollection_shard2_replica_n4] o.a.s.m.SolrMetricManager Closing metric reporters for registry=solr.collection.testcollection.shard2.leader, tag=25623584
   [junit4]   2> 1833432 INFO  (coreCloseExecutor-6683-thread-2) [n:127.0.0.1:36345_solr c:testcollection s:shard2 r:core_node8 x:testcollection_shard2_replica_n6] o.a.s.m.SolrMetricManager Closing metric reporters for registry=solr.collection.testcollection.shard2.leader, tag=12814616
   [junit4]   2> 1833436 INFO  (jetty-closer-2629-thread-2) [    ] o.a.s.c.Overseer Overseer (id=98489405242605574-127.0.0.1:36345_solr-n_0000000000) closing
   [junit4]   2> 1833437 INFO  (OverseerStateUpdate-98489405242605574-127.0.0.1:36345_solr-n_0000000000) [n:127.0.0.1:36345_solr    ] o.a.s.c.Overseer Overseer Loop exiting : 127.0.0.1:36345_solr
   [junit4]   2> 1833437 INFO  (zkCallback-2640-thread-2-processing-n:127.0.0.1:36345_solr) [n:127.0.0.1:36345_solr    ] o.a.s.c.c.ZkStateReader Updated live nodes from ZooKeeper... (2) -> (1)
   [junit4]   2> 1834937 WARN  (zkCallback-2639-thread-1-processing-n:127.0.0.1:45345_solr) [n:127.0.0.1:45345_solr    ] o.a.s.c.c.ZkStateReader ZooKeeper watch triggered, but Solr cannot talk to ZK: [KeeperErrorCode = Session expired for /live_nodes]
   [junit4]   2> 1834937 INFO  (jetty-closer-2629-thread-1) [    ] o.e.j.s.h.ContextHandler Stopped o.e.j.s.ServletContextHandler@7c2d73{/solr,null,UNAVAILABLE}
   [junit4]   2> 1834937 WARN  (zkCallback-2640-thread-2-processing-n:127.0.0.1:36345_solr) [n:127.0.0.1:36345_solr    ] o.a.s.c.c.ZkStateReader ZooKeeper watch triggered, but Solr cannot talk to ZK: [KeeperErrorCode = Session expired for /live_nodes]
   [junit4]   2> 1834938 INFO  (jetty-closer-2629-thread-2) [    ] o.e.j.s.h.ContextHandler Stopped o.e.j.s.ServletContextHandler@17f7797{/solr,null,UNAVAILABLE}
   [junit4]   2> 1834938 ERROR (SUITE-TestAuthenticationFramework-seed#[BB6040DD3B4B702F]-worker) [    ] o.a.z.s.ZooKeeperServer ZKShutdownHandler is not registered, so ZooKeeper server won't take any action on ERROR or SHUTDOWN server state changes
   [junit4]   2> 1834939 INFO  (SUITE-TestAuthenticationFramework-seed#[BB6040DD3B4B702F]-worker) [    ] o.a.s.c.ZkTestServer connecting to 127.0.0.1:46079 46079
   [junit4]   2> 1834959 INFO  (Thread-4350) [    ] o.a.s.c.ZkTestServer connecting to 127.0.0.1:46079 46079
   [junit4]   2> 1834960 WARN  (Thread-4350) [    ] o.a.s.c.ZkTestServer Watch limit violations: 
   [junit4]   2> Maximum concurrent create/delete watches above limit:
   [junit4]   2> 
   [junit4]   2> 	4	/solr/configs/solrCloudCollectionConfig
   [junit4]   2> 	3	/solr/aliases.json
   [junit4]   2> 	3	/solr/clusterprops.json
   [junit4]   2> 	2	/solr/security.json
   [junit4]   2> 
   [junit4]   2> Maximum concurrent data watches above limit:
   [junit4]   2> 
   [junit4]   2> 	19	/solr/collections/testcollection/state.json
   [junit4]   2> 	3	/solr/clusterstate.json
   [junit4]   2> 	2	/solr/collections/testcollection/leader_elect/shard1/election/98489405242605574-core_node5-n_0000000000
   [junit4]   2> 	2	/solr/collections/testcollection/leader_elect/shard2/election/98489405242605573-core_node7-n_0000000000
   [junit4]   2> 
   [junit4]   2> Maximum concurrent children watches above limit:
   [junit4]   2> 
   [junit4]   2> 	3	/solr/live_nodes
   [junit4]   2> 	3	/solr/collections
   [junit4]   2> 
   [junit4]   2> NOTE: leaving temporary files on disk at: /home/jenkins/workspace/Lucene-Solr-7.x-Linux/solr/build/solr-core/test/J2/temp/solr.cloud.TestAuthenticationFramework_BB6040DD3B4B702F-001
   [junit4]   2> NOTE: test params are: codec=Asserting(Lucene70), sim=RandomSimilarity(queryNorm=false): {}, locale=fr-BE, timezone=PST
   [junit4]   2> NOTE: Linux 4.10.0-27-generic i386/Oracle Corporation 1.8.0_144 (32-bit)/cpus=8,threads=1,free=155644208,total=467664896
   [junit4]   2> NOTE: All tests run in this JVM: [TestDistributedMissingSort, TestTestInjection, TestHttpShardHandlerFactory, ZkStateReaderTest, UniqFieldsUpdateProcessorFactoryTest, TestLeaderInitiatedRecoveryThread, ClassificationUpdateProcessorFactoryTest, TestCodecSupport, TestManagedSynonymFilterFactory, JavabinLoaderTest, BooleanFieldTest, ShufflingReplicaListTransformerTest, TestLegacyNumericUtils, TestNumericRangeQuery32, CdcrReplicationDistributedZkTest, BasicAuthStandaloneTest, StatsComponentTest, TestRecovery, CoreSorterTest, QueryEqualityTest, PolyFieldTest, TestExactStatsCache, ExplicitHLLTest, SuggesterTest, ReturnFieldsTest, TlogReplayBufferedWhileIndexingTest, TestHighFrequencyDictionaryFactory, TestConfigSetsAPIZkFailure, TestSlowCompositeReaderWrapper, AutoScalingHandlerTest, TestFieldCacheWithThreads, RequestLoggingTest, ResponseLogComponentTest, TestPseudoReturnFields, TestCloudPivotFacet, DistributedFacetPivotSmallAdvancedTest, SortByFunctionTest, TestMacroExpander, ManagedSchemaRoundRobinCloudTest, TestBulkSchemaAPI, HdfsCollectionsAPIDistributedZkTest, TestDFRSimilarityFactory, TestQuerySenderListener, TestExceedMaxTermLength, TestReRankQParserPlugin, TestInitQParser, CloneFieldUpdateProcessorFactoryTest, TestReqParamsAPI, HdfsWriteToMultipleCollectionsTest, SolrCoreCheckLockOnStartupTest, TestRandomRequestDistribution, TestIndexSearcher, TestDocTermOrds, BadIndexSchemaTest, FullSolrCloudDistribCmdsTest, OverseerTaskQueueTest, FacetPivotSmallTest, TestManagedResource, HardAutoCommitTest, HdfsDirectoryFactoryTest, XsltUpdateRequestHandlerTest, SimpleFacetsTest, OverseerModifyCollectionTest, TestOverriddenPrefixQueryForCustomFieldType, AddSchemaFieldsUpdateProcessorFactoryTest, TestFieldCacheSort, TestSystemCollAutoCreate, DistributedQueryComponentCustomSortTest, DocumentBuilderTest, LeaderInitiatedRecoveryOnCommitTest, PathHierarchyTokenizerFactoryTest, ClusterStateTest, DocValuesNotIndexedTest, SaslZkACLProviderTest, TestNumericTerms64, ConjunctionSolrSpellCheckerTest, TestReload, AnalyticsQueryTest, TestDistribDocBasedVersion, TestFilteredDocIdSet, RemoteQueryErrorTest, TestGroupingSearch, MinimalSchemaTest, TestJavabinTupleStreamParser, MissingSegmentRecoveryTest, TestNonDefinedSimilarityFactory, SimpleMLTQParserTest, TestSurroundQueryParser, SolrCloudReportersTest, MultiTermTest, TestComplexPhraseQParserPlugin, SpatialRPTFieldTypeTest, DateFieldTest, HdfsRecoveryZkTest, TestPKIAuthenticationPlugin, SolrJmxReporterCloudTest, MoveReplicaTest, CustomCollectionTest, TimeZoneUtilsTest, TestInitParams, TestCloudNestedDocsSort, TestFoldingMultitermQuery, TestSubQueryTransformer, TestSolrXml, TestSolr4Spatial2, PeerSyncWithIndexFingerprintCachingTest, TestApiFramework, TestLMJelinekMercerSimilarityFactory, AsyncCallRequestStatusResponseTest, BasicDistributedZk2Test, TestSort, RegexBoostProcessorTest, TermVectorComponentDistributedTest, NotRequiredUniqueKeyTest, ConfigSetsAPITest, SolrInfoBeanTest, ChaosMonkeySafeLeaderTest, UnloadDistributedZkTest, SyncSliceTest, OpenCloseCoreStressTest, OverseerTest, ShardRoutingTest, RecoveryZkTest, TestReplicationHandler, TestRandomFaceting, LeaderElectionTest, ZkSolrClientTest, TestZkChroot, ZkCLITest, TestDistributedGrouping, TestHashPartitioner, DistributedTermsComponentTest, SolrCoreTest, DirectUpdateHandlerTest, SoftAutoCommitTest, TestCSVResponseWriter, BinaryUpdateRequestHandlerTest, TestPHPSerializedResponseWriter, TestComponentsName, SearchHandlerTest, TestLFUCache, TestTolerantSearch, ConnectionReuseTest, AssignTest, CdcrReplicationHandlerTest, CdcrRequestHandlerTest, CdcrVersionReplicationTest, ChaosMonkeyNothingIsSafeWithPullReplicasTest, CleanupOldIndexTest, CollectionsAPIAsyncDistributedZkTest, ConnectionManagerTest, DeleteNodeTest, DeleteStatusTest, DistribJoinFromCollectionTest, LeaderElectionContextKeyTest, LeaderFailoverAfterPartitionTest, MoveReplicaHDFSUlogDirTest, NodeMutatorTest, OutOfBoxZkACLAndCredentialsProvidersTest, OverriddenZkACLAndCredentialsProvidersTest, SharedFSAutoReplicaFailoverTest, SharedFSAutoReplicaFailoverUtilsTest, SimpleCollectionCreateDeleteTest, SolrCLIZkUtilsTest, SolrCloudExampleTest, TestAuthenticationFramework]
   [junit4] Completed [504/729 (3!)] on J2 in 9.55s, 1 test, 1 error <<< FAILURES!

[...truncated 40203 lines...]

Mime
View raw message