lucene-dev mailing list archives

Site index · List index
Message view « Date » · « Thread »
Top « Date » · « Thread »
From Policeman Jenkins Server <jenk...@thetaphi.de>
Subject [JENKINS-EA] Lucene-Solr-6.6-Windows (64bit/jdk-9-ea+181) - Build # 33 - Still Unstable!
Date Fri, 25 Aug 2017 09:57:58 GMT
Build: https://jenkins.thetaphi.de/job/Lucene-Solr-6.6-Windows/33/
Java: 64bit/jdk-9-ea+181 -XX:+UseCompressedOops -XX:+UseSerialGC --illegal-access=deny

3 tests failed.
FAILED:  org.apache.solr.cloud.ChaosMonkeySafeLeaderTest.test

Error Message:
Captured an uncaught exception in thread: Thread[id=10995, name=updateExecutor-2789-thread-1, state=RUNNABLE, group=TGRP-ChaosMonkeySafeLeaderTest]

Stack Trace:
com.carrotsearch.randomizedtesting.UncaughtExceptionError: Captured an uncaught exception in thread: Thread[id=10995, name=updateExecutor-2789-thread-1, state=RUNNABLE, group=TGRP-ChaosMonkeySafeLeaderTest]
	at __randomizedtesting.SeedInfo.seed([D60014D3C82FA656:5E542B0966D3CBAE]:0)
Caused by: org.apache.solr.common.SolrException: Replica: http://127.0.0.1:59158/_faj/collection1/ should have been marked under leader initiated recovery in ZkController but wasn't.
	at __randomizedtesting.SeedInfo.seed([D60014D3C82FA656]:0)
	at org.apache.solr.cloud.LeaderInitiatedRecoveryThread.run(LeaderInitiatedRecoveryThread.java:88)
	at com.codahale.metrics.InstrumentedExecutorService$InstrumentedRunnable.run(InstrumentedExecutorService.java:176)
	at org.apache.solr.common.util.ExecutorUtil$MDCAwareThreadPoolExecutor.lambda$execute$0(ExecutorUtil.java:229)
	at java.base/java.util.concurrent.ThreadPoolExecutor.runWorker(ThreadPoolExecutor.java:1167)
	at java.base/java.util.concurrent.ThreadPoolExecutor$Worker.run(ThreadPoolExecutor.java:641)
	at java.base/java.lang.Thread.run(Thread.java:844)


FAILED:  junit.framework.TestSuite.org.apache.solr.core.TestLazyCores

Error Message:
Could not remove the following files (in the order of attempts):    C:\Users\jenkins\workspace\Lucene-Solr-6.6-Windows\solr\build\solr-core\test\J0\temp\solr.core.TestLazyCores_D60014D3C82FA656-001\tempDir-008\collection4: java.nio.file.DirectoryNotEmptyException: C:\Users\jenkins\workspace\Lucene-Solr-6.6-Windows\solr\build\solr-core\test\J0\temp\solr.core.TestLazyCores_D60014D3C82FA656-001\tempDir-008\collection4    C:\Users\jenkins\workspace\Lucene-Solr-6.6-Windows\solr\build\solr-core\test\J0\temp\solr.core.TestLazyCores_D60014D3C82FA656-001\tempDir-008: java.nio.file.DirectoryNotEmptyException: C:\Users\jenkins\workspace\Lucene-Solr-6.6-Windows\solr\build\solr-core\test\J0\temp\solr.core.TestLazyCores_D60014D3C82FA656-001\tempDir-008 

Stack Trace:
java.io.IOException: Could not remove the following files (in the order of attempts):
   C:\Users\jenkins\workspace\Lucene-Solr-6.6-Windows\solr\build\solr-core\test\J0\temp\solr.core.TestLazyCores_D60014D3C82FA656-001\tempDir-008\collection4: java.nio.file.DirectoryNotEmptyException: C:\Users\jenkins\workspace\Lucene-Solr-6.6-Windows\solr\build\solr-core\test\J0\temp\solr.core.TestLazyCores_D60014D3C82FA656-001\tempDir-008\collection4
   C:\Users\jenkins\workspace\Lucene-Solr-6.6-Windows\solr\build\solr-core\test\J0\temp\solr.core.TestLazyCores_D60014D3C82FA656-001\tempDir-008: java.nio.file.DirectoryNotEmptyException: C:\Users\jenkins\workspace\Lucene-Solr-6.6-Windows\solr\build\solr-core\test\J0\temp\solr.core.TestLazyCores_D60014D3C82FA656-001\tempDir-008

	at __randomizedtesting.SeedInfo.seed([D60014D3C82FA656]:0)
	at org.apache.lucene.util.IOUtils.rm(IOUtils.java:329)
	at org.apache.lucene.util.TestRuleTemporaryFilesCleanup.afterAlways(TestRuleTemporaryFilesCleanup.java:216)
	at com.carrotsearch.randomizedtesting.rules.TestRuleAdapter$1.afterAlways(TestRuleAdapter.java:31)
	at com.carrotsearch.randomizedtesting.rules.StatementAdapter.evaluate(StatementAdapter.java:43)
	at com.carrotsearch.randomizedtesting.rules.StatementAdapter.evaluate(StatementAdapter.java:36)
	at org.apache.lucene.util.TestRuleAssertionsRequired$1.evaluate(TestRuleAssertionsRequired.java:53)
	at org.apache.lucene.util.TestRuleMarkFailure$1.evaluate(TestRuleMarkFailure.java:47)
	at org.apache.lucene.util.TestRuleIgnoreAfterMaxFailures$1.evaluate(TestRuleIgnoreAfterMaxFailures.java:64)
	at org.apache.lucene.util.TestRuleIgnoreTestSuites$1.evaluate(TestRuleIgnoreTestSuites.java:54)
	at com.carrotsearch.randomizedtesting.rules.StatementAdapter.evaluate(StatementAdapter.java:36)
	at com.carrotsearch.randomizedtesting.ThreadLeakControl$StatementRunner.run(ThreadLeakControl.java:368)
	at java.base/java.lang.Thread.run(Thread.java:844)


FAILED:  org.apache.solr.security.BasicAuthIntegrationTest.testBasicAuth

Error Message:
Error from server at http://127.0.0.1:61124/solr/authCollection: No registered leader was found after waiting for 4000ms , collection: authCollection slice: shard2

Stack Trace:
org.apache.solr.client.solrj.impl.HttpSolrClient$RemoteSolrException: Error from server at http://127.0.0.1:61124/solr/authCollection: No registered leader was found after waiting for 4000ms , collection: authCollection slice: shard2
	at __randomizedtesting.SeedInfo.seed([D60014D3C82FA656:6A6E62C16C7C252C]:0)
	at org.apache.solr.client.solrj.impl.HttpSolrClient.executeMethod(HttpSolrClient.java:612)
	at org.apache.solr.client.solrj.impl.HttpSolrClient.request(HttpSolrClient.java:279)
	at org.apache.solr.client.solrj.impl.HttpSolrClient.request(HttpSolrClient.java:268)
	at org.apache.solr.client.solrj.impl.LBHttpSolrClient.doRequest(LBHttpSolrClient.java:447)
	at org.apache.solr.client.solrj.impl.LBHttpSolrClient.request(LBHttpSolrClient.java:388)
	at org.apache.solr.client.solrj.impl.CloudSolrClient.sendRequest(CloudSolrClient.java:1383)
	at org.apache.solr.client.solrj.impl.CloudSolrClient.requestWithRetryOnStaleState(CloudSolrClient.java:1134)
	at org.apache.solr.client.solrj.impl.CloudSolrClient.request(CloudSolrClient.java:1073)
	at org.apache.solr.security.BasicAuthIntegrationTest.testBasicAuth(BasicAuthIntegrationTest.java:194)
	at java.base/jdk.internal.reflect.NativeMethodAccessorImpl.invoke0(Native Method)
	at java.base/jdk.internal.reflect.NativeMethodAccessorImpl.invoke(NativeMethodAccessorImpl.java:62)
	at java.base/jdk.internal.reflect.DelegatingMethodAccessorImpl.invoke(DelegatingMethodAccessorImpl.java:43)
	at java.base/java.lang.reflect.Method.invoke(Method.java:564)
	at com.carrotsearch.randomizedtesting.RandomizedRunner.invoke(RandomizedRunner.java:1713)
	at com.carrotsearch.randomizedtesting.RandomizedRunner$8.evaluate(RandomizedRunner.java:907)
	at com.carrotsearch.randomizedtesting.RandomizedRunner$9.evaluate(RandomizedRunner.java:943)
	at com.carrotsearch.randomizedtesting.RandomizedRunner$10.evaluate(RandomizedRunner.java:957)
	at com.carrotsearch.randomizedtesting.rules.SystemPropertiesRestoreRule$1.evaluate(SystemPropertiesRestoreRule.java:57)
	at org.apache.lucene.util.TestRuleSetupTeardownChained$1.evaluate(TestRuleSetupTeardownChained.java:49)
	at org.apache.lucene.util.AbstractBeforeAfterRule$1.evaluate(AbstractBeforeAfterRule.java:45)
	at org.apache.lucene.util.TestRuleThreadAndTestName$1.evaluate(TestRuleThreadAndTestName.java:48)
	at org.apache.lucene.util.TestRuleIgnoreAfterMaxFailures$1.evaluate(TestRuleIgnoreAfterMaxFailures.java:64)
	at org.apache.lucene.util.TestRuleMarkFailure$1.evaluate(TestRuleMarkFailure.java:47)
	at com.carrotsearch.randomizedtesting.rules.StatementAdapter.evaluate(StatementAdapter.java:36)
	at com.carrotsearch.randomizedtesting.ThreadLeakControl$StatementRunner.run(ThreadLeakControl.java:368)
	at com.carrotsearch.randomizedtesting.ThreadLeakControl.forkTimeoutingTask(ThreadLeakControl.java:817)
	at com.carrotsearch.randomizedtesting.ThreadLeakControl$3.evaluate(ThreadLeakControl.java:468)
	at com.carrotsearch.randomizedtesting.RandomizedRunner.runSingleTest(RandomizedRunner.java:916)
	at com.carrotsearch.randomizedtesting.RandomizedRunner$5.evaluate(RandomizedRunner.java:802)
	at com.carrotsearch.randomizedtesting.RandomizedRunner$6.evaluate(RandomizedRunner.java:852)
	at com.carrotsearch.randomizedtesting.RandomizedRunner$7.evaluate(RandomizedRunner.java:863)
	at com.carrotsearch.randomizedtesting.rules.StatementAdapter.evaluate(StatementAdapter.java:36)
	at com.carrotsearch.randomizedtesting.rules.SystemPropertiesRestoreRule$1.evaluate(SystemPropertiesRestoreRule.java:57)
	at org.apache.lucene.util.AbstractBeforeAfterRule$1.evaluate(AbstractBeforeAfterRule.java:45)
	at com.carrotsearch.randomizedtesting.rules.StatementAdapter.evaluate(StatementAdapter.java:36)
	at org.apache.lucene.util.TestRuleStoreClassName$1.evaluate(TestRuleStoreClassName.java:41)
	at com.carrotsearch.randomizedtesting.rules.NoShadowingOrOverridesOnMethodsRule$1.evaluate(NoShadowingOrOverridesOnMethodsRule.java:40)
	at com.carrotsearch.randomizedtesting.rules.NoShadowingOrOverridesOnMethodsRule$1.evaluate(NoShadowingOrOverridesOnMethodsRule.java:40)
	at com.carrotsearch.randomizedtesting.rules.StatementAdapter.evaluate(StatementAdapter.java:36)
	at com.carrotsearch.randomizedtesting.rules.StatementAdapter.evaluate(StatementAdapter.java:36)
	at org.apache.lucene.util.TestRuleAssertionsRequired$1.evaluate(TestRuleAssertionsRequired.java:53)
	at org.apache.lucene.util.TestRuleMarkFailure$1.evaluate(TestRuleMarkFailure.java:47)
	at org.apache.lucene.util.TestRuleIgnoreAfterMaxFailures$1.evaluate(TestRuleIgnoreAfterMaxFailures.java:64)
	at org.apache.lucene.util.TestRuleIgnoreTestSuites$1.evaluate(TestRuleIgnoreTestSuites.java:54)
	at com.carrotsearch.randomizedtesting.rules.StatementAdapter.evaluate(StatementAdapter.java:36)
	at com.carrotsearch.randomizedtesting.ThreadLeakControl$StatementRunner.run(ThreadLeakControl.java:368)
	at java.base/java.lang.Thread.run(Thread.java:844)




Build Log:
[...truncated 12011 lines...]
   [junit4] Suite: org.apache.solr.core.TestLazyCores
   [junit4]   2> Creating dataDir: C:\Users\jenkins\workspace\Lucene-Solr-6.6-Windows\solr\build\solr-core\test\J0\temp\solr.core.TestLazyCores_D60014D3C82FA656-001\init-core-data-001
   [junit4]   2> 785844 WARN  (SUITE-TestLazyCores-seed#[D60014D3C82FA656]-worker) [    ] o.a.s.SolrTestCaseJ4 startTrackingSearchers: numOpens=2 numCloses=2
   [junit4]   2> 785845 INFO  (SUITE-TestLazyCores-seed#[D60014D3C82FA656]-worker) [    ] o.a.s.SolrTestCaseJ4 Using TrieFields
   [junit4]   2> 785846 INFO  (SUITE-TestLazyCores-seed#[D60014D3C82FA656]-worker) [    ] o.a.s.SolrTestCaseJ4 Randomized ssl (false) and clientAuth (false) via: @org.apache.solr.util.RandomizeSSL(reason="", value=0.0/0.0, ssl=0.0/0.0, clientAuth=0.0/0.0)
   [junit4]   2> 785847 INFO  (TEST-TestLazyCores.testLazyLoad-seed#[D60014D3C82FA656]) [    ] o.a.s.SolrTestCaseJ4 ###Starting testLazyLoad
   [junit4]   2> 785890 INFO  (TEST-TestLazyCores.testLazyLoad-seed#[D60014D3C82FA656]) [    ] o.a.s.c.SolrXmlConfig Loading container configuration from C:\Users\jenkins\workspace\Lucene-Solr-6.6-Windows\solr\build\solr-core\test\J0\temp\solr.core.TestLazyCores_D60014D3C82FA656-001\tempDir-001\solr.xml
   [junit4]   2> 785895 INFO  (TEST-TestLazyCores.testLazyLoad-seed#[D60014D3C82FA656]) [    ] o.a.s.u.UpdateShardHandler Creating UpdateShardHandler HTTP client with params: socketTimeout=340000&connTimeout=45000&retry=true
   [junit4]   2> 785922 INFO  (TEST-TestLazyCores.testLazyLoad-seed#[D60014D3C82FA656]) [    ] o.a.s.c.TransientSolrCoreCacheDefault Allocating transient cache for 4 transient cores
   [junit4]   2> 785928 WARN  (coreLoadExecutor-4540-thread-3) [    ] o.a.s.c.Config Beginning with Solr 5.5, <mergePolicy> is deprecated, use <mergePolicyFactory> instead.
   [junit4]   2> 785928 WARN  (coreLoadExecutor-4540-thread-1) [    ] o.a.s.c.Config Beginning with Solr 5.5, <mergePolicy> is deprecated, use <mergePolicyFactory> instead.
   [junit4]   2> 785929 INFO  (coreLoadExecutor-4540-thread-3) [    ] o.a.s.c.SolrConfig Using Lucene MatchVersion: 6.6.1
   [junit4]   2> 785929 INFO  (coreLoadExecutor-4540-thread-1) [    ] o.a.s.c.SolrConfig Using Lucene MatchVersion: 6.6.1
   [junit4]   2> 785929 WARN  (coreLoadExecutor-4540-thread-2) [    ] o.a.s.c.Config Beginning with Solr 5.5, <mergePolicy> is deprecated, use <mergePolicyFactory> instead.
   [junit4]   2> 785930 INFO  (coreLoadExecutor-4540-thread-2) [    ] o.a.s.c.SolrConfig Using Lucene MatchVersion: 6.6.1
   [junit4]   2> 785940 INFO  (coreLoadExecutor-4540-thread-1) [    ] o.a.s.s.IndexSchema [collection1] Schema name=tiny
   [junit4]   2> 785940 INFO  (coreLoadExecutor-4540-thread-2) [    ] o.a.s.s.IndexSchema [collection2] Schema name=tiny
   [junit4]   2> 785940 INFO  (coreLoadExecutor-4540-thread-3) [    ] o.a.s.s.IndexSchema [collection5] Schema name=tiny
   [junit4]   2> 785942 INFO  (coreLoadExecutor-4540-thread-1) [    ] o.a.s.s.IndexSchema Loaded schema tiny/1.1 with uniqueid field id
   [junit4]   2> 785942 INFO  (coreLoadExecutor-4540-thread-1) [    ] o.a.s.c.CoreContainer Creating SolrCore 'collection1' using configuration from instancedir C:\Users\jenkins\workspace\Lucene-Solr-6.6-Windows\solr\build\solr-core\test\J0\temp\solr.core.TestLazyCores_D60014D3C82FA656-001\tempDir-001\.\collection1, trusted=true
   [junit4]   2> 785942 INFO  (coreLoadExecutor-4540-thread-2) [    ] o.a.s.s.IndexSchema Loaded schema tiny/1.1 with uniqueid field id
   [junit4]   2> 785942 INFO  (coreLoadExecutor-4540-thread-2) [    ] o.a.s.c.CoreContainer Creating SolrCore 'collection2' using configuration from instancedir C:\Users\jenkins\workspace\Lucene-Solr-6.6-Windows\solr\build\solr-core\test\J0\temp\solr.core.TestLazyCores_D60014D3C82FA656-001\tempDir-001\.\collection2, trusted=true
   [junit4]   2> 785942 INFO  (coreLoadExecutor-4540-thread-3) [    ] o.a.s.s.IndexSchema Loaded schema tiny/1.1 with uniqueid field id
   [junit4]   2> 785942 INFO  (coreLoadExecutor-4540-thread-3) [    ] o.a.s.c.CoreContainer Creating SolrCore 'collection5' using configuration from instancedir C:\Users\jenkins\workspace\Lucene-Solr-6.6-Windows\solr\build\solr-core\test\J0\temp\solr.core.TestLazyCores_D60014D3C82FA656-001\tempDir-001\.\collection5, trusted=true
   [junit4]   2> 785943 INFO  (coreLoadExecutor-4540-thread-1) [    ] o.a.s.c.SolrCore solr.RecoveryStrategy.Builder
   [junit4]   2> 785943 INFO  (coreLoadExecutor-4540-thread-2) [    ] o.a.s.c.SolrCore solr.RecoveryStrategy.Builder
   [junit4]   2> 785943 INFO  (coreLoadExecutor-4540-thread-1) [    ] o.a.s.c.SolrCore [[collection1] ] Opening new SolrCore at [C:\Users\jenkins\workspace\Lucene-Solr-6.6-Windows\solr\build\solr-core\test\J0\temp\solr.core.TestLazyCores_D60014D3C82FA656-001\tempDir-001\collection1], dataDir=[C:\Users\jenkins\workspace\Lucene-Solr-6.6-Windows\solr\build\solr-core\test\J0\temp\solr.core.TestLazyCores_D60014D3C82FA656-001\tempDir-001\.\collection1\data\]
   [junit4]   2> 785943 INFO  (coreLoadExecutor-4540-thread-2) [    ] o.a.s.c.SolrCore [[collection2] ] Opening new SolrCore at [C:\Users\jenkins\workspace\Lucene-Solr-6.6-Windows\solr\build\solr-core\test\J0\temp\solr.core.TestLazyCores_D60014D3C82FA656-001\tempDir-001\collection2], dataDir=[C:\Users\jenkins\workspace\Lucene-Solr-6.6-Windows\solr\build\solr-core\test\J0\temp\solr.core.TestLazyCores_D60014D3C82FA656-001\tempDir-001\.\collection2\data\]
   [junit4]   2> 785943 INFO  (coreLoadExecutor-4540-thread-3) [    ] o.a.s.c.SolrCore solr.RecoveryStrategy.Builder
   [junit4]   2> 785943 INFO  (coreLoadExecutor-4540-thread-3) [    ] o.a.s.c.SolrCore [[collection5] ] Opening new SolrCore at [C:\Users\jenkins\workspace\Lucene-Solr-6.6-Windows\solr\build\solr-core\test\J0\temp\solr.core.TestLazyCores_D60014D3C82FA656-001\tempDir-001\collection5], dataDir=[C:\Users\jenkins\workspace\Lucene-Solr-6.6-Windows\solr\build\solr-core\test\J0\temp\solr.core.TestLazyCores_D60014D3C82FA656-001\tempDir-001\.\collection5\data\]
   [junit4]   2> 785947 INFO  (coreLoadExecutor-4540-thread-2) [    ] o.a.s.u.RandomMergePolicy RandomMergePolicy wrapping class org.apache.lucene.index.TieredMergePolicy: [TieredMergePolicy: maxMergeAtOnce=49, maxMergeAtOnceExplicit=25, maxMergedSegmentMB=44.6083984375, floorSegmentMB=1.8681640625, forceMergeDeletesPctAllowed=15.652648059537269, segmentsPerTier=50.0, maxCFSSegmentSizeMB=8.796093022207999E12, noCFSRatio=1.0
   [junit4]   2> 785947 INFO  (coreLoadExecutor-4540-thread-3) [    ] o.a.s.u.RandomMergePolicy RandomMergePolicy wrapping class org.apache.lucene.index.TieredMergePolicy: [TieredMergePolicy: maxMergeAtOnce=49, maxMergeAtOnceExplicit=25, maxMergedSegmentMB=44.6083984375, floorSegmentMB=1.8681640625, forceMergeDeletesPctAllowed=15.652648059537269, segmentsPerTier=50.0, maxCFSSegmentSizeMB=8.796093022207999E12, noCFSRatio=1.0
   [junit4]   2> 785948 INFO  (coreLoadExecutor-4540-thread-1) [    ] o.a.s.u.RandomMergePolicy RandomMergePolicy wrapping class org.apache.lucene.index.TieredMergePolicy: [TieredMergePolicy: maxMergeAtOnce=49, maxMergeAtOnceExplicit=25, maxMergedSegmentMB=44.6083984375, floorSegmentMB=1.8681640625, forceMergeDeletesPctAllowed=15.652648059537269, segmentsPerTier=50.0, maxCFSSegmentSizeMB=8.796093022207999E12, noCFSRatio=1.0
   [junit4]   2> 786010 INFO  (coreLoadExecutor-4540-thread-2) [    ] o.a.s.u.CommitTracker Hard AutoCommit: disabled
   [junit4]   2> 786011 INFO  (coreLoadExecutor-4540-thread-2) [    ] o.a.s.u.CommitTracker Soft AutoCommit: disabled
   [junit4]   2> 786011 INFO  (coreLoadExecutor-4540-thread-2) [    ] o.a.s.u.RandomMergePolicy RandomMergePolicy wrapping class org.apache.lucene.index.LogDocMergePolicy: [LogDocMergePolicy: minMergeSize=1000, mergeFactor=49, maxMergeSize=9223372036854775807, maxMergeSizeForForcedMerge=9223372036854775807, calibrateSizeByDeletes=false, maxMergeDocs=2147483647, maxCFSSegmentSizeMB=8.796093022207999E12, noCFSRatio=0.7674550238409049]
   [junit4]   2> 786012 INFO  (coreLoadExecutor-4540-thread-2) [    ] o.a.s.s.SolrIndexSearcher Opening [Searcher@247b8fc4[collection2] main]
   [junit4]   2> 786012 INFO  (coreLoadExecutor-4540-thread-2) [    ] o.a.s.r.ManagedResourceStorage File-based storage initialized to use dir: C:\Users\jenkins\workspace\Lucene-Solr-6.6-Windows\solr\build\solr-core\test\J0\temp\solr.core.TestLazyCores_D60014D3C82FA656-001\tempDir-001\collection2\conf
   [junit4]   2> 786013 INFO  (coreLoadExecutor-4540-thread-2) [    ] o.a.s.h.ReplicationHandler Commits will be reserved for  10000
   [junit4]   2> 786013 INFO  (searcherExecutor-4542-thread-1) [    ] o.a.s.c.SolrCore [collection2] Registered new searcher Searcher@247b8fc4[collection2] main{ExitableDirectoryReader(UninvertingDirectoryReader())}
   [junit4]   2> 786021 INFO  (coreLoadExecutor-4540-thread-3) [    ] o.a.s.u.CommitTracker Hard AutoCommit: disabled
   [junit4]   2> 786021 INFO  (coreLoadExecutor-4540-thread-3) [    ] o.a.s.u.CommitTracker Soft AutoCommit: disabled
   [junit4]   2> 786022 INFO  (coreLoadExecutor-4540-thread-1) [    ] o.a.s.u.CommitTracker Hard AutoCommit: disabled
   [junit4]   2> 786022 INFO  (coreLoadExecutor-4540-thread-1) [    ] o.a.s.u.CommitTracker Soft AutoCommit: disabled
   [junit4]   2> 786022 INFO  (coreLoadExecutor-4540-thread-1) [    ] o.a.s.u.RandomMergePolicy RandomMergePolicy wrapping class org.apache.lucene.index.LogDocMergePolicy: [LogDocMergePolicy: minMergeSize=1000, mergeFactor=49, maxMergeSize=9223372036854775807, maxMergeSizeForForcedMerge=9223372036854775807, calibrateSizeByDeletes=false, maxMergeDocs=2147483647, maxCFSSegmentSizeMB=8.796093022207999E12, noCFSRatio=0.7674550238409049]
   [junit4]   2> 786022 INFO  (coreLoadExecutor-4540-thread-3) [    ] o.a.s.u.RandomMergePolicy RandomMergePolicy wrapping class org.apache.lucene.index.LogDocMergePolicy: [LogDocMergePolicy: minMergeSize=1000, mergeFactor=49, maxMergeSize=9223372036854775807, maxMergeSizeForForcedMerge=9223372036854775807, calibrateSizeByDeletes=false, maxMergeDocs=2147483647, maxCFSSegmentSizeMB=8.796093022207999E12, noCFSRatio=0.7674550238409049]
   [junit4]   2> 786023 INFO  (coreLoadExecutor-4540-thread-3) [    ] o.a.s.s.SolrIndexSearcher Opening [Searcher@75aa6b8a[collection5] main]
   [junit4]   2> 786023 INFO  (coreLoadExecutor-4540-thread-1) [    ] o.a.s.s.SolrIndexSearcher Opening [Searcher@4837623b[collection1] main]
   [junit4]   2> 786023 INFO  (coreLoadExecutor-4540-thread-3) [    ] o.a.s.r.ManagedResourceStorage File-based storage initialized to use dir: C:\Users\jenkins\workspace\Lucene-Solr-6.6-Windows\solr\build\solr-core\test\J0\temp\solr.core.TestLazyCores_D60014D3C82FA656-001\tempDir-001\collection5\conf
   [junit4]   2> 786023 INFO  (coreLoadExecutor-4540-thread-1) [    ] o.a.s.r.ManagedResourceStorage File-based storage initialized to use dir: C:\Users\jenkins\workspace\Lucene-Solr-6.6-Windows\solr\build\solr-core\test\J0\temp\solr.core.TestLazyCores_D60014D3C82FA656-001\tempDir-001\collection1\conf
   [junit4]   2> 786023 INFO  (coreLoadExecutor-4540-thread-3) [    ] o.a.s.h.ReplicationHandler Commits will be reserved for  10000
   [junit4]   2> 786023 INFO  (coreLoadExecutor-4540-thread-1) [    ] o.a.s.h.ReplicationHandler Commits will be reserved for  10000
   [junit4]   2> 786024 INFO  (searcherExecutor-4541-thread-1) [    ] o.a.s.c.SolrCore [collection1] Registered new searcher Searcher@4837623b[collection1] main{ExitableDirectoryReader(UninvertingDirectoryReader())}
   [junit4]   2> 786024 INFO  (searcherExecutor-4543-thread-1) [    ] o.a.s.c.SolrCore [collection5] Registered new searcher Searcher@75aa6b8a[collection5] main{ExitableDirectoryReader(UninvertingDirectoryReader())}
   [junit4]   2> 786032 WARN  (TEST-TestLazyCores.testLazyLoad-seed#[D60014D3C82FA656]) [    ] o.a.s.c.Config Beginning with Solr 5.5, <mergePolicy> is deprecated, use <mergePolicyFactory> instead.
   [junit4]   2> 786032 INFO  (TEST-TestLazyCores.testLazyLoad-seed#[D60014D3C82FA656]) [    ] o.a.s.c.SolrConfig Using Lucene MatchVersion: 6.6.1
   [junit4]   2> 786037 INFO  (TEST-TestLazyCores.testLazyLoad-seed#[D60014D3C82FA656]) [    ] o.a.s.s.IndexSchema [collection3] Schema name=tiny
   [junit4]   2> 786039 INFO  (TEST-TestLazyCores.testLazyLoad-seed#[D60014D3C82FA656]) [    ] o.a.s.s.IndexSchema Loaded schema tiny/1.1 with uniqueid field id
   [junit4]   2> 786039 INFO  (TEST-TestLazyCores.testLazyLoad-seed#[D60014D3C82FA656]) [    ] o.a.s.c.CoreContainer Creating SolrCore 'collection3' using configuration from instancedir C:\Users\jenkins\workspace\Lucene-Solr-6.6-Windows\solr\build\solr-core\test\J0\temp\solr.core.TestLazyCores_D60014D3C82FA656-001\tempDir-001\.\collection3, trusted=true
   [junit4]   2> 786039 INFO  (TEST-TestLazyCores.testLazyLoad-seed#[D60014D3C82FA656]) [    ] o.a.s.c.SolrCore solr.RecoveryStrategy.Builder
   [junit4]   2> 786039 INFO  (TEST-TestLazyCores.testLazyLoad-seed#[D60014D3C82FA656]) [    ] o.a.s.c.SolrCore [[collection3] ] Opening new SolrCore at [C:\Users\jenkins\workspace\Lucene-Solr-6.6-Windows\solr\build\solr-core\test\J0\temp\solr.core.TestLazyCores_D60014D3C82FA656-001\tempDir-001\collection3], dataDir=[C:\Users\jenkins\workspace\Lucene-Solr-6.6-Windows\solr\build\solr-core\test\J0\temp\solr.core.TestLazyCores_D60014D3C82FA656-001\tempDir-001\.\collection3\data\]
   [junit4]   2> 786045 INFO  (TEST-TestLazyCores.testLazyLoad-seed#[D60014D3C82FA656]) [    ] o.a.s.u.RandomMergePolicy RandomMergePolicy wrapping class org.apache.lucene.index.LogByteSizeMergePolicy: [LogByteSizeMergePolicy: minMergeSize=1677721, mergeFactor=30, maxMergeSize=2147483648, maxMergeSizeForForcedMerge=9223372036854775807, calibrateSizeByDeletes=false, maxMergeDocs=2147483647, maxCFSSegmentSizeMB=8.796093022207999E12, noCFSRatio=0.0]
   [junit4]   2> 786088 INFO  (TEST-TestLazyCores.testLazyLoad-seed#[D60014D3C82FA656]) [    ] o.a.s.u.CommitTracker Hard AutoCommit: disabled
   [junit4]   2> 786089 INFO  (TEST-TestLazyCores.testLazyLoad-seed#[D60014D3C82FA656]) [    ] o.a.s.u.CommitTracker Soft AutoCommit: disabled
   [junit4]   2> 786089 INFO  (TEST-TestLazyCores.testLazyLoad-seed#[D60014D3C82FA656]) [    ] o.a.s.u.RandomMergePolicy RandomMergePolicy wrapping class org.apache.lucene.index.TieredMergePolicy: [TieredMergePolicy: maxMergeAtOnce=50, maxMergeAtOnceExplicit=41, maxMergedSegmentMB=9.5712890625, floorSegmentMB=1.1376953125, forceMergeDeletesPctAllowed=10.570938219896172, segmentsPerTier=14.0, maxCFSSegmentSizeMB=8.796093022207999E12, noCFSRatio=0.22392511427362916
   [junit4]   2> 786090 INFO  (TEST-TestLazyCores.testLazyLoad-seed#[D60014D3C82FA656]) [    ] o.a.s.s.SolrIndexSearcher Opening [Searcher@6a8eceae[collection3] main]
   [junit4]   2> 786090 INFO  (TEST-TestLazyCores.testLazyLoad-seed#[D60014D3C82FA656]) [    ] o.a.s.r.ManagedResourceStorage File-based storage initialized to use dir: C:\Users\jenkins\workspace\Lucene-Solr-6.6-Windows\solr\build\solr-core\test\J0\temp\solr.core.TestLazyCores_D60014D3C82FA656-001\tempDir-001\collection3\conf
   [junit4]   2> 786091 INFO  (TEST-TestLazyCores.testLazyLoad-seed#[D60014D3C82FA656]) [    ] o.a.s.h.ReplicationHandler Commits will be reserved for  10000
   [junit4]   2> 786091 INFO  (searcherExecutor-4553-thread-1) [    ] o.a.s.c.SolrCore [collection3] Registered new searcher Searcher@6a8eceae[collection3] main{ExitableDirectoryReader(UninvertingDirectoryReader())}
   [junit4]   2> 786096 WARN  (TEST-TestLazyCores.testLazyLoad-seed#[D60014D3C82FA656]) [    ] o.a.s.c.Config Beginning with Solr 5.5, <mergePolicy> is deprecated, use <mergePolicyFactory> instead.
   [junit4]   2> 786097 INFO  (TEST-TestLazyCores.testLazyLoad-seed#[D60014D3C82FA656]) [    ] o.a.s.c.SolrConfig Using Lucene MatchVersion: 6.6.1
   [junit4]   2> 786113 INFO  (TEST-TestLazyCores.testLazyLoad-seed#[D60014D3C82FA656]) [    ] o.a.s.s.IndexSchema [collection4] Schema name=tiny
   [junit4]   2> 786115 INFO  (TEST-TestLazyCores.testLazyLoad-seed#[D60014D3C82FA656]) [    ] o.a.s.s.IndexSchema Loaded schema tiny/1.1 with uniqueid field id
   [junit4]   2> 786115 INFO  (TEST-TestLazyCores.testLazyLoad-seed#[D60014D3C82FA656]) [    ] o.a.s.c.CoreContainer Creating SolrCore 'collection4' using configuration from instancedir C:\Users\jenkins\workspace\Lucene-Solr-6.6-Windows\solr\build\solr-core\test\J0\temp\solr.core.TestLazyCores_D60014D3C82FA656-001\tempDir-001\.\collection4, trusted=true
   [junit4]   2> 786116 INFO  (TEST-TestLazyCores.testLazyLoad-seed#[D60014D3C82FA656]) [    ] o.a.s.c.SolrCore solr.RecoveryStrategy.Builder
   [junit4]   2> 786116 INFO  (TEST-TestLazyCores.testLazyLoad-seed#[D60014D3C82FA656]) [    ] o.a.s.c.SolrCore [[collection4] ] Opening new SolrCore at [C:\Users\jenkins\workspace\Lucene-Solr-6.6-Windows\solr\build\solr-core\test\J0\temp\solr.core.TestLazyCores_D60014D3C82FA656-001\tempDir-001\collection4], dataDir=[C:\Users\jenkins\workspace\Lucene-Solr-6.6-Windows\solr\build\solr-core\test\J0\temp\solr.core.TestLazyCores_D60014D3C82FA656-001\tempDir-001\.\collection4\data\]
   [junit4]   2> 786121 INFO  (TEST-TestLazyCores.testLazyLoad-seed#[D60014D3C82FA656]) [    ] o.a.s.u.RandomMergePolicy RandomMergePolicy wrapping class org.apache.lucene.index.TieredMergePolicy: [TieredMergePolicy: maxMergeAtOnce=17, maxMergeAtOnceExplicit=36, maxMergedSegmentMB=6.115234375, floorSegmentMB=0.4580078125, forceMergeDeletesPctAllowed=26.35133249652136, segmentsPerTier=38.0, maxCFSSegmentSizeMB=8.796093022207999E12, noCFSRatio=0.0
   [junit4]   2> 786168 INFO  (TEST-TestLazyCores.testLazyLoad-seed#[D60014D3C82FA656]) [    ] o.a.s.u.CommitTracker Hard AutoCommit: disabled
   [junit4]   2> 786168 INFO  (TEST-TestLazyCores.testLazyLoad-seed#[D60014D3C82FA656]) [    ] o.a.s.u.CommitTracker Soft AutoCommit: disabled
   [junit4]   2> 786169 INFO  (TEST-TestLazyCores.testLazyLoad-seed#[D60014D3C82FA656]) [    ] o.a.s.u.RandomMergePolicy RandomMergePolicy wrapping class org.apache.lucene.index.LogByteSizeMergePolicy: [LogByteSizeMergePolicy: minMergeSize=1677721, mergeFactor=42, maxMergeSize=2147483648, maxMergeSizeForForcedMerge=9223372036854775807, calibrateSizeByDeletes=false, maxMergeDocs=2147483647, maxCFSSegmentSizeMB=8.796093022207999E12, noCFSRatio=0.26579959893656335]
   [junit4]   2> 786169 INFO  (TEST-TestLazyCores.testLazyLoad-seed#[D60014D3C82FA656]) [    ] o.a.s.s.SolrIndexSearcher Opening [Searcher@5cf18647[collection4] main]
   [junit4]   2> 786170 INFO  (TEST-TestLazyCores.testLazyLoad-seed#[D60014D3C82FA656]) [    ] o.a.s.r.ManagedResourceStorage File-based storage initialized to use dir: C:\Users\jenkins\workspace\Lucene-Solr-6.6-Windows\solr\build\solr-core\test\J0\temp\solr.core.TestLazyCores_D60014D3C82FA656-001\tempDir-001\collection4\conf
   [junit4]   2> 786171 INFO  (TEST-TestLazyCores.testLazyLoad-seed#[D60014D3C82FA656]) [    ] o.a.s.h.ReplicationHandler Commits will be reserved for  10000
   [junit4]   2> 786171 INFO  (searcherExecutor-4557-thread-1) [    ] o.a.s.c.SolrCore [collection4] Registered new searcher Searcher@5cf18647[collection4] main{ExitableDirectoryReader(UninvertingDirectoryReader())}
   [junit4]   2> 786171 INFO  (TEST-TestLazyCores.testLazyLoad-seed#[D60014D3C82FA656]) [    ] o.a.s.c.CoreContainer Shutting down CoreContainer instance=1501654444
   [junit4]   2> 786171 INFO  (TEST-TestLazyCores.testLazyLoad-seed#[D60014D3C82FA656]) [    ] o.a.s.m.SolrMetricManager Closing metric reporters for: solr.node
   [junit4]   2> 786171 INFO  (TEST-TestLazyCores.testLazyLoad-seed#[D60014D3C82FA656]) [    ] o.a.s.m.SolrMetricManager Closing metric reporters for: solr.jvm
   [junit4]   2> 786171 INFO  (TEST-TestLazyCores.testLazyLoad-seed#[D60014D3C82FA656]) [    ] o.a.s.m.SolrMetricManager Closing metric reporters for: solr.jetty
   [junit4]   2> 786173 INFO  (coreCloseExecutor-4561-thread-1) [    ] o.a.s.c.SolrCore [collection1]  CLOSING SolrCore org.apache.solr.core.SolrCore@4061aebd
   [junit4]   2> 786173 INFO  (coreCloseExecutor-4561-thread-5) [    ] o.a.s.c.SolrCore [collection3]  CLOSING SolrCore org.apache.solr.core.SolrCore@d42f17
   [junit4]   2> 786173 INFO  (coreCloseExecutor-4561-thread-4) [    ] o.a.s.c.SolrCore [collection2]  CLOSING SolrCore org.apache.solr.core.SolrCore@73b4b00
   [junit4]   2> 786173 INFO  (coreCloseExecutor-4561-thread-2) [    ] o.a.s.c.SolrCore [collection5]  CLOSING SolrCore org.apache.solr.core.SolrCore@541dbe31
   [junit4]   2> 786173 INFO  (coreCloseExecutor-4561-thread-3) [    ] o.a.s.c.SolrCore [collection4]  CLOSING SolrCore org.apache.solr.core.SolrCore@71795408
   [junit4]   2> 786175 INFO  (coreCloseExecutor-4561-thread-1) [    ] o.a.s.m.SolrMetricManager Closing metric reporters for: solr.core.collection1
   [junit4]   2> 786176 INFO  (coreCloseExecutor-4561-thread-2) [    ] o.a.s.m.SolrMetricManager Closing metric reporters for: solr.core.collection5
   [junit4]   2> 786176 INFO  (coreCloseExecutor-4561-thread-5) [    ] o.a.s.m.SolrMetricManager Closing metric reporters for: solr.core.collection3
   [junit4]   2> 786177 INFO  (coreCloseExecutor-4561-thread-4) [    ] o.a.s.m.SolrMetricManager Closing metric reporters for: solr.core.collection2
   [junit4]   2> 786178 INFO  (coreCloseExecutor-4561-thread-3) [    ] o.a.s.m.SolrMetricManager Closing metric reporters for: solr.core.collection4
   [junit4]   2> 786179 INFO  (TEST-TestLazyCores.testLazyLoad-seed#[D60014D3C82FA656]) [    ] o.a.s.SolrTestCaseJ4 ###Ending testLazyLoad
   [junit4]   2> 786181 INFO  (TEST-TestLazyCores.testCreateTransientFromAdmin-seed#[D60014D3C82FA656]) [    ] o.a.s.SolrTestCaseJ4 ###Starting testCreateTransientFromAdmin
   [junit4]   2> 786228 INFO  (TEST-TestLazyCores.testCreateTransientFromAdmin-seed#[D60014D3C82FA656]) [    ] o.a.s.c.SolrXmlConfig Loading container configuration from C:\Users\jenkins\workspace\Lucene-Solr-6.6-Windows\solr\build\solr-core\test\J0\temp\solr.core.TestLazyCores_D60014D3C82FA656-001\tempDir-002\solr.xml
   [junit4]   2> 786232 INFO  (TEST-TestLazyCores.testCreateTransientFromAdmin-seed#[D60014D3C82FA656]) [    ] o.a.s.u.UpdateShardHandler Creating UpdateShardHandler HTTP client with params: socketTimeout=340000&connTimeout=45000&retry=true
   [junit4]   2> 786262 INFO  (TEST-TestLazyCores.testCreateTransientFromAdmin-seed#[D60014D3C82FA656]) [    ] o.a.s.c.TransientSolrCoreCacheDefault Allocating transient cache for 4 transient cores
   [junit4]   2> 786270 WARN  (coreLoadExecutor-4568-thread-2) [    ] o.a.s.c.Config Beginning with Solr 5.5, <mergePolicy> is deprecated, use <mergePolicyFactory> instead.
   [junit4]   2> 786270 WARN  (coreLoadExecutor-4568-thread-3) [    ] o.a.s.c.Config Beginning with Solr 5.5, <mergePolicy> is deprecated, use <mergePolicyFactory> instead.
   [junit4]   2> 786270 INFO  (coreLoadExecutor-4568-thread-2) [    ] o.a.s.c.SolrConfig Using Lucene MatchVersion: 6.6.1
   [junit4]   2> 786271 INFO  (coreLoadExecutor-4568-thread-3) [    ] o.a.s.c.SolrConfig Using Lucene MatchVersion: 6.6.1
   [junit4]   2> 786284 INFO  (coreLoadExecutor-4568-thread-2) [    ] o.a.s.s.IndexSchema [collection2] Schema name=tiny
   [junit4]   2> 786285 INFO  (coreLoadExecutor-4568-thread-3) [    ] o.a.s.s.IndexSchema [collection5] Schema name=tiny
   [junit4]   2> 786285 INFO  (coreLoadExecutor-4568-thread-2) [    ] o.a.s.s.IndexSchema Loaded schema tiny/1.1 with uniqueid field id
   [junit4]   2> 786285 WARN  (coreLoadExecutor-4568-thread-1) [    ] o.a.s.c.Config Beginning with Solr 5.5, <mergePolicy> is deprecated, use <mergePolicyFactory> instead.
   [junit4]   2> 786285 INFO  (coreLoadExecutor-4568-thread-2) [    ] o.a.s.c.CoreContainer Creating SolrCore 'collection2' using configuration from instancedir C:\Users\jenkins\workspace\Lucene-Solr-6.6-Windows\solr\build\solr-core\test\J0\temp\solr.core.TestLazyCores_D60014D3C82FA656-001\tempDir-002\.\collection2, trusted=true
   [junit4]   2> 786285 INFO  (coreLoadExecutor-4568-thread-1) [    ] o.a.s.c.SolrConfig Using Lucene MatchVersion: 6.6.1
   [junit4]   2> 786285 INFO  (coreLoadExecutor-4568-thread-2) [    ] o.a.s.c.SolrCore solr.RecoveryStrategy.Builder
   [junit4]   2> 786285 INFO  (coreLoadExecutor-4568-thread-2) [    ] o.a.s.c.SolrCore [[collection2] ] Opening new SolrCore at [C:\Users\jenkins\workspace\Lucene-Solr-6.6-Windows\solr\build\solr-core\test\J0\temp\solr.core.TestLazyCores_D60014D3C82FA656-001\tempDir-002\collection2], dataDir=[C:\Users\jenkins\workspace\Lucene-Solr-6.6-Windows\solr\build\solr-core\test\J0\temp\solr.core.TestLazyCores_D60014D3C82FA656-001\tempDir-002\.\collection2\data\]
   [junit4]   2> 786287 INFO  (coreLoadExecutor-4568-thread-3) [    ] o.a.s.s.IndexSchema Loaded schema tiny/1.1 with uniqueid field id
   [junit4]   2> 786288 INFO  (coreLoadExecutor-4568-thread-3) [    ] o.a.s.c.CoreContainer Creating SolrCore 'collection5' using configuration from instancedir C:\Users\jenkins\workspace\Lucene-Solr-6.6-Windows\solr\build\solr-core\test\J0\temp\solr.core.TestLazyCores_D60014D3C82FA656-001\tempDir-002\.\collection5, trusted=true
   [junit4]   2> 786288 INFO  (coreLoadExecutor-4568-thread-3) [    ] o.a.s.c.SolrCore solr.RecoveryStrategy.Builder
   [junit4]   2> 786288 INFO  (coreLoadExecutor-4568-thread-3) [    ] o.a.s.c.SolrCore [[collection5] ] Opening new SolrCore at [C:\Users\jenkins\workspace\Lucene-Solr-6.6-Windows\solr\build\solr-core\test\J0\temp\solr.core.TestLazyCores_D60014D3C82FA656-001\tempDir-002\collection5], dataDir=[C:\Users\jenkins\workspace\Lucene-Solr-6.6-Windows\solr\build\solr-core\test\J0\temp\solr.core.TestLazyCores_D60014D3C82FA656-001\tempDir-002\.\collection5\data\]
   [junit4]   2> 786292 INFO  (coreLoadExecutor-4568-thread-1) [    ] o.a.s.s.IndexSchema [collection1] Schema name=tiny
   [junit4]   2> 786292 INFO  (coreLoadExecutor-4568-thread-2) [    ] o.a.s.u.RandomMergePolicy RandomMergePolicy wrapping class org.apache.lucene.index.TieredMergePolicy: [TieredMergePolicy: maxMergeAtOnce=49, maxMergeAtOnceExplicit=25, maxMergedSegmentMB=44.6083984375, floorSegmentMB=1.8681640625, forceMergeDeletesPctAllowed=15.652648059537269, segmentsPerTier=50.0, maxCFSSegmentSizeMB=8.796093022207999E12, noCFSRatio=1.0
   [junit4]   2> 786293 INFO  (coreLoadExecutor-4568-thread-3) [    ] o.a.s.u.RandomMergePolicy RandomMergePolicy wrapping class org.apache.lucene.index.TieredMergePolicy: [TieredMergePolicy: maxMergeAtOnce=49, maxMergeAtOnceExplicit=25, maxMergedSegmentMB=44.6083984375, floorSegmentMB=1.8681640625, forceMergeDeletesPctAllowed=15.652648059537269, segmentsPerTier=50.0, maxCFSSegmentSizeMB=8.796093022207999E12, noCFSRatio=1.0
   [junit4]   2> 786295 INFO  (coreLoadExecutor-4568-thread-1) [    ] o.a.s.s.IndexSchema Loaded schema tiny/1.1 with uniqueid field id
   [junit4]   2> 786295 INFO  (coreLoadExecutor-4568-thread-1) [    ] o.a.s.c.CoreContainer Creating SolrCore 'collection1' using configuration from instancedir C:\Users\jenkins\workspace\Lucene-Solr-6.6-Windows\solr\build\solr-core\test\J0\temp\solr.core.TestLazyCores_D60014D3C82FA656-001\tempDir-002\.\collection1, trusted=true
   [junit4]   2> 786295 INFO  (coreLoadExecutor-4568-thread-1) [    ] o.a.s.c.SolrCore solr.RecoveryStrategy.Builder
   [junit4]   2> 786295 INFO  (coreLoadExecutor-4568-thread-1) [    ] o.a.s.c.SolrCore [[collection1] ] Opening new SolrCore at [C:\Users\jenkins\workspace\Lucene-Solr-6.6-Windows\solr\build\solr-core\test\J0\temp\solr.core.TestLazyCores_D60014D3C82FA656-001\tempDir-002\collection1], dataDir=[C:\Users\jenkins\workspace\Lucene-Solr-6.6-Windows\solr\build\solr-core\test\J0\temp\solr.core.TestLazyCores_D60014D3C82FA656-001\tempDir-002\.\collection1\data\]
   [junit4]   2> 786300 INFO  (coreLoadExecutor-4568-thread-1) [    ] o.a.s.u.RandomMergePolicy RandomMergePolicy wrapping class org.apache.lucene.index.TieredMergePolicy: [TieredMergePolicy: maxMergeAtOnce=49, maxMergeAtOnceExplicit=25, maxMergedSegmentMB=44.6083984375, floorSegmentMB=1.8681640625, forceMergeDeletesPctAllowed=15.652648059537269, segmentsPerTier=50.0, maxCFSSegmentSizeMB=8.796093022207999E12, noCFSRatio=1.0
   [junit4]   2> 786357 INFO  (coreLoadExecutor-4568-thread-2) [    ] o.a.s.u.CommitTracker Hard AutoCommit: disabled
   [junit4]   2> 786357 INFO  (coreLoadExecutor-4568-thread-2) [    ] o.a.s.u.CommitTracker Soft AutoCommit: disabled
   [junit4]   2> 786357 INFO  (coreLoadExecutor-4568-thread-2) [    ] o.a.s.u.RandomMergePolicy RandomMergePolicy wrapping class org.apache.lucene.index.LogDocMergePolicy: [LogDocMergePolicy: minMergeSize=1000, mergeFactor=49, maxMergeSize=9223372036854775807, maxMergeSizeForForcedMerge=9223372036854775807, calibrateSizeByDeletes=false, maxMergeDocs=2147483647, maxCFSSegmentSizeMB=8.796093022207999E12, noCFSRatio=0.7674550238409049]
   [junit4]   2> 786358 INFO  (coreLoadExecutor-4568-thread-2) [    ] o.a.s.s.SolrIndexSearcher Opening [Searcher@5afd3874[collection2] main]
   [junit4]   2> 786358 INFO  (coreLoadExecutor-4568-thread-2) [    ] o.a.s.r.ManagedResourceStorage File-based storage initialized to use dir: C:\Users\jenkins\workspace\Lucene-Solr-6.6-Windows\solr\build\solr-core\test\J0\temp\solr.core.TestLazyCores_D60014D3C82FA656-001\tempDir-002\collection2\conf
   [junit4]   2> 786359 INFO  (coreLoadExecutor-4568-thread-2) [    ] o.a.s.h.ReplicationHandler Commits will be reserved for  10000
   [junit4]   2> 786359 INFO  (searcherExecutor-4569-thread-1) [    ] o.a.s.c.SolrCore [collection2] Registered new searcher Searcher@5afd3874[collection2] main{ExitableDirectoryReader(UninvertingDirectoryReader())}
   [junit4]   2> 786372 INFO  (coreLoadExecutor-4568-thread-3) [    ] o.a.s.u.CommitTracker Hard AutoCommit: disabled
   [junit4]   2> 786372 INFO  (coreLoadExecutor-4568-thread-3) [    ] o.a.s.u.CommitTracker Soft AutoCommit: disabled
   [junit4]   2> 786372 INFO  (coreLoadExecutor-4568-thread-3) [    ] o.a.s.u.RandomMergePolicy RandomMergePolicy wrapping class org.apache.lucene.index.LogDocMergePolicy: [LogDocMergePolicy: minMergeSize=1000, mergeFactor=49, maxMergeSize=9223372036854775807, maxMergeSizeForForcedMerge=9223372036854775807, calibrateSizeByDeletes=false, maxMergeDocs=2147483647, maxCFSSegmentSizeMB=8.796093022207999E12, noCFSRatio=0.7674550238409049]
   [junit4]   2> 786373 INFO  (coreLoadExecutor-4568-thread-3) [    ] o.a.s.s.SolrIndexSearcher Opening [Searcher@686a55[collection5] main]
   [junit4]   2> 786373 INFO  (coreLoadExecutor-4568-thread-3) [    ] o.a.s.r.ManagedResourceStorage File-based storage initialized to use dir: C:\Users\jenkins\workspace\Lucene-Solr-6.6-Windows\solr\build\solr-core\test\J0\temp\solr.core.TestLazyCores_D60014D3C82FA656-001\tempDir-002\collection5\conf
   [junit4]   2> 786374 INFO  (coreLoadExecutor-4568-thread-3) [    ] o.a.s.h.ReplicationHandler Commits will be reserved for  10000
   [junit4]   2> 786374 INFO  (searcherExecutor-4570-thread-1) [    ] o.a.s.c.SolrCore [collection5] Registered new searcher Searcher@686a55[collection5] main{ExitableDirectoryReader(UninvertingDirectoryReader())}
   [junit4]   2> 786376 INFO  (coreLoadExecutor-4568-thread-1) [    ] o.a.s.u.CommitTracker Hard AutoCommit: disabled
   [junit4]   2> 786376 INFO  (coreLoadExecutor-4568-thread-1) [    ] o.a.s.u.CommitTracker Soft AutoCommit: disabled
   [junit4]   2> 786376 INFO  (coreLoadExecutor-4568-thread-1) [    ] o.a.s.u.RandomMergePolicy RandomMergePolicy wrapping class org.apache.lucene.index.LogDocMergePolicy: [LogDocMergePolicy: minMergeSize=1000, mergeFactor=49, maxMergeSize=9223372036854775807, maxMergeSizeForForcedMerge=9223372036854775807, calibrateSizeByDeletes=false, maxMergeDocs=2147483647, maxCFSSegmentSizeMB=8.796093022207999E12, noCFSRatio=0.7674550238409049]
   [junit4]   2> 786378 INFO  (coreLoadExecutor-4568-thread-1) [    ] o.a.s.s.SolrIndexSearcher Opening [Searcher@1833971e[collection1] main]
   [junit4]   2> 786378 INFO  (coreLoadExecutor-4568-thread-1) [    ] o.a.s.r.ManagedResourceStorage File-based storage initialized to use dir: C:\Users\jenkins\workspace\Lucene-Solr-6.6-Windows\solr\build\solr-core\test\J0\temp\solr.core.TestLazyCores_D60014D3C82FA656-001\tempDir-002\collection1\conf
   [junit4]   2> 786378 INFO  (coreLoadExecutor-4568-thread-1) [    ] o.a.s.h.ReplicationHandler Commits will be reserved for  10000
   [junit4]   2> 786379 INFO  (searcherExecutor-4571-thread-1) [    ] o.a.s.c.SolrCore [collection1] Registered new searcher Searcher@1833971e[collection1] main{ExitableDirectoryReader(UninvertingDirectoryReader())}
   [junit4]   2> 786410 INFO  (TEST-TestLazyCores.testCreateTransientFromAdmin-seed#[D60014D3C82FA656]) [    ] o.a.s.h.a.CoreAdminOperation core create command loadOnStartup=true&transient=true&name=core1&action=CREATE&wt=xml
   [junit4]   2> 786417 WARN  (TEST-TestLazyCores.testCreateTransientFromAdmin-seed#[D60014D3C82FA656]) [    ] o.a.s.c.Config Beginning with Solr 5.5, <mergePolicy> is deprecated, use <mergePolicyFactory> instead.
   [junit4]   2> 786417 INFO  (TEST-TestLazyCores.testCreateTransientFromAdmin-seed#[D60014D3C82FA656]) [    ] o.a.s.c.SolrConfig Using Lucene MatchVersion: 6.6.1
   [junit4]   2> 786420 INFO  (TEST-TestLazyCores.testCreateTransientFromAdmin-seed#[D60014D3C82FA656]) [    ] o.a.s.s.IndexSchema [core1] Schema name=tiny
   [junit4]   2> 786420 INFO  (TEST-TestLazyCores.testCreateTransientFromAdmin-seed#[D60014D3C82FA656]) [    ] o.a.s.s.IndexSchema Loaded schema tiny/1.1 with uniqueid field id
   [junit4]   2> 786420 INFO  (TEST-TestLazyCores.testCreateTransientFromAdmin-seed#[D60014D3C82FA656]) [    ] o.a.s.c.CoreContainer Creating SolrCore 'core1' using configuration from instancedir C:\Users\jenkins\workspace\Lucene-Solr-6.6-Windows\solr\build\solr-core\test\J0\temp\solr.core.TestLazyCores_D60014D3C82FA656-001\tempDir-002\.\core1, trusted=true
   [junit4]   2> 786420 INFO  (TEST-TestLazyCores.testCreateTransientFromAdmin-seed#[D60014D3C82FA656]) [    ] o.a.s.c.SolrCore solr.RecoveryStrategy.Builder
   [junit4]   2> 786420 INFO  (TEST-TestLazyCores.testCreateTransientFromAdmin-seed#[D60014D3C82FA656]) [    ] o.a.s.c.SolrCore [[core1] ] Opening new SolrCore at [C:\Users\jenkins\workspace\Lucene-Solr-6.6-Windows\solr\build\solr-core\test\J0\temp\solr.core.TestLazyCores_D60014D3C82FA656-001\tempDir-002\core1], dataDir=[C:\Users\jenkins\workspace\Lucene-Solr-6.6-Windows\solr\build\solr-core\test\J0\temp\solr.core.TestLazyCores_D60014D3C82FA656-001\tempDir-002\.\core1\data\]
   [junit4]   2> 786430 INFO  (TEST-TestLazyCores.testCreateTransientFromAdmin-seed#[D60014D3C82FA656]) [    ] o.a.s.u.RandomMergePolicy RandomMergePolicy wrapping class org.apache.lucene.index.TieredMergePolicy: [TieredMergePolicy: maxMergeAtOnce=29, maxMergeAtOnceExplicit=44, maxMergedSegmentMB=31.6884765625, floorSegmentMB=1.330078125, forceMergeDeletesPctAllowed=18.73410193713167, segmentsPerTier=41.0, maxCFSSegmentSizeMB=8.796093022207999E12, noCFSRatio=1.0
   [junit4]   2> 786480 INFO  (TEST-TestLazyCores.testCreateTransientFromAdmin-seed#[D60014D3C82FA656]) [    ] o.a.s.u.CommitTracker Hard AutoCommit: disabled
   [junit4]   2> 786480 INFO  (TEST-TestLazyCores.testCreateTransientFromAdmin-seed#[D60014D3C82FA656]) [    ] o.a.s.u.CommitTracker Soft AutoCommit: disabled
   [junit4]   2> 786481 INFO  (TEST-TestLazyCores.testCreateTransientFromAdmin-seed#[D60014D3C82FA656]) [    ] o.a.s.u.RandomMergePolicy RandomMergePolicy wrapping class org.apache.lucene.index.LogDocMergePolicy: [LogDocMergePolicy: minMergeSize=1000, mergeFactor=25, maxMergeSize=9223372036854775807, maxMergeSizeForForcedMerge=9223372036854775807, calibrateSizeByDeletes=true, maxMergeDocs=2147483647, maxCFSSegmentSizeMB=8.796093022207999E12, noCFSRatio=0.78967506053062]
   [junit4]   2> 786481 INFO  (TEST-TestLazyCores.testCreateTransientFromAdmin-seed#[D60014D3C82FA656]) [    ] o.a.s.s.SolrIndexSearcher Opening [Searcher@183493c3[core1] main]
   [junit4]   2> 786482 INFO  (TEST-TestLazyCores.testCreateTransientFromAdmin-seed#[D60014D3C82FA656]) [    ] o.a.s.r.ManagedResourceStorage File-based storage initialized to use dir: C:\Users\jenkins\workspace\Lucene-Solr-6.6-Windows\solr\build\solr-core\test\J0\temp\solr.core.TestLazyCores_D60014D3C82FA656-001\tempDir-002\core1\conf
   [junit4]   2> 786482 INFO  (TEST-TestLazyCores.testCreateTransientFromAdmin-seed#[D60014D3C82FA656]) [    ] o.a.s.h.ReplicationHandler Commits will be reserved for  10000
   [junit4]   2> 786482 INFO  (searcherExecutor-4582-thread-1) [    ] o.a.s.c.SolrCore [core1] Registered new searcher Searcher@183493c3[core1] main{ExitableDirectoryReader(UninvertingDirectoryReader())}
   [junit4]   2> 786483 INFO  (TEST-TestLazyCores.testCreateTransientFromAdmin-seed#[D60014D3C82FA656]) [    ] o.a.s.h.a.CoreAdminOperation core create command loadOnStartup=false&transient=true&name=core2&action=CREATE&wt=xml
   [junit4]   2> 786500 WARN  (TEST-TestLazyCores.testCreateTransientFromAdmin-seed#[D60014D3C82FA656]) [    ] o.a.s.c.Config Beginning with Solr 5.5, <mergePolicy> is deprecated, use <mergePolicyFactory> instead.
   [junit4]   2> 786502 INFO  (TEST-TestLazyCores.testCreateTransientFromAdmin-seed#[D60014D3C82FA656]) [    ] o.a.s.c.SolrConfig Using Lucene MatchVersion: 6.6.1
   [junit4]   2> 786506 INFO  (TEST-TestLazyCores.testCreateTransientFromAdmin-seed#[D60014D3C82FA656]) [    ] o.a.s.s.IndexSchema [core2] Schema name=tiny
   [junit4]   2> 786507 INFO  (TEST-TestLazyCores.testCreateTransientFromAdmin-seed#[D60014D3C82FA656]) [    ] o.a.s.s.IndexSchema Loaded schema tiny/1.1 with uniqueid field id
   [junit4]   2> 786507 INFO  (TEST-TestLazyCores.testCreateTransientFromAdmin-seed#[D60014D3C82FA656]) [    ] o.a.s.c.CoreContainer Creating SolrCore 'core2' using configuration from instancedir C:\Users\jenkins\workspace\Lucene-Solr-6.6-Windows\solr\build\solr-core\test\J0\temp\solr.core.TestLazyCores_D60014D3C82FA656-001\tempDir-002\.\core2, trusted=true
   [junit4]   2> 786508 INFO  (TEST-TestLazyCores.testCreateTransientFromAdmin-seed#[D60014D3C82FA656]) [    ] o.a.s.c.SolrCore solr.RecoveryStrategy.Builder
   [junit4]   2> 786508 INFO  (TEST-TestLazyCores.testCreateTransientFromAdmin-seed#[D60014D3C82FA656]) [    ] o.a.s.c.SolrCore [[core2] ] Opening new SolrCore at [C:\Users\jenkins\workspace\Lucene-Solr-6.6-Windows\solr\build\solr-core\test\J0\temp\solr.core.TestLazyCores_D60014D3C82FA656-001\tempDir-002\core2], dataDir=[C:\Users\jenkins\workspace\Lucene-Solr-6.6-Windows\solr\build\solr-core\test\J0\temp\solr.core.TestLazyCores_D60014D3C82FA656-001\tempDir-002\.\core2\data\]
   [junit4]   2> 786513 INFO  (TEST-TestLazyCores.testCreateTransientFromAdmin-seed#[D60014D3C82FA656]) [    ] o.a.s.u.RandomMergePolicy RandomMergePolicy wrapping class org.apache.lucene.index.LogDocMergePolicy: [LogDocMergePolicy: minMergeSize=1000, mergeFactor=39, maxMergeSize=9223372036854775807, maxMergeSizeForForcedMerge=9223372036854775807, calibrateSizeByDeletes=false, maxMergeDocs=2147483647, maxCFSSegmentSizeMB=8.796093022207999E12, noCFSRatio=0.6134937692836382]
   [junit4]   2> 786558 INFO  (TEST-TestLazyCores.testCreateTransientFromAdmin-seed#[D60014D3C82FA656]) [    ] o.a.s.u.CommitTracker Hard AutoCommit: disabled
   [junit4]   2> 786558 INFO  (TEST-TestLazyCores.testCreateTransientFromAdmin-seed#[D60014D3C82FA656]) [    ] o.a.s.u.CommitTracker Soft AutoCommit: disabled
   [junit4]   2> 786558 INFO  (TEST-TestLazyCores.testCreateTransientFromAdmin-seed#[D60014D3C82FA656]) [    ] o.a.s.u.RandomMergePolicy RandomMergePolicy wrapping class org.apache.lucene.index.TieredMergePolicy: [TieredMergePolicy: maxMergeAtOnce=21, maxMergeAtOnceExplicit=16, maxMergedSegmentMB=45.521484375, floorSegmentMB=1.0087890625, forceMergeDeletesPctAllowed=25.699020892513825, segmentsPerTier=20.0, maxCFSSegmentSizeMB=8.796093022207999E12, noCFSRatio=1.0
   [junit4]   2> 786559 INFO  (TEST-TestLazyCores.testCreateTransientFromAdmin-seed#[D60014D3C82FA656]) [    ] o.a.s.s.SolrIndexSearcher Opening [Searcher@24898f03[core2] main]
   [junit4]   2> 786559 INFO  (TEST-TestLazyCores.testCreateTransientFromAdmin-seed#[D60014D3C82FA656]) [    ] o.a.s.r.ManagedResourceStorage File-based storage initialized to use dir: C:\Users\jenkins\workspace\Lucene-Solr-6.6-Windows\solr\build\solr-core\test\J0\temp\solr.core.TestLazyCores_D60014D3C82FA656-001\tempDir-002\core2\conf
   [junit4]   2> 786559 INFO  (TEST-TestLazyCores.testCreateTransientFromAdmin-seed#[D60014D3C82FA656]) [    ] o.a.s.h.ReplicationHandler Commits will be reserved for  10000
   [junit4]   2> 786559 INFO  (searcherExecutor-4587-thread-1) [    ] o.a.s.c.SolrCore [core2] Registered new searcher Searcher@24898f03[core2] main{ExitableDirectoryReader(UninvertingDirectoryReader())}
   [junit4]   2> 786560 INFO  (TEST-TestLazyCores.testCreateTransientFromAdmin-seed#[D60014D3C82FA656]) [    ] o.a.s.h.a.CoreAdminOperation core create command loadOnStartup=true&transient=true&name=core3&action=CREATE&wt=xml
   [junit4]   2> 786566 WARN  (TEST-TestLazyCores.testCreateTransientFromAdmin-seed#[D60014D3C82FA656]) [    ] o.a.s.c.Config Beginning with Solr 5.5, <mergePolicy> is deprecated, use <mergePolicyFactory> instead.
   [junit4]   2> 786567 INFO  (TEST-TestLazyCores.testCreateTransientFromAdmin-seed#[D60014D3C82FA656]) [    ] o.a.s.c.SolrConfig Using Lucene MatchVersion: 6.6.1
   [junit4]   2> 786571 INFO  (TEST-TestLazyCores.testCreateTransientFromAdmin-seed#[D60014D3C82FA656]) [    ] o.a.s.s.IndexSchema [core3] Schema name=tiny
   [junit4]   2> 786572 INFO  (TEST-TestLazyCores.testCreateTransientFromAdmin-seed#[D60014D3C82FA656]) [    ] o.a.s.s.IndexSchema Loaded schema tiny/1.1 with uniqueid field id
   [junit4]   2> 786572 INFO  (TEST-TestLazyCores.testCreateTransientFromAdmin-seed#[D60014D3C82FA656]) [    ] o.a.s.c.CoreContainer Creating SolrCore 'core3' using configuration from instancedir C:\Users\jenkins\workspace\Lucene-Solr-6.6-Windows\solr\build\solr-core\test\J0\temp\solr.core.TestLazyCores_D60014D3C82FA656-001\tempDir-002\.\core3, trusted=true
   [junit4]   2> 786573 INFO  (TEST-TestLazyCores.testCreateTransientFromAdmin-seed#[D60014D3C82FA656]) [    ] o.a.s.c.SolrCore solr.RecoveryStrategy.Builder
   [junit4]   2> 786573 INFO  (TEST-TestLazyCores.testCreateTransientFromAdmin-seed#[D60014D3C82FA656]) [    ] o.a.s.c.SolrCore [[core3] ] Opening new SolrCore at [C:\Users\jenkins\workspace\Lucene-Solr-6.6-Windows\solr\build\solr-core\test\J0\temp\solr.core.TestLazyCores_D60014D3C82FA656-001\tempDir-002\core3], dataDir=[C:\Users\jenkins\workspace\Lucene-Solr-6.6-Windows\solr\build\solr-core\test\J0\temp\solr.core.TestLazyCores_D60014D3C82FA656-001\tempDir-002\.\core3\data\]
   [junit4]   2> 786577 INFO  (TEST-TestLazyCores.testCreateTransientFromAdmin-seed#[D60014D3C82FA656]) [    ] o.a.s.u.RandomMergePolicy RandomMergePolicy wrapping class org.apache.lucene.index.LogByteSizeMergePolicy: [LogByteSizeMergePolicy: minMergeSize=1677721, mergeFactor=30, maxMergeSize=2147483648, maxMergeSizeForForcedMerge=9223372036854775807, calibrateSizeByDeletes=true, maxMergeDocs=2147483647, maxCFSSegmentSizeMB=8.796093022207999E12, noCFSRatio=0.8844312493210958]
   [junit4]   2> 786635 INFO  (TEST-TestLazyCores.testCreateTransientFromAdmin-seed#[D60014D3C82FA656]) [    ] o.a.s.u.CommitTracker Hard AutoCommit: disabled
   [junit4]   2> 786636 INFO  (TEST-TestLazyCores.testCreateTransientFromAdmin-seed#[D60014D3C82FA656]) [    ] o.a.s.u.CommitTracker Soft AutoCommit: disabled
   [junit4]   2> 786636 INFO  (TEST-TestLazyCores.testCreateTransientFromAdmin-seed#[D60014D3C82FA656]) [    ] o.a.s.u.RandomMergePolicy RandomMergePolicy wrapping class org.apache.lucene.index.AlcoholicMergePolicy: [AlcoholicMergePolicy: minMergeSize=0, mergeFactor=10, maxMergeSize=2139579442, maxMergeSizeForForcedMerge=9223372036854775807, calibrateSizeByDeletes=true, maxMergeDocs=2147483647, maxCFSSegmentSizeMB=8.796093022207999E12, noCFSRatio=0.1]
   [junit4]   2> 786636 INFO  (TEST-TestLazyCores.testCreateTransientFromAdmin-seed#[D60014D3C82FA656]) [    ] o.a.s.s.SolrIndexSearcher Opening [Searcher@1ada5132[core3] main]
   [junit4]   2> 786638 INFO  (TEST-TestLazyCores.testCreateTransientFromAdmin-seed#[D60014D3C82FA656]) [    ] o.a.s.r.ManagedResourceStorage File-based storage initialized to use dir: C:\Users\jenkins\workspace\Lucene-Solr-6.6-Windows\solr\build\solr-core\test\J0\temp\solr.core.TestLazyCores_D60014D3C82FA656-001\tempDir-002\core3\conf
   [junit4]   2> 786638 INFO  (TEST-TestLazyCores.testCreateTransientFromAdmin-seed#[D60014D3C82FA656]) [    ] o.a.s.h.ReplicationHandler Commits will be reserved for  10000
   [junit4]   2> 786638 INFO  (searcherExecutor-4592-thread-1) [    ] o.a.s.c.SolrCore [core3] Registered new searcher Searcher@1ada5132[core3] main{ExitableDirectoryReader(UninvertingDirectoryReader())}
   [junit4]   2> 786638 INFO  (TEST-TestLazyCores.testCreateTransientFromAdmin-seed#[D60014D3C82FA656]) [    ] o.a.s.h.a.CoreAdminOperation core create command loadOnStartup=false&transient=true&name=core4&action=CREATE&wt=xml
   [junit4]   2> 786643 WARN  (TEST-TestLazyCores.testCreateTransientFromAdmin-seed#[D60014D3C82FA656]) [    ] o.a.s.c.Config Beginning with Solr 5.5, <mergePolicy> is deprecated, use <mergePolicyFactory> instead.
   [junit4]   2> 786644 INFO  (TEST-TestLazyCores.testCreateTransientFromAdmin-seed#[D60014D3C82FA656]) [    ] o.a.s.c.SolrConfig Using Lucene MatchVersion: 6.6.1
   [junit4]   2> 786649 INFO  (TEST-TestLazyCores.testCreateTransientFromAdmin-seed#[D60014D3C82FA656]) [    ] o.a.s.s.IndexSchema [core4] Schema name=tiny
   [junit4]   2> 786650 INFO  (TEST-TestLazyCores.testCreateTransientFromAdmin-seed#[D60014D3C82FA656]) [    ] o.a.s.s.IndexSchema Loaded schema tiny/1.1 with uniqueid field id
   [junit4]   2> 786650 INFO  (TEST-TestLazyCores.testCreateTransientFromAdmin-seed#[D60014D3C82FA656]) [    ] o.a.s.c.CoreContainer Creating SolrCore 'core4' using configuration from instancedir C:\Users\jenkins\workspace\Lucene-Solr-6.6-Windows\solr\build\solr-core\test\J0\temp\solr.core.TestLazyCores_D60014D3C82FA656-001\tempDir-002\.\core4, trusted=true
   [junit4]   2> 786650 INFO  (TEST-TestLazyCores.testCreateTransientFromAdmin-seed#[D60014D3C82FA656]) [    ] o.a.s.c.SolrCore solr.RecoveryStrategy.Builder
   [junit4]   2> 786650 INFO  (TEST-TestLazyCores.testCreateTransientFromAdmin-seed#[D60014D3C82FA656]) [    ] o.a.s.c.SolrCore [[core4] ] Opening new SolrCore at [C:\Users\jenkins\workspace\Lucene-Solr-6.6-Windows\solr\build\solr-core\test\J0\temp\solr.core.TestLazyCores_D60014D3C82FA656-001\tempDir-002\core4], dataDir=[C:\Users\jenkins\workspace\Lucene-Solr-6.6-Windows\solr\build\solr-core\test\J0\temp\solr.core.TestLazyCores_D60014D3C82FA656-001\tempDir-002\.\core4\data\]
   [junit4]   2> 786655 INFO  (TEST-TestLazyCores.testCreateTransientFromAdmin-seed#[D60014D3C82FA656]) [    ] o.a.s.u.RandomMergePolicy RandomMergePolicy wrapping class org.apache.lucene.index.LogByteSizeMergePolicy: [LogByteSizeMergePolicy: minMergeSize=1677721, mergeFactor=34, maxMergeSize=2147483648, maxMergeSizeForForcedMerge=9223372036854775807, calibrateSizeByDeletes=true, maxMergeDocs=2147483647, maxCFSSegmentSizeMB=8.796093022207999E12, noCFSRatio=0.0]
   [junit4]   2> 786701 INFO  (TEST-TestLazyCores.testCreateTransientFromAdmin-seed#[D60014D3C82FA656]) [    ] o.a.s.u.CommitTracker Hard AutoCommit: disabled
   [junit4]   2> 786702 INFO  (TEST-TestLazyCores.testCreateTransientFromAdmin-seed#[D60014D3C82FA656]) [    ] o.a.s.u.CommitTracker Soft AutoCommit: disabled
   [junit4]   2> 786702 INFO  (TEST-TestLazyCores.testCreateTransientFromAdmin-seed#[D60014D3C82FA656]) [    ] o.a.s.u.RandomMergePolicy RandomMergePolicy wrapping class org.apache.lucene.index.TieredMergePolicy: [TieredMergePolicy: maxMergeAtOnce=19, maxMergeAtOnceExplicit=47, maxMergedSegmentMB=1.4990234375, floorSegmentMB=0.306640625, forceMergeDeletesPctAllowed=14.365548556139272, segmentsPerTier=38.0, maxCFSSegmentSizeMB=8.796093022207999E12, noCFSRatio=0.0
   [junit4]   2> 786703 INFO  (TEST-TestLazyCores.testCreateTransientFromAdmin-seed#[D60014D3C82FA656]) [    ] o.a.s.s.SolrIndexSearcher Opening [Searcher@9a1cab7[core4] main]
   [junit4]   2> 786703 INFO  (TEST-TestLazyCores.testCreateTransientFromAdmin-seed#[D60014D3C82FA656]) [    ] o.a.s.r.ManagedResourceStorage File-based storage initialized to use dir: C:\Users\jenkins\workspace\Lucene-Solr-6.6-Windows\solr\build\solr-core\test\J0\temp\solr.core.TestLazyCores_D60014D3C82FA656-001\tempDir-002\core4\conf
   [junit4]   2> 786703 INFO  (TEST-TestLazyCores.testCreateTransientFromAdmin-seed#[D60014D3C82FA656]) [    ] o.a.s.h.ReplicationHandler Commits will be reserved for  10000
   [junit4]   2> 786703 INFO  (searcherExecutor-4597-thread-1) [    ] o.a.s.c.SolrCore [core4] Registered new searcher Searcher@9a1cab7[core4] main{ExitableDirectoryReader(UninvertingDirectoryReader())}
   [junit4]   2> 786703 INFO  (TEST-TestLazyCores.testCreateTransientFromAdmin-seed#[D60014D3C82FA656]) [    ] o.a.s.c.TransientSolrCoreCacheDefault Closing transient core [collection2]
   [junit4]   2> 786704 INFO  (Thread-2415) [    ] o.a.s.c.SolrCore [collection2]  CLOSING SolrCore org.apache.solr.core.SolrCore@1c8fb021
   [junit4]   2> 786704 INFO  (TEST-TestLazyCores.testCreateTransientFromAdmin-seed#[D60014D3C82FA656]) [    ] o.a.s.h.a.CoreAdminOperation core create command loadOnStartup=false&transient=true&name=core5&action=CREATE&wt=xml
   [junit4]   2> 786706 INFO  (Thread-2415) [    ] o.a.s.m.SolrMetricManager Closing metric reporters for: solr.core.collection2
   [junit4]   2> 786711 WARN  (TEST-TestLazyCores.testCreateTransientFromAdmin-seed#[D60014D3C82FA656]) [    ] o.a.s.c.Config Beginning with Solr 5.5, <mergePolicy> is deprecated, use <mergePolicyFactory> instead.
   [junit4]   2> 786711 INFO  (TEST-TestLazyCores.testCreateTransientFromAdmin-seed#[D60014D3C82FA656]) [    ] o.a.s.c.SolrConfig Using Lucene MatchVersion: 6.6.1
   [junit4]   2> 786717 INFO  (TEST-TestLazyCores.testCreateTransientFromAdmin-seed#[D60014D3C82FA656]) [    ] o.a.s.s.IndexSchema [core5] Schema name=tiny
   [junit4]   2> 786718 INFO  (TEST-TestLazyCores.testCreateTransientFromAdmin-seed#[D60014D3C82FA656]) [    ] o.a.s.s.IndexSchema Loaded schema tiny/1.1 with uniqueid field id
   [junit4]   2> 786718 INFO  (TEST-TestLazyCores.testCreateTransientFromAdmin-seed#[D60014D3C82FA656]) [    ] o.a.s.c.CoreContainer Creating SolrCore 'core5' using configuration from instancedir C:\Users\jenkins\workspace\Lucene-Solr-6.6-Windows\solr\build\solr-core\test\J0\temp\solr.core.TestLazyCores_D60014D3C82FA656-001\tempDir-002\.\core5, trusted=true
   [junit4]   2> 786719 INFO  (TEST-TestLazyCores.testCreateTransientFromAdmin-seed#[D60014D3C82FA656]) [    ] o.a.s.c.SolrCore solr.RecoveryStrategy.Builder
   [junit4]   2> 786719 INFO  (TEST-TestLazyCores.testCreateTransientFromAdmin-seed#[D60014D3C82FA656]) [    ] o.a.s.c.SolrCore [[core5] ] Opening new SolrCore at [C:\Users\jenkins\workspace\Lucene-Solr-6.6-Windows\solr\build\solr-core\test\J0\temp\solr.core.TestLazyCores_D60014D3C82FA656-001\tempDir-002\core5], dataDir=[C:\Users\jenkins\workspace\Lucene-Solr-6.6-Windows\solr\build\solr-core\test\J0\temp\solr.core.TestLazyCores_D60014D3C82FA656-001\tempDir-002\.\core5\data\]
   [junit4]   2> 786724 INFO  (TEST-TestLazyCores.testCreateTransientFromAdmin-seed#[D60014D3C82FA656]) [    ] o.a.s.u.RandomMergePolicy RandomMergePolicy wrapping class org.apache.lucene.index.LogByteSizeMergePolicy: [LogByteSizeMergePolicy: minMergeSize=1677721, mergeFactor=10, maxMergeSize=2147483648, maxMergeSizeForForcedMerge=9223372036854775807, calibrateSizeByDeletes=false, maxMergeDocs=2147483647, maxCFSSegmentSizeMB=8.796093022207999E12, noCFSRatio=0.21705823502839883]
   [junit4]   2> 786780 INFO  (TEST-TestLazyCores.testCreateTransientFromAdmin-seed#[D60014D3C82FA656]) [    ] o.a.s.u.CommitTracker Hard AutoCommit: disabled
   [junit4]   2> 786780 INFO  (TEST-TestLazyCores.testCreateTransientFromAdmin-seed#[D60014D3C82FA656]) [    ] o.a.s.u.CommitTracker Soft AutoCommit: disabled
   [junit4]   2> 786780 INFO  (TEST-TestLazyCores.testCreateTransientFromAdmin-seed#[D60014D3C82FA656]) [    ] o.a.s.u.RandomMergePolicy RandomMergePolicy wrapping class org.apache.lucene.index.LogDocMergePolicy: [LogDocMergePolicy: minMergeSize=1000, mergeFactor=21, maxMergeSize=9223372036854775807, maxMergeSizeForForcedMerge=9223372036854775807, calibrateSizeByDeletes=false, maxMergeDocs=2147483647, maxCFSSegmentSizeMB=8.796093022207999E12, noCFSRatio=0.3511170536647087]
   [junit4]   2> 786781 INFO  (TEST-TestLazyCores.testCreateTransientFromAdmin-seed#[D60014D3C82FA656]) [    ] o.a.s.s.SolrIndexSearcher Opening [Searcher@34b6c3e6[core5] main]
   [junit4]   2> 786781 INFO  (TEST-TestLazyCores.testCreateTransientFromAdmin-seed#[D60014D3C82FA656]) [    ] o.a.s.r.ManagedResourceStorage File-based storage initialized to use dir: C:\Users\jenkins\workspace\Lucene-Solr-6.6-Windows\solr\build\solr-core\test\J0\temp\solr.core.TestLazyCores_D60014D3C82FA656-001\tempDir-002\core5\conf
   [junit4]   2> 786782 INFO  (TEST-TestLazyCores.testCreateTransientFromAdmin-seed#[D60014D3C82FA656]) [    ] o.a.s.h.ReplicationHandler Commits will be reserved for  10000
   [junit4]   2> 786782 INFO  (searcherExecutor-4602-thread-1) [    ] o.a.s.c.SolrCore [core5] Registered new searcher Searcher@34b6c3e6[core5] main{ExitableDirectoryReader(UninvertingDirectoryReader())}
   [junit4]   2> 786782 INFO  (TEST-TestLazyCores.testCreateTransientFromAdmin-seed#[D60014D3C82FA656]) [    ] o.a.s.c.TransientSolrCoreCacheDefault Closing transient core [core1]
   [junit4]   2> 786782 INFO  (Thread-2415) [    ] o.a.s.c.SolrCore [core1]  CLOSING SolrCore org.apache.solr.core.SolrCore@5ce2cedd
   [junit4]   2> 786784 INFO  (Thread-2415) [    ] o.a.s.m.SolrMetricManager Closing metric reporters for: solr.core.core1
   [junit4]   2> 786791 WARN  (TEST-TestLazyCores.testCreateTransientFromAdmin-seed#[D60014D3C82FA656]) [    ] o.a.s.c.Config Beginning with Solr 5.5, <mergePolicy> is deprecated, use <mergePolicyFactory> instead.
   [junit4]   2> 786792 INFO  (TEST-TestLazyCores.testCreateTransientFromAdmin-seed#[D60014D3C82FA656]) [    ] o.a.s.c.SolrConfig Using Lucene MatchVersion: 6.6.1
   [junit4]   2> 786796 INFO  (TEST-TestLazyCores.testCreateTransientFromAdmin-seed#[D60014D3C82FA656]) [    ] o.a.s.s.IndexSchema [core1] Schema name=tiny
   [junit4]   2> 786798 INFO  (TEST-TestLazyCores.testCreateTransientFromAdmin-seed#[D60014D3C82FA656]) [    ] o.a.s.s.IndexSchema Loaded schema tiny/1.1 with uniqueid field id
   [junit4]   2> 786798 INFO  (TEST-TestLazyCores.testCreateTransientFromAdmin-seed#[D60014D3C82FA656]) [    ] o.a.s.c.CoreContainer Creating SolrCore 'core1' using configuration from instancedir C:\Users\jenkins\workspace\Lucene-Solr-6.6-Windows\solr\build\solr-core\test\J0\temp\solr.core.TestLazyCores_D60014D3C82FA656-001\tempDir-002\.\core1, trusted=true
   [junit4]   2> 786798 INFO  (TEST-TestLazyCores.testCreateTransientFromAdmin-seed#[D60014D3C82FA656]) [    ] o.a.s.c.SolrCore solr.RecoveryStrategy.Builder
   [junit4]   2> 786798 INFO  (TEST-TestLazyCores.testCreateTransientFromAdmin-seed#[D60014D3C82FA656]) [    ] o.a.s.c.SolrCore [[core1] ] Opening new SolrCore at [C:\Users\jenkins\workspace\Lucene-Solr-6.6-Windows\solr\build\solr-core\test\J0\temp\solr.core.TestLazyCores_D60014D3C82FA656-001\tempDir-002\core1], dataDir=[C:\Users\jenkins\workspace\Lucene-Solr-6.6-Windows\solr\build\solr-core\test\J0\temp\solr.core.TestLazyCores_D60014D3C82FA656-001\tempDir-002\.\core1\data\]
   [junit4]   2> 786849 INFO  (TEST-TestLazyCores.testCreateTransientFromAdmin-seed#[D60014D3C82FA656]) [    ] o.a.s.u.CommitTracker Hard AutoCommit: disabled
   [junit4]   2> 786849 INFO  (TEST-TestLazyCores.testCreateTransientFromAdmin-seed#[D60014D3C82FA656]) [    ] o.a.s.u.CommitTracker Soft AutoCommit: disabled
   [junit4]   2> 786850 INFO  (TEST-TestLazyCores.testCreateTransientFromAdmin-seed#[D60014D3C82FA656]) [    ] o.a.s.u.RandomMergePolicy RandomMergePolicy wrapping class org.apache.lucene.index.TieredMergePolicy: [TieredMergePolicy: maxMergeAtOnce=50, maxMergeAtOnceExplicit=45, maxMergedSegmentMB=35.990234375, floorSegmentMB=1.826171875, forceMergeDeletesPctAllowed=2.962553237341848, segmentsPerTier=25.0, maxCFSSegmentSizeMB=8.796093022207999E12, noCFSRatio=0.10625069457683481
   [junit4]   2> 786850 INFO  (TEST-TestLazyCores.testCreateTransientFromAdmin-seed#[D60014D3C82FA656]) [    ] o.a.s.s.SolrIndexSearcher Opening [Searcher@6fc663e[core1] main]
   [junit4]   2> 786851 INFO  (TEST-TestLazyCores.testCreateTransientFromAdmin-seed#[D60014D3C82FA656]) [    ] o.a.s.r.ManagedResourceStorage File-based storage initialized to use dir: C:\Users\jenkins\workspace\Lucene-Solr-6.6-Windows\solr\build\solr-core\test\J0\temp\solr.core.TestLazyCores_D60014D3C82FA656-001\tempDir-002\core1\conf
   [junit4]   2> 786851 INFO  (TEST-TestLazyCores.testCreateTransientFromAdmin-seed#[D60014D3C82FA656]) [    ] o.a.s.h.ReplicationHandler Commits will be reserved for  10000
   [junit4]   2> 786851 INFO  (searcherExecutor-4606-thread-1) [    ] o.a.s.c.SolrCore [core1] Registered new searcher Searcher@6fc663e[core1] main{ExitableDirectoryReader(UninvertingDirectoryReader())}
   [junit4]   2> 786851 INFO  (TEST-TestLazyCores.testCreateTransientFromAdmin-seed#[D60014D3C82FA656]) [    ] o.a.s.c.TransientSolrCoreCacheDefault Closing transient core [core2]
   [junit4]   2> 786851 INFO  (Thread-2415) [    ] o.a.s.c.SolrCore [core2]  CLOSING SolrCore org.apache.solr.core.SolrCore@564412de
   [junit4]   2> 786853 INFO  (Thread-2415) [    ] o.a.s.m.SolrMetricManager Closing metric reporters for: solr.core.core2
   [junit4]   2> 786859 WARN  (TEST-TestLazyCores.testCreateTransientFromAdmin-seed#[D60014D3C82FA656]) [    ] o.a.s.c.Config Beginning with Solr 5.5, <mergePolicy> is deprecated, use <mergePolicyFactory> instead.
   [junit4]   2> 786859 INFO  (TEST-TestLazyCores.testCreateTransientFromAdmin-seed#[D60014D3C82FA656]) [    ] o.a.s.c.SolrConfig Using Lucene MatchVersion: 6.6.1
   [junit4]   2> 786876 INFO  (TEST-TestLazyCores.testCreateTransientFromAdmin-seed#[D60014D3C82FA656]) [    ] o.a.s.s.IndexSchema [core2] Schema name=tiny
   [junit4]   2> 786879 INFO  (TEST-TestLazyCores.testCreateTransientFromAdmin-seed#[D60014D3C82FA656]) [    ] o.a.s.s.IndexSchema Loaded schema tiny/1.1 with uniqueid field id
   [junit4]   2> 786879 INFO  (TEST-TestLazyCores.testCreateTransientFromAdmin-seed#[D60014D3C82FA656]) [    ] o.a.s.c.CoreContainer Creating SolrCore 'core2' using configuration from instancedir C:\Users\jenkins\workspace\Lucene-Solr-6.6-Windows\solr\build\solr-core\test\J0\temp\solr.core.TestLazyCores_D60014D3C82FA656-001\tempDir-002\.\core2, trusted=true
   [junit4]   2> 786880 INFO  (TEST-TestLazyCores.testCreateTransientFromAdmin-seed#[D60014D3C82FA656]) [    ] o.a.s.c.SolrCore solr.RecoveryStrategy.Builder
   [junit4]   2> 786880 INFO  (TEST-TestLazyCores.testCreateTransientFromAdmin-seed#[D60014D3C82FA656]) [    ] o.a.s.c.SolrCore [[core2] ] Opening new SolrCore at [C:\Users\jenkins\workspace\Lucene-Solr-6.6-Windows\solr\build\solr-core\test\J0\temp\solr.core.TestLazyCores_D60014D3C82FA656-001\tempDir-002\core2], dataDir=[C:\Users\jenkins\workspace\Lucene-Solr-6.6-Windows\solr\build\solr-core\test\J0\temp\solr.core.TestLazyCores_D60014D3C82FA656-001\tempDir-002\.\core2\data\]
   [junit4]   2> 786941 INFO  (TEST-TestLazyCores.testCreateTransientFromAdmin-seed#[D60014D3C82FA656]) [    ] o.a.s.u.CommitTracker Hard AutoCommit: disabled
   [junit4]   2> 786941 INFO  (TEST-TestLazyCores.testCreateTransientFromAdmin-seed#[D60014D3C82FA656]) [    ] o.a.s.u.CommitTracker Soft AutoCommit: disabled
   [junit4]   2> 786943 INFO  (TEST-TestLazyCores.testCreateTransientFromAdmin-seed#[D60014D3C82FA656]) [    ] o.a.s.u.RandomMergePolicy RandomMergePolicy wrapping class org.apache.lucene.index.TieredMergePolicy: [TieredMergePolicy: maxMergeAtOnce=38, maxMergeAtOnceExplicit=26, maxMergedSegmentMB=83.43359375, floorSegmentMB=1.798828125, forceMergeDeletesPctAllowed=1.227749258743177, segmentsPerTier=28.0, maxCFSSegmentSizeMB=8.796093022207999E12, noCFSRatio=0.8058242403493074
   [junit4]   2> 786943 INFO  (TEST-TestLazyCores.testCreateTransientFromAdmin-seed#[D60014D3C82FA656]) [    ] o.a.s.s.SolrIndexSearcher Opening [Searcher@232da594[core2] main]
   [junit4]   2> 786944 INFO  (TEST-TestLazyCores.testCreateTransientFromAdmin-seed#[D60014D3C82FA656]) [    ] o.a.s.r.ManagedResourceStorage File-based storage initialized to use dir: C:\Users\jenkins\workspace\Lucene-Solr-6.6-Windows\solr\build\solr-core\test\J0\temp\solr.core.TestLazyCores_D60014D3C82FA656-001\tempDir-002\core2\conf
   [junit4]   2> 786944 INFO  (TEST-TestLazyCores.testCreateTransientFromAdmin-seed#[D60014D3C82FA656]) [    ] o.a.s.h.ReplicationHandler Commits will be reserved for  10000
   [junit4]   2> 786945 INFO  (searcherExecutor-4610-thread-1) [    ] o.a.s.c.SolrCore [core2] Registered new searcher Searcher@232da594[core2] main{ExitableDirectoryReader(UninvertingDirectoryReader())}
   [junit4]   2> 786945 INFO  (TEST-TestLazyCores.testCreateTransientFromAdmin-seed#[D60014D3C82FA656]) [    ] o.a.s.c.TransientSolrCoreCacheDefault Closing transient core [core3]
   [junit4]   2> 786945 INFO  (Thread-2415) [    ] o.a.s.c.SolrCore [core3]  CLOSING SolrCore org.apache.solr.core.SolrCore@39bd21dd
   [junit4]   2> 786946 INFO  (Thread-2415) [    ] o.a.s.m.SolrMetricManager Closing metric reporters for: solr.core.core3
   [junit4]   2> 786953 WARN  (TEST-TestLazyCores.testCreateTransientFromAdmin-seed#[D60014D3C82FA656]) [    ] o.a.s.c.Config Beginning with Solr 5.5, <mergePolicy> is deprecated, use <mergePolicyFactory> instead.
   [junit4]   2> 786953 INFO  (TEST-TestLazyCores.testCreateTransientFromAdmin-seed#[D60014D3C82FA656]) [    ] o.a.s.c.SolrConfig Using Lucene MatchVersion: 6.6.1
   [junit4]   2> 786958 INFO  (TEST-TestLazyCores.testCreateTransientFromAdmin-seed#[D60014D3C82FA656]) [    ] o.a.s.s.IndexSchema [core3] Schema name=tiny
   [junit4]   2> 786960 INFO  (TEST-TestLazyCores.testCreateTransientFromAdmin-seed#[D60014D3C82FA656]) [    ] o.a.s.s.IndexSchema Loaded schema tiny/1.1 with uniqueid field id
   [junit4]   2> 786960 INFO  (TEST-TestLazyCores.testCreateTransientFromAdmin-seed#[D60014D3C82FA656]) [    ] o.a.s.c.CoreContainer Creating SolrCore 'core3' using configuration from instancedir C:\Users\jenkins\workspace\Lucene-Solr-6.6-Windows\solr\build\solr-core\test\J0\temp\solr.core.TestLazyCores_D60014D3C82FA656-001\tempDir-002\.\core3, trusted=true
   [junit4]   2> 786960 INFO  (TEST-TestLazyCores.testCreateTransientFromAdmin-seed#[D60014D3C82FA656]) [    ] o.a.s.c.SolrCore solr.RecoveryStrategy.Builder
   [junit4]   2> 786961 INFO  (TEST-TestLazyCores.testCreateTransientFromAdmin-seed#[D60014D3C82FA656]) [    ] o.a.s.c.SolrCore [[core3] ] Opening new SolrCore at [C:\Users\jenkins\workspace\Lucene-Solr-6.6-Windows\solr\build\solr-core\test\J0\temp\solr.core.TestLazyCores_D60014D3C82FA656-001\tempDir-002\core3], dataDir=[C:\Users\jenkins\workspace\Lucene-Solr-6.6-Windows\solr\build\solr-core\test\J0\temp\solr.core.TestLazyCores_D60014D3C82FA656-001\tempDir-002\.\core3\data\]
   [junit4]   2> 787008 INFO  (TEST-TestLazyCores.testCreateTransientFromAdmin-seed#[D60014D3C82FA656]) [    ] o.a.s.u.CommitTracker Hard AutoCommit: disabled
   [junit4]   2> 787008 INFO  (TEST-TestLazyCores.testCreateTransientFromAdmin-seed#[D60014D3C82FA656]) [    ] o.a.s.u.CommitTracker Soft AutoCommit: disabled
   [junit4]   2> 787008 INFO  (TEST-TestLazyCores.testCreateTransientFromAdmin-seed#[D60014D3C82FA656]) [    ] o.a.s.u.RandomMergePolicy RandomMergePolicy wrapping class org.apache.lucene.index.TieredMergePolicy: [TieredMergePolicy: maxMergeAtOnce=15, maxMergeAtOnceExplicit=14, maxMergedSegmentMB=98.2666015625, floorSegmentMB=0.3154296875, forceMergeDeletesPctAllowed=8.64159892987869, segmentsPerTier=13.0, maxCFSSegmentSizeMB=8.796093022207999E12, noCFSRatio=0.0
   [junit4]   2> 787013 INFO  (TEST-TestLazyCores.testCreateTransientFromAdmin-seed#[D60014D3C82FA656]) [    ] o.a.s.s.SolrIndexSearcher Opening [Searcher@272563b2[core3] main]
   [junit4]   2> 787013 INFO  (TEST-TestLazyCores.testCreateTransientFromAdmin-seed#[D60014D3C82FA656]) [    ] o.a.s.r.ManagedResourceStorage File-based storage initialized to use dir: C:\Users\jenkins\workspace\Lucene-Solr-6.6-Windows\solr\build\solr-core\test\J0\temp\solr.core.TestLazyCores_D60014D3C82FA656-001\tempDir-002\core3\conf
   [junit4]   2> 787013 INFO  (TEST-TestLazyCores.testCreateTransientFromAdmin-seed#[D60014D3C82FA656]) [    ] o.a.s.h.ReplicationHandler Commits will be reserved for  10000
   [junit4]   2> 787014 INFO  (searcherExecutor-4614-thread-1) [    ] o.a.s.c.SolrCore [core3] Registered new searcher Searcher@272563b2[core3] main{ExitableDirectoryReader(UninvertingDirectoryReader())}
   [junit4]   2> 787014 INFO  (TEST-TestLazyCores.testCreateTransientFromAdmin-seed#[D60014D3C82FA656]) [    ] o.a.s.c.TransientSolrCoreCacheDefault Closing transient core [core4]
   [junit4]   2> 787014 INFO  (Thread-2415) [    ] o.a.s.c.SolrCore [core4]  CLOSING SolrCore org.apache.solr.core.SolrCore@160e4bdb
   [junit4]   2> 787015 INFO  (Thread-2415) [    ] o.a.s.m.SolrMetricManager Closing metric reporters for: solr.core.core4
   [junit4]   2> 787021 WARN  (TEST-TestLazyCores.testCreateTransientFromAdmin-seed#[D60014D3C82FA656]) [    ] o.a.s.c.Config Beginning with Solr 5.5, <mergePolicy> is deprecated, use <mergePolicyFactory> instead.
   [junit4]   2> 787021 INFO  (TEST-TestLazyCores.testCreateTransientFromAdmin-seed#[D60014D3C82FA656]) [    ] o.a.s.c.SolrConfig Using Lucene MatchVersion: 6.6.1
   [junit4]   2> 787034 INFO  (TEST-TestLazyCores.testCreateTransientFromAdmin-seed#[D60014D3C82FA656]) [    ] o.a.s.s.IndexSchema [core4] Schema name=tiny
   [junit4]   2> 787035 INFO  (TEST-TestLazyCores.testCreateTransientFromAdmin-seed#[D60014D3C82FA656]) [    ] o.a.s.s.IndexSchema Loaded schema tiny/1.1 with uniqueid field id
   [junit4]   2> 787035 INFO  (TEST-TestLazyCores.testCreateTransientFromAdmin-seed#[D60014D3C82FA656]) [    ] o.a.s.c.CoreContainer Creating SolrCore 'core4' using configuration from instancedir C:\Users\jenkins\workspace\Lucene-Solr-6.6-Windows\solr\build\solr-core\test\J0\temp\solr.core.TestLazyCores_D60014D3C82FA656-001\tempDir-002\.\core4, trusted=true
   [junit4]   2> 787036 INFO  (TEST-TestLazyCores.testCreateTransientFromAdmin-seed#[D60014D3C82FA656]) [    ] o.a.s.c.SolrCore solr.RecoveryStrategy.Builder
   [junit4]   2> 787036 INFO  (TEST-TestLazyCores.testCreateTransientFromAdmin-seed#[D60014D3C82FA656]) [    ] o.a.s.c.SolrCore [[core4] ] Opening new SolrCore at [C:\Users\jenkins\workspace\Lucene-Solr-6.6-Windows\solr\build\solr-core\test\J0\temp\solr.core.TestLazyCores_D60014D3C82FA656-001\tempDir-002\core4], dataDir=[C:\Users\jenkins\workspace\Lucene-Solr-6.6-Windows\solr\build\solr-core\test\J0\temp\solr.core.TestLazyCores_D60014D3C82FA656-001\tempDir-002\.\core4\data\]
   [junit4]   2> 787082 INFO  (TEST-TestLazyCores.testCreateTransientFromAdmin-seed#[D60014D3C82FA656]) [    ] o.a.s.u.CommitTracker Hard AutoCommit: disabled
   [junit4]   2> 787082 INFO  (TEST-TestLazyCores.testCreateTransientFromAdmin-seed#[D60014D3C82FA656]) [    ] o.a.s.u.CommitTracker Soft AutoCommit: disabled
   [junit4]   2> 787083 INFO  (TEST-TestLazyCores.testCreateTransientFromAdmin-seed#[D60014D3C82FA656]) [    ] o.a.s.u.RandomMergePolicy RandomMergePolicy wrapping class org.apache.lucene.index.LogDocMergePolicy: [LogDocMergePolicy: minMergeSize=1000, mergeFactor=48, maxMergeSize=9223372036854775807, maxMergeSizeForForcedMerge=9223372036854775807, calibrateSizeByDeletes=false, maxMergeDocs=2147483647, maxCFSSegmentSizeMB=8.796093022207999E12, noCFSRatio=0.0]
   [junit4]   2> 787083 INFO  (TEST-TestLazyCores.testCreateTransientFromAdmin-seed#[D60014D3C82FA656]) [    ] o.a.s.s.SolrIndexSearcher Opening [Searcher@3d7c5e23[core4] main]
   [junit4]   2> 787083 INFO  (TEST-TestLazyCores.testCreateTransientFromAdmin-seed#[D60014D3C82FA656]) [    ] o.a.s.r.ManagedResourceStorage File-based storage initialized to use dir: C:\Users\jenkins\workspace\Lucene-Solr-6.6-Windows\solr\build\solr-core\test\J0\temp\solr.core.TestLazyCores_D60014D3C82FA656-001\tempDir-002\core4\conf
   [junit4]   2> 787084 INFO  (TEST-TestLazyCores.testCreateTransientFromAdmin-seed#[D60014D3C82FA656]) [    ] o.a.s.h.ReplicationHandler Commits will be reserved for  10000
   [junit4]   2> 787084 INFO  (searcherExecutor-4618-thread-1) [    ] o.a.s.c.SolrCore [core4] Registered new searcher Searcher@3d7c5e23[core4] main{ExitableDirectoryReader(UninvertingDirectoryReader())}
   [junit4]   2> 787084 INFO  (TEST-TestLazyCores.testCreateTransientFromAdmin-seed#[D60014D3C82FA656]) [    ] o.a.s.c.TransientSolrCoreCacheDefault Closing transient core [core5]
   [junit4]   2> 787084 INFO  (Thread-2415) [    ] o.a.s.c.SolrCore [core5]  CLOSING SolrCore org.apache.solr.core.SolrCore@a30a352
   [junit4]   2> 787086 INFO  (Thread-2415) [    ] o.a.s.m.SolrMetricManager Closing metric reporters for: solr.core.core5
   [junit4]   2> 787093 WARN  (TEST-TestLazyCores.testCreateTransientFromAdmin-seed#[D60014D3C82FA656]) [    ] o.a.s.c.Config Beginning with Solr 5.5, <mergePolicy> is deprecated, use <mergePolicyFactory> instead.
   [junit4]   2> 787094 INFO  (TEST-TestLazyCores.testCreateTransientFromAdmin-seed#[D60014D3C82FA656]) [    ] o.a.s.c.SolrConfig Using Lucene MatchVersion: 6.6.1
   [junit4]   2> 787098 INFO  (TEST-TestLazyCores.testCreateTransientFromAdmin-seed#[D60014D3C82FA656]) [    ] o.a.s.s.IndexSchema [core5] Schema name=tiny
   [junit4]   2> 787100 INFO  (TEST-TestLazyCores.testCreateTransientFromAdmin-seed#[D60014D3C82FA656]) [    ] o.a.s.s.IndexSchema Loaded schema tiny/1.1 with uniqueid field id
   [junit4]   2> 787100 INFO  (TEST-TestLazyCores.testCreateTransientFromAdmin-seed#[D60014D3C82FA656]) [    ] o.a.s.c.CoreContainer Creating SolrCore 'core5' using configuration from instancedir C:\Users\jenkins\workspace\Lucene-Solr-6.6-Windows\solr\build\solr-core\test\J0\temp\solr.core.TestLazyCores_D60014D3C82FA656-001\tempDir-002\.\core5, trusted=true
   [junit4]   2> 787101 INFO  (TEST-TestLazyCores.testCreateTransientFromAdmin-seed#[D60014D3C82FA656]) [    ] o.a.s.c.SolrCore solr.RecoveryStrategy.Builder
   [junit4]   2> 787101 INFO  (TEST-TestLazyCores.testCreateTransientFromAdmin-seed#[D60014D3C82FA656]) [    ] o.a.s.c.SolrCore [[core5] ] Opening new SolrCore at [C:\Users\jenkins\workspace\Lucene-Solr-6.6-Windows\solr\build\solr-core\test\J0\temp\solr.core.TestLazyCores_D60014D3C82FA656-001\tempDir-002\core5], dataDir=[C:\Users\jenkins\workspace\Lucene-Solr-6.6-Windows\solr\build\solr-core\test\J0\temp\solr.core.TestLazyCores_D60014D3C82FA656-001\tempDir-002\.\core5\data\]
   [junit4]   2> 787147 INFO  (TEST-TestLazyCores.testCreateTransientFromAdmin-seed#[D60014D3C82FA656]) [    ] o.a.s.u.CommitTracker Hard AutoCommit: disabled
   [junit4]   2> 787147 INFO  (TEST-TestLazyCores.testCreateTransientFromAdmin-seed#[D60014D3C82FA656]) [    ] o.a.s.u.CommitTracker Soft AutoCommit: disabled
   [junit4]   2> 787148 INFO  (TEST-TestLazyCores.testCreateTransientFromAdmin-seed#[D60014D3C82FA656]) [    ] o.a.s.u.RandomMergePolicy RandomMergePolicy wrapping class org.apache.lucene.index.TieredMergePolicy: [TieredMergePolicy: maxMergeAtOnce=38, maxMergeAtOnceExplicit=30, maxMergedSegmentMB=75.9697265625, floorSegmentMB=1.4052734375, forceMergeDeletesPctAllowed=29.21886411231692, segmentsPerTier=11.0, maxCFSSegmentSizeMB=8.796093022207999E12, noCFSRatio=0.4130708628929297
   [junit4]   2> 787150 INFO  (TEST-TestLazyCores.testCreateTransientFromAdmin-seed#[D60014D3C82FA656]) [    ] o.a.s.s.SolrIndexSearcher Opening [Searcher@3b208637[core5] main]
   [junit4]   2> 787150 INFO  (TEST-TestLazyCores.testCreateTransientFromAdmin-seed#[D60014D3C82FA656]) [    ] o.a.s.r.ManagedResourceStorage File-based storage initialized to use dir: C:\Users\jenkins\workspace\Lucene-Solr-6.6-Windows\solr\build\solr-core\test\J0\temp\solr.core.TestLazyCores_D60014D3C82FA656-001\tempDir-002\core5\conf
   [junit4]   2> 787150 INFO  (TEST-TestLazyCores.testCreateTransientFromAdmin-seed#[D60014D3C82FA656]) [    ] o.a.s.h.ReplicationHandler Commits will be reserved for  10000
   [junit4]   2> 787150 INFO  (searcherExecutor-4622-thread-1) [    ] o.a.s.c.SolrCore [core5] Registered new searcher Searcher@3b208637[core5] main{ExitableDirectoryReader(UninvertingDirectoryReader())}
   [junit4]   2> 787150 INFO  (TEST-TestLazyCores.testCreateTransientFromAdmin-seed#[D60014D3C82FA656]) [    ] o.a.s.c.TransientSolrCoreCacheDefault Closing transient core [core1]
   [junit4]   2> 787151 INFO  (TEST-TestLazyCores.testCreateTransientFromAdmin-seed#[D60014D3C82FA656]) [    ] o.a.s.m.SolrMetricManager Closing metric reporters for: solr.core.core2
   [junit4]   2> 787151 INFO  (TEST-TestLazyCores.testCreateTransientFromAdmin-seed#[D60014D3C82FA656]) [    ] o.a.s.c.SolrCore Core core2 is not yet closed, waiting 100 ms before checking again.
   [junit4]   2> 787253 INFO  (TEST-TestLazyCores.testCreateTransientFromAdmin-seed#[D60014D3C82FA656]) [    ] o.a.s.c.SolrCore Core core2 is not yet closed, waiting 100 ms before checking again.
   [junit4]   2> 787354 INFO  (TEST-TestLazyCores.testCreateTransientFromAdmin-seed#[D60014D3C82FA656]) [    ] o.a.s.c.SolrCore Core core2 is not yet closed, waiting 100 ms before checking again.
   [junit4]   2> 787455 INFO  (TEST-TestLazyCores.testCreateTransientFromAdmin-seed#[D60014D3C82FA656]) [    ] o.a.s.c.SolrCore Core core2 is not yet closed, waiting 100 ms before checking again.
   [junit4]   2> 787555 INFO  (TEST-TestLazyCores.testCreateTransientFromAdmin-seed#[D60014D3C82FA656]) [    ] o.a.s.c.SolrCore Core core2 is not yet closed, waiting 100 ms before checking again.
   [junit4]   2> 787655 INFO  (TEST-TestLazyCores.testCreateTransientFromAdmin-seed#[D60014D3C82FA656]) [    ] o.a.s.c.SolrCore Core core2 is not yet closed, waiting 100 ms before checking again.
   [junit4]   2> 787756 INFO  (TEST-TestLazyCores.testCreateTransientFromAdmin-seed#[D60014D3C82FA656]) [    ] o.a.s.c.SolrCore Core core2 is not yet closed, waiting 100 ms before checking again.
   [junit4]   2> 787857 INFO  (TEST-TestLazyCores.testCreateTransientFromAdmin-seed#[D60014D3C82FA656]) [    ] o.a.s.c.SolrCore Core core2 is not yet closed, waiting 100 ms before checking again.
   [junit4]   2> 787958 INFO  (TEST-TestLazyCores.testCreateTransientFromAdmin-seed#[D60014D3C82FA656]) [    ] o.a.s.c.SolrCore Core core2 is not yet closed, waiting 100 ms before checking again.
   [junit4]   2> 788023 INFO  (Thread-2416) [    ] o.a.s.c.SolrCore [core1]  CLOSING SolrCore org.apache.solr.core.SolrCore@4fa5c916
   [junit4]   2> 788025 INFO  (Thread-2416) [    ] o.a.s.m.SolrMetricManager Closing metric reporters for: solr.core.core1
   [junit4]   2> 788026 INFO  (Thread-2416) [    ] o.a.s.c.SolrCore [core2]  CLOSING SolrCore org.apache.solr.core.SolrCore@3d60f545
   [junit4]   2> 788053 INFO  (Thread-2416) [    ] o.a.s.m.SolrMetricManager Closing metric reporters for: solr.core.core2
   [junit4]   2> 788070 INFO  (TEST-TestLazyCores.testCreateTransientFromAdmin-seed#[D60014D3C82FA656]) [    ] o.a.s.m.SolrMetricManager Closing metric reporters for: solr.core.core3
   [junit4]   2> 788070 INFO  (TEST-TestLazyCores.testCreateTransientFromAdmin-seed#[D60014D3C82FA656]) [    ] o.a.s.c.SolrCore [core3]  CLOSING SolrCore org.apache.solr.core.SolrCore@3b74fdbb
   [junit4]   2> 788072 INFO  (TEST-TestLazyCores.testCreateTransientFromAdmin-seed#[D60014D3C82FA656]) [    ] o.a.s.m.SolrMetricManager Closing metric reporters for: solr.core.core3
   [junit4]   2> 788072 INFO  (TEST-TestLazyCores.testCreateTransientFromAdmin-seed#[D60014D3C82FA656]) [    ] o.a.s.m.SolrMetricManager Closing metric reporters for: solr.core.core4
   [junit4]   2> 788072 INFO  (TEST-TestLazyCores.testCreateTransientFromAdmin-seed#[D60014D3C82FA656]) [    ] o.a.s.c.SolrCore [core4]  CLOSING SolrCore org.apache.solr.core.SolrCore@1a6b6aec
   [junit4]   2> 788074 INFO  (TEST-TestLazyCores.testCreateTransientFromAdmin-seed#[D60014D3C82FA656]) [    ] o.a.s.m.SolrMetricManager Closing metric reporters for: solr.core.core4
   [junit4]   2> 788074 INFO  (TEST-TestLazyCores.testCreateTransientFromAdmin-seed#[D60014D3C82FA656]) [    ] o.a.s.m.SolrMetricManager Closing metric reporters for: solr.core.core5
   [junit4]   2> 788074 INFO  (TEST-TestLazyCores.testCreateTransientFromAdmin-seed#[D60014D3C82FA656]) [    ] o.a.s.c.SolrCore [core5]  CLOSING SolrCore org.apache.solr.core.SolrCore@b524a30
   [junit4]   2> 788076 INFO  (TEST-TestLazyCores.testCreateTransientFromAdmin-seed#[D60014D3C82FA656]) [    ] o.a.s.m.SolrMetricManager Closing metric reporters for: solr.core.core5
   [junit4]   2> 788076 INFO  (TEST-TestLazyCores.testCreateTransientFromAdmin-seed#[D60014D3C82FA656]) [    ] o.a.s.c.CoreContainer Shutting down CoreContainer instance=88006150
   [junit4]   2> 788076 INFO  (TEST-TestLazyCores.testCreateTransientFromAdmin-seed#[D60014D3C82FA656]) [    ] o.a.s.m.SolrMetricManager Closing metric reporters for: solr.node
   [junit4]   2> 788076 INFO  (TEST-TestLazyCores.testCreateTransientFromAdmin-seed#[D60014D3C82FA656]) [    ] o.a.s.m.SolrMetricManager Closing metric reporters for: solr.jvm
   [junit4]   2> 788076 INFO  (TEST-TestLazyCores.testCreateTransientFromAdmin-seed#[D60014D3C82FA656]) [    ] o.a.s.m.SolrMetricManager Closing metric reporters for: solr.jetty
   [junit4]   2> 788102 INFO  (coreCloseExecutor-4631-thread-1) [    ] o.a.s.c.SolrCore [collection5]  CLOSING SolrCore org.apache.solr.core.SolrCore@3cf22b5d
   [junit4]   2> 788104 INFO  (coreCloseExecutor-4631-thread-2) [    ] o.a.s.c.SolrCore [collection1]  CLOSING SolrCore org.apache.solr.core.SolrCore@6ac5fb43
   [junit4]   2> 788106 INFO  (coreCloseExecutor-4631-thread-1) [    ] o.a.s.m.SolrMetricManager Closing metric reporters for: solr.core.collection5
   [junit4]   2> 788106 INFO  (coreCloseExecutor-4631-thread-2) [    ] o.a.s.m.SolrMetricManager Closing metric reporters for: solr.core.collection1
   [junit4]   2> 788107 INFO  (TEST-TestLazyCores.testCreateTransientFromAdmin-seed#[D60014D3C82FA656]) [    ] o.a.s.SolrTestCaseJ4 ###Ending testCreateTransientFromAdmin
   [junit4] IGNOR/A 0.00s J0 | TestLazyCores.testNoCommit
   [junit4]    > Assumption #1: 'badapple' test group is disabled (@BadApple(bugUrl="https://issues.apache.org/jira/browse/SOLR-10101"))
   [junit4]   2> 788113 INFO  (TEST-TestLazyCores.testRace-seed#[D60014D3C82FA656]) [    ] o.a.s.SolrTestCaseJ4 ###Starting testRace
   [junit4]   2> 788169 INFO  (TEST-TestLazyCores.testRace-seed#[D60014D3C82FA656]) [    ] o.a.s.c.SolrXmlConfig Loading container configuration from C:\Users\jenkins\workspace\Lucene-Solr-6.6-Windows\solr\build\solr-core\test\J0\temp\solr.core.TestLazyCores_D60014D3C82FA656-001\tempDir-003\solr.xml
   [junit4]   2> 788175 INFO  (TEST-TestLazyCores.testRace-seed#[D60014D3C82FA656]) [    ] o.a.s.u.UpdateShardHandler Creating UpdateShardHandler HTTP client with params: socketTimeout=340000&connTimeout=45000&retry=true
   [junit4]   2> 788220 INFO  (TEST-TestLazyCores.testRace-seed#[D60014D3C82FA656]) [    ] o.a.s.c.TransientSolrCoreCacheDefault Allocating transient cache for 4 transient cores
   [junit4]   2> 788230 WARN  (coreLoadExecutor-4638-thread-3) [    ] o.a.s.c.Config Beginning with Solr 5.5, <mergePolicy> is deprecated, use <mergePolicyFactory> instead.
   [junit4]   2> 788230 INFO  (coreLoadExecutor-4638-thread-3) [    ] o.a.s.c.SolrConfig Using Lucene MatchVersion: 6.6.1
   [junit4]   2> 788230 WARN  (coreLoadExecutor-4638-thread-2) [    ] o.a.s.c.Config Beginning with Solr 5.5, <mergePolicy> is deprecated, use <mergePolicyFactory> instead.
   [junit4]   2> 788231 INFO  (coreLoadExecutor-4638-thread-2) [    ] o.a.s.c.SolrConfig Using Lucene MatchVersion: 6.6.1
   [junit4]   2> 788236 INFO  (coreLoadExecutor-4638-thread-3) [    ] o.a.s.s.IndexSchema [collection5] Schema name=tiny
   [junit4]   2> 788237 INFO  (coreLoadExecutor-4638-thread-2) [    ] o.a.s.s.IndexSchema [collection2] Schema name=tiny


[...truncated too long message...]

rg.apache.zookeeper.server.NIOServerCnxnFactory.run(NIOServerCnxnFactory.java:203)
   [junit4]   2> 	at java.base/java.lang.Thread.run(Thread.java:844)
   [junit4]   2> 946831 INFO  (coreCloseExecutor-5156-thread-1) [    ] o.a.s.m.SolrMetricManager Closing metric reporters for: solr.core.authCollection.shard2.replica1
   [junit4]   2> 946831 INFO  (zkCallback-3054-thread-1) [    ] o.a.s.c.c.ZkStateReader Updated live nodes from ZooKeeper... (3) -> (1)
   [junit4]   2> 946836 WARN  (zkCallback-3054-thread-1) [    ] o.a.s.c.c.ZkStateReader ZooKeeper watch triggered, but Solr cannot talk to ZK: [KeeperErrorCode = Session expired for /live_nodes]
   [junit4]   2> 948087 ERROR (coreZkRegister-5136-thread-1) [    ] o.a.s.c.ZkController Error getting leader from zk
   [junit4]   2> org.apache.solr.common.SolrException: CoreContainer is closed
   [junit4]   2> 	at org.apache.solr.cloud.ZkController.getLeaderProps(ZkController.java:1040)
   [junit4]   2> 	at org.apache.solr.cloud.ZkController.getLeaderProps(ZkController.java:1007)
   [junit4]   2> 	at org.apache.solr.cloud.ZkController.getLeader(ZkController.java:963)
   [junit4]   2> 	at org.apache.solr.cloud.ZkController.register(ZkController.java:902)
   [junit4]   2> 	at org.apache.solr.cloud.ZkController.register(ZkController.java:846)
   [junit4]   2> 	at org.apache.solr.core.ZkContainer.lambda$registerInZk$0(ZkContainer.java:181)
   [junit4]   2> 	at org.apache.solr.common.util.ExecutorUtil$MDCAwareThreadPoolExecutor.lambda$execute$0(ExecutorUtil.java:229)
   [junit4]   2> 	at java.base/java.util.concurrent.ThreadPoolExecutor.runWorker(ThreadPoolExecutor.java:1167)
   [junit4]   2> 	at java.base/java.util.concurrent.ThreadPoolExecutor$Worker.run(ThreadPoolExecutor.java:641)
   [junit4]   2> 	at java.base/java.lang.Thread.run(Thread.java:844)
   [junit4]   2> 948087 ERROR (coreZkRegister-5136-thread-1) [    ] o.a.s.c.ZkContainer :org.apache.solr.common.SolrException: Error getting leader from zk for shard shard2
   [junit4]   2> 	at org.apache.solr.cloud.ZkController.getLeader(ZkController.java:996)
   [junit4]   2> 	at org.apache.solr.cloud.ZkController.register(ZkController.java:902)
   [junit4]   2> 	at org.apache.solr.cloud.ZkController.register(ZkController.java:846)
   [junit4]   2> 	at org.apache.solr.core.ZkContainer.lambda$registerInZk$0(ZkContainer.java:181)
   [junit4]   2> 	at org.apache.solr.common.util.ExecutorUtil$MDCAwareThreadPoolExecutor.lambda$execute$0(ExecutorUtil.java:229)
   [junit4]   2> 	at java.base/java.util.concurrent.ThreadPoolExecutor.runWorker(ThreadPoolExecutor.java:1167)
   [junit4]   2> 	at java.base/java.util.concurrent.ThreadPoolExecutor$Worker.run(ThreadPoolExecutor.java:641)
   [junit4]   2> 	at java.base/java.lang.Thread.run(Thread.java:844)
   [junit4]   2> Caused by: org.apache.solr.common.SolrException: CoreContainer is closed
   [junit4]   2> 	at org.apache.solr.cloud.ZkController.getLeaderProps(ZkController.java:1040)
   [junit4]   2> 	at org.apache.solr.cloud.ZkController.getLeaderProps(ZkController.java:1007)
   [junit4]   2> 	at org.apache.solr.cloud.ZkController.getLeader(ZkController.java:963)
   [junit4]   2> 	... 7 more
   [junit4]   2> 
   [junit4]   2> 948088 INFO  (jetty-closer-3026-thread-3) [    ] o.e.j.s.h.ContextHandler Stopped o.e.j.s.ServletContextHandler@9f2d909{/solr,null,UNAVAILABLE}
   [junit4]   2> 948331 WARN  (zkCallback-3040-thread-2) [    ] o.a.s.c.c.ZkStateReader ZooKeeper watch triggered, but Solr cannot talk to ZK: [KeeperErrorCode = Session expired for /live_nodes]
   [junit4]   2> 948331 INFO  (jetty-closer-3026-thread-2) [    ] o.e.j.s.h.ContextHandler Stopped o.e.j.s.ServletContextHandler@7d5b908d{/solr,null,UNAVAILABLE}
   [junit4]   2> 948332 INFO  (jetty-closer-3026-thread-1) [    ] o.e.j.s.h.ContextHandler Stopped o.e.j.s.ServletContextHandler@ac304ce{/solr,null,UNAVAILABLE}
   [junit4]   2> 948336 ERROR (SUITE-BasicAuthIntegrationTest-seed#[D60014D3C82FA656]-worker) [    ] o.a.z.s.ZooKeeperServer ZKShutdownHandler is not registered, so ZooKeeper server won't take any action on ERROR or SHUTDOWN server state changes
   [junit4]   2> 948336 INFO  (SUITE-BasicAuthIntegrationTest-seed#[D60014D3C82FA656]-worker) [    ] o.a.s.c.ZkTestServer connecting to 127.0.0.1:61117 61117
   [junit4]   2> 948337 INFO  (Thread-2551) [    ] o.a.s.c.ZkTestServer connecting to 127.0.0.1:61117 61117
   [junit4]   2> 948340 WARN  (Thread-2551) [    ] o.a.s.c.ZkTestServer Watch limit violations: 
   [junit4]   2> Maximum concurrent create/delete watches above limit:
   [junit4]   2> 
   [junit4]   2> 	5	/solr/aliases.json
   [junit4]   2> 	5	/solr/clusterprops.json
   [junit4]   2> 	4	/solr/security.json
   [junit4]   2> 	4	/solr/configs/conf
   [junit4]   2> 
   [junit4]   2> Maximum concurrent data watches above limit:
   [junit4]   2> 
   [junit4]   2> 	5	/solr/clusterstate.json
   [junit4]   2> 	4	/solr/collections/authCollection/state.json
   [junit4]   2> 	2	/solr/overseer_elect/election/98543386811432967-127.0.0.1:61121_solr-n_0000000000
   [junit4]   2> 
   [junit4]   2> Maximum concurrent children watches above limit:
   [junit4]   2> 
   [junit4]   2> 	5	/solr/collections
   [junit4]   2> 	4	/solr/live_nodes
   [junit4]   2> 
   [junit4]   2> 948340 INFO  (SUITE-BasicAuthIntegrationTest-seed#[D60014D3C82FA656]-worker) [    ] o.a.s.SolrTestCaseJ4 ###deleteCore
   [junit4]   2> NOTE: leaving temporary files on disk at: C:\Users\jenkins\workspace\Lucene-Solr-6.6-Windows\solr\build\solr-core\test\J1\temp\solr.security.BasicAuthIntegrationTest_D60014D3C82FA656-001
   [junit4]   2> Aug 25, 2017 9:19:23 AM com.carrotsearch.randomizedtesting.ThreadLeakControl checkThreadLeaks
   [junit4]   2> WARNING: Will linger awaiting termination of 1 leaked thread(s).
   [junit4]   2> NOTE: test params are: codec=Asserting(Lucene62), sim=RandomSimilarity(queryNorm=true,coord=crazy): {}, locale=ta-IN, timezone=America/Catamarca
   [junit4]   2> NOTE: Windows 10 10.0 amd64/Oracle Corporation 9 (64-bit)/cpus=3,threads=1,free=193632672,total=497434624
   [junit4]   2> NOTE: All tests run in this JVM: [TestStressUserVersions, FieldAnalysisRequestHandlerTest, BlockJoinFacetDistribTest, TestFreeTextSuggestions, HdfsTlogReplayBufferedWhileIndexingTest, MultiThreadedOCPTest, SpellPossibilityIteratorTest, DistributedFacetPivotLargeTest, DocValuesMissingTest, HLLSerializationTest, SuggesterTSTTest, HdfsSyncSliceTest, LeaderElectionIntegrationTest, TestPKIAuthenticationPlugin, SparseHLLTest, SpatialRPTFieldTypeTest, QueryResultKeyTest, HdfsNNFailoverTest, TestConfigSetsAPIZkFailure, CopyFieldTest, ShardRoutingCustomTest, TestClusterStateMutator, FieldMutatingUpdateProcessorTest, TestCoreAdminApis, CdcrVersionReplicationTest, TlogReplayBufferedWhileIndexingTest, SecurityConfHandlerTest, TestIndexSearcher, CleanupOldIndexTest, TestClusterProperties, CoreAdminCreateDiscoverTest, OpenCloseCoreStressTest, TestTrackingShardHandlerFactory, RAMDirectoryFactoryTest, SliceStateTest, TestObjectReleaseTracker, HdfsLockFactoryTest, DistributedFacetPivotWhiteBoxTest, CoreSorterTest, ManagedSchemaRoundRobinCloudTest, TestSubQueryTransformerCrossCore, ConnectionReuseTest, TestCoreDiscovery, TestSolrQueryParserResource, SpellCheckCollatorWithCollapseTest, ZkSolrClientTest, ConfigSetsAPITest, RecoveryAfterSoftCommitTest, TestFoldingMultitermQuery, TestScoreJoinQPNoScore, TestMacroExpander, TestCustomSort, TestXmlQParser, TestSolrConfigHandlerCloud, MBeansHandlerTest, TestDownShardTolerantSearch, BasicFunctionalityTest, TestOmitPositions, TestSolr4Spatial, TestExportWriter, DebugComponentTest, SpellCheckComponentTest, ReturnFieldsTest, TestConfigSetsAPI, TestDistributedGrouping, TermVectorComponentDistributedTest, TestSolrDeletionPolicy2, TestConfigOverlay, LukeRequestHandlerTest, SearchHandlerTest, CollectionsAPIDistributedZkTest, OverseerCollectionConfigSetProcessorTest, TestEmbeddedSolrServerSchemaAPI, TestPushWriter, RestartWhileUpdatingTest, DistribJoinFromCollectionTest, TestRestManager, DataDrivenBlockJoinTest, SolrXmlInZkTest, AtomicUpdatesTest, TestCloudManagedSchema, TestSolrFieldCacheMBean, ClusterStateTest, AnalysisErrorHandlingTest, IgnoreCommitOptimizeUpdateProcessorFactoryTest, SolrIndexSplitterTest, TestFastWriter, ChangedSchemaMergeTest, TestFuzzyAnalyzedSuggestions, TestMaxScoreQueryParser, LeaderFailureAfterFreshStartTest, ScriptEngineTest, TestDocSet, TestRandomCollapseQParserPlugin, TestSQLHandler, RequestHandlersTest, CircularListTest, CoreAdminHandlerTest, SSLMigrationTest, TestSolrXml, TestNRTOpen, DateMathParserTest, BufferStoreTest, TestGraphMLResponseWriter, SolrIndexConfigTest, TestSolrCloudWithSecureImpersonation, LeaderElectionContextKeyTest, CollectionTooManyReplicasTest, TestExceedMaxTermLength, TestUtils, TestRandomFaceting, TestImpersonationWithHadoopAuth, HdfsChaosMonkeySafeLeaderTest, TestUninvertingReader, TestSimpleQParserPlugin, UpdateRequestProcessorFactoryTest, TestBlobHandler, TestDeleteCollectionOnDownNodes, TestComplexPhraseLeadingWildcard, DistributedTermsComponentTest, PKIAuthenticationIntegrationTest, TestDistributedMissingSort, BasicZkTest, IndexSchemaTest, HighlighterConfigTest, DistributedFacetPivotSmallAdvancedTest, TestSimpleTrackingShardHandler, TestTolerantUpdateProcessorCloud, CloneFieldUpdateProcessorFactoryTest, ChaosMonkeySafeLeaderTest, TestDistribIDF, PreAnalyzedUpdateProcessorTest, TestRangeQuery, TestSolrCoreSnapshots, LeaderInitiatedRecoveryOnShardRestartTest, TestConfigSetProperties, TestHdfsCloudBackupRestore, BasicDistributedZk2Test, TestCloudJSONFacetJoinDomain, TestSha256AuthenticationProvider, TestHashQParserPlugin, TestIndexingPerformance, TestJmxMonitoredMap, TestManagedSchemaAPI, SpellingQueryConverterTest, JsonLoaderTest, TestCloudPseudoReturnFields, TestSchemaNameResource, BasicAuthIntegrationTest]
   [junit4] Completed [334/713 (3!)] on J1 in 11.17s, 1 test, 1 error <<< FAILURES!

[...truncated 37568 lines...]

Mime
View raw message