lucene-dev mailing list archives

Site index · List index
Message view « Date » · « Thread »
Top « Date » · « Thread »
From Policeman Jenkins Server <jenk...@thetaphi.de>
Subject [JENKINS] Lucene-Solr-7.0-Windows (32bit/jdk1.8.0_144) - Build # 76 - Unstable!
Date Thu, 10 Aug 2017 03:16:20 GMT
Build: https://jenkins.thetaphi.de/job/Lucene-Solr-7.0-Windows/76/
Java: 32bit/jdk1.8.0_144 -server -XX:+UseG1GC

1 tests failed.
FAILED:  junit.framework.TestSuite.org.apache.solr.util.TestSolrCLIRunExample

Error Message:
Could not remove the following files (in the order of attempts):    C:\Users\jenkins\workspace\Lucene-Solr-7.0-Windows\solr\build\solr-core\test\J0\temp\solr.util.TestSolrCLIRunExample_DF3FC52E0F1B9AC8-001\tempDir-005\techproducts\solr\techproducts\data: java.nio.file.DirectoryNotEmptyException: C:\Users\jenkins\workspace\Lucene-Solr-7.0-Windows\solr\build\solr-core\test\J0\temp\solr.util.TestSolrCLIRunExample_DF3FC52E0F1B9AC8-001\tempDir-005\techproducts\solr\techproducts\data    C:\Users\jenkins\workspace\Lucene-Solr-7.0-Windows\solr\build\solr-core\test\J0\temp\solr.util.TestSolrCLIRunExample_DF3FC52E0F1B9AC8-001\tempDir-005\techproducts\solr\techproducts: java.nio.file.DirectoryNotEmptyException: C:\Users\jenkins\workspace\Lucene-Solr-7.0-Windows\solr\build\solr-core\test\J0\temp\solr.util.TestSolrCLIRunExample_DF3FC52E0F1B9AC8-001\tempDir-005\techproducts\solr\techproducts    C:\Users\jenkins\workspace\Lucene-Solr-7.0-Windows\solr\build\solr-core\test\J0\temp\solr.util.TestSolrCLIRunExample_DF3FC52E0F1B9AC8-001\tempDir-005\techproducts\solr: java.nio.file.DirectoryNotEmptyException: C:\Users\jenkins\workspace\Lucene-Solr-7.0-Windows\solr\build\solr-core\test\J0\temp\solr.util.TestSolrCLIRunExample_DF3FC52E0F1B9AC8-001\tempDir-005\techproducts\solr    C:\Users\jenkins\workspace\Lucene-Solr-7.0-Windows\solr\build\solr-core\test\J0\temp\solr.util.TestSolrCLIRunExample_DF3FC52E0F1B9AC8-001\tempDir-005\techproducts: java.nio.file.DirectoryNotEmptyException: C:\Users\jenkins\workspace\Lucene-Solr-7.0-Windows\solr\build\solr-core\test\J0\temp\solr.util.TestSolrCLIRunExample_DF3FC52E0F1B9AC8-001\tempDir-005\techproducts    C:\Users\jenkins\workspace\Lucene-Solr-7.0-Windows\solr\build\solr-core\test\J0\temp\solr.util.TestSolrCLIRunExample_DF3FC52E0F1B9AC8-001\tempDir-005: java.nio.file.DirectoryNotEmptyException: C:\Users\jenkins\workspace\Lucene-Solr-7.0-Windows\solr\build\solr-core\test\J0\temp\solr.util.TestSolrCLIRunExample_DF3FC52E0F1B9AC8-001\tempDir-005    C:\Users\jenkins\workspace\Lucene-Solr-7.0-Windows\solr\build\solr-core\test\J0\temp\solr.util.TestSolrCLIRunExample_DF3FC52E0F1B9AC8-001\tempDir-005\techproducts\solr\techproducts\data\snapshot_metadata: java.nio.file.AccessDeniedException: C:\Users\jenkins\workspace\Lucene-Solr-7.0-Windows\solr\build\solr-core\test\J0\temp\solr.util.TestSolrCLIRunExample_DF3FC52E0F1B9AC8-001\tempDir-005\techproducts\solr\techproducts\data\snapshot_metadata    C:\Users\jenkins\workspace\Lucene-Solr-7.0-Windows\solr\build\solr-core\test\J0\temp\solr.util.TestSolrCLIRunExample_DF3FC52E0F1B9AC8-001: java.nio.file.DirectoryNotEmptyException: C:\Users\jenkins\workspace\Lucene-Solr-7.0-Windows\solr\build\solr-core\test\J0\temp\solr.util.TestSolrCLIRunExample_DF3FC52E0F1B9AC8-001 

Stack Trace:
java.io.IOException: Could not remove the following files (in the order of attempts):
   C:\Users\jenkins\workspace\Lucene-Solr-7.0-Windows\solr\build\solr-core\test\J0\temp\solr.util.TestSolrCLIRunExample_DF3FC52E0F1B9AC8-001\tempDir-005\techproducts\solr\techproducts\data: java.nio.file.DirectoryNotEmptyException: C:\Users\jenkins\workspace\Lucene-Solr-7.0-Windows\solr\build\solr-core\test\J0\temp\solr.util.TestSolrCLIRunExample_DF3FC52E0F1B9AC8-001\tempDir-005\techproducts\solr\techproducts\data
   C:\Users\jenkins\workspace\Lucene-Solr-7.0-Windows\solr\build\solr-core\test\J0\temp\solr.util.TestSolrCLIRunExample_DF3FC52E0F1B9AC8-001\tempDir-005\techproducts\solr\techproducts: java.nio.file.DirectoryNotEmptyException: C:\Users\jenkins\workspace\Lucene-Solr-7.0-Windows\solr\build\solr-core\test\J0\temp\solr.util.TestSolrCLIRunExample_DF3FC52E0F1B9AC8-001\tempDir-005\techproducts\solr\techproducts
   C:\Users\jenkins\workspace\Lucene-Solr-7.0-Windows\solr\build\solr-core\test\J0\temp\solr.util.TestSolrCLIRunExample_DF3FC52E0F1B9AC8-001\tempDir-005\techproducts\solr: java.nio.file.DirectoryNotEmptyException: C:\Users\jenkins\workspace\Lucene-Solr-7.0-Windows\solr\build\solr-core\test\J0\temp\solr.util.TestSolrCLIRunExample_DF3FC52E0F1B9AC8-001\tempDir-005\techproducts\solr
   C:\Users\jenkins\workspace\Lucene-Solr-7.0-Windows\solr\build\solr-core\test\J0\temp\solr.util.TestSolrCLIRunExample_DF3FC52E0F1B9AC8-001\tempDir-005\techproducts: java.nio.file.DirectoryNotEmptyException: C:\Users\jenkins\workspace\Lucene-Solr-7.0-Windows\solr\build\solr-core\test\J0\temp\solr.util.TestSolrCLIRunExample_DF3FC52E0F1B9AC8-001\tempDir-005\techproducts
   C:\Users\jenkins\workspace\Lucene-Solr-7.0-Windows\solr\build\solr-core\test\J0\temp\solr.util.TestSolrCLIRunExample_DF3FC52E0F1B9AC8-001\tempDir-005: java.nio.file.DirectoryNotEmptyException: C:\Users\jenkins\workspace\Lucene-Solr-7.0-Windows\solr\build\solr-core\test\J0\temp\solr.util.TestSolrCLIRunExample_DF3FC52E0F1B9AC8-001\tempDir-005
   C:\Users\jenkins\workspace\Lucene-Solr-7.0-Windows\solr\build\solr-core\test\J0\temp\solr.util.TestSolrCLIRunExample_DF3FC52E0F1B9AC8-001\tempDir-005\techproducts\solr\techproducts\data\snapshot_metadata: java.nio.file.AccessDeniedException: C:\Users\jenkins\workspace\Lucene-Solr-7.0-Windows\solr\build\solr-core\test\J0\temp\solr.util.TestSolrCLIRunExample_DF3FC52E0F1B9AC8-001\tempDir-005\techproducts\solr\techproducts\data\snapshot_metadata
   C:\Users\jenkins\workspace\Lucene-Solr-7.0-Windows\solr\build\solr-core\test\J0\temp\solr.util.TestSolrCLIRunExample_DF3FC52E0F1B9AC8-001: java.nio.file.DirectoryNotEmptyException: C:\Users\jenkins\workspace\Lucene-Solr-7.0-Windows\solr\build\solr-core\test\J0\temp\solr.util.TestSolrCLIRunExample_DF3FC52E0F1B9AC8-001

	at __randomizedtesting.SeedInfo.seed([DF3FC52E0F1B9AC8]:0)
	at org.apache.lucene.util.IOUtils.rm(IOUtils.java:329)
	at org.apache.lucene.util.TestRuleTemporaryFilesCleanup.afterAlways(TestRuleTemporaryFilesCleanup.java:216)
	at com.carrotsearch.randomizedtesting.rules.TestRuleAdapter$1.afterAlways(TestRuleAdapter.java:31)
	at com.carrotsearch.randomizedtesting.rules.StatementAdapter.evaluate(StatementAdapter.java:43)
	at com.carrotsearch.randomizedtesting.rules.StatementAdapter.evaluate(StatementAdapter.java:36)
	at org.apache.lucene.util.TestRuleAssertionsRequired$1.evaluate(TestRuleAssertionsRequired.java:53)
	at org.apache.lucene.util.TestRuleMarkFailure$1.evaluate(TestRuleMarkFailure.java:47)
	at org.apache.lucene.util.TestRuleIgnoreAfterMaxFailures$1.evaluate(TestRuleIgnoreAfterMaxFailures.java:64)
	at org.apache.lucene.util.TestRuleIgnoreTestSuites$1.evaluate(TestRuleIgnoreTestSuites.java:54)
	at com.carrotsearch.randomizedtesting.rules.StatementAdapter.evaluate(StatementAdapter.java:36)
	at com.carrotsearch.randomizedtesting.ThreadLeakControl$StatementRunner.run(ThreadLeakControl.java:368)
	at java.lang.Thread.run(Thread.java:748)




Build Log:
[...truncated 11951 lines...]
   [junit4] Suite: org.apache.solr.util.TestSolrCLIRunExample
   [junit4]   2> Creating dataDir: C:\Users\jenkins\workspace\Lucene-Solr-7.0-Windows\solr\build\solr-core\test\J0\temp\solr.util.TestSolrCLIRunExample_DF3FC52E0F1B9AC8-001\init-core-data-001
   [junit4]   2> 1269801 WARN  (SUITE-TestSolrCLIRunExample-seed#[DF3FC52E0F1B9AC8]-worker) [    ] o.a.s.SolrTestCaseJ4 startTrackingSearchers: numOpens=11 numCloses=11
   [junit4]   2> 1269801 INFO  (SUITE-TestSolrCLIRunExample-seed#[DF3FC52E0F1B9AC8]-worker) [    ] o.a.s.SolrTestCaseJ4 Using PointFields (NUMERIC_POINTS_SYSPROP=true) w/NUMERIC_DOCVALUES_SYSPROP=true
   [junit4]   2> 1269806 INFO  (SUITE-TestSolrCLIRunExample-seed#[DF3FC52E0F1B9AC8]-worker) [    ] o.a.s.SolrTestCaseJ4 Randomized ssl (false) and clientAuth (false) via: @org.apache.solr.SolrTestCaseJ4$SuppressSSL(bugUrl=https://issues.apache.org/jira/browse/SOLR-5776)
   [junit4]   2> 1269807 INFO  (TEST-TestSolrCLIRunExample.testFailExecuteScript-seed#[DF3FC52E0F1B9AC8]) [    ] o.a.s.SolrTestCaseJ4 ###Starting testFailExecuteScript
   [junit4]   2> 
   [junit4]   2> ERROR: Failed to start Solr using command: "C:\Users\jenkins\workspace\Lucene-Solr-7.0-Windows\solr\build\solr-core\test\J0\temp\solr.util.TestSolrCLIRunExample_DF3FC52E0F1B9AC8-001\tempDir-001\failExecuteScript" start -p 50532 -s "C:\Users\jenkins\workspace\Lucene-Solr-7.0-Windows\solr\build\solr-core\test\J0\temp\solr.util.TestSolrCLIRunExample_DF3FC52E0F1B9AC8-001\tempDir-001\techproducts\solr" Exception : org.apache.commons.exec.ExecuteException: Execution failed (Exit value: -559038737. Caused by java.io.IOException: Cannot run program "C:\Users\jenkins\workspace\Lucene-Solr-7.0-Windows\solr\build\solr-core\test\J0\temp\solr.util.TestSolrCLIRunExample_DF3FC52E0F1B9AC8-001\tempDir-001\failExecuteScript" (in directory "."): CreateProcess error=193, %1 is not a valid Win32 application)
   [junit4]   2> 
   [junit4]   2> 1271028 INFO  (TEST-TestSolrCLIRunExample.testFailExecuteScript-seed#[DF3FC52E0F1B9AC8]) [    ] o.a.s.SolrTestCaseJ4 ###Ending testFailExecuteScript
   [junit4]   2> 1271031 INFO  (TEST-TestSolrCLIRunExample.testInteractiveSolrCloudExample-seed#[DF3FC52E0F1B9AC8]) [    ] o.a.s.SolrTestCaseJ4 ###Starting testInteractiveSolrCloudExample
   [junit4]   2> 1273112 INFO  (TEST-TestSolrCLIRunExample.testInteractiveSolrCloudExample-seed#[DF3FC52E0F1B9AC8]) [    ] o.a.s.c.MiniSolrCloudCluster Starting cluster of 1 servers in C:\Users\jenkins\workspace\Lucene-Solr-7.0-Windows\solr\build\solr-core\test\J0\temp\solr.util.TestSolrCLIRunExample_DF3FC52E0F1B9AC8-001\tempDir-003
   [junit4]   2> 1273113 INFO  (TEST-TestSolrCLIRunExample.testInteractiveSolrCloudExample-seed#[DF3FC52E0F1B9AC8]) [    ] o.a.s.c.ZkTestServer STARTING ZK TEST SERVER
   [junit4]   2> 1273113 INFO  (Thread-2564) [    ] o.a.s.c.ZkTestServer client port:0.0.0.0/0.0.0.0:0
   [junit4]   2> 1273113 INFO  (Thread-2564) [    ] o.a.s.c.ZkTestServer Starting server
   [junit4]   2> 1273125 ERROR (Thread-2564) [    ] o.a.z.s.ZooKeeperServer ZKShutdownHandler is not registered, so ZooKeeper server won't take any action on ERROR or SHUTDOWN server state changes
   [junit4]   2> 1273214 INFO  (TEST-TestSolrCLIRunExample.testInteractiveSolrCloudExample-seed#[DF3FC52E0F1B9AC8]) [    ] o.a.s.c.ZkTestServer start zk server on port:50556
   [junit4]   2> 1273231 INFO  (jetty-launcher-3536-thread-1) [    ] o.e.j.s.Server jetty-9.3.14.v20161028
   [junit4]   2> 1273232 INFO  (jetty-launcher-3536-thread-1) [    ] o.e.j.s.h.ContextHandler Started o.e.j.s.ServletContextHandler@1518c15{/solr,null,AVAILABLE}
   [junit4]   2> 1273233 INFO  (jetty-launcher-3536-thread-1) [    ] o.e.j.s.AbstractConnector Started ServerConnector@1af9dd3{HTTP/1.1,[http/1.1]}{127.0.0.1:50538}
   [junit4]   2> 1273233 INFO  (jetty-launcher-3536-thread-1) [    ] o.e.j.s.Server Started @1276813ms
   [junit4]   2> 1273233 INFO  (jetty-launcher-3536-thread-1) [    ] o.a.s.c.s.e.JettySolrRunner Jetty properties: {hostContext=/solr, hostPort=50538}
   [junit4]   2> 1273233 ERROR (jetty-launcher-3536-thread-1) [    ] o.a.s.s.StartupLoggingUtils Missing Java Option solr.log.dir. Logging may be missing or incomplete.
   [junit4]   2> 1273233 INFO  (jetty-launcher-3536-thread-1) [    ] o.a.s.s.SolrDispatchFilter  ___      _       Welcome to Apache Solr? version 7.0.0
   [junit4]   2> 1273233 INFO  (jetty-launcher-3536-thread-1) [    ] o.a.s.s.SolrDispatchFilter / __| ___| |_ _   Starting in cloud mode on port 50538
   [junit4]   2> 1273233 INFO  (jetty-launcher-3536-thread-1) [    ] o.a.s.s.SolrDispatchFilter \__ \/ _ \ | '_|  Install dir: null, Default config dir: null
   [junit4]   2> 1273233 INFO  (jetty-launcher-3536-thread-1) [    ] o.a.s.s.SolrDispatchFilter |___/\___/_|_|    Start time: 2017-08-10T02:31:38.541Z
   [junit4]   2> 1273247 INFO  (jetty-launcher-3536-thread-1) [    ] o.a.s.s.SolrDispatchFilter solr.xml found in ZooKeeper. Loading...
   [junit4]   2> 1273264 INFO  (jetty-launcher-3536-thread-1) [    ] o.a.s.c.SolrXmlConfig MBean server found: com.sun.jmx.mbeanserver.JmxMBeanServer@b643a5, but no JMX reporters were configured - adding default JMX reporter.
   [junit4]   2> 1273273 INFO  (jetty-launcher-3536-thread-1) [    ] o.a.s.c.ZkContainer Zookeeper client=127.0.0.1:50556/solr
   [junit4]   2> 1273543 INFO  (jetty-launcher-3536-thread-1) [n:localhost:50538_solr    ] o.a.s.c.Overseer Overseer (id=null) closing
   [junit4]   2> 1273544 INFO  (jetty-launcher-3536-thread-1) [n:localhost:50538_solr    ] o.a.s.c.OverseerElectionContext I am going to be the leader localhost:50538_solr
   [junit4]   2> 1273545 INFO  (jetty-launcher-3536-thread-1) [n:localhost:50538_solr    ] o.a.s.c.Overseer Overseer (id=98456849509777411-localhost:50538_solr-n_0000000000) starting
   [junit4]   2> 1273554 INFO  (jetty-launcher-3536-thread-1) [n:localhost:50538_solr    ] o.a.s.c.ZkController Register node as live in ZooKeeper:/live_nodes/localhost:50538_solr
   [junit4]   2> 1273555 INFO  (OverseerStateUpdate-98456849509777411-localhost:50538_solr-n_0000000000) [n:localhost:50538_solr    ] o.a.s.c.c.ZkStateReader Updated live nodes from ZooKeeper... (0) -> (1)
   [junit4]   2> 1273736 INFO  (jetty-launcher-3536-thread-1) [n:localhost:50538_solr    ] o.a.s.m.r.SolrJmxReporter JMX monitoring for 'solr.node' (registry 'solr.node') enabled at server: com.sun.jmx.mbeanserver.JmxMBeanServer@b643a5
   [junit4]   2> 1273740 INFO  (jetty-launcher-3536-thread-1) [n:localhost:50538_solr    ] o.a.s.m.r.SolrJmxReporter JMX monitoring for 'solr.jvm' (registry 'solr.jvm') enabled at server: com.sun.jmx.mbeanserver.JmxMBeanServer@b643a5
   [junit4]   2> 1273740 INFO  (jetty-launcher-3536-thread-1) [n:localhost:50538_solr    ] o.a.s.m.r.SolrJmxReporter JMX monitoring for 'solr.jetty' (registry 'solr.jetty') enabled at server: com.sun.jmx.mbeanserver.JmxMBeanServer@b643a5
   [junit4]   2> 1273742 INFO  (jetty-launcher-3536-thread-1) [n:localhost:50538_solr    ] o.a.s.c.CorePropertiesLocator Found 0 core definitions underneath C:\Users\jenkins\workspace\Lucene-Solr-7.0-Windows\solr\build\solr-core\test\J0\temp\solr.util.TestSolrCLIRunExample_DF3FC52E0F1B9AC8-001\tempDir-003\node1
   [junit4]   2> 1273766 WARN  (NIOServerCxn.Factory:0.0.0.0/0.0.0.0:0) [    ] o.a.z.s.NIOServerCnxn caught end of stream exception
   [junit4]   2> EndOfStreamException: Unable to read additional data from client sessionid 0x15dc9fba4bc0004, likely client has closed socket
   [junit4]   2> 	at org.apache.zookeeper.server.NIOServerCnxn.doIO(NIOServerCnxn.java:239)
   [junit4]   2> 	at org.apache.zookeeper.server.NIOServerCnxnFactory.run(NIOServerCnxnFactory.java:203)
   [junit4]   2> 	at java.lang.Thread.run(Thread.java:748)
   [junit4]   2> 1276871 INFO  (qtp9508125-14595) [n:localhost:50538_solr    ] o.a.s.s.HttpSolrCall [admin] webapp=null path=/admin/info/system params={wt=json} status=0 QTime=36
   [junit4]   2> 1276875 INFO  (qtp9508125-14595) [n:localhost:50538_solr    ] o.a.s.h.a.CollectionsHandler Invoked Collection Action :clusterstatus with params action=CLUSTERSTATUS&wt=json and sendToOCPQueue=true
   [junit4]   2> 1276880 INFO  (qtp9508125-14595) [n:localhost:50538_solr    ] o.a.s.s.HttpSolrCall [admin] webapp=null path=/admin/collections params={action=CLUSTERSTATUS&wt=json} status=0 QTime=5
   [junit4]   2> 1276891 INFO  (TEST-TestSolrCLIRunExample.testInteractiveSolrCloudExample-seed#[DF3FC52E0F1B9AC8]) [    ] o.a.s.c.c.ZkStateReader Updated live nodes from ZooKeeper... (0) -> (1)
   [junit4]   2> 1276893 INFO  (TEST-TestSolrCLIRunExample.testInteractiveSolrCloudExample-seed#[DF3FC52E0F1B9AC8]) [    ] o.a.s.c.s.i.ZkClientClusterStateProvider Cluster at 127.0.0.1:50556/solr ready
   [junit4]   2> 1276893 WARN  (NIOServerCxn.Factory:0.0.0.0/0.0.0.0:0) [    ] o.a.z.s.NIOServerCnxn caught end of stream exception
   [junit4]   2> EndOfStreamException: Unable to read additional data from client sessionid 0x15dc9fba4bc0005, likely client has closed socket
   [junit4]   2> 	at org.apache.zookeeper.server.NIOServerCnxn.doIO(NIOServerCnxn.java:239)
   [junit4]   2> 	at org.apache.zookeeper.server.NIOServerCnxnFactory.run(NIOServerCnxnFactory.java:203)
   [junit4]   2> 	at java.lang.Thread.run(Thread.java:748)
   [junit4]   2> 1276897 INFO  (qtp9508125-14601) [n:localhost:50538_solr    ] o.a.s.h.a.CollectionsHandler Invoked Collection Action :list with params action=list&wt=json and sendToOCPQueue=true
   [junit4]   2> 1276897 INFO  (qtp9508125-14601) [n:localhost:50538_solr    ] o.a.s.s.HttpSolrCall [admin] webapp=null path=/admin/collections params={action=list&wt=json} status=0 QTime=0
   [junit4]   2> 1276918 INFO  (qtp9508125-14601) [n:localhost:50538_solr    ] o.a.s.s.HttpSolrCall [admin] webapp=null path=/admin/info/system params={wt=json} status=0 QTime=13
   [junit4]   2> 1276921 INFO  (qtp9508125-14601) [n:localhost:50538_solr    ] o.a.s.h.a.CollectionsHandler Invoked Collection Action :clusterstatus with params action=CLUSTERSTATUS&wt=json and sendToOCPQueue=true
   [junit4]   2> 1276922 INFO  (qtp9508125-14601) [n:localhost:50538_solr    ] o.a.s.s.HttpSolrCall [admin] webapp=null path=/admin/collections params={action=CLUSTERSTATUS&wt=json} status=0 QTime=1
   [junit4]   2> 1276930 INFO  (TEST-TestSolrCLIRunExample.testInteractiveSolrCloudExample-seed#[DF3FC52E0F1B9AC8]) [    ] o.a.s.c.c.ZkStateReader Updated live nodes from ZooKeeper... (0) -> (1)
   [junit4]   2> 1276931 INFO  (TEST-TestSolrCLIRunExample.testInteractiveSolrCloudExample-seed#[DF3FC52E0F1B9AC8]) [    ] o.a.s.c.s.i.ZkClientClusterStateProvider Cluster at 127.0.0.1:50556/solr ready
   [junit4]   2> 1277034 INFO  (qtp9508125-14596) [n:localhost:50538_solr    ] o.a.s.h.a.CollectionsHandler Invoked Collection Action :list with params action=list&wt=json and sendToOCPQueue=true
   [junit4]   2> 1277035 INFO  (qtp9508125-14596) [n:localhost:50538_solr    ] o.a.s.s.HttpSolrCall [admin] webapp=null path=/admin/collections params={action=list&wt=json} status=0 QTime=0
   [junit4]   2> 1277037 INFO  (qtp9508125-14595) [n:localhost:50538_solr    ] o.a.s.h.a.CollectionsHandler Invoked Collection Action :create with params replicationFactor=2&maxShardsPerNode=4&collection.configName=testCloudExamplePrompt&name=testCloudExamplePrompt&action=CREATE&numShards=2&wt=json and sendToOCPQueue=true
   [junit4]   2> 1277038 INFO  (OverseerThreadFactory-5575-thread-1-processing-n:localhost:50538_solr) [n:localhost:50538_solr    ] o.a.s.c.CreateCollectionCmd Create collection testCloudExamplePrompt
   [junit4]   2> 1277042 WARN  (OverseerThreadFactory-5575-thread-1-processing-n:localhost:50538_solr) [n:localhost:50538_solr    ] o.a.s.c.CreateCollectionCmd Specified number of replicas of 2 on collection testCloudExamplePrompt is higher than the number of Solr instances currently live or live and part of your createNodeSet(1). It's unusual to run two replica of the same slice on the same Solr-instance.
   [junit4]   2> 1277148 INFO  (OverseerStateUpdate-98456849509777411-localhost:50538_solr-n_0000000000) [n:localhost:50538_solr    ] o.a.s.c.o.SliceMutator createReplica() {
   [junit4]   2>   "operation":"ADDREPLICA",
   [junit4]   2>   "collection":"testCloudExamplePrompt",
   [junit4]   2>   "shard":"shard1",
   [junit4]   2>   "core":"testCloudExamplePrompt_shard1_replica_n1",
   [junit4]   2>   "state":"down",
   [junit4]   2>   "base_url":"http://localhost:50538/solr",
   [junit4]   2>   "type":"NRT"} 
   [junit4]   2> 1277150 INFO  (OverseerStateUpdate-98456849509777411-localhost:50538_solr-n_0000000000) [n:localhost:50538_solr    ] o.a.s.c.o.SliceMutator createReplica() {
   [junit4]   2>   "operation":"ADDREPLICA",
   [junit4]   2>   "collection":"testCloudExamplePrompt",
   [junit4]   2>   "shard":"shard1",
   [junit4]   2>   "core":"testCloudExamplePrompt_shard1_replica_n2",
   [junit4]   2>   "state":"down",
   [junit4]   2>   "base_url":"http://localhost:50538/solr",
   [junit4]   2>   "type":"NRT"} 
   [junit4]   2> 1277151 INFO  (OverseerStateUpdate-98456849509777411-localhost:50538_solr-n_0000000000) [n:localhost:50538_solr    ] o.a.s.c.o.SliceMutator createReplica() {
   [junit4]   2>   "operation":"ADDREPLICA",
   [junit4]   2>   "collection":"testCloudExamplePrompt",
   [junit4]   2>   "shard":"shard2",
   [junit4]   2>   "core":"testCloudExamplePrompt_shard2_replica_n1",
   [junit4]   2>   "state":"down",
   [junit4]   2>   "base_url":"http://localhost:50538/solr",
   [junit4]   2>   "type":"NRT"} 
   [junit4]   2> 1277152 INFO  (OverseerStateUpdate-98456849509777411-localhost:50538_solr-n_0000000000) [n:localhost:50538_solr    ] o.a.s.c.o.SliceMutator createReplica() {
   [junit4]   2>   "operation":"ADDREPLICA",
   [junit4]   2>   "collection":"testCloudExamplePrompt",
   [junit4]   2>   "shard":"shard2",
   [junit4]   2>   "core":"testCloudExamplePrompt_shard2_replica_n2",
   [junit4]   2>   "state":"down",
   [junit4]   2>   "base_url":"http://localhost:50538/solr",
   [junit4]   2>   "type":"NRT"} 
   [junit4]   2> 1277354 INFO  (qtp9508125-14599) [n:localhost:50538_solr    ] o.a.s.h.a.CoreAdminOperation core create command qt=/admin/cores&coreNodeName=core_node2&collection.configName=testCloudExamplePrompt&newCollection=true&name=testCloudExamplePrompt_shard1_replica_n2&action=CREATE&numShards=2&collection=testCloudExamplePrompt&shard=shard1&wt=javabin&version=2&replicaType=NRT
   [junit4]   2> 1277354 INFO  (qtp9508125-14601) [n:localhost:50538_solr    ] o.a.s.h.a.CoreAdminOperation core create command qt=/admin/cores&coreNodeName=core_node1&collection.configName=testCloudExamplePrompt&newCollection=true&name=testCloudExamplePrompt_shard1_replica_n1&action=CREATE&numShards=2&collection=testCloudExamplePrompt&shard=shard1&wt=javabin&version=2&replicaType=NRT
   [junit4]   2> 1277354 INFO  (qtp9508125-14599) [n:localhost:50538_solr    ] o.a.s.c.TransientSolrCoreCacheDefault Allocating transient cache for 2147483647 transient cores
   [junit4]   2> 1277355 INFO  (qtp9508125-14598) [n:localhost:50538_solr    ] o.a.s.h.a.CoreAdminOperation core create command qt=/admin/cores&coreNodeName=core_node3&collection.configName=testCloudExamplePrompt&newCollection=true&name=testCloudExamplePrompt_shard2_replica_n1&action=CREATE&numShards=2&collection=testCloudExamplePrompt&shard=shard2&wt=javabin&version=2&replicaType=NRT
   [junit4]   2> 1277355 INFO  (qtp9508125-14597) [n:localhost:50538_solr    ] o.a.s.h.a.CoreAdminOperation core create command qt=/admin/cores&coreNodeName=core_node4&collection.configName=testCloudExamplePrompt&newCollection=true&name=testCloudExamplePrompt_shard2_replica_n2&action=CREATE&numShards=2&collection=testCloudExamplePrompt&shard=shard2&wt=javabin&version=2&replicaType=NRT
   [junit4]   2> 1277466 INFO  (zkCallback-3543-thread-1-processing-n:localhost:50538_solr) [n:localhost:50538_solr    ] o.a.s.c.c.ZkStateReader A cluster state change: [WatchedEvent state:SyncConnected type:NodeDataChanged path:/collections/testCloudExamplePrompt/state.json] for collection [testCloudExamplePrompt] has occurred - updating... (live nodes size: [1])
   [junit4]   2> 1277466 INFO  (zkCallback-3543-thread-2-processing-n:localhost:50538_solr) [n:localhost:50538_solr    ] o.a.s.c.c.ZkStateReader A cluster state change: [WatchedEvent state:SyncConnected type:NodeDataChanged path:/collections/testCloudExamplePrompt/state.json] for collection [testCloudExamplePrompt] has occurred - updating... (live nodes size: [1])
   [junit4]   2> 1278402 INFO  (qtp9508125-14601) [n:localhost:50538_solr c:testCloudExamplePrompt s:shard1 r:core_node1 x:testCloudExamplePrompt_shard1_replica_n1] o.a.s.c.RequestParams conf resource params.json loaded . version : 0 
   [junit4]   2> 1278402 INFO  (qtp9508125-14598) [n:localhost:50538_solr c:testCloudExamplePrompt s:shard2 r:core_node3 x:testCloudExamplePrompt_shard2_replica_n1] o.a.s.c.RequestParams conf resource params.json loaded . version : 0 
   [junit4]   2> 1278402 INFO  (qtp9508125-14601) [n:localhost:50538_solr c:testCloudExamplePrompt s:shard1 r:core_node1 x:testCloudExamplePrompt_shard1_replica_n1] o.a.s.c.RequestParams request params refreshed to version 0
   [junit4]   2> 1278402 INFO  (qtp9508125-14598) [n:localhost:50538_solr c:testCloudExamplePrompt s:shard2 r:core_node3 x:testCloudExamplePrompt_shard2_replica_n1] o.a.s.c.RequestParams request params refreshed to version 0
   [junit4]   2> 1278403 INFO  (qtp9508125-14597) [n:localhost:50538_solr c:testCloudExamplePrompt s:shard2 r:core_node4 x:testCloudExamplePrompt_shard2_replica_n2] o.a.s.c.RequestParams conf resource params.json loaded . version : 0 
   [junit4]   2> 1278403 INFO  (qtp9508125-14597) [n:localhost:50538_solr c:testCloudExamplePrompt s:shard2 r:core_node4 x:testCloudExamplePrompt_shard2_replica_n2] o.a.s.c.RequestParams request params refreshed to version 0
   [junit4]   2> 1278404 INFO  (qtp9508125-14599) [n:localhost:50538_solr c:testCloudExamplePrompt s:shard1 r:core_node2 x:testCloudExamplePrompt_shard1_replica_n2] o.a.s.c.RequestParams conf resource params.json loaded . version : 0 
   [junit4]   2> 1278404 INFO  (qtp9508125-14599) [n:localhost:50538_solr c:testCloudExamplePrompt s:shard1 r:core_node2 x:testCloudExamplePrompt_shard1_replica_n2] o.a.s.c.RequestParams request params refreshed to version 0
   [junit4]   2> 1278405 WARN  (qtp9508125-14597) [n:localhost:50538_solr c:testCloudExamplePrompt s:shard2 r:core_node4 x:testCloudExamplePrompt_shard2_replica_n2] o.a.s.c.SolrConfig Couldn't add files from C:\Users\jenkins\workspace\Lucene-Solr-7.0-Windows\solr\build\solr-core\test\J0\temp\solr.util.TestSolrCLIRunExample_DF3FC52E0F1B9AC8-001\tempDir-003\node1\testCloudExamplePrompt_shard2_replica_n2\..\..\..\..\contrib\extraction\lib filtered by .*\.jar to classpath: C:\Users\jenkins\workspace\Lucene-Solr-7.0-Windows\solr\build\solr-core\test\J0\temp\solr.util.TestSolrCLIRunExample_DF3FC52E0F1B9AC8-001\tempDir-003\node1\testCloudExamplePrompt_shard2_replica_n2\..\..\..\..\contrib\extraction\lib
   [junit4]   2> 1278405 WARN  (qtp9508125-14601) [n:localhost:50538_solr c:testCloudExamplePrompt s:shard1 r:core_node1 x:testCloudExamplePrompt_shard1_replica_n1] o.a.s.c.SolrConfig Couldn't add files from C:\Users\jenkins\workspace\Lucene-Solr-7.0-Windows\solr\build\solr-core\test\J0\temp\solr.util.TestSolrCLIRunExample_DF3FC52E0F1B9AC8-001\tempDir-003\node1\testCloudExamplePrompt_shard1_replica_n1\..\..\..\..\contrib\extraction\lib filtered by .*\.jar to classpath: C:\Users\jenkins\workspace\Lucene-Solr-7.0-Windows\solr\build\solr-core\test\J0\temp\solr.util.TestSolrCLIRunExample_DF3FC52E0F1B9AC8-001\tempDir-003\node1\testCloudExamplePrompt_shard1_replica_n1\..\..\..\..\contrib\extraction\lib
   [junit4]   2> 1278405 WARN  (qtp9508125-14599) [n:localhost:50538_solr c:testCloudExamplePrompt s:shard1 r:core_node2 x:testCloudExamplePrompt_shard1_replica_n2] o.a.s.c.SolrConfig Couldn't add files from C:\Users\jenkins\workspace\Lucene-Solr-7.0-Windows\solr\build\solr-core\test\J0\temp\solr.util.TestSolrCLIRunExample_DF3FC52E0F1B9AC8-001\tempDir-003\node1\testCloudExamplePrompt_shard1_replica_n2\..\..\..\..\contrib\extraction\lib filtered by .*\.jar to classpath: C:\Users\jenkins\workspace\Lucene-Solr-7.0-Windows\solr\build\solr-core\test\J0\temp\solr.util.TestSolrCLIRunExample_DF3FC52E0F1B9AC8-001\tempDir-003\node1\testCloudExamplePrompt_shard1_replica_n2\..\..\..\..\contrib\extraction\lib
   [junit4]   2> 1278405 WARN  (qtp9508125-14598) [n:localhost:50538_solr c:testCloudExamplePrompt s:shard2 r:core_node3 x:testCloudExamplePrompt_shard2_replica_n1] o.a.s.c.SolrConfig Couldn't add files from C:\Users\jenkins\workspace\Lucene-Solr-7.0-Windows\solr\build\solr-core\test\J0\temp\solr.util.TestSolrCLIRunExample_DF3FC52E0F1B9AC8-001\tempDir-003\node1\testCloudExamplePrompt_shard2_replica_n1\..\..\..\..\contrib\extraction\lib filtered by .*\.jar to classpath: C:\Users\jenkins\workspace\Lucene-Solr-7.0-Windows\solr\build\solr-core\test\J0\temp\solr.util.TestSolrCLIRunExample_DF3FC52E0F1B9AC8-001\tempDir-003\node1\testCloudExamplePrompt_shard2_replica_n1\..\..\..\..\contrib\extraction\lib
   [junit4]   2> 1278406 WARN  (qtp9508125-14597) [n:localhost:50538_solr c:testCloudExamplePrompt s:shard2 r:core_node4 x:testCloudExamplePrompt_shard2_replica_n2] o.a.s.c.SolrConfig Couldn't add files from C:\Users\jenkins\workspace\Lucene-Solr-7.0-Windows\solr\build\solr-core\test\J0\temp\solr.util.TestSolrCLIRunExample_DF3FC52E0F1B9AC8-001\tempDir-003\node1\testCloudExamplePrompt_shard2_replica_n2\..\..\..\..\dist filtered by solr-cell-\d.*\.jar to classpath: C:\Users\jenkins\workspace\Lucene-Solr-7.0-Windows\solr\build\solr-core\test\J0\temp\solr.util.TestSolrCLIRunExample_DF3FC52E0F1B9AC8-001\tempDir-003\node1\testCloudExamplePrompt_shard2_replica_n2\..\..\..\..\dist
   [junit4]   2> 1278407 WARN  (qtp9508125-14601) [n:localhost:50538_solr c:testCloudExamplePrompt s:shard1 r:core_node1 x:testCloudExamplePrompt_shard1_replica_n1] o.a.s.c.SolrConfig Couldn't add files from C:\Users\jenkins\workspace\Lucene-Solr-7.0-Windows\solr\build\solr-core\test\J0\temp\solr.util.TestSolrCLIRunExample_DF3FC52E0F1B9AC8-001\tempDir-003\node1\testCloudExamplePrompt_shard1_replica_n1\..\..\..\..\dist filtered by solr-cell-\d.*\.jar to classpath: C:\Users\jenkins\workspace\Lucene-Solr-7.0-Windows\solr\build\solr-core\test\J0\temp\solr.util.TestSolrCLIRunExample_DF3FC52E0F1B9AC8-001\tempDir-003\node1\testCloudExamplePrompt_shard1_replica_n1\..\..\..\..\dist
   [junit4]   2> 1278407 WARN  (qtp9508125-14598) [n:localhost:50538_solr c:testCloudExamplePrompt s:shard2 r:core_node3 x:testCloudExamplePrompt_shard2_replica_n1] o.a.s.c.SolrConfig Couldn't add files from C:\Users\jenkins\workspace\Lucene-Solr-7.0-Windows\solr\build\solr-core\test\J0\temp\solr.util.TestSolrCLIRunExample_DF3FC52E0F1B9AC8-001\tempDir-003\node1\testCloudExamplePrompt_shard2_replica_n1\..\..\..\..\dist filtered by solr-cell-\d.*\.jar to classpath: C:\Users\jenkins\workspace\Lucene-Solr-7.0-Windows\solr\build\solr-core\test\J0\temp\solr.util.TestSolrCLIRunExample_DF3FC52E0F1B9AC8-001\tempDir-003\node1\testCloudExamplePrompt_shard2_replica_n1\..\..\..\..\dist
   [junit4]   2> 1278408 WARN  (qtp9508125-14599) [n:localhost:50538_solr c:testCloudExamplePrompt s:shard1 r:core_node2 x:testCloudExamplePrompt_shard1_replica_n2] o.a.s.c.SolrConfig Couldn't add files from C:\Users\jenkins\workspace\Lucene-Solr-7.0-Windows\solr\build\solr-core\test\J0\temp\solr.util.TestSolrCLIRunExample_DF3FC52E0F1B9AC8-001\tempDir-003\node1\testCloudExamplePrompt_shard1_replica_n2\..\..\..\..\dist filtered by solr-cell-\d.*\.jar to classpath: C:\Users\jenkins\workspace\Lucene-Solr-7.0-Windows\solr\build\solr-core\test\J0\temp\solr.util.TestSolrCLIRunExample_DF3FC52E0F1B9AC8-001\tempDir-003\node1\testCloudExamplePrompt_shard1_replica_n2\..\..\..\..\dist
   [junit4]   2> 1278409 WARN  (qtp9508125-14598) [n:localhost:50538_solr c:testCloudExamplePrompt s:shard2 r:core_node3 x:testCloudExamplePrompt_shard2_replica_n1] o.a.s.c.SolrConfig Couldn't add files from C:\Users\jenkins\workspace\Lucene-Solr-7.0-Windows\solr\build\solr-core\test\J0\temp\solr.util.TestSolrCLIRunExample_DF3FC52E0F1B9AC8-001\tempDir-003\node1\testCloudExamplePrompt_shard2_replica_n1\..\..\..\..\contrib\clustering\lib filtered by .*\.jar to classpath: C:\Users\jenkins\workspace\Lucene-Solr-7.0-Windows\solr\build\solr-core\test\J0\temp\solr.util.TestSolrCLIRunExample_DF3FC52E0F1B9AC8-001\tempDir-003\node1\testCloudExamplePrompt_shard2_replica_n1\..\..\..\..\contrib\clustering\lib
   [junit4]   2> 1278409 WARN  (qtp9508125-14598) [n:localhost:50538_solr c:testCloudExamplePrompt s:shard2 r:core_node3 x:testCloudExamplePrompt_shard2_replica_n1] o.a.s.c.SolrConfig Couldn't add files from C:\Users\jenkins\workspace\Lucene-Solr-7.0-Windows\solr\build\solr-core\test\J0\temp\solr.util.TestSolrCLIRunExample_DF3FC52E0F1B9AC8-001\tempDir-003\node1\testCloudExamplePrompt_shard2_replica_n1\..\..\..\..\dist filtered by solr-clustering-\d.*\.jar to classpath: C:\Users\jenkins\workspace\Lucene-Solr-7.0-Windows\solr\build\solr-core\test\J0\temp\solr.util.TestSolrCLIRunExample_DF3FC52E0F1B9AC8-001\tempDir-003\node1\testCloudExamplePrompt_shard2_replica_n1\..\..\..\..\dist
   [junit4]   2> 1278410 WARN  (qtp9508125-14598) [n:localhost:50538_solr c:testCloudExamplePrompt s:shard2 r:core_node3 x:testCloudExamplePrompt_shard2_replica_n1] o.a.s.c.SolrConfig Couldn't add files from C:\Users\jenkins\workspace\Lucene-Solr-7.0-Windows\solr\build\solr-core\test\J0\temp\solr.util.TestSolrCLIRunExample_DF3FC52E0F1B9AC8-001\tempDir-003\node1\testCloudExamplePrompt_shard2_replica_n1\..\..\..\..\contrib\langid\lib filtered by .*\.jar to classpath: C:\Users\jenkins\workspace\Lucene-Solr-7.0-Windows\solr\build\solr-core\test\J0\temp\solr.util.TestSolrCLIRunExample_DF3FC52E0F1B9AC8-001\tempDir-003\node1\testCloudExamplePrompt_shard2_replica_n1\..\..\..\..\contrib\langid\lib
   [junit4]   2> 1278410 WARN  (qtp9508125-14598) [n:localhost:50538_solr c:testCloudExamplePrompt s:shard2 r:core_node3 x:testCloudExamplePrompt_shard2_replica_n1] o.a.s.c.SolrConfig Couldn't add files from C:\Users\jenkins\workspace\Lucene-Solr-7.0-Windows\solr\build\solr-core\test\J0\temp\solr.util.TestSolrCLIRunExample_DF3FC52E0F1B9AC8-001\tempDir-003\node1\testCloudExamplePrompt_shard2_replica_n1\..\..\..\..\dist filtered by solr-langid-\d.*\.jar to classpath: C:\Users\jenkins\workspace\Lucene-Solr-7.0-Windows\solr\build\solr-core\test\J0\temp\solr.util.TestSolrCLIRunExample_DF3FC52E0F1B9AC8-001\tempDir-003\node1\testCloudExamplePrompt_shard2_replica_n1\..\..\..\..\dist
   [junit4]   2> 1278411 WARN  (qtp9508125-14601) [n:localhost:50538_solr c:testCloudExamplePrompt s:shard1 r:core_node1 x:testCloudExamplePrompt_shard1_replica_n1] o.a.s.c.SolrConfig Couldn't add files from C:\Users\jenkins\workspace\Lucene-Solr-7.0-Windows\solr\build\solr-core\test\J0\temp\solr.util.TestSolrCLIRunExample_DF3FC52E0F1B9AC8-001\tempDir-003\node1\testCloudExamplePrompt_shard1_replica_n1\..\..\..\..\contrib\clustering\lib filtered by .*\.jar to classpath: C:\Users\jenkins\workspace\Lucene-Solr-7.0-Windows\solr\build\solr-core\test\J0\temp\solr.util.TestSolrCLIRunExample_DF3FC52E0F1B9AC8-001\tempDir-003\node1\testCloudExamplePrompt_shard1_replica_n1\..\..\..\..\contrib\clustering\lib
   [junit4]   2> 1278411 WARN  (qtp9508125-14601) [n:localhost:50538_solr c:testCloudExamplePrompt s:shard1 r:core_node1 x:testCloudExamplePrompt_shard1_replica_n1] o.a.s.c.SolrConfig Couldn't add files from C:\Users\jenkins\workspace\Lucene-Solr-7.0-Windows\solr\build\solr-core\test\J0\temp\solr.util.TestSolrCLIRunExample_DF3FC52E0F1B9AC8-001\tempDir-003\node1\testCloudExamplePrompt_shard1_replica_n1\..\..\..\..\dist filtered by solr-clustering-\d.*\.jar to classpath: C:\Users\jenkins\workspace\Lucene-Solr-7.0-Windows\solr\build\solr-core\test\J0\temp\solr.util.TestSolrCLIRunExample_DF3FC52E0F1B9AC8-001\tempDir-003\node1\testCloudExamplePrompt_shard1_replica_n1\..\..\..\..\dist
   [junit4]   2> 1278412 WARN  (qtp9508125-14597) [n:localhost:50538_solr c:testCloudExamplePrompt s:shard2 r:core_node4 x:testCloudExamplePrompt_shard2_replica_n2] o.a.s.c.SolrConfig Couldn't add files from C:\Users\jenkins\workspace\Lucene-Solr-7.0-Windows\solr\build\solr-core\test\J0\temp\solr.util.TestSolrCLIRunExample_DF3FC52E0F1B9AC8-001\tempDir-003\node1\testCloudExamplePrompt_shard2_replica_n2\..\..\..\..\contrib\clustering\lib filtered by .*\.jar to classpath: C:\Users\jenkins\workspace\Lucene-Solr-7.0-Windows\solr\build\solr-core\test\J0\temp\solr.util.TestSolrCLIRunExample_DF3FC52E0F1B9AC8-001\tempDir-003\node1\testCloudExamplePrompt_shard2_replica_n2\..\..\..\..\contrib\clustering\lib
   [junit4]   2> 1278411 WARN  (qtp9508125-14598) [n:localhost:50538_solr c:testCloudExamplePrompt s:shard2 r:core_node3 x:testCloudExamplePrompt_shard2_replica_n1] o.a.s.c.SolrConfig Couldn't add files from C:\Users\jenkins\workspace\Lucene-Solr-7.0-Windows\solr\build\solr-core\test\J0\temp\solr.util.TestSolrCLIRunExample_DF3FC52E0F1B9AC8-001\tempDir-003\node1\testCloudExamplePrompt_shard2_replica_n1\..\..\..\..\contrib\velocity\lib filtered by .*\.jar to classpath: C:\Users\jenkins\workspace\Lucene-Solr-7.0-Windows\solr\build\solr-core\test\J0\temp\solr.util.TestSolrCLIRunExample_DF3FC52E0F1B9AC8-001\tempDir-003\node1\testCloudExamplePrompt_shard2_replica_n1\..\..\..\..\contrib\velocity\lib
   [junit4]   2> 1278412 WARN  (qtp9508125-14597) [n:localhost:50538_solr c:testCloudExamplePrompt s:shard2 r:core_node4 x:testCloudExamplePrompt_shard2_replica_n2] o.a.s.c.SolrConfig Couldn't add files from C:\Users\jenkins\workspace\Lucene-Solr-7.0-Windows\solr\build\solr-core\test\J0\temp\solr.util.TestSolrCLIRunExample_DF3FC52E0F1B9AC8-001\tempDir-003\node1\testCloudExamplePrompt_shard2_replica_n2\..\..\..\..\dist filtered by solr-clustering-\d.*\.jar to classpath: C:\Users\jenkins\workspace\Lucene-Solr-7.0-Windows\solr\build\solr-core\test\J0\temp\solr.util.TestSolrCLIRunExample_DF3FC52E0F1B9AC8-001\tempDir-003\node1\testCloudExamplePrompt_shard2_replica_n2\..\..\..\..\dist
   [junit4]   2> 1278412 WARN  (qtp9508125-14598) [n:localhost:50538_solr c:testCloudExamplePrompt s:shard2 r:core_node3 x:testCloudExamplePrompt_shard2_replica_n1] o.a.s.c.SolrConfig Couldn't add files from C:\Users\jenkins\workspace\Lucene-Solr-7.0-Windows\solr\build\solr-core\test\J0\temp\solr.util.TestSolrCLIRunExample_DF3FC52E0F1B9AC8-001\tempDir-003\node1\testCloudExamplePrompt_shard2_replica_n1\..\..\..\..\dist filtered by solr-velocity-\d.*\.jar to classpath: C:\Users\jenkins\workspace\Lucene-Solr-7.0-Windows\solr\build\solr-core\test\J0\temp\solr.util.TestSolrCLIRunExample_DF3FC52E0F1B9AC8-001\tempDir-003\node1\testCloudExamplePrompt_shard2_replica_n1\..\..\..\..\dist
   [junit4]   2> 1278413 WARN  (qtp9508125-14601) [n:localhost:50538_solr c:testCloudExamplePrompt s:shard1 r:core_node1 x:testCloudExamplePrompt_shard1_replica_n1] o.a.s.c.SolrConfig Couldn't add files from C:\Users\jenkins\workspace\Lucene-Solr-7.0-Windows\solr\build\solr-core\test\J0\temp\solr.util.TestSolrCLIRunExample_DF3FC52E0F1B9AC8-001\tempDir-003\node1\testCloudExamplePrompt_shard1_replica_n1\..\..\..\..\contrib\langid\lib filtered by .*\.jar to classpath: C:\Users\jenkins\workspace\Lucene-Solr-7.0-Windows\solr\build\solr-core\test\J0\temp\solr.util.TestSolrCLIRunExample_DF3FC52E0F1B9AC8-001\tempDir-003\node1\testCloudExamplePrompt_shard1_replica_n1\..\..\..\..\contrib\langid\lib
   [junit4]   2> 1278413 WARN  (qtp9508125-14601) [n:localhost:50538_solr c:testCloudExamplePrompt s:shard1 r:core_node1 x:testCloudExamplePrompt_shard1_replica_n1] o.a.s.c.SolrConfig Couldn't add files from C:\Users\jenkins\workspace\Lucene-Solr-7.0-Windows\solr\build\solr-core\test\J0\temp\solr.util.TestSolrCLIRunExample_DF3FC52E0F1B9AC8-001\tempDir-003\node1\testCloudExamplePrompt_shard1_replica_n1\..\..\..\..\dist filtered by solr-langid-\d.*\.jar to classpath: C:\Users\jenkins\workspace\Lucene-Solr-7.0-Windows\solr\build\solr-core\test\J0\temp\solr.util.TestSolrCLIRunExample_DF3FC52E0F1B9AC8-001\tempDir-003\node1\testCloudExamplePrompt_shard1_replica_n1\..\..\..\..\dist
   [junit4]   2> 1278412 WARN  (qtp9508125-14599) [n:localhost:50538_solr c:testCloudExamplePrompt s:shard1 r:core_node2 x:testCloudExamplePrompt_shard1_replica_n2] o.a.s.c.SolrConfig Couldn't add files from C:\Users\jenkins\workspace\Lucene-Solr-7.0-Windows\solr\build\solr-core\test\J0\temp\solr.util.TestSolrCLIRunExample_DF3FC52E0F1B9AC8-001\tempDir-003\node1\testCloudExamplePrompt_shard1_replica_n2\..\..\..\..\contrib\clustering\lib filtered by .*\.jar to classpath: C:\Users\jenkins\workspace\Lucene-Solr-7.0-Windows\solr\build\solr-core\test\J0\temp\solr.util.TestSolrCLIRunExample_DF3FC52E0F1B9AC8-001\tempDir-003\node1\testCloudExamplePrompt_shard1_replica_n2\..\..\..\..\contrib\clustering\lib
   [junit4]   2> 1278413 WARN  (qtp9508125-14599) [n:localhost:50538_solr c:testCloudExamplePrompt s:shard1 r:core_node2 x:testCloudExamplePrompt_shard1_replica_n2] o.a.s.c.SolrConfig Couldn't add files from C:\Users\jenkins\workspace\Lucene-Solr-7.0-Windows\solr\build\solr-core\test\J0\temp\solr.util.TestSolrCLIRunExample_DF3FC52E0F1B9AC8-001\tempDir-003\node1\testCloudExamplePrompt_shard1_replica_n2\..\..\..\..\dist filtered by solr-clustering-\d.*\.jar to classpath: C:\Users\jenkins\workspace\Lucene-Solr-7.0-Windows\solr\build\solr-core\test\J0\temp\solr.util.TestSolrCLIRunExample_DF3FC52E0F1B9AC8-001\tempDir-003\node1\testCloudExamplePrompt_shard1_replica_n2\..\..\..\..\dist
   [junit4]   2> 1278414 WARN  (qtp9508125-14597) [n:localhost:50538_solr c:testCloudExamplePrompt s:shard2 r:core_node4 x:testCloudExamplePrompt_shard2_replica_n2] o.a.s.c.SolrConfig Couldn't add files from C:\Users\jenkins\workspace\Lucene-Solr-7.0-Windows\solr\build\solr-core\test\J0\temp\solr.util.TestSolrCLIRunExample_DF3FC52E0F1B9AC8-001\tempDir-003\node1\testCloudExamplePrompt_shard2_replica_n2\..\..\..\..\contrib\langid\lib filtered by .*\.jar to classpath: C:\Users\jenkins\workspace\Lucene-Solr-7.0-Windows\solr\build\solr-core\test\J0\temp\solr.util.TestSolrCLIRunExample_DF3FC52E0F1B9AC8-001\tempDir-003\node1\testCloudExamplePrompt_shard2_replica_n2\..\..\..\..\contrib\langid\lib
   [junit4]   2> 1278415 WARN  (qtp9508125-14597) [n:localhost:50538_solr c:testCloudExamplePrompt s:shard2 r:core_node4 x:testCloudExamplePrompt_shard2_replica_n2] o.a.s.c.SolrConfig Couldn't add files from C:\Users\jenkins\workspace\Lucene-Solr-7.0-Windows\solr\build\solr-core\test\J0\temp\solr.util.TestSolrCLIRunExample_DF3FC52E0F1B9AC8-001\tempDir-003\node1\testCloudExamplePrompt_shard2_replica_n2\..\..\..\..\dist filtered by solr-langid-\d.*\.jar to classpath: C:\Users\jenkins\workspace\Lucene-Solr-7.0-Windows\solr\build\solr-core\test\J0\temp\solr.util.TestSolrCLIRunExample_DF3FC52E0F1B9AC8-001\tempDir-003\node1\testCloudExamplePrompt_shard2_replica_n2\..\..\..\..\dist
   [junit4]   2> 1278415 WARN  (qtp9508125-14601) [n:localhost:50538_solr c:testCloudExamplePrompt s:shard1 r:core_node1 x:testCloudExamplePrompt_shard1_replica_n1] o.a.s.c.SolrConfig Couldn't add files from C:\Users\jenkins\workspace\Lucene-Solr-7.0-Windows\solr\build\solr-core\test\J0\temp\solr.util.TestSolrCLIRunExample_DF3FC52E0F1B9AC8-001\tempDir-003\node1\testCloudExamplePrompt_shard1_replica_n1\..\..\..\..\contrib\velocity\lib filtered by .*\.jar to classpath: C:\Users\jenkins\workspace\Lucene-Solr-7.0-Windows\solr\build\solr-core\test\J0\temp\solr.util.TestSolrCLIRunExample_DF3FC52E0F1B9AC8-001\tempDir-003\node1\testCloudExamplePrompt_shard1_replica_n1\..\..\..\..\contrib\velocity\lib
   [junit4]   2> 1278415 WARN  (qtp9508125-14601) [n:localhost:50538_solr c:testCloudExamplePrompt s:shard1 r:core_node1 x:testCloudExamplePrompt_shard1_replica_n1] o.a.s.c.SolrConfig Couldn't add files from C:\Users\jenkins\workspace\Lucene-Solr-7.0-Windows\solr\build\solr-core\test\J0\temp\solr.util.TestSolrCLIRunExample_DF3FC52E0F1B9AC8-001\tempDir-003\node1\testCloudExamplePrompt_shard1_replica_n1\..\..\..\..\dist filtered by solr-velocity-\d.*\.jar to classpath: C:\Users\jenkins\workspace\Lucene-Solr-7.0-Windows\solr\build\solr-core\test\J0\temp\solr.util.TestSolrCLIRunExample_DF3FC52E0F1B9AC8-001\tempDir-003\node1\testCloudExamplePrompt_shard1_replica_n1\..\..\..\..\dist
   [junit4]   2> 1278419 INFO  (qtp9508125-14598) [n:localhost:50538_solr c:testCloudExamplePrompt s:shard2 r:core_node3 x:testCloudExamplePrompt_shard2_replica_n1] o.a.s.c.SolrConfig Using Lucene MatchVersion: 7.0.0
   [junit4]   2> 1278422 INFO  (qtp9508125-14601) [n:localhost:50538_solr c:testCloudExamplePrompt s:shard1 r:core_node1 x:testCloudExamplePrompt_shard1_replica_n1] o.a.s.c.SolrConfig Using Lucene MatchVersion: 7.0.0
   [junit4]   2> 1278437 WARN  (qtp9508125-14599) [n:localhost:50538_solr c:testCloudExamplePrompt s:shard1 r:core_node2 x:testCloudExamplePrompt_shard1_replica_n2] o.a.s.c.SolrConfig Couldn't add files from C:\Users\jenkins\workspace\Lucene-Solr-7.0-Windows\solr\build\solr-core\test\J0\temp\solr.util.TestSolrCLIRunExample_DF3FC52E0F1B9AC8-001\tempDir-003\node1\testCloudExamplePrompt_shard1_replica_n2\..\..\..\..\contrib\langid\lib filtered by .*\.jar to classpath: C:\Users\jenkins\workspace\Lucene-Solr-7.0-Windows\solr\build\solr-core\test\J0\temp\solr.util.TestSolrCLIRunExample_DF3FC52E0F1B9AC8-001\tempDir-003\node1\testCloudExamplePrompt_shard1_replica_n2\..\..\..\..\contrib\langid\lib
   [junit4]   2> 1278437 WARN  (qtp9508125-14599) [n:localhost:50538_solr c:testCloudExamplePrompt s:shard1 r:core_node2 x:testCloudExamplePrompt_shard1_replica_n2] o.a.s.c.SolrConfig Couldn't add files from C:\Users\jenkins\workspace\Lucene-Solr-7.0-Windows\solr\build\solr-core\test\J0\temp\solr.util.TestSolrCLIRunExample_DF3FC52E0F1B9AC8-001\tempDir-003\node1\testCloudExamplePrompt_shard1_replica_n2\..\..\..\..\dist filtered by solr-langid-\d.*\.jar to classpath: C:\Users\jenkins\workspace\Lucene-Solr-7.0-Windows\solr\build\solr-core\test\J0\temp\solr.util.TestSolrCLIRunExample_DF3FC52E0F1B9AC8-001\tempDir-003\node1\testCloudExamplePrompt_shard1_replica_n2\..\..\..\..\dist
   [junit4]   2> 1278438 WARN  (qtp9508125-14597) [n:localhost:50538_solr c:testCloudExamplePrompt s:shard2 r:core_node4 x:testCloudExamplePrompt_shard2_replica_n2] o.a.s.c.SolrConfig Couldn't add files from C:\Users\jenkins\workspace\Lucene-Solr-7.0-Windows\solr\build\solr-core\test\J0\temp\solr.util.TestSolrCLIRunExample_DF3FC52E0F1B9AC8-001\tempDir-003\node1\testCloudExamplePrompt_shard2_replica_n2\..\..\..\..\contrib\velocity\lib filtered by .*\.jar to classpath: C:\Users\jenkins\workspace\Lucene-Solr-7.0-Windows\solr\build\solr-core\test\J0\temp\solr.util.TestSolrCLIRunExample_DF3FC52E0F1B9AC8-001\tempDir-003\node1\testCloudExamplePrompt_shard2_replica_n2\..\..\..\..\contrib\velocity\lib
   [junit4]   2> 1278439 WARN  (qtp9508125-14597) [n:localhost:50538_solr c:testCloudExamplePrompt s:shard2 r:core_node4 x:testCloudExamplePrompt_shard2_replica_n2] o.a.s.c.SolrConfig Couldn't add files from C:\Users\jenkins\workspace\Lucene-Solr-7.0-Windows\solr\build\solr-core\test\J0\temp\solr.util.TestSolrCLIRunExample_DF3FC52E0F1B9AC8-001\tempDir-003\node1\testCloudExamplePrompt_shard2_replica_n2\..\..\..\..\dist filtered by solr-velocity-\d.*\.jar to classpath: C:\Users\jenkins\workspace\Lucene-Solr-7.0-Windows\solr\build\solr-core\test\J0\temp\solr.util.TestSolrCLIRunExample_DF3FC52E0F1B9AC8-001\tempDir-003\node1\testCloudExamplePrompt_shard2_replica_n2\..\..\..\..\dist
   [junit4]   2> 1278440 WARN  (qtp9508125-14599) [n:localhost:50538_solr c:testCloudExamplePrompt s:shard1 r:core_node2 x:testCloudExamplePrompt_shard1_replica_n2] o.a.s.c.SolrConfig Couldn't add files from C:\Users\jenkins\workspace\Lucene-Solr-7.0-Windows\solr\build\solr-core\test\J0\temp\solr.util.TestSolrCLIRunExample_DF3FC52E0F1B9AC8-001\tempDir-003\node1\testCloudExamplePrompt_shard1_replica_n2\..\..\..\..\contrib\velocity\lib filtered by .*\.jar to classpath: C:\Users\jenkins\workspace\Lucene-Solr-7.0-Windows\solr\build\solr-core\test\J0\temp\solr.util.TestSolrCLIRunExample_DF3FC52E0F1B9AC8-001\tempDir-003\node1\testCloudExamplePrompt_shard1_replica_n2\..\..\..\..\contrib\velocity\lib
   [junit4]   2> 1278441 WARN  (qtp9508125-14599) [n:localhost:50538_solr c:testCloudExamplePrompt s:shard1 r:core_node2 x:testCloudExamplePrompt_shard1_replica_n2] o.a.s.c.SolrConfig Couldn't add files from C:\Users\jenkins\workspace\Lucene-Solr-7.0-Windows\solr\build\solr-core\test\J0\temp\solr.util.TestSolrCLIRunExample_DF3FC52E0F1B9AC8-001\tempDir-003\node1\testCloudExamplePrompt_shard1_replica_n2\..\..\..\..\dist filtered by solr-velocity-\d.*\.jar to classpath: C:\Users\jenkins\workspace\Lucene-Solr-7.0-Windows\solr\build\solr-core\test\J0\temp\solr.util.TestSolrCLIRunExample_DF3FC52E0F1B9AC8-001\tempDir-003\node1\testCloudExamplePrompt_shard1_replica_n2\..\..\..\..\dist
   [junit4]   2> 1278446 INFO  (qtp9508125-14597) [n:localhost:50538_solr c:testCloudExamplePrompt s:shard2 r:core_node4 x:testCloudExamplePrompt_shard2_replica_n2] o.a.s.c.SolrConfig Using Lucene MatchVersion: 7.0.0
   [junit4]   2> 1278449 INFO  (qtp9508125-14599) [n:localhost:50538_solr c:testCloudExamplePrompt s:shard1 r:core_node2 x:testCloudExamplePrompt_shard1_replica_n2] o.a.s.c.SolrConfig Using Lucene MatchVersion: 7.0.0
   [junit4]   2> 1278456 INFO  (qtp9508125-14601) [n:localhost:50538_solr c:testCloudExamplePrompt s:shard1 r:core_node1 x:testCloudExamplePrompt_shard1_replica_n1] o.a.s.s.IndexSchema [testCloudExamplePrompt_shard1_replica_n1] Schema name=default-config
   [junit4]   2> 1278463 INFO  (qtp9508125-14598) [n:localhost:50538_solr c:testCloudExamplePrompt s:shard2 r:core_node3 x:testCloudExamplePrompt_shard2_replica_n1] o.a.s.s.IndexSchema [testCloudExamplePrompt_shard2_replica_n1] Schema name=default-config
   [junit4]   2> 1278474 INFO  (qtp9508125-14597) [n:localhost:50538_solr c:testCloudExamplePrompt s:shard2 r:core_node4 x:testCloudExamplePrompt_shard2_replica_n2] o.a.s.s.IndexSchema [testCloudExamplePrompt_shard2_replica_n2] Schema name=default-config
   [junit4]   2> 1278479 INFO  (qtp9508125-14599) [n:localhost:50538_solr c:testCloudExamplePrompt s:shard1 r:core_node2 x:testCloudExamplePrompt_shard1_replica_n2] o.a.s.s.IndexSchema [testCloudExamplePrompt_shard1_replica_n2] Schema name=default-config
   [junit4]   2> 1278883 INFO  (qtp9508125-14601) [n:localhost:50538_solr c:testCloudExamplePrompt s:shard1 r:core_node1 x:testCloudExamplePrompt_shard1_replica_n1] o.a.s.s.IndexSchema Loaded schema default-config/1.6 with uniqueid field id
   [junit4]   2> 1278883 INFO  (qtp9508125-14598) [n:localhost:50538_solr c:testCloudExamplePrompt s:shard2 r:core_node3 x:testCloudExamplePrompt_shard2_replica_n1] o.a.s.s.IndexSchema Loaded schema default-config/1.6 with uniqueid field id
   [junit4]   2> 1278885 INFO  (qtp9508125-14599) [n:localhost:50538_solr c:testCloudExamplePrompt s:shard1 r:core_node2 x:testCloudExamplePrompt_shard1_replica_n2] o.a.s.s.IndexSchema Loaded schema default-config/1.6 with uniqueid field id
   [junit4]   2> 1278919 INFO  (qtp9508125-14597) [n:localhost:50538_solr c:testCloudExamplePrompt s:shard2 r:core_node4 x:testCloudExamplePrompt_shard2_replica_n2] o.a.s.s.IndexSchema Loaded schema default-config/1.6 with uniqueid field id
   [junit4]   2> 1278931 INFO  (qtp9508125-14601) [n:localhost:50538_solr c:testCloudExamplePrompt s:shard1 r:core_node1 x:testCloudExamplePrompt_shard1_replica_n1] o.a.s.c.CoreContainer Creating SolrCore 'testCloudExamplePrompt_shard1_replica_n1' using configuration from collection testCloudExamplePrompt, trusted=true
   [junit4]   2> 1278931 INFO  (qtp9508125-14598) [n:localhost:50538_solr c:testCloudExamplePrompt s:shard2 r:core_node3 x:testCloudExamplePrompt_shard2_replica_n1] o.a.s.c.CoreContainer Creating SolrCore 'testCloudExamplePrompt_shard2_replica_n1' using configuration from collection testCloudExamplePrompt, trusted=true
   [junit4]   2> 1278935 INFO  (qtp9508125-14598) [n:localhost:50538_solr c:testCloudExamplePrompt s:shard2 r:core_node3 x:testCloudExamplePrompt_shard2_replica_n1] o.a.s.m.r.SolrJmxReporter JMX monitoring for 'solr.core.testCloudExamplePrompt.shard2.replica_n1' (registry 'solr.core.testCloudExamplePrompt.shard2.replica_n1') enabled at server: com.sun.jmx.mbeanserver.JmxMBeanServer@b643a5
   [junit4]   2> 1278935 INFO  (qtp9508125-14601) [n:localhost:50538_solr c:testCloudExamplePrompt s:shard1 r:core_node1 x:testCloudExamplePrompt_shard1_replica_n1] o.a.s.m.r.SolrJmxReporter JMX monitoring for 'solr.core.testCloudExamplePrompt.shard1.replica_n1' (registry 'solr.core.testCloudExamplePrompt.shard1.replica_n1') enabled at server: com.sun.jmx.mbeanserver.JmxMBeanServer@b643a5
   [junit4]   2> 1278936 INFO  (qtp9508125-14598) [n:localhost:50538_solr c:testCloudExamplePrompt s:shard2 r:core_node3 x:testCloudExamplePrompt_shard2_replica_n1] o.a.s.c.SolrCore solr.RecoveryStrategy.Builder
   [junit4]   2> 1278936 INFO  (qtp9508125-14601) [n:localhost:50538_solr c:testCloudExamplePrompt s:shard1 r:core_node1 x:testCloudExamplePrompt_shard1_replica_n1] o.a.s.c.SolrCore solr.RecoveryStrategy.Builder
   [junit4]   2> 1278936 INFO  (qtp9508125-14598) [n:localhost:50538_solr c:testCloudExamplePrompt s:shard2 r:core_node3 x:testCloudExamplePrompt_shard2_replica_n1] o.a.s.c.SolrCore [[testCloudExamplePrompt_shard2_replica_n1] ] Opening new SolrCore at [C:\Users\jenkins\workspace\Lucene-Solr-7.0-Windows\solr\build\solr-core\test\J0\temp\solr.util.TestSolrCLIRunExample_DF3FC52E0F1B9AC8-001\tempDir-003\node1\testCloudExamplePrompt_shard2_replica_n1], dataDir=[C:\Users\jenkins\workspace\Lucene-Solr-7.0-Windows\solr\build\solr-core\test\J0\temp\solr.util.TestSolrCLIRunExample_DF3FC52E0F1B9AC8-001\tempDir-003\node1\testCloudExamplePrompt_shard2_replica_n1\data\]
   [junit4]   2> 1278936 INFO  (qtp9508125-14601) [n:localhost:50538_solr c:testCloudExamplePrompt s:shard1 r:core_node1 x:testCloudExamplePrompt_shard1_replica_n1] o.a.s.c.SolrCore [[testCloudExamplePrompt_shard1_replica_n1] ] Opening new SolrCore at [C:\Users\jenkins\workspace\Lucene-Solr-7.0-Windows\solr\build\solr-core\test\J0\temp\solr.util.TestSolrCLIRunExample_DF3FC52E0F1B9AC8-001\tempDir-003\node1\testCloudExamplePrompt_shard1_replica_n1], dataDir=[C:\Users\jenkins\workspace\Lucene-Solr-7.0-Windows\solr\build\solr-core\test\J0\temp\solr.util.TestSolrCLIRunExample_DF3FC52E0F1B9AC8-001\tempDir-003\node1\testCloudExamplePrompt_shard1_replica_n1\data\]
   [junit4]   2> 1278949 INFO  (qtp9508125-14599) [n:localhost:50538_solr c:testCloudExamplePrompt s:shard1 r:core_node2 x:testCloudExamplePrompt_shard1_replica_n2] o.a.s.c.CoreContainer Creating SolrCore 'testCloudExamplePrompt_shard1_replica_n2' using configuration from collection testCloudExamplePrompt, trusted=true
   [junit4]   2> 1278949 INFO  (qtp9508125-14599) [n:localhost:50538_solr c:testCloudExamplePrompt s:shard1 r:core_node2 x:testCloudExamplePrompt_shard1_replica_n2] o.a.s.m.r.SolrJmxReporter JMX monitoring for 'solr.core.testCloudExamplePrompt.shard1.replica_n2' (registry 'solr.core.testCloudExamplePrompt.shard1.replica_n2') enabled at server: com.sun.jmx.mbeanserver.JmxMBeanServer@b643a5
   [junit4]   2> 1278950 INFO  (qtp9508125-14599) [n:localhost:50538_solr c:testCloudExamplePrompt s:shard1 r:core_node2 x:testCloudExamplePrompt_shard1_replica_n2] o.a.s.c.SolrCore solr.RecoveryStrategy.Builder
   [junit4]   2> 1278950 INFO  (qtp9508125-14599) [n:localhost:50538_solr c:testCloudExamplePrompt s:shard1 r:core_node2 x:testCloudExamplePrompt_shard1_replica_n2] o.a.s.c.SolrCore [[testCloudExamplePrompt_shard1_replica_n2] ] Opening new SolrCore at [C:\Users\jenkins\workspace\Lucene-Solr-7.0-Windows\solr\build\solr-core\test\J0\temp\solr.util.TestSolrCLIRunExample_DF3FC52E0F1B9AC8-001\tempDir-003\node1\testCloudExamplePrompt_shard1_replica_n2], dataDir=[C:\Users\jenkins\workspace\Lucene-Solr-7.0-Windows\solr\build\solr-core\test\J0\temp\solr.util.TestSolrCLIRunExample_DF3FC52E0F1B9AC8-001\tempDir-003\node1\testCloudExamplePrompt_shard1_replica_n2\data\]
   [junit4]   2> 1278953 INFO  (qtp9508125-14601) [n:localhost:50538_solr c:testCloudExamplePrompt s:shard1 r:core_node1 x:testCloudExamplePrompt_shard1_replica_n1] o.a.s.r.XSLTResponseWriter xsltCacheLifetimeSeconds=5
   [junit4]   2> 1278962 INFO  (qtp9508125-14598) [n:localhost:50538_solr c:testCloudExamplePrompt s:shard2 r:core_node3 x:testCloudExamplePrompt_shard2_replica_n1] o.a.s.r.XSLTResponseWriter xsltCacheLifetimeSeconds=5
   [junit4]   2> 1278973 INFO  (qtp9508125-14599) [n:localhost:50538_solr c:testCloudExamplePrompt s:shard1 r:core_node2 x:testCloudExamplePrompt_shard1_replica_n2] o.a.s.r.XSLTResponseWriter xsltCacheLifetimeSeconds=5
   [junit4]   2> 1279002 INFO  (qtp9508125-14597) [n:localhost:50538_solr c:testCloudExamplePrompt s:shard2 r:core_node4 x:testCloudExamplePrompt_shard2_replica_n2] o.a.s.c.CoreContainer Creating SolrCore 'testCloudExamplePrompt_shard2_replica_n2' using configuration from collection testCloudExamplePrompt, trusted=true
   [junit4]   2> 1279002 INFO  (qtp9508125-14597) [n:localhost:50538_solr c:testCloudExamplePrompt s:shard2 r:core_node4 x:testCloudExamplePrompt_shard2_replica_n2] o.a.s.m.r.SolrJmxReporter JMX monitoring for 'solr.core.testCloudExamplePrompt.shard2.replica_n2' (registry 'solr.core.testCloudExamplePrompt.shard2.replica_n2') enabled at server: com.sun.jmx.mbeanserver.JmxMBeanServer@b643a5
   [junit4]   2> 1279003 INFO  (qtp9508125-14597) [n:localhost:50538_solr c:testCloudExamplePrompt s:shard2 r:core_node4 x:testCloudExamplePrompt_shard2_replica_n2] o.a.s.c.SolrCore solr.RecoveryStrategy.Builder
   [junit4]   2> 1279003 INFO  (qtp9508125-14597) [n:localhost:50538_solr c:testCloudExamplePrompt s:shard2 r:core_node4 x:testCloudExamplePrompt_shard2_replica_n2] o.a.s.c.SolrCore [[testCloudExamplePrompt_shard2_replica_n2] ] Opening new SolrCore at [C:\Users\jenkins\workspace\Lucene-Solr-7.0-Windows\solr\build\solr-core\test\J0\temp\solr.util.TestSolrCLIRunExample_DF3FC52E0F1B9AC8-001\tempDir-003\node1\testCloudExamplePrompt_shard2_replica_n2], dataDir=[C:\Users\jenkins\workspace\Lucene-Solr-7.0-Windows\solr\build\solr-core\test\J0\temp\solr.util.TestSolrCLIRunExample_DF3FC52E0F1B9AC8-001\tempDir-003\node1\testCloudExamplePrompt_shard2_replica_n2\data\]
   [junit4]   2> 1279031 INFO  (qtp9508125-14597) [n:localhost:50538_solr c:testCloudExamplePrompt s:shard2 r:core_node4 x:testCloudExamplePrompt_shard2_replica_n2] o.a.s.r.XSLTResponseWriter xsltCacheLifetimeSeconds=5
   [junit4]   2> 1279097 INFO  (qtp9508125-14598) [n:localhost:50538_solr c:testCloudExamplePrompt s:shard2 r:core_node3 x:testCloudExamplePrompt_shard2_replica_n1] o.a.s.u.UpdateHandler Using UpdateLog implementation: org.apache.solr.update.UpdateLog
   [junit4]   2> 1279097 INFO  (qtp9508125-14598) [n:localhost:50538_solr c:testCloudExamplePrompt s:shard2 r:core_node3 x:testCloudExamplePrompt_shard2_replica_n1] o.a.s.u.UpdateLog Initializing UpdateLog: dataDir= defaultSyncLevel=FLUSH numRecordsToKeep=100 maxNumLogsToKeep=10 numVersionBuckets=65536
   [junit4]   2> 1279099 INFO  (qtp9508125-14598) [n:localhost:50538_solr c:testCloudExamplePrompt s:shard2 r:core_node3 x:testCloudExamplePrompt_shard2_replica_n1] o.a.s.u.CommitTracker Hard AutoCommit: if uncommited for 15000ms; 
   [junit4]   2> 1279099 INFO  (qtp9508125-14598) [n:localhost:50538_solr c:testCloudExamplePrompt s:shard2 r:core_node3 x:testCloudExamplePrompt_shard2_replica_n1] o.a.s.u.CommitTracker Soft AutoCommit: disabled
   [junit4]   2> 1279103 INFO  (qtp9508125-14598) [n:localhost:50538_solr c:testCloudExamplePrompt s:shard2 r:core_node3 x:testCloudExamplePrompt_shard2_replica_n1] o.a.s.s.SolrIndexSearcher Opening [Searcher@1e37f06[testCloudExamplePrompt_shard2_replica_n1] main]
   [junit4]   2> 1279112 INFO  (qtp9508125-14598) [n:localhost:50538_solr c:testCloudExamplePrompt s:shard2 r:core_node3 x:testCloudExamplePrompt_shard2_replica_n1] o.a.s.r.ManagedResourceStorage Configured ZooKeeperStorageIO with znodeBase: /configs/testCloudExamplePrompt
   [junit4]   2> 1279112 INFO  (qtp9508125-14598) [n:localhost:50538_solr c:testCloudExamplePrompt s:shard2 r:core_node3 x:testCloudExamplePrompt_shard2_replica_n1] o.a.s.r.ManagedResourceStorage Loaded null at path _rest_managed.json using ZooKeeperStorageIO:path=/configs/testCloudExamplePrompt
   [junit4]   2> 1279112 INFO  (qtp9508125-14598) [n:localhost:50538_solr c:testCloudExamplePrompt s:shard2 r:core_node3 x:testCloudExamplePrompt_shard2_replica_n1] o.a.s.s.ZkIndexSchemaReader Creating ZooKeeper watch for the managed schema at /configs/testCloudExamplePrompt/managed-schema
   [junit4]   2> 1279113 INFO  (qtp9508125-14598) [n:localhost:50538_solr c:testCloudExamplePrompt s:shard2 r:core_node3 x:testCloudExamplePrompt_shard2_replica_n1] o.a.s.s.ZkIndexSchemaReader Current schema version 0 is already the latest
   [junit4]   2> 1279114 INFO  (qtp9508125-14598) [n:localhost:50538_solr c:testCloudExamplePrompt s:shard2 r:core_node3 x:testCloudExamplePrompt_shard2_replica_n1] o.a.s.h.c.SpellCheckComponent Initializing spell checkers
   [junit4]   2> 1279114 INFO  (qtp9508125-14598) [n:localhost:50538_solr c:testCloudExamplePrompt s:shard2 r:core_node3 x:testCloudExamplePrompt_shard2_replica_n1] o.a.s.s.DirectSolrSpellChecker init: {name=default,field=_text_,classname=solr.DirectSolrSpellChecker,distanceMeasure=internal,accuracy=0.5,maxEdits=2,minPrefix=1,maxInspections=5,minQueryLength=4,maxQueryFrequency=0.01}
   [junit4]   2> 1279115 INFO  (qtp9508125-14598) [n:localhost:50538_solr c:testCloudExamplePrompt s:shard2 r:core_node3 x:testCloudExamplePrompt_shard2_replica_n1] o.a.s.h.ReplicationHandler Commits will be reserved for  10000
   [junit4]   2> 1279115 INFO  (qtp9508125-14598) [n:localhost:50538_solr c:testCloudExamplePrompt s:shard2 r:core_node3 x:testCloudExamplePrompt_shard2_replica_n1] o.a.s.u.UpdateLog Could not find max version in index or recent updates, using new clock 1575309598442651648
   [junit4]   2> 1279129 INFO  (qtp9508125-14598) [n:localhost:50538_solr c:testCloudExamplePrompt s:shard2 r:core_node3 x:testCloudExamplePrompt_shard2_replica_n1] o.a.s.c.ShardLeaderElectionContext Waiting until we see more replicas up for shard shard2: total=2 found=1 timeoutin=179999ms
   [junit4]   2> 1279212 INFO  (qtp9508125-14597) [n:localhost:50538_solr c:testCloudExamplePrompt s:shard2 r:core_node4 x:testCloudExamplePrompt_shard2_replica_n2] o.a.s.u.UpdateHandler Using UpdateLog implementation: org.apache.solr.update.UpdateLog
   [junit4]   2> 1279212 INFO  (qtp9508125-14597) [n:localhost:50538_solr c:testCloudExamplePrompt s:shard2 r:core_node4 x:testCloudExamplePrompt_shard2_replica_n2] o.a.s.u.UpdateLog Initializing UpdateLog: dataDir= defaultSyncLevel=FLUSH numRecordsToKeep=100 maxNumLogsToKeep=10 numVersionBuckets=65536
   [junit4]   2> 1279214 INFO  (qtp9508125-14597) [n:localhost:50538_solr c:testCloudExamplePrompt s:shard2 r:core_node4 x:testCloudExamplePrompt_shard2_replica_n2] o.a.s.u.CommitTracker Hard AutoCommit: if uncommited for 15000ms; 
   [junit4]   2> 1279214 INFO  (qtp9508125-14597) [n:localhost:50538_solr c:testCloudExamplePrompt s:shard2 r:core_node4 x:testCloudExamplePrompt_shard2_replica_n2] o.a.s.u.CommitTracker Soft AutoCommit: disabled
   [junit4]   2> 1279218 INFO  (qtp9508125-14597) [n:localhost:50538_solr c:testCloudExamplePrompt s:shard2 r:core_node4 x:testCloudExamplePrompt_shard2_replica_n2] o.a.s.s.SolrIndexSearcher Opening [Searcher@a88571[testCloudExamplePrompt_shard2_replica_n2] main]
   [junit4]   2> 1279220 INFO  (qtp9508125-14597) [n:localhost:50538_solr c:testCloudExamplePrompt s:shard2 r:core_node4 x:testCloudExamplePrompt_shard2_replica_n2] o.a.s.r.ManagedResourceStorage Configured ZooKeeperStorageIO with znodeBase: /configs/testCloudExamplePrompt
   [junit4]   2> 1279221 INFO  (qtp9508125-14597) [n:localhost:50538_solr c:testCloudExamplePrompt s:shard2 r:core_node4 x:testCloudExamplePrompt_shard2_replica_n2] o.a.s.r.ManagedResourceStorage Loaded null at path _rest_managed.json using ZooKeeperStorageIO:path=/configs/testCloudExamplePrompt
   [junit4]   2> 1279221 INFO  (qtp9508125-14597) [n:localhost:50538_solr c:testCloudExamplePrompt s:shard2 r:core_node4 x:testCloudExamplePrompt_shard2_replica_n2] o.a.s.s.ZkIndexSchemaReader Creating ZooKeeper watch for the managed schema at /configs/testCloudExamplePrompt/managed-schema
   [junit4]   2> 1279221 INFO  (qtp9508125-14597) [n:localhost:50538_solr c:testCloudExamplePrompt s:shard2 r:core_node4 x:testCloudExamplePrompt_shard2_replica_n2] o.a.s.s.ZkIndexSchemaReader Current schema version 0 is already the latest
   [junit4]   2> 1279222 INFO  (qtp9508125-14597) [n:localhost:50538_solr c:testCloudExamplePrompt s:shard2 r:core_node4 x:testCloudExamplePrompt_shard2_replica_n2] o.a.s.h.c.SpellCheckComponent Initializing spell checkers
   [junit4]   2> 1279222 INFO  (qtp9508125-14597) [n:localhost:50538_solr c:testCloudExamplePrompt s:shard2 r:core_node4 x:testCloudExamplePrompt_shard2_replica_n2] o.a.s.s.DirectSolrSpellChecker init: {name=default,field=_text_,classname=solr.DirectSolrSpellChecker,distanceMeasure=internal,accuracy=0.5,maxEdits=2,minPrefix=1,maxInspections=5,minQueryLength=4,maxQueryFrequency=0.01}
   [junit4]   2> 1279224 INFO  (qtp9508125-14597) [n:localhost:50538_solr c:testCloudExamplePrompt s:shard2 r:core_node4 x:testCloudExamplePrompt_shard2_replica_n2] o.a.s.h.ReplicationHandler Commits will be reserved for  10000
   [junit4]   2> 1279224 INFO  (qtp9508125-14597) [n:localhost:50538_solr c:testCloudExamplePrompt s:shard2 r:core_node4 x:testCloudExamplePrompt_shard2_replica_n2] o.a.s.u.UpdateLog Could not find max version in index or recent updates, using new clock 1575309598556946432
   [junit4]   2> 1279224 INFO  (qtp9508125-14601) [n:localhost:50538_solr c:testCloudExamplePrompt s:shard1 r:core_node1 x:testCloudExamplePrompt_shard1_replica_n1] o.a.s.u.UpdateHandler Using UpdateLog implementation: org.apache.solr.update.UpdateLog
   [junit4]   2> 1279224 INFO  (qtp9508125-14601) [n:localhost:50538_solr c:testCloudExamplePrompt s:shard1 r:core_node1 x:testCloudExamplePrompt_shard1_replica_n1] o.a.s.u.UpdateLog Initializing UpdateLog: dataDir= defaultSyncLevel=FLUSH numRecordsToKeep=100 maxNumLogsToKeep=10 numVersionBuckets=65536
   [junit4]   2> 1279226 INFO  (qtp9508125-14599) [n:localhost:50538_solr c:testCloudExamplePrompt s:shard1 r:core_node2 x:testCloudExamplePrompt_shard1_replica_n2] o.a.s.u.UpdateHandler Using UpdateLog implementation: org.apache.solr.update.UpdateLog
   [junit4]   2> 1279228 INFO  (qtp9508125-14599) [n:localhost:50538_solr c:testCloudExamplePrompt s:shard1 r:core_node2 x:testCloudExamplePrompt_shard1_replica_n2] o.a.s.u.UpdateLog Initializing UpdateLog: dataDir= defaultSyncLevel=FLUSH numRecordsToKeep=100 maxNumLogsToKeep=10 numVersionBuckets=65536
   [junit4]   2> 1279228 INFO  (qtp9508125-14601) [n:localhost:50538_solr c:testCloudExamplePrompt s:shard1 r:core_node1 x:testCloudExamplePrompt_shard1_replica_n1] o.a.s.u.CommitTracker Hard AutoCommit: if uncommited for 15000ms; 
   [junit4]   2> 1279228 INFO  (qtp9508125-14601) [n:localhost:50538_solr c:testCloudExamplePrompt s:shard1 r:core_node1 x:testCloudExamplePrompt_shard1_replica_n1] o.a.s.u.CommitTracker Soft AutoCommit: disabled
   [junit4]   2> 1279234 INFO  (searcherExecutor-5581-thread-1-processing-n:localhost:50538_solr x:testCloudExamplePrompt_shard2_replica_n2 s:shard2 c:testCloudExamplePrompt r:core_node4) [n:localhost:50538_solr c:testCloudExamplePrompt s:shard2 r:core_node4 x:testCloudExamplePrompt_shard2_replica_n2] o.a.s.c.QuerySenderListener QuerySenderListener sending requests to Searcher@a88571[testCloudExamplePrompt_shard2_replica_n2] main{ExitableDirectoryReader(UninvertingDirectoryReader())}
   [junit4]   2> 1279234 INFO  (searcherExecutor-5581-thread-1-processing-n:localhost:50538_solr x:testCloudExamplePrompt_shard2_replica_n2 s:shard2 c:testCloudExamplePrompt r:core_node4) [n:localhost:50538_solr c:testCloudExamplePrompt s:shard2 r:core_node4 x:testCloudExamplePrompt_shard2_replica_n2] o.a.s.c.QuerySenderListener QuerySenderListener done.
   [junit4]   2> 1279234 INFO  (searcherExecutor-5581-thread-1-processing-n:localhost:50538_solr x:testCloudExamplePrompt_shard2_replica_n2 s:shard2 c:testCloudExamplePrompt r:core_node4) [n:localhost:50538_solr c:testCloudExamplePrompt s:shard2 r:core_node4 x:testCloudExamplePrompt_shard2_replica_n2] o.a.s.h.c.SpellCheckComponent Loading spell index for spellchecker: default
   [junit4]   2> 1279235 INFO  (searcherExecutor-5581-thread-1-processing-n:localhost:50538_solr x:testCloudExamplePrompt_shard2_replica_n2 s:shard2 c:testCloudExamplePrompt r:core_node4) [n:localhost:50538_solr c:testCloudExamplePrompt s:shard2 r:core_node4 x:testCloudExamplePrompt_shard2_replica_n2] o.a.s.c.SolrCore [testCloudExamplePrompt_shard2_replica_n2] Registered new searcher Searcher@a88571[testCloudExamplePrompt_shard2_replica_n2] main{ExitableDirectoryReader(UninvertingDirectoryReader())}
   [junit4]   2> 1279235 INFO  (searcherExecutor-5579-thread-1-processing-n:localhost:50538_solr x:testCloudExamplePrompt_shard2_replica_n1 s:shard2 c:testCloudExamplePrompt r:core_node3) [n:localhost:50538_solr c:testCloudExamplePrompt s:shard2 r:core_node3 x:testCloudExamplePrompt_shard2_replica_n1] o.a.s.c.QuerySenderListener QuerySenderListener sending requests to Searcher@1e37f06[testCloudExamplePrompt_shard2_replica_n1] main{ExitableDirectoryReader(UninvertingDirectoryReader())}
   [junit4]   2> 1279235 INFO  (searcherExecutor-5579-thread-1-processing-n:localhost:50538_solr x:testCloudExamplePrompt_shard2_replica_n1 s:shard2 c:testCloudExamplePrompt r:core_node3) [n:localhost:50538_solr c:testCloudExamplePrompt s:shard2 r:core_node3 x:testCloudExamplePrompt_shard2_replica_n1] o.a.s.c.QuerySenderListener QuerySenderListener done.
   [junit4]   2> 1279235 INFO  (searcherExecutor-5579-thread-1-processing-n:localhost:50538_solr x:testCloudExamplePrompt_shard2_replica_n1 s:shard2 c:testCloudExamplePrompt r:core_node3) [n:localhost:50538_solr c:testCloudExamplePrompt s:shard2 r:core_node3 x:testCloudExamplePrompt_shard2_replica_n1] o.a.s.h.c.SpellCheckComponent Loading spell index for spellchecker: default
   [junit4]   2> 1279236 INFO  (qtp9508125-14601) [n:localhost:50538_solr c:testCloudExamplePrompt s:shard1 r:core_node1 x:testCloudExamplePrompt_shard1_replica_n1] o.a.s.s.SolrIndexSearcher Opening [Searcher@337959[testCloudExamplePrompt_shard1_replica_n1] main]
   [junit4]   2> 1279237 INFO  (searcherExecutor-5579-thread-1-processing-n:localhost:50538_solr x:testCloudExamplePrompt_shard2_replica_n1 s:shard2 c:testCloudExamplePrompt r:core_node3) [n:localhost:50538_solr c:testCloudExamplePrompt s:shard2 r:core_node3 x:testCloudExamplePrompt_shard2_replica_n1] o.a.s.c.SolrCore [testCloudExamplePrompt_shard2_replica_n1] Registered new searcher Searcher@1e37f06[testCloudExamplePrompt_shard2_replica_n1] main{ExitableDirectoryReader(UninvertingDirectoryReader())}
   [junit4]   2> 1279240 INFO  (qtp9508125-14601) [n:localhost:50538_solr c:testCloudExamplePrompt s:shard1 r:core_node1 x:testCloudExamplePrompt_shard1_replica_n1] o.a.s.r.ManagedResourceStorage Configured ZooKeeperStorageIO with znodeBase: /configs/testCloudExamplePrompt
   [junit4]   2> 1279241 INFO  (qtp9508125-14601) [n:localhost:50538_solr c:testCloudExamplePrompt s:shard1 r:core_node1 x:testCloudExamplePrompt_shard1_replica_n1] o.a.s.r.ManagedResourceStorage Loaded null at path _rest_managed.json using ZooKeeperStorageIO:path=/configs/testCloudExamplePrompt
   [junit4]   2> 1279241 INFO  (qtp9508125-14601) [n:localhost:50538_solr c:testCloudExamplePrompt s:shard1 r:core_node1 x:testCloudExamplePrompt_shard1_replica_n1] o.a.s.s.ZkIndexSchemaReader Creating ZooKeeper watch for the managed schema at /configs/testCloudExamplePrompt/managed-schema
   [junit4]   2> 1279242 INFO  (qtp9508125-14599) [n:localhost:50538_solr c:testCloudExamplePrompt s:shard1 r:core_node2 x:testCloudExamplePrompt_shard1_replica_n2] o.a.s.u.CommitTracker Hard AutoCommit: if uncommited for 15000ms; 
   [junit4]   2> 1279242 INFO  (qtp9508125-14599) [n:localhost:50538_solr c:testCloudExamplePrompt s:shard1 r:core_node2 x:testCloudExamplePrompt_shard1_replica_n2] o.a.s.u.CommitTracker Soft AutoCommit: disabled
   [junit4]   2> 1279243 INFO  (qtp9508125-14601) [n:localhost:50538_solr c:testCloudExamplePrompt s:shard1 r:core_node1 x:testCloudExamplePrompt_shard1_replica_n1] o.a.s.s.ZkIndexSchemaReader Current schema version 0 is already the latest
   [junit4]   2> 1279244 INFO  (qtp9508125-14601) [n:localhost:50538_solr c:testCloudExamplePrompt s:shard1 r:core_node1 x:testCloudExamplePrompt_shard1_replica_n1] o.a.s.h.c.SpellCheckComponent Initializing spell checkers
   [junit4]   2> 1279244 INFO  (qtp9508125-14601) [n:localhost:50538_solr c:testCloudExamplePrompt s:shard1 r:core_node1 x:testCloudExamplePrompt_shard1_replica_n1] o.a.s.s.DirectSolrSpellChecker init: {name=default,field=_text_,classname=solr.DirectSolrSpellChecker,distanceMeasure=internal,accuracy=0.5,maxEdits=2,minPrefix=1,maxInspections=5,minQueryLength=4,maxQueryFrequency=0.01}
   [junit4]   2> 1279246 INFO  (qtp9508125-14599) [n:localhost:50538_solr c:testCloudExamplePrompt s:shard1 r:core_node2 x:testCloudExamplePrompt_shard1_replica_n2] o.a.s.s.SolrIndexSearcher Opening [Searcher@1ef77c8[testCloudExamplePrompt_shard1_replica_n2] main]
   [junit4]   2> 1279247 INFO  (qtp9508125-14599) [n:localhost:50538_solr c:testCloudExamplePrompt s:shard1 r:core_node2 x:testCloudExamplePrompt_shard1_replica_n2] o.a.s.r.ManagedResourceStorage Configured ZooKeeperStorageIO with znodeBase: /configs/testCloudExamplePrompt
   [junit4]   2> 1279253 INFO  (qtp9508125-14601) [n:localhost:50538_solr c:testCloudExamplePrompt s:shard1 r:core_node1 x:testCloudExamplePrompt_shard1_replica_n1] o.a.s.h.ReplicationHandler Commits will be reserved for  10000
   [junit4]   2> 1279253 INFO  (searcherExecutor-5578-thread-1-processing-n:localhost:50538_solr x:testCloudExamplePrompt_shard1_replica_n1 s:shard1 c:testCloudExamplePrompt r:core_node1) [n:localhost:50538_solr c:testCloudExamplePrompt s:shard1 r:core_node1 x:testCloudExamplePrompt_shard1_replica_n1] o.a.s.c.QuerySenderListener QuerySenderListener sending requests to Searcher@337959[testCloudExamplePrompt_shard1_replica_n1] main{ExitableDirectoryReader(UninvertingDirectoryReader())}
   [junit4]   2> 1279253 INFO  (qtp9508125-14601) [n:localhost:50538_solr c:testCloudExamplePrompt s:shard1 r:core_node1 x:testCloudExamplePrompt_shard1_replica_n1] o.a.s.u.UpdateLog Could not find max version in index or recent updates, using new clock 1575309598587355136
   [junit4]   2> 1279253 INFO  (searcherExecutor-5578-thread-1-processing-n:localhost:50538_solr x:testCloudExamplePrompt_shard1_replica_n1 s:shard1 c:testCloudExamplePrompt r:core_node1) [n:localhost:50538_solr c:testCloudExamplePrompt s:shard1 r:core_node1 x:testCloudExamplePrompt_shard1_replica_n1] o.a.s.c.QuerySenderListener QuerySenderListener done.
   [junit4]   2> 1279254 INFO  (searcherExecutor-5578-thread-1-processing-n:localhost:50538_solr x:testCloudExamplePrompt_shard1_replica_n1 s:shard1 c:testCloudExamplePrompt r:core_node1) [n:localhost:50538_solr c:testCloudExamplePrompt s:shard1 r:core_node1 x:testCloudExamplePrompt_shard1_replica_n1] o.a.s.h.c.SpellCheckComponent Loading spell index for spellchecker: default
   [junit4]   2> 1279255 INFO  (searcherExecutor-5578-thread-1-processing-n:localhost:50538_solr x:testCloudExamplePrompt_shard1_replica_n1 s:shard1 c:testCloudExamplePrompt r:core_node1) [n:localhost:50538_solr c:testCloudExamplePrompt s:shard1 r:core_node1 x:testCloudExamplePrompt_shard1_replica_n1] o.a.s.c.SolrCore [testCloudExamplePrompt_shard1_replica_n1] Registered new searcher Searcher@337959[testCloudExamplePrompt_shard1_replica_n1] main{ExitableDirectoryReader(UninvertingDirectoryReader())}
   [junit4]   2> 1279255 INFO  (qtp9508125-14599) [n:localhost:50538_solr c:testCloudExamplePrompt s:shard1 r:core_node2 x:testCloudExamplePrompt_shard1_replica_n2] o.a.s.r.ManagedResourceStorage Loaded null at path _rest_managed.json using ZooKeeperStorageIO:path=/configs/testCloudExamplePrompt
   [junit4]   2> 1279255 INFO  (qtp9508125-14599) [n:localhost:50538_solr c:testCloudExamplePrompt s:shard1 r:core_node2 x:testCloudExamplePrompt_shard1_replica_n2] o.a.s.s.ZkIndexSchemaReader Creating ZooKeeper watch for the managed schema at /configs/testCloudExamplePrompt/managed-schema
   [junit4]   2> 1279256 INFO  (qtp9508125-14599) [n:localhost:50538_solr c:testCloudExamplePrompt s:shard1 r:core_node2 x:testCloudExamplePrompt_shard1_replica_n2] o.a.s.s.ZkIndexSchemaReader Current schema version 0 is already the latest
   [junit4]   2> 1279257 INFO  (qtp9508125-14599) [n:localhost:50538_solr c:testCloudExamplePrompt s:shard1 r:core_node2 x:testCloudExamplePrompt_shard1_replica_n2] o.a.s.h.c.SpellCheckComponent Initializing spell checkers
   [junit4]   2> 1279257 INFO  (qtp9508125-14599) [n:localhost:50538_solr c:testCloudExamplePrompt s:shard1 r:core_node2 x:testCloudExamplePrompt_shard1_replica_n2] o.a.s.s.DirectSolrSpellChecker init: {name=default,field=_text_,classname=solr.DirectSolrSpellChecker,distanceMeasure=internal,accuracy=0.5,maxEdits=2,minPrefix=1,maxInspections=5,minQueryLength=4,maxQueryFrequency=0.01}
   [junit4]   2> 1279259 INFO  (qtp9508125-14599) [n:localhost:50538_solr c:testCloudExamplePrompt s:shard1 r:core_node2 x:testCloudExamplePrompt_shard1_replica_n2] o.a.s.h.ReplicationHandler Commits will be reserved for  10000
   [junit4]   2> 1279260 INFO  (qtp9508125-14599) [n:localhost:50538_solr c:testCloudExamplePrompt s:shard1 r:core_node2 x:testCloudExamplePrompt_shard1_replica_n2] o.a.s.u.UpdateLog Could not find max version in index or recent updates, using new clock 1575309598594695168
   [junit4]   2> 1279260 INFO  (searcherExecutor-5580-thread-1-processing-n:localhost:50538_solr x:testCloudExamplePrompt_shard1_replica_n2 s:shard1 c:testCloudExamplePrompt r:core_node2) [n:localhost:50538_solr c:testCloudExamplePrompt s:shard1 r:core_node2 x:testCloudExamplePrompt_shard1_replica_n2] o.a.s.c.QuerySenderListener QuerySenderListener sending requests to Searcher@1ef77c8[testCloudExamplePrompt_shard1_replica_n2] main{ExitableDirectoryReader(UninvertingDirectoryReader())}
   [junit4]   2> 1279260 INFO  (searcherExecutor-5580-thread-1-processing-n:localhost:50538_solr x:testCloudExamplePrompt_shard1_replica_n2 s:shard1 c:testCloudExamplePrompt r:core_node2) [n:localhost:50538_solr c:testCloudExamplePrompt s:shard1 r:core_node2 x:testCloudExamplePrompt_shard1_replica_n2] o.a.s.c.QuerySenderListener QuerySenderListener done.
   [junit4]   2> 1279260 INFO  (searcherExecutor-5580-thread-1-processing-n:localhost:50538_solr x:testCloudExamplePrompt_shard1_replica_n2 s:shard1 c:testCloudExamplePrompt r:core_node2) [n:localhost:50538_solr c:testCloudExamplePrompt s:shard1 r:core_node2 x:testCloudExamplePrompt_shard1_replica_n2] o.a.s.h.c.SpellCheckComponent Loading spell index for spellchecker: default
   [junit4]   2> 1279261 INFO  (searcherExecutor-5580-thread-1-processing-n:localhost:50538_solr x:testCloudExamplePrompt_shard1_replica_n2 s:shard1 c:testCloudExamplePrompt r:core_node2) [n:localhost:50538_solr c:testCloudExamplePrompt s:shard1 r:core_node2 x:testCloudExamplePrompt_shard1_replica_n2] o.a.s.c.SolrCore [testCloudExamplePrompt_shard1_replica_n2] Registered new searcher Searcher@1ef77c8[testCloudExamplePrompt_shard1_replica_n2] main{ExitableDirectoryReader(UninvertingDirectoryReader())}
   [junit4]   2> 1279261 INFO  (qtp9508125-14601) [n:localhost:50538_solr c:testCloudExamplePrompt s:shard1 r:core_node1 x:testCloudExamplePrompt_shard1_replica_n1] o.a.s.c.ShardLeaderElectionContext Waiting until we see more replicas up for shard shard1: total=2 found=1 timeoutin=179998ms
   [junit4]   2> 1279264 INFO  (zkCallback-3543-thread-2-processing-n:localhost:50538_solr) [n:localhost:50538_solr    ] o.a.s.c.c.ZkStateReader A cluster state change: [WatchedEvent state:SyncConnected type:NodeDataChanged path:/collections/testCloudExamplePrompt/state.json] for collection [testCloudExamplePrompt] has occurred - updating... (live nodes size: [1])
   [junit4]   2> 1279264 INFO  (zkCallback-3543-thread-1-processing-n:localhost:50538_solr) [n:localhost:50538_solr    ] o.a.s.c.c.ZkStateReader A cluster state change: [WatchedEvent state:SyncConnected type:NodeDataChanged path:/collections/testCloudExamplePrompt/state.json] for collection [testCloudExamplePrompt] has occurred - updating... (live nodes size: [1])
   [junit4]   2> 1279370 INFO  (zkCallback-3543-thread-1-processing-n:localhost:50538_solr) [n:localhost:50538_solr    ] o.a.s.c.c.ZkStateReader A cluster state change: [WatchedEvent state:SyncConnected type:NodeDataChanged path:/collections/testCloudExamplePrompt/state.json] for collection [testCloudExamplePrompt] has occurred - updating... (live nodes size: [1])
   [junit4]   2> 1279371 INFO  (zkCallback-3543-thread-2-processing-n:localhost:50538_solr) [n:localhost:50538_solr    ] o.a.s.c.c.ZkStateReader A cluster state change: [WatchedEvent state:SyncConnected type:NodeDataChanged path:/collections/testCloudExamplePrompt/state.json] for collection [testCloudExamplePrompt] has occurred - updating... (live nodes size: [1])
   [junit4]   2> 1279631 INFO  (qtp9508125-14598) [n:localhost:50538_solr c:testCloudExamplePrompt s:shard2 r:core_node3 x:testCloudExamplePrompt_shard2_replica_n1] o.a.s.c.ShardLeaderElectionContext Enough replicas found to continue.
   [junit4]   2> 1279631 INFO  (qtp9508125-14598) [n:localhost:50538_solr c:testCloudExamplePrompt s:shard2 r:core_node3 x:testCloudExamplePrompt_shard2_replica_n1] o.a.s.c.ShardLeaderElectionContext I may be the new leader - try and sync
   [junit4]   2> 1279631 INFO  (qtp9508125-14598) [n:localhost:50538_solr c:testCloudExamplePrompt s:shard2 r:core_node3 x:testCloudExamplePrompt_shard2_replica_n1] o.a.s.c.SyncStrategy Sync replicas to http://localhost:50538/solr/testCloudExamplePrompt_shard2_replica_n1/
   [junit4]   2> 1279632 INFO  (qtp9508125-14598) [n:localhost:50538_solr c:testCloudExamplePrompt s:shard2 r:core_node3 x:testCloudExamplePrompt_shard2_replica_n1] o.a.s.u.PeerSync PeerSync: core=testCloudExamplePrompt_shard2_replica_n1 url=http://localhost:50538/solr START replicas=[http://localhost:50538/solr/testCloudExamplePrompt_shard2_replica_n2/] nUpdates=100
   [junit4]   2> 1279632 INFO  (qtp9508125-14598) [n:localhost:50538_solr c:testCloudExamplePrompt s:shard2 r:core_node3 x:testCloudExamplePrompt_shard2_replica_n1] o.a.s.u.PeerSync PeerSync: core=testCloudExamplePrompt_shard2_replica_n1 url=http://localhost:50538/solr DONE.  We have no versions.  sync failed.
   [junit4]   2> 1279634 INFO  (qtp9508125-14596) [n:localhost:50538_solr c:testCloudExamplePrompt s:shard2 r:core_node4 x:testCloudExamplePrompt_shard2_replica_n2] o.a.s.c.S.Request [testCloudExamplePrompt_shard2_replica_n2]  webapp=/solr path=/get params={distrib=false&qt=/get&fingerprint=false&getVersions=100&wt=javabin&version=2} status=0 QTime=0
   [junit4]   2> 1279634 INFO  (qtp9508125-14598) [n:localhost:50538_solr c:testCloudExamplePrompt s:shard2 r:core_node3 x:testCloudExamplePrompt_shard2_replica_n1] o.a.s.c.SyncStrategy Leader's attempt to sync with shard failed, moving to the next candidate
   [junit4]   2> 1279634 INFO  (qtp9508125-14598) [n:localhost:50538_solr c:testCloudExamplePrompt s:shard2 r:core_node3 x:testCloudExamplePrompt_shard2_replica_n1] o.a.s.c.ShardLeaderElectionContext We failed sync, but we have no versions - we can't sync in that case - we were active before, so become leader anyway
   [junit4]   2> 1279634 INFO  (qtp9508125-14598) [n:localhost:50538_solr c:testCloudExamplePrompt s:shard2 r:core_node3 x:testCloudExamplePrompt_shard2_replica_n1] o.a.s.c.ShardLeaderElectionContext Found all replicas participating in election, clear LIR
   [junit4]   2> 1279639 INFO  (qtp9508125-14598) [n:localhost:50538_solr c:testCloudExamplePrompt s:shard2 r:core_node3 x:testCloudExamplePrompt_shard2_replica_n1] o.a.s.c.ShardLeaderElectionContext I am the new leader: http://localhost:50538/solr/testCloudExamplePrompt_shard2_replica_n1/ shard2
   [junit4]   2> 1279742 INFO  (zkCallback-3543-thread-2-processing-n:localhost:50538_solr) [n:localhost:50538_solr    ] o.a.s.c.c.ZkStateReader A cluster state change: [WatchedEvent state:SyncConnected type:NodeDataChanged path:/collections/testCloudExamplePrompt/state.json] for collection [testCloudExamplePrompt] has occurred - updating... (live nodes size: [1])
   [junit4]   2> 1279743 INFO  (zkCallback-3543-thread-1-processing-n:localhost:50538_solr) [n:localhost:50538_solr    ] o.a.s.c.c.ZkStateReader A cluster state change: [WatchedEvent state:SyncConnected type:NodeDataChanged path:/collections/testCloudExamplePrompt/state.json] for collection [testCloudExamplePrompt] has occurred - updating... (live nodes size: [1])
   [junit4]   2> 1279762 INFO  (qtp9508125-14601) [n:localhost:50538_solr c:testCloudExamplePrompt s:shard1 r:core_node1 x:testCloudExamplePrompt_shard1_replica_n1] o.a.s.c.ShardLeaderElectionContext Enough replicas found to continue.
   [junit4]   2> 1279762 INFO  (qtp9508125-14601) [n:localhost:50538_solr c:testCloudExamplePrompt s:shard1 r:core_node1 x:testCloudExamplePrompt_shard1_replica_n1] o.a.s.c.ShardLeaderElectionContext I may be the new leader - try and sync
   [junit4]   2> 1279762 INFO  (qtp9508125-14601) [n:localhost:50538_solr c:testCloudExamplePrompt s:shard1 r:core_node1 x:testCloudExamplePrompt_shard1_replica_n1] o.a.s.c.SyncStrategy Sync replicas to http://localhost:50538/solr/testCloudExamplePrompt_shard1_replica_n1/
   [junit4]   2> 1279763 INFO  (qtp9508125-14601) [n:localhost:50538_solr c:testCloudExamplePrompt s:shard1 r:core_node1 x:testCloudExamplePrompt_shard1_replica_n1] o.a.s.u.PeerSync PeerSync: core=testCloudExamplePrompt_shard1_replica_n1 url=http://localhost:50538/solr START replicas=[http://localhost:50538/solr/testCloudExamplePrompt_shard1_replica_n2/] nUpdates=100
   [junit4]   2> 1279764 INFO  (qtp9508125-14605) [n:localhost:50538_solr c:testCloudExamplePrompt s:shard1 r:core_node2 x:testCloudExamplePrompt_shard1_replica_n2] o.a.s.c.S.Request [testCloudExamplePrompt_shard1_replica_n2]  webapp=/solr path=/get params={distrib=false&qt=/get&fingerprint=false&getVersions=100&wt=javabin&version=2} status=0 QTime=0
   [junit4]   2> 1279767 INFO  (qtp9508125-14601) [n:localhost:50538_solr c:testCloudExamplePrompt s:shard1 r:core_node1 x:testCloudExamplePrompt_shard1_replica_n1] o.a.s.u.PeerSync PeerSync: core=testCloudExamplePrompt_shard1_replica_n1 url=http://localhost:50538/solr DONE.  We have no versions.  sync failed.
   [junit4]   2> 1279767 INFO  (qtp9508125-14601) [n:localhost:50538_solr c:testCloudExamplePrompt s:shard1 r:core_node1 x:testCloudExamplePrompt_shard1_replica_n1] o.a.s.c.SyncStrategy Leader's attempt to sync with shard failed, moving to the next candidate
   [junit4]   2> 1279778 INFO  (qtp9508125-14601) [n:localhost:50538_solr c:testCloudExamplePrompt s:shard1 r:core_node1 x:testCloudExamplePrompt_shard1_replica_n1] o.a.s.c.ShardLeaderElectionContext We failed sync, but we have no versions - we can't sync in that case - we were active before, so become leader anyway
   [junit4]   2> 1279778 INFO  (qtp9508125-14601) [n:localhost:50538_solr c:testCloudExamplePrompt s:shard1 r:core_node1 x:testCloudExamplePrompt_shard1_replica_n1] o.a.s.c.ShardLeaderElectionContext Found all replicas participating in election, clear LIR
   [junit4]   2> 1279815 INFO  (qtp9508125-14601) [n:localhost:50538_solr c:testCloudExamplePrompt s:shard1 r:core_node1 x:testCloudExamplePrompt_shard1_replica_n1] o.a.s.c.ShardLeaderElectionContext I am the new leader: http://localhost:50538/solr/testCloudExamplePrompt_shard1_replica_n1/ shard1
   [junit4]   2> 1279822 INFO  (qtp9508125-14598) [n:localhost:50538_solr c:testCloudExamplePrompt s:shard2 r:core_node3 x:testCloudExamplePrompt_shard2_replica_n1] o.a.s.c.ZkController I am the leader, no recovery necessary
   [junit4]   2> 1279829 INFO  (qtp9508125-14598) [n:localhost:50538_solr c:testCloudExamplePrompt s:shard2 r:core_node3 x:testCloudExamplePrompt_shard2_replica_n1] o.a.s.s.HttpSolrCall [admin] webapp=null path=/admin/cores params={qt=/admin/cores&coreNodeName=core_node3&collection.configName=testCloudExamplePrompt&newCollection=true&name=testCloudExamplePrompt_shard2_replica_n1&action=CREATE&numShards=2&collection=testCloudExamplePrompt&shard=shard2&wt=javabin&version=2&replicaType=NRT} status=0 QTime=2474
   [junit4]   2> 1279928 INFO  (zkCallback-3543-thread-1-processing-n:localhost:50538_solr) [n:localhost:50538_solr    ] o.a.s.c.c.ZkStateReader A cluster state change: [WatchedEvent state:SyncConnected type:NodeDataChanged path:/collections/testCloudExamplePrompt/state.json] for collection [testCloudExamplePrompt] has occurred - updating... (live nodes size: [1])
   [junit4]   2> 1279928 INFO  (zkCallback-3543-thread-2-processing-n:localhost:50538_solr) [n:localhost:50538_solr    ] o.a.s.c.c.ZkStateReader A cluster state change: [WatchedEvent state:SyncConnected type:NodeDataChanged path:/collections/testCloudExamplePrompt/state.json] for collection [testCloudExamplePrompt] has occurred - updating... (live nodes size: [1])
   [junit4]   2> 1279968 INFO  (qtp9508125-14601) [n:localhost:50538_solr c:testCloudExamplePrompt s:shard1 r:core_node1 x:testCloudExamplePrompt_shard1_replica_n1] o.a.s.c.ZkController I am the leader, no recovery necessary
   [junit4]   2> 1279970 INFO  (qtp9508125-14601) [n:localhost:50538_solr c:testCloudExamplePrompt s:shard1 r:core_node1 x:testCloudExamplePrompt_shard1_replica_n1] o.a.s.s.HttpSolrCall [admin] webapp=null path=/admin/cores params={qt=/admin/cores&coreNodeName=core_node1&collection.configName=testCloudExamplePrompt&newCollection=true&name=testCloudExamplePrompt_shard1_replica_n1&action=CREATE&numShards=2&collection=testCloudExamplePrompt&shard=shard1&wt=javabin&version=2&replicaType=NRT} status=0 QTime=2617
   [junit4]   2> 1280074 INFO  (zkCallback-3543-thread-2-processing-n:localhost:50538_solr) [n:localhost:50538_solr    ] o.a.s.c.c.ZkStateReader A cluster state change: [WatchedEvent state:SyncConnected type:NodeDataChanged path:/collections/testCloudExamplePrompt/state.json] for collection [testCloudExamplePrompt] has occurred - updating... (live nodes size: [1])
   [junit4]   2> 1280074 INFO  (zkCallback-3543-thread-1-processing-n:localhost:50538_solr) [n:localhost:505

[...truncated too long message...]

) [    x:techproducts] o.a.s.u.LoggingInfoStream [IW][coreCloseExecutor-5666-thread-1]: rollback: done finish merges
   [junit4]   2> 1301186 INFO  (coreCloseExecutor-5666-thread-1) [    x:techproducts] o.a.s.u.LoggingInfoStream [DW][coreCloseExecutor-5666-thread-1]: abort
   [junit4]   2> 1301186 INFO  (coreCloseExecutor-5666-thread-1) [    x:techproducts] o.a.s.u.LoggingInfoStream [DW][coreCloseExecutor-5666-thread-1]: done abort success=true
   [junit4]   2> 1301186 INFO  (coreCloseExecutor-5666-thread-1) [    x:techproducts] o.a.s.u.LoggingInfoStream [IW][coreCloseExecutor-5666-thread-1]: rollback: infos=_0(7.0.0):C32
   [junit4]   2> 1301186 INFO  (coreCloseExecutor-5666-thread-1) [    x:techproducts] o.a.s.u.LoggingInfoStream [IFD][coreCloseExecutor-5666-thread-1]: now checkpoint "_0(7.0.0):C32" [1 segments ; isCommit = false]
   [junit4]   2> 1301186 INFO  (coreCloseExecutor-5666-thread-1) [    x:techproducts] o.a.s.u.LoggingInfoStream [IFD][coreCloseExecutor-5666-thread-1]: 0 msec to checkpoint
   [junit4]   2> 1301189 INFO  (coreCloseExecutor-5666-thread-1) [    x:techproducts] o.a.s.m.SolrMetricManager Closing metric reporters for registry=solr.core.techproducts, tag=4354588
   [junit4]   2> 1301194 INFO  (TEST-TestSolrCLIRunExample.testTechproductsExample-seed#[DF3FC52E0F1B9AC8]) [    ] o.e.j.s.h.ContextHandler Stopped o.e.j.s.ServletContextHandler@1517d48{/solr,null,UNAVAILABLE}
   [junit4]   2> 1301196 INFO  (TEST-TestSolrCLIRunExample.testTechproductsExample-seed#[DF3FC52E0F1B9AC8]) [    ] o.a.s.u.TestSolrCLIRunExample Stopped standalone Solr instance running on port 50726
   [junit4]   2> 1301196 INFO  (TEST-TestSolrCLIRunExample.testTechproductsExample-seed#[DF3FC52E0F1B9AC8]) [    ] o.a.s.SolrTestCaseJ4 ###Ending testTechproductsExample
   [junit4]   2> 1301197 INFO  (SUITE-TestSolrCLIRunExample-seed#[DF3FC52E0F1B9AC8]-worker) [    ] o.a.s.SolrTestCaseJ4 ------------------------------------------------------- Done waiting for tracked resources to be released
   [junit4]   2> Aug 10, 2017 2:32:06 AM com.carrotsearch.randomizedtesting.ThreadLeakControl checkThreadLeaks
   [junit4]   2> WARNING: Will linger awaiting termination of 2 leaked thread(s).
   [junit4]   2> NOTE: test params are: codec=Asserting(Lucene70), sim=RandomSimilarity(queryNorm=true): {}, locale=ar-SD, timezone=Africa/Luanda
   [junit4]   2> NOTE: Windows 10 10.0 x86/Oracle Corporation 1.8.0_144 (32-bit)/cpus=3,threads=1,free=155120536,total=536870912
   [junit4]   2> NOTE: All tests run in this JVM: [TestFuzzyAnalyzedSuggestions, TestPseudoReturnFields, UtilsToolTest, DateFieldTest, LeaderInitiatedRecoveryOnShardRestartTest, TestIndexingPerformance, CollectionsAPISolrJTest, DefaultValueUpdateProcessorTest, TestRuleBasedAuthorizationPlugin, TestAnalyzeInfixSuggestions, NotRequiredUniqueKeyTest, FullHLLTest, DeleteNodeTest, OverseerTest, ScriptEngineTest, TestLMDirichletSimilarityFactory, TestCodecSupport, DistribCursorPagingTest, TestAuthorizationFramework, ShardSplitTest, ZkCLITest, TestExactSharedStatsCache, TestOverriddenPrefixQueryForCustomFieldType, TestSerializedLuceneMatchVersion, LeaderElectionContextKeyTest, AliasIntegrationTest, TestPerFieldSimilarityWithDefaultOverride, SuggesterWFSTTest, TestFoldingMultitermQuery, RequestHandlersTest, TestEmbeddedSolrServerSchemaAPI, TestFieldCacheSortRandom, MetricsConfigTest, TestInPlaceUpdatesDistrib, TestJmxIntegration, DeleteInactiveReplicaTest, VMParamsZkACLAndCredentialsProvidersTest, TestClusterProperties, UpdateLogTest, SSLMigrationTest, TestBinaryField, TestClusterStateMutator, RequiredFieldsTest, TestSegmentSorting, MultiTermTest, CreateCollectionCleanupTest, TestFieldTypeCollectionResource, TestDynamicFieldCollectionResource, TestRestManager, TestRawTransformer, DistributedFacetPivotSmallTest, TestApiFramework, BooleanFieldTest, TestPushWriter, JSONWriterTest, TestHttpShardHandlerFactory, TestInfoStreamLogging, TestFaceting, TestXmlQParser, OverseerTaskQueueTest, BlockJoinFacetSimpleTest, TestClassNameShortening, ShardRoutingTest, SpatialFilterTest, RegexBoostProcessorTest, TestPhraseSuggestions, TestScoreJoinQPNoScore, TestSimpleQParserPlugin, TestMultiValuedNumericRangeQuery, HighlighterTest, DirectUpdateHandlerTest, IndexBasedSpellCheckerTest, TestJsonRequest, TestLFUCache, DisMaxRequestHandlerTest, TestDelegationWithHadoopAuth, PropertiesRequestHandlerTest, TestQuerySenderListener, MultiThreadedOCPTest, RestartWhileUpdatingTest, TestPolicyCloud, TestSlowCompositeReaderWrapper, TestFileDictionaryLookup, SimpleMLTQParserTest, TestDynamicLoading, ManagedSchemaRoundRobinCloudTest, ConfigSetsAPITest, TestInitQParser, TestDeleteCollectionOnDownNodes, TestManagedResource, TestSort, TestLeaderElectionZkExpiry, TlogReplayBufferedWhileIndexingTest, CoreSorterTest, BasicDistributedZkTest, TestSchemaNameResource, ZkStateWriterTest, TestChildDocTransformer, SimplePostToolTest, TestDistributedSearch, RAMDirectoryFactoryTest, TestSchemaSimilarityResource, PeerSyncTest, SolrMetricsIntegrationTest, TestReplicaProperties, SuggesterTest, CSVRequestHandlerTest, CoreAdminRequestStatusTest, SegmentsInfoRequestHandlerTest, TestConfigSetsAPIZkFailure, TestRequestStatusCollectionAPI, SolrTestCaseJ4Test, TestFieldSortValues, ShufflingReplicaListTransformerTest, TestFieldCollectionResource, TestReqParamsAPI, DataDrivenBlockJoinTest, TestSQLHandler, TestXIncludeConfig, WrapperMergePolicyFactoryTest, TestHashPartitioner, ResponseLogComponentTest, TestReloadDeadlock, TestMaxScoreQueryParser, ClusterStateTest, TestMiniSolrCloudClusterSSL, DocValuesMissingTest, TestStressReorder, AsyncCallRequestStatusResponseTest, PrimitiveFieldTypeTest, TestSolrCoreProperties, HdfsBasicDistributedZkTest, TestExportWriter, TestConfigSetProperties, AtomicUpdatesTest, IgnoreCommitOptimizeUpdateProcessorFactoryTest, TolerantUpdateProcessorTest, WordBreakSolrSpellCheckerTest, RequestLoggingTest, TestManagedSchemaThreadSafety, SolrIndexSplitterTest, AnalysisAfterCoreReloadTest, TestManagedStopFilterFactory, TestStressCloudBlindAtomicUpdates, CdcrVersionReplicationTest, TestUseDocValuesAsStored, CleanupOldIndexTest, SolrSlf4jReporterTest, CircularListTest, TestRandomCollapseQParserPlugin, TestSolrCloudSnapshots, TestObjectReleaseTracker, CdcrReplicationHandlerTest, CloneFieldUpdateProcessorFactoryTest, TestManagedSchema, DocValuesTest, TestHdfsCloudBackupRestore, TestBlobHandler, TestSolrCLIRunExample]
   [junit4]   2> NOTE: reproduce with: ant test  -Dtestcase=TestSolrCLIRunExample -Dtests.seed=DF3FC52E0F1B9AC8 -Dtests.slow=true -Dtests.locale=ar-SD -Dtests.timezone=Africa/Luanda -Dtests.asserts=true -Dtests.file.encoding=US-ASCII
   [junit4] ERROR   0.00s J0 | TestSolrCLIRunExample (suite) <<<
   [junit4]    > Throwable #1: java.io.IOException: Could not remove the following files (in the order of attempts):
   [junit4]    >    C:\Users\jenkins\workspace\Lucene-Solr-7.0-Windows\solr\build\solr-core\test\J0\temp\solr.util.TestSolrCLIRunExample_DF3FC52E0F1B9AC8-001\tempDir-005\techproducts\solr\techproducts\data: java.nio.file.DirectoryNotEmptyException: C:\Users\jenkins\workspace\Lucene-Solr-7.0-Windows\solr\build\solr-core\test\J0\temp\solr.util.TestSolrCLIRunExample_DF3FC52E0F1B9AC8-001\tempDir-005\techproducts\solr\techproducts\data
   [junit4]    >    C:\Users\jenkins\workspace\Lucene-Solr-7.0-Windows\solr\build\solr-core\test\J0\temp\solr.util.TestSolrCLIRunExample_DF3FC52E0F1B9AC8-001\tempDir-005\techproducts\solr\techproducts: java.nio.file.DirectoryNotEmptyException: C:\Users\jenkins\workspace\Lucene-Solr-7.0-Windows\solr\build\solr-core\test\J0\temp\solr.util.TestSolrCLIRunExample_DF3FC52E0F1B9AC8-001\tempDir-005\techproducts\solr\techproducts
   [junit4]    >    C:\Users\jenkins\workspace\Lucene-Solr-7.0-Windows\solr\build\solr-core\test\J0\temp\solr.util.TestSolrCLIRunExample_DF3FC52E0F1B9AC8-001\tempDir-005\techproducts\solr: java.nio.file.DirectoryNotEmptyException: C:\Users\jenkins\workspace\Lucene-Solr-7.0-Windows\solr\build\solr-core\test\J0\temp\solr.util.TestSolrCLIRunExample_DF3FC52E0F1B9AC8-001\tempDir-005\techproducts\solr
   [junit4]    >    C:\Users\jenkins\workspace\Lucene-Solr-7.0-Windows\solr\build\solr-core\test\J0\temp\solr.util.TestSolrCLIRunExample_DF3FC52E0F1B9AC8-001\tempDir-005\techproducts: java.nio.file.DirectoryNotEmptyException: C:\Users\jenkins\workspace\Lucene-Solr-7.0-Windows\solr\build\solr-core\test\J0\temp\solr.util.TestSolrCLIRunExample_DF3FC52E0F1B9AC8-001\tempDir-005\techproducts
   [junit4]    >    C:\Users\jenkins\workspace\Lucene-Solr-7.0-Windows\solr\build\solr-core\test\J0\temp\solr.util.TestSolrCLIRunExample_DF3FC52E0F1B9AC8-001\tempDir-005: java.nio.file.DirectoryNotEmptyException: C:\Users\jenkins\workspace\Lucene-Solr-7.0-Windows\solr\build\solr-core\test\J0\temp\solr.util.TestSolrCLIRunExample_DF3FC52E0F1B9AC8-001\tempDir-005
   [junit4]    >    C:\Users\jenkins\workspace\Lucene-Solr-7.0-Windows\solr\build\solr-core\test\J0\temp\solr.util.TestSolrCLIRunExample_DF3FC52E0F1B9AC8-001\tempDir-005\techproducts\solr\techproducts\data\snapshot_metadata: java.nio.file.AccessDeniedException: C:\Users\jenkins\workspace\Lucene-Solr-7.0-Windows\solr\build\solr-core\test\J0\temp\solr.util.TestSolrCLIRunExample_DF3FC52E0F1B9AC8-001\tempDir-005\techproducts\solr\techproducts\data\snapshot_metadata
   [junit4]    >    C:\Users\jenkins\workspace\Lucene-Solr-7.0-Windows\solr\build\solr-core\test\J0\temp\solr.util.TestSolrCLIRunExample_DF3FC52E0F1B9AC8-001: java.nio.file.DirectoryNotEmptyException: C:\Users\jenkins\workspace\Lucene-Solr-7.0-Windows\solr\build\solr-core\test\J0\temp\solr.util.TestSolrCLIRunExample_DF3FC52E0F1B9AC8-001
   [junit4]    > 	at __randomizedtesting.SeedInfo.seed([DF3FC52E0F1B9AC8]:0)
   [junit4]    > 	at org.apache.lucene.util.IOUtils.rm(IOUtils.java:329)
   [junit4]    > 	at java.lang.Thread.run(Thread.java:748)
   [junit4] Completed [349/728 (1!)] on J0 in 31.73s, 4 tests, 1 error <<< FAILURES!

[...truncated 40685 lines...]

Mime
View raw message