lucene-dev mailing list archives

Site index · List index
Message view « Date » · « Thread »
Top « Date » · « Thread »
From Policeman Jenkins Server <jenk...@thetaphi.de>
Subject [JENKINS-EA] Lucene-Solr-master-Linux (32bit/jdk-9-ea+181) - Build # 20383 - Still Unstable!
Date Mon, 28 Aug 2017 03:43:48 GMT
Build: https://jenkins.thetaphi.de/job/Lucene-Solr-master-Linux/20383/
Java: 32bit/jdk-9-ea+181 -server -XX:+UseG1GC --illegal-access=deny

2 tests failed.
FAILED:  org.apache.solr.metrics.reporters.SolrSlf4jReporterTest.testReporter

Error Message:
count1=6, count2=6 - no 'solr.node' logs in: {numFound=0,start=0,docs=[]}

Stack Trace:
java.lang.AssertionError: count1=6, count2=6 - no 'solr.node' logs in: {numFound=0,start=0,docs=[]}
	at __randomizedtesting.SeedInfo.seed([3DB546EC9DC1F9A9:62516BDBF6CD6AEC]:0)
	at org.junit.Assert.fail(Assert.java:93)
	at org.apache.solr.metrics.reporters.SolrSlf4jReporterTest.testReporter(SolrSlf4jReporterTest.java:90)
	at java.base/jdk.internal.reflect.NativeMethodAccessorImpl.invoke0(Native Method)
	at java.base/jdk.internal.reflect.NativeMethodAccessorImpl.invoke(NativeMethodAccessorImpl.java:62)
	at java.base/jdk.internal.reflect.DelegatingMethodAccessorImpl.invoke(DelegatingMethodAccessorImpl.java:43)
	at java.base/java.lang.reflect.Method.invoke(Method.java:564)
	at com.carrotsearch.randomizedtesting.RandomizedRunner.invoke(RandomizedRunner.java:1713)
	at com.carrotsearch.randomizedtesting.RandomizedRunner$8.evaluate(RandomizedRunner.java:907)
	at com.carrotsearch.randomizedtesting.RandomizedRunner$9.evaluate(RandomizedRunner.java:943)
	at com.carrotsearch.randomizedtesting.RandomizedRunner$10.evaluate(RandomizedRunner.java:957)
	at com.carrotsearch.randomizedtesting.rules.SystemPropertiesRestoreRule$1.evaluate(SystemPropertiesRestoreRule.java:57)
	at org.apache.lucene.util.TestRuleSetupTeardownChained$1.evaluate(TestRuleSetupTeardownChained.java:49)
	at org.apache.lucene.util.AbstractBeforeAfterRule$1.evaluate(AbstractBeforeAfterRule.java:45)
	at org.apache.lucene.util.TestRuleThreadAndTestName$1.evaluate(TestRuleThreadAndTestName.java:48)
	at org.apache.lucene.util.TestRuleIgnoreAfterMaxFailures$1.evaluate(TestRuleIgnoreAfterMaxFailures.java:64)
	at org.apache.lucene.util.TestRuleMarkFailure$1.evaluate(TestRuleMarkFailure.java:47)
	at com.carrotsearch.randomizedtesting.rules.StatementAdapter.evaluate(StatementAdapter.java:36)
	at com.carrotsearch.randomizedtesting.ThreadLeakControl$StatementRunner.run(ThreadLeakControl.java:368)
	at com.carrotsearch.randomizedtesting.ThreadLeakControl.forkTimeoutingTask(ThreadLeakControl.java:817)
	at com.carrotsearch.randomizedtesting.ThreadLeakControl$3.evaluate(ThreadLeakControl.java:468)
	at com.carrotsearch.randomizedtesting.RandomizedRunner.runSingleTest(RandomizedRunner.java:916)
	at com.carrotsearch.randomizedtesting.RandomizedRunner$5.evaluate(RandomizedRunner.java:802)
	at com.carrotsearch.randomizedtesting.RandomizedRunner$6.evaluate(RandomizedRunner.java:852)
	at com.carrotsearch.randomizedtesting.RandomizedRunner$7.evaluate(RandomizedRunner.java:863)
	at com.carrotsearch.randomizedtesting.rules.StatementAdapter.evaluate(StatementAdapter.java:36)
	at com.carrotsearch.randomizedtesting.rules.SystemPropertiesRestoreRule$1.evaluate(SystemPropertiesRestoreRule.java:57)
	at org.apache.lucene.util.AbstractBeforeAfterRule$1.evaluate(AbstractBeforeAfterRule.java:45)
	at com.carrotsearch.randomizedtesting.rules.StatementAdapter.evaluate(StatementAdapter.java:36)
	at org.apache.lucene.util.TestRuleStoreClassName$1.evaluate(TestRuleStoreClassName.java:41)
	at com.carrotsearch.randomizedtesting.rules.NoShadowingOrOverridesOnMethodsRule$1.evaluate(NoShadowingOrOverridesOnMethodsRule.java:40)
	at com.carrotsearch.randomizedtesting.rules.NoShadowingOrOverridesOnMethodsRule$1.evaluate(NoShadowingOrOverridesOnMethodsRule.java:40)
	at com.carrotsearch.randomizedtesting.rules.StatementAdapter.evaluate(StatementAdapter.java:36)
	at com.carrotsearch.randomizedtesting.rules.StatementAdapter.evaluate(StatementAdapter.java:36)
	at org.apache.lucene.util.TestRuleAssertionsRequired$1.evaluate(TestRuleAssertionsRequired.java:53)
	at org.apache.lucene.util.TestRuleMarkFailure$1.evaluate(TestRuleMarkFailure.java:47)
	at org.apache.lucene.util.TestRuleIgnoreAfterMaxFailures$1.evaluate(TestRuleIgnoreAfterMaxFailures.java:64)
	at org.apache.lucene.util.TestRuleIgnoreTestSuites$1.evaluate(TestRuleIgnoreTestSuites.java:54)
	at com.carrotsearch.randomizedtesting.rules.StatementAdapter.evaluate(StatementAdapter.java:36)
	at com.carrotsearch.randomizedtesting.ThreadLeakControl$StatementRunner.run(ThreadLeakControl.java:368)
	at java.base/java.lang.Thread.run(Thread.java:844)


FAILED:  org.apache.solr.update.processor.UpdateRequestProcessorFactoryTest.testUpdateDistribChainSkipping

Error Message:
Tests must be run with INFO level logging otherwise LogUpdateProcessor isn't used and can't
be tested.

Stack Trace:
java.lang.AssertionError: Tests must be run with INFO level logging otherwise LogUpdateProcessor
isn't used and can't be tested.
	at __randomizedtesting.SeedInfo.seed([3DB546EC9DC1F9A9:4C51B83AEB2ADE65]:0)
	at org.junit.Assert.fail(Assert.java:93)
	at org.junit.Assert.assertTrue(Assert.java:43)
	at org.apache.solr.update.processor.UpdateRequestProcessorFactoryTest.testUpdateDistribChainSkipping(UpdateRequestProcessorFactoryTest.java:101)
	at java.base/jdk.internal.reflect.NativeMethodAccessorImpl.invoke0(Native Method)
	at java.base/jdk.internal.reflect.NativeMethodAccessorImpl.invoke(NativeMethodAccessorImpl.java:62)
	at java.base/jdk.internal.reflect.DelegatingMethodAccessorImpl.invoke(DelegatingMethodAccessorImpl.java:43)
	at java.base/java.lang.reflect.Method.invoke(Method.java:564)
	at com.carrotsearch.randomizedtesting.RandomizedRunner.invoke(RandomizedRunner.java:1713)
	at com.carrotsearch.randomizedtesting.RandomizedRunner$8.evaluate(RandomizedRunner.java:907)
	at com.carrotsearch.randomizedtesting.RandomizedRunner$9.evaluate(RandomizedRunner.java:943)
	at com.carrotsearch.randomizedtesting.RandomizedRunner$10.evaluate(RandomizedRunner.java:957)
	at com.carrotsearch.randomizedtesting.rules.SystemPropertiesRestoreRule$1.evaluate(SystemPropertiesRestoreRule.java:57)
	at org.apache.lucene.util.TestRuleSetupTeardownChained$1.evaluate(TestRuleSetupTeardownChained.java:49)
	at org.apache.lucene.util.AbstractBeforeAfterRule$1.evaluate(AbstractBeforeAfterRule.java:45)
	at org.apache.lucene.util.TestRuleThreadAndTestName$1.evaluate(TestRuleThreadAndTestName.java:48)
	at org.apache.lucene.util.TestRuleIgnoreAfterMaxFailures$1.evaluate(TestRuleIgnoreAfterMaxFailures.java:64)
	at org.apache.lucene.util.TestRuleMarkFailure$1.evaluate(TestRuleMarkFailure.java:47)
	at com.carrotsearch.randomizedtesting.rules.StatementAdapter.evaluate(StatementAdapter.java:36)
	at com.carrotsearch.randomizedtesting.ThreadLeakControl$StatementRunner.run(ThreadLeakControl.java:368)
	at com.carrotsearch.randomizedtesting.ThreadLeakControl.forkTimeoutingTask(ThreadLeakControl.java:817)
	at com.carrotsearch.randomizedtesting.ThreadLeakControl$3.evaluate(ThreadLeakControl.java:468)
	at com.carrotsearch.randomizedtesting.RandomizedRunner.runSingleTest(RandomizedRunner.java:916)
	at com.carrotsearch.randomizedtesting.RandomizedRunner$5.evaluate(RandomizedRunner.java:802)
	at com.carrotsearch.randomizedtesting.RandomizedRunner$6.evaluate(RandomizedRunner.java:852)
	at com.carrotsearch.randomizedtesting.RandomizedRunner$7.evaluate(RandomizedRunner.java:863)
	at com.carrotsearch.randomizedtesting.rules.StatementAdapter.evaluate(StatementAdapter.java:36)
	at com.carrotsearch.randomizedtesting.rules.SystemPropertiesRestoreRule$1.evaluate(SystemPropertiesRestoreRule.java:57)
	at org.apache.lucene.util.AbstractBeforeAfterRule$1.evaluate(AbstractBeforeAfterRule.java:45)
	at com.carrotsearch.randomizedtesting.rules.StatementAdapter.evaluate(StatementAdapter.java:36)
	at org.apache.lucene.util.TestRuleStoreClassName$1.evaluate(TestRuleStoreClassName.java:41)
	at com.carrotsearch.randomizedtesting.rules.NoShadowingOrOverridesOnMethodsRule$1.evaluate(NoShadowingOrOverridesOnMethodsRule.java:40)
	at com.carrotsearch.randomizedtesting.rules.NoShadowingOrOverridesOnMethodsRule$1.evaluate(NoShadowingOrOverridesOnMethodsRule.java:40)
	at com.carrotsearch.randomizedtesting.rules.StatementAdapter.evaluate(StatementAdapter.java:36)
	at com.carrotsearch.randomizedtesting.rules.StatementAdapter.evaluate(StatementAdapter.java:36)
	at org.apache.lucene.util.TestRuleAssertionsRequired$1.evaluate(TestRuleAssertionsRequired.java:53)
	at org.apache.lucene.util.TestRuleMarkFailure$1.evaluate(TestRuleMarkFailure.java:47)
	at org.apache.lucene.util.TestRuleIgnoreAfterMaxFailures$1.evaluate(TestRuleIgnoreAfterMaxFailures.java:64)
	at org.apache.lucene.util.TestRuleIgnoreTestSuites$1.evaluate(TestRuleIgnoreTestSuites.java:54)
	at com.carrotsearch.randomizedtesting.rules.StatementAdapter.evaluate(StatementAdapter.java:36)
	at com.carrotsearch.randomizedtesting.ThreadLeakControl$StatementRunner.run(ThreadLeakControl.java:368)
	at java.base/java.lang.Thread.run(Thread.java:844)




Build Log:
[...truncated 11940 lines...]
   [junit4] Suite: org.apache.solr.metrics.reporters.SolrSlf4jReporterTest
   [junit4]   2> 1425471 INFO  (SUITE-SolrSlf4jReporterTest-seed#[3DB546EC9DC1F9A9]-worker)
[    ] o.a.s.SolrTestCaseJ4 SecureRandom sanity checks: test.solr.allowed.securerandom=null
& java.security.egd=file:/dev/./urandom
   [junit4]   2> Creating dataDir: /home/jenkins/workspace/Lucene-Solr-master-Linux/solr/build/solr-core/test/J1/temp/solr.metrics.reporters.SolrSlf4jReporterTest_3DB546EC9DC1F9A9-001/init-core-data-001
   [junit4]   2> 1425471 WARN  (SUITE-SolrSlf4jReporterTest-seed#[3DB546EC9DC1F9A9]-worker)
[    ] o.a.s.SolrTestCaseJ4 startTrackingSearchers: numOpens=9 numCloses=9
   [junit4]   2> 1425471 INFO  (SUITE-SolrSlf4jReporterTest-seed#[3DB546EC9DC1F9A9]-worker)
[    ] o.a.s.SolrTestCaseJ4 Using TrieFields (NUMERIC_POINTS_SYSPROP=false) w/NUMERIC_DOCVALUES_SYSPROP=false
   [junit4]   2> 1425472 INFO  (SUITE-SolrSlf4jReporterTest-seed#[3DB546EC9DC1F9A9]-worker)
[    ] o.a.s.SolrTestCaseJ4 Randomized ssl (false) and clientAuth (true) via: @org.apache.solr.util.RandomizeSSL(reason="",
ssl=0.0/0.0, value=0.0/0.0, clientAuth=0.0/0.0)
   [junit4]   2> 1425476 INFO  (TEST-SolrSlf4jReporterTest.testReporter-seed#[3DB546EC9DC1F9A9])
[    ] o.a.s.SolrTestCaseJ4 ###Starting testReporter
   [junit4]   2> 1431946 INFO  (TEST-SolrSlf4jReporterTest.testReporter-seed#[3DB546EC9DC1F9A9])
[    ] o.a.s.SolrTestCaseJ4 ###Ending testReporter
   [junit4]   2> NOTE: reproduce with: ant test  -Dtestcase=SolrSlf4jReporterTest -Dtests.method=testReporter
-Dtests.seed=3DB546EC9DC1F9A9 -Dtests.multiplier=3 -Dtests.slow=true -Dtests.locale=gsw-FR
-Dtests.timezone=America/Santiago -Dtests.asserts=true -Dtests.file.encoding=US-ASCII
   [junit4] FAILURE 6.48s J1 | SolrSlf4jReporterTest.testReporter <<<
   [junit4]    > Throwable #1: java.lang.AssertionError: count1=6, count2=6 - no 'solr.node'
logs in: {numFound=0,start=0,docs=[]}
   [junit4]    > 	at __randomizedtesting.SeedInfo.seed([3DB546EC9DC1F9A9:62516BDBF6CD6AEC]:0)
   [junit4]    > 	at org.apache.solr.metrics.reporters.SolrSlf4jReporterTest.testReporter(SolrSlf4jReporterTest.java:90)
   [junit4]    > 	at java.base/jdk.internal.reflect.NativeMethodAccessorImpl.invoke0(Native
Method)
   [junit4]    > 	at java.base/jdk.internal.reflect.NativeMethodAccessorImpl.invoke(NativeMethodAccessorImpl.java:62)
   [junit4]    > 	at java.base/jdk.internal.reflect.DelegatingMethodAccessorImpl.invoke(DelegatingMethodAccessorImpl.java:43)
   [junit4]    > 	at java.base/java.lang.reflect.Method.invoke(Method.java:564)
   [junit4]    > 	at java.base/java.lang.Thread.run(Thread.java:844)
   [junit4]   2> 1431948 INFO  (SUITE-SolrSlf4jReporterTest-seed#[3DB546EC9DC1F9A9]-worker)
[    ] o.a.s.SolrTestCaseJ4 ###deleteCore
   [junit4]   2> NOTE: leaving temporary files on disk at: /home/jenkins/workspace/Lucene-Solr-master-Linux/solr/build/solr-core/test/J1/temp/solr.metrics.reporters.SolrSlf4jReporterTest_3DB546EC9DC1F9A9-001
   [junit4]   2> NOTE: test params are: codec=Asserting(Lucene70): {}, docValues:{}, maxPointsInLeafNode=677,
maxMBSortInHeap=5.7270135315739985, sim=RandomSimilarity(queryNorm=true): {}, locale=gsw-FR,
timezone=America/Santiago
   [junit4]   2> NOTE: Linux 4.10.0-27-generic i386/Oracle Corporation 9 (32-bit)/cpus=8,threads=1,free=325040576,total=536870912
   [junit4]   2> NOTE: All tests run in this JVM: [ZkCLITest, TestSolrCloudWithDelegationTokens,
TestTlogReplica, BadCopyFieldTest, TestInfoStreamLogging, IgnoreCommitOptimizeUpdateProcessorFactoryTest,
DistributedFacetPivotWhiteBoxTest, TestSolrJ, TestDynamicFieldCollectionResource, TestSolrIndexConfig,
TestFuzzyAnalyzedSuggestions, LoggingHandlerTest, MoveReplicaTest, OverseerTaskQueueTest,
TolerantUpdateProcessorTest, TestCloudPivotFacet, TestLRUCache, DirectSolrConnectionTest,
TestRandomRequestDistribution, DocValuesTest, CloudMLTQParserTest, VersionInfoTest, TestPayloadScoreQParserPlugin,
TestMultiValuedNumericRangeQuery, TestSolrConfigHandler, TestSchemaVersionResource, TestSolrCLIRunExample,
TestSolrConfigHandlerConcurrent, SuggestComponentContextFilterQueryTest, PropertiesRequestHandlerTest,
ShardRoutingTest, TestSQLHandler, BadComponentTest, ConnectionReuseTest, ClusterStateUpdateTest,
DistribCursorPagingTest, FileBasedSpellCheckerTest, TestBlobHandler, CleanupOldIndexTest,
ResponseHeaderTest, TestInPlaceUpdatesDistrib, AddBlockUpdateTest, IndexSchemaTest, TestCustomStream,
SolrGraphiteReporterTest, MissingSegmentRecoveryTest, HdfsLockFactoryTest, TestCollectionsAPIViaSolrCloudCluster,
TestFreeTextSuggestions, ZkFailoverTest, TestOrdValues, TestMiniSolrCloudClusterSSL, TestDocBasedVersionConstraints,
OutOfBoxZkACLAndCredentialsProvidersTest, TestBM25SimilarityFactory, TestSha256AuthenticationProvider,
BlockJoinFacetDistribTest, SharedFSAutoReplicaFailoverUtilsTest, TestPullReplica, TestStressVersions,
SolrMetricReporterTest, TestUnifiedSolrHighlighter, TestDistribDocBasedVersion, AnalyticsMergeStrategyTest,
FileUtilsTest, TestReloadDeadlock, TestRTGBase, SaslZkACLProviderTest, TestCoreContainer,
RestartWhileUpdatingTest, SolrCmdDistributorTest, BasicAuthIntegrationTest, ChaosMonkeyNothingIsSafeWithPullReplicasTest,
AlternateDirectoryTest, DeleteReplicaTest, StatsReloadRaceTest, DistributedSuggestComponentTest,
TestSegmentSorting, TestSchemaNameResource, DistributedFacetPivotLongTailTest, V2StandaloneTest,
LeaderInitiatedRecoveryOnCommitTest, TestDFISimilarityFactory, PrimUtilsTest, ShardRoutingCustomTest,
TestReplicationHandlerBackup, HdfsSyncSliceTest, TestPartialUpdateDeduplication, MetricsConfigTest,
TestSimpleTrackingShardHandler, TestCustomDocTransformer, TestMaxTokenLenTokenizer, JSONWriterTest,
ConnectionManagerTest, OpenCloseCoreStressTest, ReplicaListTransformerTest, TermVectorComponentTest,
TestCharFilters, TestPerFieldSimilarity, TestTrieFacet, TestExactSharedStatsCache, TestElisionMultitermQuery,
HLLSerializationTest, DisMaxRequestHandlerTest, TestBackupRepositoryFactory, TestLegacyFieldReuse,
TestScoreJoinQPNoScore, TestUpdate, TestCloudSearcherWarming, TestSmileRequest, SolrSlf4jReporterTest]
   [junit4] Completed [364/732 (1!)] on J1 in 6.54s, 1 test, 1 failure <<< FAILURES!

[...truncated 242 lines...]
   [junit4] Suite: org.apache.solr.update.processor.UpdateRequestProcessorFactoryTest
   [junit4]   2> 1548600 INFO  (SUITE-UpdateRequestProcessorFactoryTest-seed#[3DB546EC9DC1F9A9]-worker)
[    ] o.a.s.SolrTestCaseJ4 SecureRandom sanity checks: test.solr.allowed.securerandom=null
& java.security.egd=file:/dev/./urandom
   [junit4]   2> Creating dataDir: /home/jenkins/workspace/Lucene-Solr-master-Linux/solr/build/solr-core/test/J1/temp/solr.update.processor.UpdateRequestProcessorFactoryTest_3DB546EC9DC1F9A9-001/init-core-data-001
   [junit4]   2> 1548600 WARN  (SUITE-UpdateRequestProcessorFactoryTest-seed#[3DB546EC9DC1F9A9]-worker)
[    ] o.a.s.SolrTestCaseJ4 startTrackingSearchers: numOpens=3 numCloses=3
   [junit4]   2> 1548600 INFO  (SUITE-UpdateRequestProcessorFactoryTest-seed#[3DB546EC9DC1F9A9]-worker)
[    ] o.a.s.SolrTestCaseJ4 Using PointFields (NUMERIC_POINTS_SYSPROP=true) w/NUMERIC_DOCVALUES_SYSPROP=false
   [junit4]   2> 1548601 INFO  (SUITE-UpdateRequestProcessorFactoryTest-seed#[3DB546EC9DC1F9A9]-worker)
[    ] o.a.s.SolrTestCaseJ4 Randomized ssl (false) and clientAuth (false) via: @org.apache.solr.util.RandomizeSSL(reason="",
ssl=0.0/0.0, value=0.0/0.0, clientAuth=0.0/0.0)
   [junit4]   2> 1548601 INFO  (SUITE-UpdateRequestProcessorFactoryTest-seed#[3DB546EC9DC1F9A9]-worker)
[    ] o.a.s.SolrTestCaseJ4 ####initCore
   [junit4]   2> 1549002 WARN  (coreLoadExecutor-5761-thread-1) [    ] o.a.s.c.RequestHandlers
no default request handler is registered (either '/select' or 'standard')
   [junit4]   2> 1549005 WARN  (coreLoadExecutor-5761-thread-1) [    ] o.a.s.r.ManagedResourceStorage
Cannot write to config directory /home/jenkins/workspace/Lucene-Solr-master-Linux/solr/core/src/test-files/solr/collection1/conf;
switching to use InMemory storage instead.
   [junit4]   2> 1549006 INFO  (SUITE-UpdateRequestProcessorFactoryTest-seed#[3DB546EC9DC1F9A9]-worker)
[    ] o.a.s.SolrTestCaseJ4 ####initCore end
   [junit4]   2> 1549008 INFO  (TEST-UpdateRequestProcessorFactoryTest.testUpdateDistribChainSkipping-seed#[3DB546EC9DC1F9A9])
[    ] o.a.s.SolrTestCaseJ4 ###Starting testUpdateDistribChainSkipping
   [junit4]   2> 1549008 INFO  (TEST-UpdateRequestProcessorFactoryTest.testUpdateDistribChainSkipping-seed#[3DB546EC9DC1F9A9])
[    ] o.a.s.SolrTestCaseJ4 ###Ending testUpdateDistribChainSkipping
   [junit4]   2> NOTE: reproduce with: ant test  -Dtestcase=UpdateRequestProcessorFactoryTest
-Dtests.method=testUpdateDistribChainSkipping -Dtests.seed=3DB546EC9DC1F9A9 -Dtests.multiplier=3
-Dtests.slow=true -Dtests.locale=om -Dtests.timezone=Australia/Sydney -Dtests.asserts=true
-Dtests.file.encoding=US-ASCII
   [junit4] FAILURE 0.00s J1 | UpdateRequestProcessorFactoryTest.testUpdateDistribChainSkipping
<<<
   [junit4]    > Throwable #1: java.lang.AssertionError: Tests must be run with INFO level
logging otherwise LogUpdateProcessor isn't used and can't be tested.
   [junit4]    > 	at __randomizedtesting.SeedInfo.seed([3DB546EC9DC1F9A9:4C51B83AEB2ADE65]:0)
   [junit4]    > 	at org.apache.solr.update.processor.UpdateRequestProcessorFactoryTest.testUpdateDistribChainSkipping(UpdateRequestProcessorFactoryTest.java:101)
   [junit4]    > 	at java.base/jdk.internal.reflect.NativeMethodAccessorImpl.invoke0(Native
Method)
   [junit4]    > 	at java.base/jdk.internal.reflect.NativeMethodAccessorImpl.invoke(NativeMethodAccessorImpl.java:62)
   [junit4]    > 	at java.base/jdk.internal.reflect.DelegatingMethodAccessorImpl.invoke(DelegatingMethodAccessorImpl.java:43)
   [junit4]    > 	at java.base/java.lang.reflect.Method.invoke(Method.java:564)
   [junit4]    > 	at java.base/java.lang.Thread.run(Thread.java:844)
   [junit4]   2> 1549010 INFO  (TEST-UpdateRequestProcessorFactoryTest.testConfiguration-seed#[3DB546EC9DC1F9A9])
[    ] o.a.s.SolrTestCaseJ4 ###Starting testConfiguration
   [junit4]   2> 1549011 INFO  (TEST-UpdateRequestProcessorFactoryTest.testConfiguration-seed#[3DB546EC9DC1F9A9])
[    ] o.a.s.SolrTestCaseJ4 ###Ending testConfiguration
   [junit4]   2> 1549012 INFO  (TEST-UpdateRequestProcessorFactoryTest.testRequestTimeUrp-seed#[3DB546EC9DC1F9A9])
[    ] o.a.s.SolrTestCaseJ4 ###Starting testRequestTimeUrp
   [junit4]   2> 1549013 INFO  (TEST-UpdateRequestProcessorFactoryTest.testRequestTimeUrp-seed#[3DB546EC9DC1F9A9])
[    ] o.a.s.SolrTestCaseJ4 ###Ending testRequestTimeUrp
   [junit4]   2> 1549014 INFO  (SUITE-UpdateRequestProcessorFactoryTest-seed#[3DB546EC9DC1F9A9]-worker)
[    ] o.a.s.SolrTestCaseJ4 ###deleteCore
   [junit4]   2> NOTE: leaving temporary files on disk at: /home/jenkins/workspace/Lucene-Solr-master-Linux/solr/build/solr-core/test/J1/temp/solr.update.processor.UpdateRequestProcessorFactoryTest_3DB546EC9DC1F9A9-001
   [junit4]   2> NOTE: test params are: codec=Asserting(Lucene70): {}, docValues:{}, maxPointsInLeafNode=1840,
maxMBSortInHeap=6.460599945974629, sim=RandomSimilarity(queryNorm=false): {}, locale=om, timezone=Australia/Sydney
   [junit4]   2> NOTE: Linux 4.10.0-27-generic i386/Oracle Corporation 9 (32-bit)/cpus=8,threads=1,free=84887408,total=212860928
   [junit4]   2> NOTE: All tests run in this JVM: [ZkCLITest, TestSolrCloudWithDelegationTokens,
TestTlogReplica, BadCopyFieldTest, TestInfoStreamLogging, IgnoreCommitOptimizeUpdateProcessorFactoryTest,
DistributedFacetPivotWhiteBoxTest, TestSolrJ, TestDynamicFieldCollectionResource, TestSolrIndexConfig,
TestFuzzyAnalyzedSuggestions, LoggingHandlerTest, MoveReplicaTest, OverseerTaskQueueTest,
TolerantUpdateProcessorTest, TestCloudPivotFacet, TestLRUCache, DirectSolrConnectionTest,
TestRandomRequestDistribution, DocValuesTest, CloudMLTQParserTest, VersionInfoTest, TestPayloadScoreQParserPlugin,
TestMultiValuedNumericRangeQuery, TestSolrConfigHandler, TestSchemaVersionResource, TestSolrCLIRunExample,
TestSolrConfigHandlerConcurrent, SuggestComponentContextFilterQueryTest, PropertiesRequestHandlerTest,
ShardRoutingTest, TestSQLHandler, BadComponentTest, ConnectionReuseTest, ClusterStateUpdateTest,
DistribCursorPagingTest, FileBasedSpellCheckerTest, TestBlobHandler, CleanupOldIndexTest,
ResponseHeaderTest, TestInPlaceUpdatesDistrib, AddBlockUpdateTest, IndexSchemaTest, TestCustomStream,
SolrGraphiteReporterTest, MissingSegmentRecoveryTest, HdfsLockFactoryTest, TestCollectionsAPIViaSolrCloudCluster,
TestFreeTextSuggestions, ZkFailoverTest, TestOrdValues, TestMiniSolrCloudClusterSSL, TestDocBasedVersionConstraints,
OutOfBoxZkACLAndCredentialsProvidersTest, TestBM25SimilarityFactory, TestSha256AuthenticationProvider,
BlockJoinFacetDistribTest, SharedFSAutoReplicaFailoverUtilsTest, TestPullReplica, TestStressVersions,
SolrMetricReporterTest, TestUnifiedSolrHighlighter, TestDistribDocBasedVersion, AnalyticsMergeStrategyTest,
FileUtilsTest, TestReloadDeadlock, TestRTGBase, SaslZkACLProviderTest, TestCoreContainer,
RestartWhileUpdatingTest, SolrCmdDistributorTest, BasicAuthIntegrationTest, ChaosMonkeyNothingIsSafeWithPullReplicasTest,
AlternateDirectoryTest, DeleteReplicaTest, StatsReloadRaceTest, DistributedSuggestComponentTest,
TestSegmentSorting, TestSchemaNameResource, DistributedFacetPivotLongTailTest, V2StandaloneTest,
LeaderInitiatedRecoveryOnCommitTest, TestDFISimilarityFactory, PrimUtilsTest, ShardRoutingCustomTest,
TestReplicationHandlerBackup, HdfsSyncSliceTest, TestPartialUpdateDeduplication, MetricsConfigTest,
TestSimpleTrackingShardHandler, TestCustomDocTransformer, TestMaxTokenLenTokenizer, JSONWriterTest,
ConnectionManagerTest, OpenCloseCoreStressTest, ReplicaListTransformerTest, TermVectorComponentTest,
TestCharFilters, TestPerFieldSimilarity, TestTrieFacet, TestExactSharedStatsCache, TestElisionMultitermQuery,
HLLSerializationTest, DisMaxRequestHandlerTest, TestBackupRepositoryFactory, TestLegacyFieldReuse,
TestScoreJoinQPNoScore, TestUpdate, TestCloudSearcherWarming, TestSmileRequest, SolrSlf4jReporterTest,
SubstringBytesRefFilterTest, SchemaVersionSpecificBehaviorTest, TestSubQueryTransformerDistrib,
SpellCheckComponentTest, ChaosMonkeySafeLeaderTest, RemoteQueryErrorTest, DistributedIntervalFacetingTest,
SliceStateTest, TestCloudDeleteByQuery, ShowFileRequestHandlerTest, DistributedQueryElevationComponentTest,
AnalysisAfterCoreReloadTest, SpellCheckCollatorTest, CoreAdminHandlerTest, PolyFieldTest,
NoCacheHeaderTest, TestAtomicUpdateErrorCases, DefaultValueUpdateProcessorTest, DocValuesMultiTest,
DistanceFunctionTest, XsltUpdateRequestHandlerTest, TestSurroundQueryParser, TestWriterPerf,
DirectSolrSpellCheckerTest, DocumentAnalysisRequestHandlerTest, PrimitiveFieldTypeTest, TestValueSourceCache,
MoreLikeThisHandlerTest, IndexSchemaRuntimeFieldTest, UpdateRequestProcessorFactoryTest]
   [junit4] Completed [444/732 (2!)] on J1 in 0.46s, 3 tests, 1 failure <<< FAILURES!

[...truncated 37536 lines...]

Mime
View raw message