lucene-dev mailing list archives

Site index · List index
Message view « Date » · « Thread »
Top « Date » · « Thread »
From Policeman Jenkins Server <jenk...@thetaphi.de>
Subject [JENKINS-EA] Lucene-Solr-7.x-Windows (32bit/jdk-9-ea+181) - Build # 135 - Still Unstable!
Date Thu, 24 Aug 2017 10:25:13 GMT
Build: https://jenkins.thetaphi.de/job/Lucene-Solr-7.x-Windows/135/
Java: 32bit/jdk-9-ea+181 -server -XX:+UseConcMarkSweepGC --illegal-access=deny

2 tests failed.
FAILED:  org.apache.solr.metrics.reporters.SolrSlf4jReporterTest.testReporter

Error Message:
No 'solr.node' logs in: {numFound=0,start=0,docs=[]}

Stack Trace:
java.lang.AssertionError: No 'solr.node' logs in: {numFound=0,start=0,docs=[]}
	at __randomizedtesting.SeedInfo.seed([81333B8A8106EA47:DED716BDEA0A7902]:0)
	at org.junit.Assert.fail(Assert.java:93)
	at org.apache.solr.metrics.reporters.SolrSlf4jReporterTest.testReporter(SolrSlf4jReporterTest.java:85)
	at java.base/jdk.internal.reflect.NativeMethodAccessorImpl.invoke0(Native Method)
	at java.base/jdk.internal.reflect.NativeMethodAccessorImpl.invoke(NativeMethodAccessorImpl.java:62)
	at java.base/jdk.internal.reflect.DelegatingMethodAccessorImpl.invoke(DelegatingMethodAccessorImpl.java:43)
	at java.base/java.lang.reflect.Method.invoke(Method.java:564)
	at com.carrotsearch.randomizedtesting.RandomizedRunner.invoke(RandomizedRunner.java:1713)
	at com.carrotsearch.randomizedtesting.RandomizedRunner$8.evaluate(RandomizedRunner.java:907)
	at com.carrotsearch.randomizedtesting.RandomizedRunner$9.evaluate(RandomizedRunner.java:943)
	at com.carrotsearch.randomizedtesting.RandomizedRunner$10.evaluate(RandomizedRunner.java:957)
	at com.carrotsearch.randomizedtesting.rules.SystemPropertiesRestoreRule$1.evaluate(SystemPropertiesRestoreRule.java:57)
	at org.apache.lucene.util.TestRuleSetupTeardownChained$1.evaluate(TestRuleSetupTeardownChained.java:49)
	at org.apache.lucene.util.AbstractBeforeAfterRule$1.evaluate(AbstractBeforeAfterRule.java:45)
	at org.apache.lucene.util.TestRuleThreadAndTestName$1.evaluate(TestRuleThreadAndTestName.java:48)
	at org.apache.lucene.util.TestRuleIgnoreAfterMaxFailures$1.evaluate(TestRuleIgnoreAfterMaxFailures.java:64)
	at org.apache.lucene.util.TestRuleMarkFailure$1.evaluate(TestRuleMarkFailure.java:47)
	at com.carrotsearch.randomizedtesting.rules.StatementAdapter.evaluate(StatementAdapter.java:36)
	at com.carrotsearch.randomizedtesting.ThreadLeakControl$StatementRunner.run(ThreadLeakControl.java:368)
	at com.carrotsearch.randomizedtesting.ThreadLeakControl.forkTimeoutingTask(ThreadLeakControl.java:817)
	at com.carrotsearch.randomizedtesting.ThreadLeakControl$3.evaluate(ThreadLeakControl.java:468)
	at com.carrotsearch.randomizedtesting.RandomizedRunner.runSingleTest(RandomizedRunner.java:916)
	at com.carrotsearch.randomizedtesting.RandomizedRunner$5.evaluate(RandomizedRunner.java:802)
	at com.carrotsearch.randomizedtesting.RandomizedRunner$6.evaluate(RandomizedRunner.java:852)
	at com.carrotsearch.randomizedtesting.RandomizedRunner$7.evaluate(RandomizedRunner.java:863)
	at com.carrotsearch.randomizedtesting.rules.StatementAdapter.evaluate(StatementAdapter.java:36)
	at com.carrotsearch.randomizedtesting.rules.SystemPropertiesRestoreRule$1.evaluate(SystemPropertiesRestoreRule.java:57)
	at org.apache.lucene.util.AbstractBeforeAfterRule$1.evaluate(AbstractBeforeAfterRule.java:45)
	at com.carrotsearch.randomizedtesting.rules.StatementAdapter.evaluate(StatementAdapter.java:36)
	at org.apache.lucene.util.TestRuleStoreClassName$1.evaluate(TestRuleStoreClassName.java:41)
	at com.carrotsearch.randomizedtesting.rules.NoShadowingOrOverridesOnMethodsRule$1.evaluate(NoShadowingOrOverridesOnMethodsRule.java:40)
	at com.carrotsearch.randomizedtesting.rules.NoShadowingOrOverridesOnMethodsRule$1.evaluate(NoShadowingOrOverridesOnMethodsRule.java:40)
	at com.carrotsearch.randomizedtesting.rules.StatementAdapter.evaluate(StatementAdapter.java:36)
	at com.carrotsearch.randomizedtesting.rules.StatementAdapter.evaluate(StatementAdapter.java:36)
	at org.apache.lucene.util.TestRuleAssertionsRequired$1.evaluate(TestRuleAssertionsRequired.java:53)
	at org.apache.lucene.util.TestRuleMarkFailure$1.evaluate(TestRuleMarkFailure.java:47)
	at org.apache.lucene.util.TestRuleIgnoreAfterMaxFailures$1.evaluate(TestRuleIgnoreAfterMaxFailures.java:64)
	at org.apache.lucene.util.TestRuleIgnoreTestSuites$1.evaluate(TestRuleIgnoreTestSuites.java:54)
	at com.carrotsearch.randomizedtesting.rules.StatementAdapter.evaluate(StatementAdapter.java:36)
	at com.carrotsearch.randomizedtesting.ThreadLeakControl$StatementRunner.run(ThreadLeakControl.java:368)
	at java.base/java.lang.Thread.run(Thread.java:844)


FAILED:  org.apache.solr.update.processor.UpdateRequestProcessorFactoryTest.testUpdateDistribChainSkipping

Error Message:
Tests must be run with INFO level logging otherwise LogUpdateProcessor isn't used and can't be tested.

Stack Trace:
java.lang.AssertionError: Tests must be run with INFO level logging otherwise LogUpdateProcessor isn't used and can't be tested.
	at __randomizedtesting.SeedInfo.seed([81333B8A8106EA47:F0D7C55CF7EDCD8B]:0)
	at org.junit.Assert.fail(Assert.java:93)
	at org.junit.Assert.assertTrue(Assert.java:43)
	at org.apache.solr.update.processor.UpdateRequestProcessorFactoryTest.testUpdateDistribChainSkipping(UpdateRequestProcessorFactoryTest.java:101)
	at java.base/jdk.internal.reflect.NativeMethodAccessorImpl.invoke0(Native Method)
	at java.base/jdk.internal.reflect.NativeMethodAccessorImpl.invoke(NativeMethodAccessorImpl.java:62)
	at java.base/jdk.internal.reflect.DelegatingMethodAccessorImpl.invoke(DelegatingMethodAccessorImpl.java:43)
	at java.base/java.lang.reflect.Method.invoke(Method.java:564)
	at com.carrotsearch.randomizedtesting.RandomizedRunner.invoke(RandomizedRunner.java:1713)
	at com.carrotsearch.randomizedtesting.RandomizedRunner$8.evaluate(RandomizedRunner.java:907)
	at com.carrotsearch.randomizedtesting.RandomizedRunner$9.evaluate(RandomizedRunner.java:943)
	at com.carrotsearch.randomizedtesting.RandomizedRunner$10.evaluate(RandomizedRunner.java:957)
	at com.carrotsearch.randomizedtesting.rules.SystemPropertiesRestoreRule$1.evaluate(SystemPropertiesRestoreRule.java:57)
	at org.apache.lucene.util.TestRuleSetupTeardownChained$1.evaluate(TestRuleSetupTeardownChained.java:49)
	at org.apache.lucene.util.AbstractBeforeAfterRule$1.evaluate(AbstractBeforeAfterRule.java:45)
	at org.apache.lucene.util.TestRuleThreadAndTestName$1.evaluate(TestRuleThreadAndTestName.java:48)
	at org.apache.lucene.util.TestRuleIgnoreAfterMaxFailures$1.evaluate(TestRuleIgnoreAfterMaxFailures.java:64)
	at org.apache.lucene.util.TestRuleMarkFailure$1.evaluate(TestRuleMarkFailure.java:47)
	at com.carrotsearch.randomizedtesting.rules.StatementAdapter.evaluate(StatementAdapter.java:36)
	at com.carrotsearch.randomizedtesting.ThreadLeakControl$StatementRunner.run(ThreadLeakControl.java:368)
	at com.carrotsearch.randomizedtesting.ThreadLeakControl.forkTimeoutingTask(ThreadLeakControl.java:817)
	at com.carrotsearch.randomizedtesting.ThreadLeakControl$3.evaluate(ThreadLeakControl.java:468)
	at com.carrotsearch.randomizedtesting.RandomizedRunner.runSingleTest(RandomizedRunner.java:916)
	at com.carrotsearch.randomizedtesting.RandomizedRunner$5.evaluate(RandomizedRunner.java:802)
	at com.carrotsearch.randomizedtesting.RandomizedRunner$6.evaluate(RandomizedRunner.java:852)
	at com.carrotsearch.randomizedtesting.RandomizedRunner$7.evaluate(RandomizedRunner.java:863)
	at com.carrotsearch.randomizedtesting.rules.StatementAdapter.evaluate(StatementAdapter.java:36)
	at com.carrotsearch.randomizedtesting.rules.SystemPropertiesRestoreRule$1.evaluate(SystemPropertiesRestoreRule.java:57)
	at org.apache.lucene.util.AbstractBeforeAfterRule$1.evaluate(AbstractBeforeAfterRule.java:45)
	at com.carrotsearch.randomizedtesting.rules.StatementAdapter.evaluate(StatementAdapter.java:36)
	at org.apache.lucene.util.TestRuleStoreClassName$1.evaluate(TestRuleStoreClassName.java:41)
	at com.carrotsearch.randomizedtesting.rules.NoShadowingOrOverridesOnMethodsRule$1.evaluate(NoShadowingOrOverridesOnMethodsRule.java:40)
	at com.carrotsearch.randomizedtesting.rules.NoShadowingOrOverridesOnMethodsRule$1.evaluate(NoShadowingOrOverridesOnMethodsRule.java:40)
	at com.carrotsearch.randomizedtesting.rules.StatementAdapter.evaluate(StatementAdapter.java:36)
	at com.carrotsearch.randomizedtesting.rules.StatementAdapter.evaluate(StatementAdapter.java:36)
	at org.apache.lucene.util.TestRuleAssertionsRequired$1.evaluate(TestRuleAssertionsRequired.java:53)
	at org.apache.lucene.util.TestRuleMarkFailure$1.evaluate(TestRuleMarkFailure.java:47)
	at org.apache.lucene.util.TestRuleIgnoreAfterMaxFailures$1.evaluate(TestRuleIgnoreAfterMaxFailures.java:64)
	at org.apache.lucene.util.TestRuleIgnoreTestSuites$1.evaluate(TestRuleIgnoreTestSuites.java:54)
	at com.carrotsearch.randomizedtesting.rules.StatementAdapter.evaluate(StatementAdapter.java:36)
	at com.carrotsearch.randomizedtesting.ThreadLeakControl$StatementRunner.run(ThreadLeakControl.java:368)
	at java.base/java.lang.Thread.run(Thread.java:844)




Build Log:
[...truncated 1723 lines...]
   [junit4] JVM J0: stderr was not empty, see: C:\Users\jenkins\workspace\Lucene-Solr-7.x-Windows\lucene\build\core\test\temp\junit4-J0-20170824_085649_87415967205987159507079.syserr
   [junit4] >>> JVM J0 emitted unexpected output (verbatim) ----
   [junit4] Java HotSpot(TM) Server VM warning: Option UseConcMarkSweepGC was deprecated in version 9.0 and will likely be removed in a future release.
   [junit4] <<< JVM J0: EOF ----

[...truncated 3 lines...]
   [junit4] JVM J1: stderr was not empty, see: C:\Users\jenkins\workspace\Lucene-Solr-7.x-Windows\lucene\build\core\test\temp\junit4-J1-20170824_085649_8742033335537868412461.syserr
   [junit4] >>> JVM J1 emitted unexpected output (verbatim) ----
   [junit4] Java HotSpot(TM) Server VM warning: Option UseConcMarkSweepGC was deprecated in version 9.0 and will likely be removed in a future release.
   [junit4] <<< JVM J1: EOF ----

[...truncated 304 lines...]
   [junit4] JVM J0: stderr was not empty, see: C:\Users\jenkins\workspace\Lucene-Solr-7.x-Windows\lucene\build\test-framework\test\temp\junit4-J0-20170824_090433_4777611727748094763741.syserr
   [junit4] >>> JVM J0 emitted unexpected output (verbatim) ----
   [junit4] Java HotSpot(TM) Server VM warning: Option UseConcMarkSweepGC was deprecated in version 9.0 and will likely be removed in a future release.
   [junit4] <<< JVM J0: EOF ----

   [junit4] JVM J1: stderr was not empty, see: C:\Users\jenkins\workspace\Lucene-Solr-7.x-Windows\lucene\build\test-framework\test\temp\junit4-J1-20170824_090433_4774618504497494310988.syserr
   [junit4] >>> JVM J1 emitted unexpected output (verbatim) ----
   [junit4] Java HotSpot(TM) Server VM warning: Option UseConcMarkSweepGC was deprecated in version 9.0 and will likely be removed in a future release.
   [junit4] <<< JVM J1: EOF ----

[...truncated 1034 lines...]
   [junit4] JVM J0: stderr was not empty, see: C:\Users\jenkins\workspace\Lucene-Solr-7.x-Windows\lucene\build\analysis\common\test\temp\junit4-J0-20170824_090521_4143072110561741483331.syserr
   [junit4] >>> JVM J0 emitted unexpected output (verbatim) ----
   [junit4] Java HotSpot(TM) Server VM warning: Option UseConcMarkSweepGC was deprecated in version 9.0 and will likely be removed in a future release.
   [junit4] <<< JVM J0: EOF ----

[...truncated 3 lines...]
   [junit4] JVM J1: stderr was not empty, see: C:\Users\jenkins\workspace\Lucene-Solr-7.x-Windows\lucene\build\analysis\common\test\temp\junit4-J1-20170824_090521_41417948656839189955358.syserr
   [junit4] >>> JVM J1 emitted unexpected output (verbatim) ----
   [junit4] Java HotSpot(TM) Server VM warning: Option UseConcMarkSweepGC was deprecated in version 9.0 and will likely be removed in a future release.
   [junit4] <<< JVM J1: EOF ----

[...truncated 215 lines...]
   [junit4] JVM J1: stderr was not empty, see: C:\Users\jenkins\workspace\Lucene-Solr-7.x-Windows\lucene\build\analysis\icu\test\temp\junit4-J1-20170824_090733_7756477530965371605583.syserr
   [junit4] >>> JVM J1 emitted unexpected output (verbatim) ----
   [junit4] Java HotSpot(TM) Server VM warning: Option UseConcMarkSweepGC was deprecated in version 9.0 and will likely be removed in a future release.
   [junit4] <<< JVM J1: EOF ----

[...truncated 5 lines...]
   [junit4] JVM J0: stderr was not empty, see: C:\Users\jenkins\workspace\Lucene-Solr-7.x-Windows\lucene\build\analysis\icu\test\temp\junit4-J0-20170824_090733_7759561347418250571580.syserr
   [junit4] >>> JVM J0 emitted unexpected output (verbatim) ----
   [junit4] Java HotSpot(TM) Server VM warning: Option UseConcMarkSweepGC was deprecated in version 9.0 and will likely be removed in a future release.
   [junit4] <<< JVM J0: EOF ----

[...truncated 232 lines...]
   [junit4] JVM J0: stderr was not empty, see: C:\Users\jenkins\workspace\Lucene-Solr-7.x-Windows\lucene\build\analysis\kuromoji\test\temp\junit4-J0-20170824_090742_96817424835188991312732.syserr
   [junit4] >>> JVM J0 emitted unexpected output (verbatim) ----
   [junit4] Java HotSpot(TM) Server VM warning: Option UseConcMarkSweepGC was deprecated in version 9.0 and will likely be removed in a future release.
   [junit4] <<< JVM J0: EOF ----

[...truncated 9 lines...]
   [junit4] JVM J1: stderr was not empty, see: C:\Users\jenkins\workspace\Lucene-Solr-7.x-Windows\lucene\build\analysis\kuromoji\test\temp\junit4-J1-20170824_090742_9687959251109383459587.syserr
   [junit4] >>> JVM J1 emitted unexpected output (verbatim) ----
   [junit4] Java HotSpot(TM) Server VM warning: Option UseConcMarkSweepGC was deprecated in version 9.0 and will likely be removed in a future release.
   [junit4] <<< JVM J1: EOF ----

[...truncated 147 lines...]
   [junit4] JVM J0: stderr was not empty, see: C:\Users\jenkins\workspace\Lucene-Solr-7.x-Windows\lucene\build\analysis\morfologik\test\temp\junit4-J0-20170824_090813_31814767525927101255001.syserr
   [junit4] >>> JVM J0 emitted unexpected output (verbatim) ----
   [junit4] Java HotSpot(TM) Server VM warning: Option UseConcMarkSweepGC was deprecated in version 9.0 and will likely be removed in a future release.
   [junit4] <<< JVM J0: EOF ----

[...truncated 3 lines...]
   [junit4] JVM J1: stderr was not empty, see: C:\Users\jenkins\workspace\Lucene-Solr-7.x-Windows\lucene\build\analysis\morfologik\test\temp\junit4-J1-20170824_090813_3189120898255208377166.syserr
   [junit4] >>> JVM J1 emitted unexpected output (verbatim) ----
   [junit4] Java HotSpot(TM) Server VM warning: Option UseConcMarkSweepGC was deprecated in version 9.0 and will likely be removed in a future release.
   [junit4] <<< JVM J1: EOF ----

[...truncated 156 lines...]
   [junit4] JVM J0: stderr was not empty, see: C:\Users\jenkins\workspace\Lucene-Solr-7.x-Windows\lucene\build\analysis\phonetic\test\temp\junit4-J0-20170824_090818_72718158173655113709471.syserr
   [junit4] >>> JVM J0 emitted unexpected output (verbatim) ----
   [junit4] Java HotSpot(TM) Server VM warning: Option UseConcMarkSweepGC was deprecated in version 9.0 and will likely be removed in a future release.
   [junit4] <<< JVM J0: EOF ----

[...truncated 6 lines...]
   [junit4] JVM J1: stderr was not empty, see: C:\Users\jenkins\workspace\Lucene-Solr-7.x-Windows\lucene\build\analysis\phonetic\test\temp\junit4-J1-20170824_090818_7279970109247833185488.syserr
   [junit4] >>> JVM J1 emitted unexpected output (verbatim) ----
   [junit4] Java HotSpot(TM) Server VM warning: Option UseConcMarkSweepGC was deprecated in version 9.0 and will likely be removed in a future release.
   [junit4] <<< JVM J1: EOF ----

[...truncated 144 lines...]
   [junit4] JVM J1: stderr was not empty, see: C:\Users\jenkins\workspace\Lucene-Solr-7.x-Windows\lucene\build\analysis\smartcn\test\temp\junit4-J1-20170824_090828_439854062872683700021.syserr
   [junit4] >>> JVM J1 emitted unexpected output (verbatim) ----
   [junit4] Java HotSpot(TM) Server VM warning: Option UseConcMarkSweepGC was deprecated in version 9.0 and will likely be removed in a future release.
   [junit4] <<< JVM J1: EOF ----

[...truncated 3 lines...]
   [junit4] JVM J0: stderr was not empty, see: C:\Users\jenkins\workspace\Lucene-Solr-7.x-Windows\lucene\build\analysis\smartcn\test\temp\junit4-J0-20170824_090828_4399237471873500473109.syserr
   [junit4] >>> JVM J0 emitted unexpected output (verbatim) ----
   [junit4] Java HotSpot(TM) Server VM warning: Option UseConcMarkSweepGC was deprecated in version 9.0 and will likely be removed in a future release.
   [junit4] <<< JVM J0: EOF ----

[...truncated 152 lines...]
   [junit4] JVM J1: stderr was not empty, see: C:\Users\jenkins\workspace\Lucene-Solr-7.x-Windows\lucene\build\analysis\stempel\test\temp\junit4-J1-20170824_090838_8302084079812953010619.syserr
   [junit4] >>> JVM J1 emitted unexpected output (verbatim) ----
   [junit4] Java HotSpot(TM) Server VM warning: Option UseConcMarkSweepGC was deprecated in version 9.0 and will likely be removed in a future release.
   [junit4] <<< JVM J1: EOF ----

   [junit4] JVM J0: stderr was not empty, see: C:\Users\jenkins\workspace\Lucene-Solr-7.x-Windows\lucene\build\analysis\stempel\test\temp\junit4-J0-20170824_090838_830446075443450634576.syserr
   [junit4] >>> JVM J0 emitted unexpected output (verbatim) ----
   [junit4] Java HotSpot(TM) Server VM warning: Option UseConcMarkSweepGC was deprecated in version 9.0 and will likely be removed in a future release.
   [junit4] <<< JVM J0: EOF ----

[...truncated 160 lines...]
   [junit4] JVM J0: stderr was not empty, see: C:\Users\jenkins\workspace\Lucene-Solr-7.x-Windows\lucene\build\analysis\uima\test\temp\junit4-J0-20170824_090842_88217789446894278247335.syserr
   [junit4] >>> JVM J0 emitted unexpected output (verbatim) ----
   [junit4] Java HotSpot(TM) Server VM warning: Option UseConcMarkSweepGC was deprecated in version 9.0 and will likely be removed in a future release.
   [junit4] <<< JVM J0: EOF ----

[...truncated 204 lines...]
   [junit4] JVM J0: stderr was not empty, see: C:\Users\jenkins\workspace\Lucene-Solr-7.x-Windows\lucene\build\backward-codecs\test\temp\junit4-J0-20170824_090906_12017284434397509568237.syserr
   [junit4] >>> JVM J0 emitted unexpected output (verbatim) ----
   [junit4] Java HotSpot(TM) Server VM warning: Option UseConcMarkSweepGC was deprecated in version 9.0 and will likely be removed in a future release.
   [junit4] <<< JVM J0: EOF ----

[...truncated 9 lines...]
   [junit4] JVM J1: stderr was not empty, see: C:\Users\jenkins\workspace\Lucene-Solr-7.x-Windows\lucene\build\backward-codecs\test\temp\junit4-J1-20170824_090906_1208659697606675109738.syserr
   [junit4] >>> JVM J1 emitted unexpected output (verbatim) ----
   [junit4] Java HotSpot(TM) Server VM warning: Option UseConcMarkSweepGC was deprecated in version 9.0 and will likely be removed in a future release.
   [junit4] <<< JVM J1: EOF ----

[...truncated 1222 lines...]
   [junit4] JVM J0: stderr was not empty, see: C:\Users\jenkins\workspace\Lucene-Solr-7.x-Windows\lucene\build\benchmark\test\temp\junit4-J0-20170824_091044_6276741633791307154542.syserr
   [junit4] >>> JVM J0 emitted unexpected output (verbatim) ----
   [junit4] Java HotSpot(TM) Server VM warning: Option UseConcMarkSweepGC was deprecated in version 9.0 and will likely be removed in a future release.
   [junit4] <<< JVM J0: EOF ----

   [junit4] JVM J1: stderr was not empty, see: C:\Users\jenkins\workspace\Lucene-Solr-7.x-Windows\lucene\build\benchmark\test\temp\junit4-J1-20170824_091044_62311262003567004604103.syserr
   [junit4] >>> JVM J1 emitted unexpected output (verbatim) ----
   [junit4] Java HotSpot(TM) Server VM warning: Option UseConcMarkSweepGC was deprecated in version 9.0 and will likely be removed in a future release.
   [junit4] <<< JVM J1: EOF ----

[...truncated 222 lines...]
   [junit4] JVM J1: stderr was not empty, see: C:\Users\jenkins\workspace\Lucene-Solr-7.x-Windows\lucene\build\classification\test\temp\junit4-J1-20170824_091058_07815151265200486895970.syserr
   [junit4] >>> JVM J1 emitted unexpected output (verbatim) ----
   [junit4] Java HotSpot(TM) Server VM warning: Option UseConcMarkSweepGC was deprecated in version 9.0 and will likely be removed in a future release.
   [junit4] <<< JVM J1: EOF ----

[...truncated 3 lines...]
   [junit4] JVM J0: stderr was not empty, see: C:\Users\jenkins\workspace\Lucene-Solr-7.x-Windows\lucene\build\classification\test\temp\junit4-J0-20170824_091058_0809027898979928408607.syserr
   [junit4] >>> JVM J0 emitted unexpected output (verbatim) ----
   [junit4] Java HotSpot(TM) Server VM warning: Option UseConcMarkSweepGC was deprecated in version 9.0 and will likely be removed in a future release.
   [junit4] <<< JVM J0: EOF ----

[...truncated 250 lines...]
   [junit4] JVM J0: stderr was not empty, see: C:\Users\jenkins\workspace\Lucene-Solr-7.x-Windows\lucene\build\codecs\test\temp\junit4-J0-20170824_091112_80112141092123228070357.syserr
   [junit4] >>> JVM J0 emitted unexpected output (verbatim) ----
   [junit4] Java HotSpot(TM) Server VM warning: Option UseConcMarkSweepGC was deprecated in version 9.0 and will likely be removed in a future release.
   [junit4] <<< JVM J0: EOF ----

[...truncated 5 lines...]
   [junit4] JVM J1: stderr was not empty, see: C:\Users\jenkins\workspace\Lucene-Solr-7.x-Windows\lucene\build\codecs\test\temp\junit4-J1-20170824_091112_80116812207791577768571.syserr
   [junit4] >>> JVM J1 emitted unexpected output (verbatim) ----
   [junit4] Java HotSpot(TM) Server VM warning: Option UseConcMarkSweepGC was deprecated in version 9.0 and will likely be removed in a future release.
   [junit4] <<< JVM J1: EOF ----

[...truncated 229 lines...]
   [junit4] JVM J1: stderr was not empty, see: C:\Users\jenkins\workspace\Lucene-Solr-7.x-Windows\lucene\build\demo\test\temp\junit4-J1-20170824_091245_41814403540955133055798.syserr
   [junit4] >>> JVM J1 emitted unexpected output (verbatim) ----
   [junit4] Java HotSpot(TM) Server VM warning: Option UseConcMarkSweepGC was deprecated in version 9.0 and will likely be removed in a future release.
   [junit4] <<< JVM J1: EOF ----

   [junit4] JVM J0: stderr was not empty, see: C:\Users\jenkins\workspace\Lucene-Solr-7.x-Windows\lucene\build\demo\test\temp\junit4-J0-20170824_091245_41816309108097997580214.syserr
   [junit4] >>> JVM J0 emitted unexpected output (verbatim) ----
   [junit4] Java HotSpot(TM) Server VM warning: Option UseConcMarkSweepGC was deprecated in version 9.0 and will likely be removed in a future release.
   [junit4] <<< JVM J0: EOF ----

[...truncated 163 lines...]
   [junit4] JVM J1: stderr was not empty, see: C:\Users\jenkins\workspace\Lucene-Solr-7.x-Windows\lucene\build\expressions\test\temp\junit4-J1-20170824_091248_90815241665486326160981.syserr
   [junit4] >>> JVM J1 emitted unexpected output (verbatim) ----
   [junit4] Java HotSpot(TM) Server VM warning: Option UseConcMarkSweepGC was deprecated in version 9.0 and will likely be removed in a future release.
   [junit4] <<< JVM J1: EOF ----

[...truncated 3 lines...]
   [junit4] JVM J0: stderr was not empty, see: C:\Users\jenkins\workspace\Lucene-Solr-7.x-Windows\lucene\build\expressions\test\temp\junit4-J0-20170824_091248_9087506966369520423314.syserr
   [junit4] >>> JVM J0 emitted unexpected output (verbatim) ----
   [junit4] Java HotSpot(TM) Server VM warning: Option UseConcMarkSweepGC was deprecated in version 9.0 and will likely be removed in a future release.
   [junit4] <<< JVM J0: EOF ----

[...truncated 208 lines...]
   [junit4] JVM J1: stderr was not empty, see: C:\Users\jenkins\workspace\Lucene-Solr-7.x-Windows\lucene\build\facet\test\temp\junit4-J1-20170824_091254_14411488513895355090831.syserr
   [junit4] >>> JVM J1 emitted unexpected output (verbatim) ----
   [junit4] Java HotSpot(TM) Server VM warning: Option UseConcMarkSweepGC was deprecated in version 9.0 and will likely be removed in a future release.
   [junit4] <<< JVM J1: EOF ----

[...truncated 3 lines...]
   [junit4] JVM J0: stderr was not empty, see: C:\Users\jenkins\workspace\Lucene-Solr-7.x-Windows\lucene\build\facet\test\temp\junit4-J0-20170824_091254_1447943296541189238524.syserr
   [junit4] >>> JVM J0 emitted unexpected output (verbatim) ----
   [junit4] Java HotSpot(TM) Server VM warning: Option UseConcMarkSweepGC was deprecated in version 9.0 and will likely be removed in a future release.
   [junit4] <<< JVM J0: EOF ----

[...truncated 172 lines...]
   [junit4] JVM J1: stderr was not empty, see: C:\Users\jenkins\workspace\Lucene-Solr-7.x-Windows\lucene\build\grouping\test\temp\junit4-J1-20170824_091308_3013457195951996072440.syserr
   [junit4] >>> JVM J1 emitted unexpected output (verbatim) ----
   [junit4] Java HotSpot(TM) Server VM warning: Option UseConcMarkSweepGC was deprecated in version 9.0 and will likely be removed in a future release.
   [junit4] <<< JVM J1: EOF ----

[...truncated 3 lines...]
   [junit4] JVM J0: stderr was not empty, see: C:\Users\jenkins\workspace\Lucene-Solr-7.x-Windows\lucene\build\grouping\test\temp\junit4-J0-20170824_091308_30118435889717976560809.syserr
   [junit4] >>> JVM J0 emitted unexpected output (verbatim) ----
   [junit4] Java HotSpot(TM) Server VM warning: Option UseConcMarkSweepGC was deprecated in version 9.0 and will likely be removed in a future release.
   [junit4] <<< JVM J0: EOF ----

[...truncated 233 lines...]
   [junit4] JVM J1: stderr was not empty, see: C:\Users\jenkins\workspace\Lucene-Solr-7.x-Windows\lucene\build\highlighter\test\temp\junit4-J1-20170824_091319_02014107652643066988700.syserr
   [junit4] >>> JVM J1 emitted unexpected output (verbatim) ----
   [junit4] Java HotSpot(TM) Server VM warning: Option UseConcMarkSweepGC was deprecated in version 9.0 and will likely be removed in a future release.
   [junit4] <<< JVM J1: EOF ----

[...truncated 6 lines...]
   [junit4] JVM J0: stderr was not empty, see: C:\Users\jenkins\workspace\Lucene-Solr-7.x-Windows\lucene\build\highlighter\test\temp\junit4-J0-20170824_091319_0207858216676105349740.syserr
   [junit4] >>> JVM J0 emitted unexpected output (verbatim) ----
   [junit4] Java HotSpot(TM) Server VM warning: Option UseConcMarkSweepGC was deprecated in version 9.0 and will likely be removed in a future release.
   [junit4] <<< JVM J0: EOF ----

[...truncated 153 lines...]
   [junit4] JVM J1: stderr was not empty, see: C:\Users\jenkins\workspace\Lucene-Solr-7.x-Windows\lucene\build\join\test\temp\junit4-J1-20170824_091329_5485946958080151980058.syserr
   [junit4] >>> JVM J1 emitted unexpected output (verbatim) ----
   [junit4] Java HotSpot(TM) Server VM warning: Option UseConcMarkSweepGC was deprecated in version 9.0 and will likely be removed in a future release.
   [junit4] <<< JVM J1: EOF ----

[...truncated 6 lines...]
   [junit4] JVM J0: stderr was not empty, see: C:\Users\jenkins\workspace\Lucene-Solr-7.x-Windows\lucene\build\join\test\temp\junit4-J0-20170824_091329_54812735628557555433437.syserr
   [junit4] >>> JVM J0 emitted unexpected output (verbatim) ----
   [junit4] Java HotSpot(TM) Server VM warning: Option UseConcMarkSweepGC was deprecated in version 9.0 and will likely be removed in a future release.
   [junit4] <<< JVM J0: EOF ----

[...truncated 140 lines...]
   [junit4] JVM J0: stderr was not empty, see: C:\Users\jenkins\workspace\Lucene-Solr-7.x-Windows\lucene\build\memory\test\temp\junit4-J0-20170824_091346_3856858428569843656768.syserr
   [junit4] >>> JVM J0 emitted unexpected output (verbatim) ----
   [junit4] Java HotSpot(TM) Server VM warning: Option UseConcMarkSweepGC was deprecated in version 9.0 and will likely be removed in a future release.
   [junit4] <<< JVM J0: EOF ----

[...truncated 3 lines...]
   [junit4] JVM J1: stderr was not empty, see: C:\Users\jenkins\workspace\Lucene-Solr-7.x-Windows\lucene\build\memory\test\temp\junit4-J1-20170824_091346_3867802246245410666389.syserr
   [junit4] >>> JVM J1 emitted unexpected output (verbatim) ----
   [junit4] Java HotSpot(TM) Server VM warning: Option UseConcMarkSweepGC was deprecated in version 9.0 and will likely be removed in a future release.
   [junit4] <<< JVM J1: EOF ----

[...truncated 174 lines...]
   [junit4] JVM J0: stderr was not empty, see: C:\Users\jenkins\workspace\Lucene-Solr-7.x-Windows\lucene\build\misc\test\temp\junit4-J0-20170824_091356_22310529542572646729578.syserr
   [junit4] >>> JVM J0 emitted unexpected output (verbatim) ----
   [junit4] Java HotSpot(TM) Server VM warning: Option UseConcMarkSweepGC was deprecated in version 9.0 and will likely be removed in a future release.
   [junit4] <<< JVM J0: EOF ----

[...truncated 6 lines...]
   [junit4] JVM J1: stderr was not empty, see: C:\Users\jenkins\workspace\Lucene-Solr-7.x-Windows\lucene\build\misc\test\temp\junit4-J1-20170824_091356_22411406392292239949390.syserr
   [junit4] >>> JVM J1 emitted unexpected output (verbatim) ----
   [junit4] Java HotSpot(TM) Server VM warning: Option UseConcMarkSweepGC was deprecated in version 9.0 and will likely be removed in a future release.
   [junit4] <<< JVM J1: EOF ----

[...truncated 305 lines...]
   [junit4] JVM J0: stderr was not empty, see: C:\Users\jenkins\workspace\Lucene-Solr-7.x-Windows\lucene\build\queries\test\temp\junit4-J0-20170824_091427_06610681698105781726092.syserr
   [junit4] >>> JVM J0 emitted unexpected output (verbatim) ----
   [junit4] Java HotSpot(TM) Server VM warning: Option UseConcMarkSweepGC was deprecated in version 9.0 and will likely be removed in a future release.
   [junit4] <<< JVM J0: EOF ----

[...truncated 3 lines...]
   [junit4] JVM J1: stderr was not empty, see: C:\Users\jenkins\workspace\Lucene-Solr-7.x-Windows\lucene\build\queries\test\temp\junit4-J1-20170824_091427_06611146957009651526403.syserr
   [junit4] >>> JVM J1 emitted unexpected output (verbatim) ----
   [junit4] Java HotSpot(TM) Server VM warning: Option UseConcMarkSweepGC was deprecated in version 9.0 and will likely be removed in a future release.
   [junit4] <<< JVM J1: EOF ----

[...truncated 220 lines...]
   [junit4] JVM J0: stderr was not empty, see: C:\Users\jenkins\workspace\Lucene-Solr-7.x-Windows\lucene\build\queryparser\test\temp\junit4-J0-20170824_091440_2301434102253531870639.syserr
   [junit4] >>> JVM J0 emitted unexpected output (verbatim) ----
   [junit4] Java HotSpot(TM) Server VM warning: Option UseConcMarkSweepGC was deprecated in version 9.0 and will likely be removed in a future release.
   [junit4] <<< JVM J0: EOF ----

   [junit4] JVM J1: stderr was not empty, see: C:\Users\jenkins\workspace\Lucene-Solr-7.x-Windows\lucene\build\queryparser\test\temp\junit4-J1-20170824_091440_2308900382186466388737.syserr
   [junit4] >>> JVM J1 emitted unexpected output (verbatim) ----
   [junit4] Java HotSpot(TM) Server VM warning: Option UseConcMarkSweepGC was deprecated in version 9.0 and will likely be removed in a future release.
   [junit4] <<< JVM J1: EOF ----

[...truncated 197 lines...]
   [junit4] JVM J1: stderr was not empty, see: C:\Users\jenkins\workspace\Lucene-Solr-7.x-Windows\lucene\build\replicator\test\temp\junit4-J1-20170824_091449_66718325530826404373277.syserr
   [junit4] >>> JVM J1 emitted unexpected output (verbatim) ----
   [junit4] Java HotSpot(TM) Server VM warning: Option UseConcMarkSweepGC was deprecated in version 9.0 and will likely be removed in a future release.
   [junit4] <<< JVM J1: EOF ----

[...truncated 6 lines...]
   [junit4] JVM J0: stderr was not empty, see: C:\Users\jenkins\workspace\Lucene-Solr-7.x-Windows\lucene\build\replicator\test\temp\junit4-J0-20170824_091449_6675334609693265657360.syserr
   [junit4] >>> JVM J0 emitted unexpected output (verbatim) ----
   [junit4] Java HotSpot(TM) Server VM warning: Option UseConcMarkSweepGC was deprecated in version 9.0 and will likely be removed in a future release.
   [junit4] <<< JVM J0: EOF ----

[...truncated 201 lines...]
   [junit4] JVM J0: stderr was not empty, see: C:\Users\jenkins\workspace\Lucene-Solr-7.x-Windows\lucene\build\sandbox\test\temp\junit4-J0-20170824_091508_35818052329468687826473.syserr
   [junit4] >>> JVM J0 emitted unexpected output (verbatim) ----
   [junit4] Java HotSpot(TM) Server VM warning: Option UseConcMarkSweepGC was deprecated in version 9.0 and will likely be removed in a future release.
   [junit4] <<< JVM J0: EOF ----

[...truncated 7 lines...]
   [junit4] JVM J1: stderr was not empty, see: C:\Users\jenkins\workspace\Lucene-Solr-7.x-Windows\lucene\build\sandbox\test\temp\junit4-J1-20170824_091508_35814551008338154530641.syserr
   [junit4] >>> JVM J1 emitted unexpected output (verbatim) ----
   [junit4] Java HotSpot(TM) Server VM warning: Option UseConcMarkSweepGC was deprecated in version 9.0 and will likely be removed in a future release.
   [junit4] <<< JVM J1: EOF ----

[...truncated 211 lines...]
   [junit4] JVM J0: stderr was not empty, see: C:\Users\jenkins\workspace\Lucene-Solr-7.x-Windows\lucene\build\spatial-extras\test\temp\junit4-J0-20170824_091547_7153329677648764426163.syserr
   [junit4] >>> JVM J0 emitted unexpected output (verbatim) ----
   [junit4] Java HotSpot(TM) Server VM warning: Option UseConcMarkSweepGC was deprecated in version 9.0 and will likely be removed in a future release.
   [junit4] <<< JVM J0: EOF ----

   [junit4] JVM J1: stderr was not empty, see: C:\Users\jenkins\workspace\Lucene-Solr-7.x-Windows\lucene\build\spatial-extras\test\temp\junit4-J1-20170824_091547_7144911775814724321592.syserr
   [junit4] >>> JVM J1 emitted unexpected output (verbatim) ----
   [junit4] Java HotSpot(TM) Server VM warning: Option UseConcMarkSweepGC was deprecated in version 9.0 and will likely be removed in a future release.
   [junit4] <<< JVM J1: EOF ----

[...truncated 174 lines...]
   [junit4] JVM J0: stderr was not empty, see: C:\Users\jenkins\workspace\Lucene-Solr-7.x-Windows\lucene\build\spatial3d\test\temp\junit4-J0-20170824_091601_35916511969322958552009.syserr
   [junit4] >>> JVM J0 emitted unexpected output (verbatim) ----
   [junit4] Java HotSpot(TM) Server VM warning: Option UseConcMarkSweepGC was deprecated in version 9.0 and will likely be removed in a future release.
   [junit4] <<< JVM J0: EOF ----

[...truncated 3 lines...]
   [junit4] JVM J1: stderr was not empty, see: C:\Users\jenkins\workspace\Lucene-Solr-7.x-Windows\lucene\build\spatial3d\test\temp\junit4-J1-20170824_091601_3596524714256380671170.syserr
   [junit4] >>> JVM J1 emitted unexpected output (verbatim) ----
   [junit4] Java HotSpot(TM) Server VM warning: Option UseConcMarkSweepGC was deprecated in version 9.0 and will likely be removed in a future release.
   [junit4] <<< JVM J1: EOF ----

[...truncated 139 lines...]
   [junit4] JVM J0: stderr was not empty, see: C:\Users\jenkins\workspace\Lucene-Solr-7.x-Windows\lucene\build\spatial\test\temp\junit4-J0-20170824_091651_5592187680194320251619.syserr
   [junit4] >>> JVM J0 emitted unexpected output (verbatim) ----
   [junit4] Java HotSpot(TM) Server VM warning: Option UseConcMarkSweepGC was deprecated in version 9.0 and will likely be removed in a future release.
   [junit4] <<< JVM J0: EOF ----

[...truncated 234 lines...]
   [junit4] JVM J1: stderr was not empty, see: C:\Users\jenkins\workspace\Lucene-Solr-7.x-Windows\lucene\build\suggest\test\temp\junit4-J1-20170824_091700_4866840934507319553544.syserr
   [junit4] >>> JVM J1 emitted unexpected output (verbatim) ----
   [junit4] Java HotSpot(TM) Server VM warning: Option UseConcMarkSweepGC was deprecated in version 9.0 and will likely be removed in a future release.
   [junit4] <<< JVM J1: EOF ----

[...truncated 6 lines...]
   [junit4] JVM J0: stderr was not empty, see: C:\Users\jenkins\workspace\Lucene-Solr-7.x-Windows\lucene\build\suggest\test\temp\junit4-J0-20170824_091700_4812779623779000667648.syserr
   [junit4] >>> JVM J0 emitted unexpected output (verbatim) ----
   [junit4] Java HotSpot(TM) Server VM warning: Option UseConcMarkSweepGC was deprecated in version 9.0 and will likely be removed in a future release.
   [junit4] <<< JVM J0: EOF ----

[...truncated 2812 lines...]
   [junit4] Suite: org.apache.solr.update.processor.UpdateRequestProcessorFactoryTest
   [junit4]   2> Creating dataDir: C:\Users\jenkins\workspace\Lucene-Solr-7.x-Windows\solr\build\solr-core\test\J1\temp\solr.update.processor.UpdateRequestProcessorFactoryTest_81333B8A8106EA47-001\init-core-data-001
   [junit4]   2> 1749380 WARN  (SUITE-UpdateRequestProcessorFactoryTest-seed#[81333B8A8106EA47]-worker) [    ] o.a.s.SolrTestCaseJ4 startTrackingSearchers: numOpens=3 numCloses=3
   [junit4]   2> 1749380 INFO  (SUITE-UpdateRequestProcessorFactoryTest-seed#[81333B8A8106EA47]-worker) [    ] o.a.s.SolrTestCaseJ4 Using PointFields (NUMERIC_POINTS_SYSPROP=true) w/NUMERIC_DOCVALUES_SYSPROP=false
   [junit4]   2> 1749382 INFO  (SUITE-UpdateRequestProcessorFactoryTest-seed#[81333B8A8106EA47]-worker) [    ] o.a.s.SolrTestCaseJ4 Randomized ssl (false) and clientAuth (false) via: @org.apache.solr.util.RandomizeSSL(reason="", value=0.0/0.0, ssl=0.0/0.0, clientAuth=0.0/0.0)
   [junit4]   2> 1749382 INFO  (SUITE-UpdateRequestProcessorFactoryTest-seed#[81333B8A8106EA47]-worker) [    ] o.a.s.SolrTestCaseJ4 SecureRandom sanity checks: test.solr.allowed.securerandom=null & java.security.egd=file:/dev/./urandom
   [junit4]   2> 1749383 INFO  (SUITE-UpdateRequestProcessorFactoryTest-seed#[81333B8A8106EA47]-worker) [    ] o.a.s.SolrTestCaseJ4 ####initCore
   [junit4]   2> 1749903 WARN  (coreLoadExecutor-8400-thread-1) [    ] o.a.s.c.RequestHandlers no default request handler is registered (either '/select' or 'standard')
   [junit4]   2> 1749905 WARN  (coreLoadExecutor-8400-thread-1) [    ] o.a.s.r.ManagedResourceStorage Cannot write to config directory C:\Users\jenkins\workspace\Lucene-Solr-7.x-Windows\solr\core\src\test-files\solr\collection1\conf; switching to use InMemory storage instead.
   [junit4]   2> 1749908 INFO  (SUITE-UpdateRequestProcessorFactoryTest-seed#[81333B8A8106EA47]-worker) [    ] o.a.s.SolrTestCaseJ4 ####initCore end
   [junit4]   2> 1749910 INFO  (TEST-UpdateRequestProcessorFactoryTest.testConfiguration-seed#[81333B8A8106EA47]) [    ] o.a.s.SolrTestCaseJ4 ###Starting testConfiguration
   [junit4]   2> 1749911 INFO  (TEST-UpdateRequestProcessorFactoryTest.testConfiguration-seed#[81333B8A8106EA47]) [    ] o.a.s.SolrTestCaseJ4 ###Ending testConfiguration
   [junit4]   2> 1749913 INFO  (TEST-UpdateRequestProcessorFactoryTest.testUpdateDistribChainSkipping-seed#[81333B8A8106EA47]) [    ] o.a.s.SolrTestCaseJ4 ###Starting testUpdateDistribChainSkipping
   [junit4]   2> 1749913 INFO  (TEST-UpdateRequestProcessorFactoryTest.testUpdateDistribChainSkipping-seed#[81333B8A8106EA47]) [    ] o.a.s.SolrTestCaseJ4 ###Ending testUpdateDistribChainSkipping
   [junit4]   2> NOTE: reproduce with: ant test  -Dtestcase=UpdateRequestProcessorFactoryTest -Dtests.method=testUpdateDistribChainSkipping -Dtests.seed=81333B8A8106EA47 -Dtests.slow=true -Dtests.locale=teo-UG -Dtests.timezone=Atlantic/South_Georgia -Dtests.asserts=true -Dtests.file.encoding=UTF-8
   [junit4] FAILURE 0.01s J1 | UpdateRequestProcessorFactoryTest.testUpdateDistribChainSkipping <<<
   [junit4]    > Throwable #1: java.lang.AssertionError: Tests must be run with INFO level logging otherwise LogUpdateProcessor isn't used and can't be tested.
   [junit4]    > 	at __randomizedtesting.SeedInfo.seed([81333B8A8106EA47:F0D7C55CF7EDCD8B]:0)
   [junit4]    > 	at org.apache.solr.update.processor.UpdateRequestProcessorFactoryTest.testUpdateDistribChainSkipping(UpdateRequestProcessorFactoryTest.java:101)
   [junit4]    > 	at java.base/jdk.internal.reflect.NativeMethodAccessorImpl.invoke0(Native Method)
   [junit4]    > 	at java.base/jdk.internal.reflect.NativeMethodAccessorImpl.invoke(NativeMethodAccessorImpl.java:62)
   [junit4]    > 	at java.base/jdk.internal.reflect.DelegatingMethodAccessorImpl.invoke(DelegatingMethodAccessorImpl.java:43)
   [junit4]    > 	at java.base/java.lang.reflect.Method.invoke(Method.java:564)
   [junit4]    > 	at java.base/java.lang.Thread.run(Thread.java:844)
   [junit4]   2> 1749918 INFO  (TEST-UpdateRequestProcessorFactoryTest.testRequestTimeUrp-seed#[81333B8A8106EA47]) [    ] o.a.s.SolrTestCaseJ4 ###Starting testRequestTimeUrp
   [junit4]   2> 1749918 INFO  (TEST-UpdateRequestProcessorFactoryTest.testRequestTimeUrp-seed#[81333B8A8106EA47]) [    ] o.a.s.SolrTestCaseJ4 ###Ending testRequestTimeUrp
   [junit4]   2> 1749920 INFO  (SUITE-UpdateRequestProcessorFactoryTest-seed#[81333B8A8106EA47]-worker) [    ] o.a.s.SolrTestCaseJ4 ###deleteCore
   [junit4]   2> NOTE: leaving temporary files on disk at: C:\Users\jenkins\workspace\Lucene-Solr-7.x-Windows\solr\build\solr-core\test\J1\temp\solr.update.processor.UpdateRequestProcessorFactoryTest_81333B8A8106EA47-001
   [junit4]   2> NOTE: test params are: codec=Asserting(Lucene70): {}, docValues:{}, maxPointsInLeafNode=815, maxMBSortInHeap=5.008312918053374, sim=RandomSimilarity(queryNorm=false): {}, locale=teo-UG, timezone=Atlantic/South_Georgia
   [junit4]   2> NOTE: Windows 10 10.0 x86/Oracle Corporation 9 (32-bit)/cpus=3,threads=1,free=277197336,total=365592576
   [junit4]   2> NOTE: All tests run in this JVM: [TestSimpleQParserPlugin, TestLegacyNumericUtils, TestNumericRangeQuery64, TestEmbeddedSolrServerSchemaAPI, CollectionsAPIAsyncDistributedZkTest, TestSchemaResource, LukeRequestHandlerTest, SolrRequestParserTest, TestScoreJoinQPNoScore, TestLeaderInitiatedRecoveryThread, TestDefaultStatsCache, DebugComponentTest, ZkNodePropsTest, SolrMetricManagerTest, TestTlogReplica, TestCollapseQParserPlugin, TestAuthorizationFramework, DeleteLastCustomShardedReplicaTest, MigrateRouteKeyTest, ChaosMonkeySafeLeaderTest, TestManagedResource, HdfsWriteToMultipleCollectionsTest, TestExportWriter, TestSearchPerf, CloudExitableDirectoryReaderTest, TestAnalyzedSuggestions, TestWordDelimiterFilterFactory, DocValuesMultiTest, ZkFailoverTest, AnalysisErrorHandlingTest, TestShortCircuitedRequests, TestSchemaManager, TestAuthenticationFramework, TestInitQParser, TestMacroExpander, TestMultiValuedNumericRangeQuery, TestCSVLoader, TestPushWriter, AliasIntegrationTest, PolyFieldTest, RollingRestartTest, TestIndexSearcher, TestDistributedGrouping, TestDelegationWithHadoopAuth, TestLRUCache, AutoCommitTest, TestManagedSynonymFilterFactory, MetricUtilsTest, TestBinaryResponseWriter, TestRangeQuery, TestComplexPhraseQParserPlugin, TestFieldCacheWithThreads, SimpleMLTQParserTest, DistributedSuggestComponentTest, DocValuesNotIndexedTest, TestCorePropertiesReload, HighlighterMaxOffsetTest, BadComponentTest, TestLRUStatsCache, TestCharFilters, TestTrie, BlobRepositoryCloudTest, TestComponentsName, TestRawTransformer, TestRecovery, TestFastLRUCache, TestStressLucene, BasicAuthStandaloneTest, TestInfoStreamLogging, TestCoreDiscovery, FullHLLTest, TestUseDocValuesAsStored, LeaderElectionIntegrationTest, TestApiFramework, DistributedIntervalFacetingTest, HdfsRecoveryZkTest, TemplateUpdateProcessorTest, CdcrRequestHandlerTest, TestRuleBasedAuthorizationPlugin, DateRangeFieldTest, TestHdfsBackupRestoreCore, DistributedMLTComponentTest, SolrJmxReporterTest, DataDrivenBlockJoinTest, CoreSorterTest, SpellPossibilityIteratorTest, UpdateParamsTest, TestRestManager, BigEndianAscendingWordDeserializerTest, InfoHandlerTest, TestPerFieldSimilarityWithDefaultOverride, EchoParamsTest, BasicZkTest, HdfsChaosMonkeySafeLeaderTest, RequestLoggingTest, SolrGraphiteReporterTest, TestMaxScoreQueryParser, ShufflingReplicaListTransformerTest, TestCopyFieldCollectionResource, DirectSolrSpellCheckerTest, TestBM25SimilarityFactory, TestCloudRecovery, TestSSLRandomization, SuggestComponentContextFilterQueryTest, OverseerModifyCollectionTest, TestDistributedMissingSort, TestManagedSchema, CopyFieldTest, TestSlowCompositeReaderWrapper, AnalyticsMergeStrategyTest, SolrPluginUtilsTest, FileUtilsTest, DocumentBuilderTest, AddSchemaFieldsUpdateProcessorFactoryTest, DistributedFacetPivotSmallTest, LeaderInitiatedRecoveryOnCommitTest, SolrCloudExampleTest, TestLockTree, WrapperMergePolicyFactoryTest, TestJsonRequest, CollectionsAPIDistributedZkTest, TestLuceneMatchVersion, TestRequestForwarding, TestIntervalFaceting, FieldMutatingUpdateProcessorTest, TestReRankQParserPlugin, TestTrackingShardHandlerFactory, TestChildDocTransformer, FullSolrCloudDistribCmdsTest, PingRequestHandlerTest, TestExactSharedStatsCache, MoveReplicaHDFSTest, TestSortByMinMaxFunction, TestMinMaxOnMultiValuedField, TestConfigSetProperties, TestAnalyzeInfixSuggestions, QueryEqualityTest, HdfsDirectoryTest, TestClusterProperties, BaseCdcrDistributedZkTest, HttpPartitionTest, TestRemoteStreaming, TestExclusionRuleCollectionAccess, DistributedFacetExistsSmallTest, FileBasedSpellCheckerTest, TestSolrQueryParser, TestCloudPivotFacet, SchemaVersionSpecificBehaviorTest, PropertiesRequestHandlerTest, InfixSuggestersTest, TestFiltering, UtilsToolTest, OpenExchangeRatesOrgProviderTest, ClassificationUpdateProcessorIntegrationTest, TestElisionMultitermQuery, UpdateLogTest, OverriddenZkACLAndCredentialsProvidersTest, SolrIndexConfigTest, TestReloadDeadlock, TestBadConfig, HdfsSyncSliceTest, CursorMarkTest, TestXmlQParser, CacheHeaderTest, TestOverriddenPrefixQueryForCustomFieldType, TestClusterStateMutator, TestZkChroot, ExternalFileFieldSortTest, HLLUtilTest, TestConfig, TestSolrCloudWithDelegationTokens, TestSystemCollAutoCreate, TestDynamicLoading, TestCollationField, TestUniqueKeyFieldResource, CachingDirectoryFactoryTest, DistributedQueryComponentCustomSortTest, TestRandomFaceting, TestJsonFacetRefinement, SuggesterTSTTest, SuggesterFSTTest, BasicDistributedZk2Test, SyncSliceTest, OpenCloseCoreStressTest, ShardRoutingTest, TestReplicationHandler, ZkSolrClientTest, TestRandomDVFaceting, ZkCLITest, ShardRoutingCustomTest, TestHashPartitioner, TestRealTimeGet, TestStressReorder, TestJoin, TestReload, TestStressVersions, SimpleFacetsTest, TestSolr4Spatial, StatsComponentTest, PeerSyncTest, DistributedQueryElevationComponentTest, CoreAdminHandlerTest, SuggesterTest, SuggesterWFSTTest, NoCacheHeaderTest, WordBreakSolrSpellCheckerTest, SolrCoreCheckLockOnStartupTest, DefaultValueUpdateProcessorTest, StatelessScriptUpdateProcessorFactoryTest, TestSolrDeletionPolicy1, SolrInfoBeanTest, XsltUpdateRequestHandlerTest, IndexBasedSpellCheckerTest, TestQueryUtils, TestWriterPerf, TestQueryTypes, TestValueSourceCache, TermVectorComponentTest, MoreLikeThisHandlerTest, RequiredFieldsTest, FieldAnalysisRequestHandlerTest, LoggingHandlerTest, IndexSchemaTest, UpdateRequestProcessorFactoryTest]
   [junit4] Completed [434/731 (1!)] on J1 in 0.59s, 3 tests, 1 failure <<< FAILURES!

[...truncated 653 lines...]
   [junit4] Suite: org.apache.solr.metrics.reporters.SolrSlf4jReporterTest
   [junit4]   2> Creating dataDir: C:\Users\jenkins\workspace\Lucene-Solr-7.x-Windows\solr\build\solr-core\test\J0\temp\solr.metrics.reporters.SolrSlf4jReporterTest_81333B8A8106EA47-001\init-core-data-001
   [junit4]   2> 2695900 WARN  (SUITE-SolrSlf4jReporterTest-seed#[81333B8A8106EA47]-worker) [    ] o.a.s.SolrTestCaseJ4 startTrackingSearchers: numOpens=44 numCloses=44
   [junit4]   2> NOTE: reproduce with: ant test  -Dtestcase=SolrSlf4jReporterTest -Dtests.method=testReporter -Dtests.seed=81333B8A8106EA47 -Dtests.slow=true -Dtests.locale=nl-SX -Dtests.timezone=AET -Dtests.asserts=true -Dtests.file.encoding=UTF-8
   [junit4] FAILURE 6.61s J0 | SolrSlf4jReporterTest.testReporter <<<
   [junit4]    > Throwable #1: java.lang.AssertionError: No 'solr.node' logs in: {numFound=0,start=0,docs=[]}
   [junit4]    > 	at __randomizedtesting.SeedInfo.seed([81333B8A8106EA47:DED716BDEA0A7902]:0)
   [junit4]    > 	at org.apache.solr.metrics.reporters.SolrSlf4jReporterTest.testReporter(SolrSlf4jReporterTest.java:85)
   [junit4]    > 	at java.base/jdk.internal.reflect.NativeMethodAccessorImpl.invoke0(Native Method)
   [junit4]    > 	at java.base/jdk.internal.reflect.NativeMethodAccessorImpl.invoke(NativeMethodAccessorImpl.java:62)
   [junit4]    > 	at java.base/jdk.internal.reflect.DelegatingMethodAccessorImpl.invoke(DelegatingMethodAccessorImpl.java:43)
   [junit4]    > 	at java.base/java.lang.reflect.Method.invoke(Method.java:564)
   [junit4]    > 	at java.base/java.lang.Thread.run(Thread.java:844)
   [junit4]   2> NOTE: leaving temporary files on disk at: C:\Users\jenkins\workspace\Lucene-Solr-7.x-Windows\solr\build\solr-core\test\J0\temp\solr.metrics.reporters.SolrSlf4jReporterTest_81333B8A8106EA47-001
   [junit4]   2> NOTE: test params are: codec=CheapBastard, sim=RandomSimilarity(queryNorm=false): {}, locale=nl-SX, timezone=AET
   [junit4]   2> NOTE: Windows 10 10.0 x86/Oracle Corporation 9 (32-bit)/cpus=3,threads=1,free=57945912,total=518979584
   [junit4]   2> NOTE: All tests run in this JVM: [TestCoreContainer, AddBlockUpdateTest, TestQuerySenderNoQuery, TestCloudSchemaless, TestRequestStatusCollectionAPI, BasicAuthIntegrationTest, TestOrdValues, TestSolrCoreProperties, TestHdfsUpdateLog, TestFoldingMultitermQuery, SolrTestCaseJ4Test, CSVRequestHandlerTest, TestCustomSort, GraphQueryTest, TestReloadAndDeleteDocs, SolrXmlInZkTest, RankQueryTest, TestPullReplicaErrorHandling, BlockCacheTest, QueryElevationComponentTest, SolrMetricReporterTest, HdfsLockFactoryTest, CdcrReplicationHandlerTest, TestFieldCacheSort, SolrShardReporterTest, TestGroupingSearch, VersionInfoTest, TestImpersonationWithHadoopAuth, HdfsRestartWhileUpdatingTest, TestUtils, TestMissingGroups, TestManagedSchemaAPI, TestExpandComponent, TestBackupRepositoryFactory, LeaderFailureAfterFreshStartTest, TestSha256AuthenticationProvider, TestPseudoReturnFields, HighlighterTest, TestPrepRecovery, TestCloudJSONFacetJoinDomain, TestCollectionAPI, SolrIndexSplitterTest, DeleteShardTest, UniqFieldsUpdateProcessorFactoryTest, TestJmxIntegration, TestDynamicFieldCollectionResource, TestPHPSerializedResponseWriter, SortByFunctionTest, TestFieldCache, JavabinLoaderTest, DistribCursorPagingTest, RequestHandlersTest, TestDeleteCollectionOnDownNodes, TestJettySolrRunner, TestSolrCoreParser, TestJavabinTupleStreamParser, TestLazyCores, MetricsHandlerTest, TestHalfAndHalfDocValues, TestFieldCacheVsDocValues, ImplicitSnitchTest, HdfsChaosMonkeyNothingIsSafeTest, TestScoreJoinQPScore, TestOmitPositions, PrimitiveFieldTypeTest, HdfsDirectoryFactoryTest, RecoveryZkTest, StressHdfsTest, TestPointFields, TestCSVResponseWriter, XmlUpdateRequestHandlerTest, HdfsRecoverLeaseTest, TestTolerantSearch, TestCodecSupport, TestLMDirichletSimilarityFactory, BasicDistributedZkTest, HdfsBasicDistributedZk2Test, TestDownShardTolerantSearch, TestUpdate, NotRequiredUniqueKeyTest, TestDFRSimilarityFactory, ConfigSetsAPITest, TestCoreAdminApis, VMParamsZkACLAndCredentialsProvidersTest, TestStressCloudBlindAtomicUpdates, BJQParserTest, TestIndexingPerformance, ClusterStateTest, CollectionReloadTest, ShardSplitTest, UUIDUpdateProcessorFallbackTest, ParsingFieldUpdateProcessorsTest, RestartWhileUpdatingTest, TestAtomicUpdateErrorCases, TestReversedWildcardFilterFactory, TestCursorMarkWithoutUniqueKey, TestTestInjection, DistributedFacetPivotLargeTest, SuggestComponentTest, BufferStoreTest, TestSimpleTextCodec, FastVectorHighlighterTest, TestSQLHandlerNonCloud, SecurityConfHandlerTest, TestCustomStream, TestRandomRequestDistribution, AsyncCallRequestStatusResponseTest, TestPhraseSuggestions, SimplePostToolTest, TestManagedStopFilterFactory, TestComplexPhraseLeadingWildcard, PKIAuthenticationIntegrationTest, HLLSerializationTest, DisMaxRequestHandlerTest, DateMathParserTest, BlockJoinFacetRandomTest, TestNumericTokenStream, ActionThrottleTest, MinimalSchemaTest, SpatialFilterTest, TestNumericRangeQuery32, TestConfigSetsAPIZkFailure, CheckHdfsIndexTest, ChaosMonkeySafeLeaderWithPullReplicasTest, CdcrBootstrapTest, TestDistributedSearch, CdcrVersionReplicationTest, URLClassifyProcessorTest, HardAutoCommitTest, TestNoOpRegenerator, DistanceFunctionTest, CurrencyFieldTypeTest, TestSchemaNameResource, TestCollectionAPIs, TestLegacyTerms, StatsReloadRaceTest, TestCloudSearcherWarming, TestHashQParserPlugin, TestGeoJSONResponseWriter, OutputWriterTest, ZkControllerTest, TestManagedSynonymGraphFilterFactory, ManagedSchemaRoundRobinCloudTest, CursorPagingTest, CreateCollectionCleanupTest, TestBlendedInfixSuggestions, TestSubQueryTransformerDistrib, AutoScalingHandlerTest, TestTolerantUpdateProcessorCloud, TestZkAclsWithHadoopAuth, TestRawResponseWriter, UnloadDistributedZkTest, CollectionsAPISolrJTest, TestFaceting, LargeFieldTest, SearchHandlerTest, CoreAdminCreateDiscoverTest, TestSurroundQueryParser, OverseerTest, TestAddFieldRealTimeGet, DirectUpdateHandlerOptimizeTest, TestLegacyFieldCache, SmileWriterTest, AlternateDirectoryTest, ResourceLoaderTest, TestExactStatsCache, TestUseDocValuesAsStored2, TestStressRecovery, SolrCoreTest, TestInitParams, TestConfigSetsAPI, PathHierarchyTokenizerFactoryTest, ClassificationUpdateProcessorTest, TestConfigReload, TestLegacyFieldReuse, TestSchemaSimilarityResource, HighlighterConfigTest, QueryParsingTest, ClusterStateUpdateTest, LeaderElectionTest, DistributedSpellCheckComponentTest, TermVectorComponentDistributedTest, DistributedTermsComponentTest, SpellCheckComponentTest, SolrCmdDistributorTest, BadIndexSchemaTest, ConvertedLegacyTest, TestSort, TestFunctionQuery, BasicFunctionalityTest, DirectUpdateHandlerTest, SoftAutoCommitTest, ShowFileRequestHandlerTest, AnalysisAfterCoreReloadTest, SignatureUpdateProcessorFactoryTest, TestExtendedDismaxParser, SpellCheckCollatorTest, DocValuesTest, DocumentAnalysisRequestHandlerTest, TermsComponentTest, IndexSchemaRuntimeFieldTest, RegexBoostProcessorTest, ReturnFieldsTest, MBeansHandlerTest, SOLR749Test, TestSolrIndexConfig, TestMergePolicyConfig, TestDocSet, NumericFieldsTest, TestPostingsSolrHighlighter, SynonymTokenizerTest, TestPerFieldSimilarity, TestIBSimilarityFactory, TimeZoneUtilsTest, ScriptEngineTest, ChaosMonkeyNothingIsSafeTest, CdcrReplicationDistributedZkTest, ChaosMonkeyNothingIsSafeWithPullReplicasTest, ConcurrentDeleteAndCreateCollectionTest, ConnectionManagerTest, DeleteInactiveReplicaTest, DeleteNodeTest, DeleteReplicaTest, DistribDocExpirationUpdateProcessorTest, ForceLeaderTest, MultiThreadedOCPTest, PeerSyncReplicationTest, SolrCLIZkUtilsTest, TestCloudInspectUtil, TestCloudPseudoReturnFields, TestCollectionsAPIViaSolrCloudCluster, TestHdfsCloudBackupRestore, TestLeaderElectionWithEmptyReplica, TestLeaderElectionZkExpiry, TestMiniSolrCloudClusterSSL, TestRandomFlRTGCloud, TestRebalanceLeaders, TestReplicaProperties, TestSizeLimitedDistributedMap, TestStressLiveNodes, TestTolerantUpdateProcessorRandomCloud, TlogReplayBufferedWhileIndexingTest, TriLevelCompositeIdRoutingTest, HdfsBasicDistributedZkTest, HdfsCollectionsAPIDistributedZkTest, HdfsNNFailoverTest, HdfsThreadLeakTest, HdfsTlogReplayBufferedWhileIndexingTest, HdfsUnloadDistributedZkTest, ZkStateReaderTest, ZkStateWriterTest, RuleEngineTest, RulesTest, TestSolrConfigHandler, TestSolrCoreSnapshots, TestReplicationHandlerBackup, TestReqParamsAPI, TestRestoreCore, TestSolrConfigHandlerCloud, TestSolrConfigHandlerConcurrent, DistributedFacetPivotSmallAdvancedTest, DistributedFacetPivotWhiteBoxTest, ReplicaListTransformerTest, SpatialHeatmapFacetsTest, SolrSlf4jReporterTest]
   [junit4] Completed [624/731 (2!)] on J0 in 6.69s, 1 test, 1 failure <<< FAILURES!

[...truncated 354 lines...]
   [junit4] JVM J0: stderr was not empty, see: C:\Users\jenkins\workspace\Lucene-Solr-7.x-Windows\solr\build\solr-core\test\temp\junit4-J0-20170824_091833_3353086688807617325268.syserr
   [junit4] >>> JVM J0 emitted unexpected output (verbatim) ----
   [junit4] Java HotSpot(TM) Server VM warning: Option UseConcMarkSweepGC was deprecated in version 9.0 and will likely be removed in a future release.
   [junit4] <<< JVM J0: EOF ----

[...truncated 3 lines...]
   [junit4] JVM J1: stderr was not empty, see: C:\Users\jenkins\workspace\Lucene-Solr-7.x-Windows\solr\build\solr-core\test\temp\junit4-J1-20170824_091833_33514914485357775310006.syserr
   [junit4] >>> JVM J1 emitted unexpected output (verbatim) ----
   [junit4] Java HotSpot(TM) Server VM warning: Option UseConcMarkSweepGC was deprecated in version 9.0 and will likely be removed in a future release.
   [junit4] <<< JVM J1: EOF ----

[...truncated 832 lines...]
   [junit4] JVM J0: stderr was not empty, see: C:\Users\jenkins\workspace\Lucene-Solr-7.x-Windows\solr\build\solr-solrj\test\temp\junit4-J0-20170824_100757_8969434910241379886356.syserr
   [junit4] >>> JVM J0 emitted unexpected output (verbatim) ----
   [junit4] Java HotSpot(TM) Server VM warning: Option UseConcMarkSweepGC was deprecated in version 9.0 and will likely be removed in a future release.
   [junit4] <<< JVM J0: EOF ----

[...truncated 3 lines...]
   [junit4] JVM J1: stderr was not empty, see: C:\Users\jenkins\workspace\Lucene-Solr-7.x-Windows\solr\build\solr-solrj\test\temp\junit4-J1-20170824_100757_8969878432829619492259.syserr
   [junit4] >>> JVM J1 emitted unexpected output (verbatim) ----
   [junit4] Java HotSpot(TM) Server VM warning: Option UseConcMarkSweepGC was deprecated in version 9.0 and will likely be removed in a future release.
   [junit4] <<< JVM J1: EOF ----

[...truncated 1241 lines...]
   [junit4] JVM J1: stderr was not empty, see: C:\Users\jenkins\workspace\Lucene-Solr-7.x-Windows\solr\build\contrib\solr-analysis-extras\test\temp\junit4-J1-20170824_101226_84518089178616093223701.syserr
   [junit4] >>> JVM J1 emitted unexpected output (verbatim) ----
   [junit4] Java HotSpot(TM) Server VM warning: Option UseConcMarkSweepGC was deprecated in version 9.0 and will likely be removed in a future release.
   [junit4] <<< JVM J1: EOF ----

   [junit4] JVM J0: stderr was not empty, see: C:\Users\jenkins\workspace\Lucene-Solr-7.x-Windows\solr\build\contrib\solr-analysis-extras\test\temp\junit4-J0-20170824_101226_8458797624737616301238.syserr
   [junit4] >>> JVM J0 emitted unexpected output (verbatim) ----
   [junit4] Java HotSpot(TM) Server VM warning: Option UseConcMarkSweepGC was deprecated in version 9.0 and will likely be removed in a future release.
   [junit4] <<< JVM J0: EOF ----

[...truncated 548 lines...]
   [junit4] JVM J0: stderr was not empty, see: C:\Users\jenkins\workspace\Lucene-Solr-7.x-Windows\solr\build\contrib\solr-analytics\test\temp\junit4-J0-20170824_101255_3919346535364421151087.syserr
   [junit4] >>> JVM J0 emitted unexpected output (verbatim) ----
   [junit4] Java HotSpot(TM) Server VM warning: Option UseConcMarkSweepGC was deprecated in version 9.0 and will likely be removed in a future release.
   [junit4] <<< JVM J0: EOF ----

[...truncated 3 lines...]
   [junit4] JVM J1: stderr was not empty, see: C:\Users\jenkins\workspace\Lucene-Solr-7.x-Windows\solr\build\contrib\solr-analytics\test\temp\junit4-J1-20170824_101255_3916942106369334075785.syserr
   [junit4] >>> JVM J1 emitted unexpected output (verbatim) ----
   [junit4] Java HotSpot(TM) Server VM warning: Option UseConcMarkSweepGC was deprecated in version 9.0 and will likely be removed in a future release.
   [junit4] <<< JVM J1: EOF ----

[...truncated 500 lines...]
   [junit4] JVM J1: stderr was not empty, see: C:\Users\jenkins\workspace\Lucene-Solr-7.x-Windows\solr\build\contrib\solr-clustering\test\temp\junit4-J1-20170824_101401_28914211926632785117975.syserr
   [junit4] >>> JVM J1 emitted unexpected output (verbatim) ----
   [junit4] Java HotSpot(TM) Server VM warning: Option UseConcMarkSweepGC was deprecated in version 9.0 and will likely be removed in a future release.
   [junit4] <<< JVM J1: EOF ----

[...truncated 3 lines...]
   [junit4] JVM J0: stderr was not empty, see: C:\Users\jenkins\workspace\Lucene-Solr-7.x-Windows\solr\build\contrib\solr-clustering\test\temp\junit4-J0-20170824_101401_2891541762767366788195.syserr
   [junit4] >>> JVM J0 emitted unexpected output (verbatim) ----
   [junit4] Java HotSpot(TM) Server VM warning: Option UseConcMarkSweepGC was deprecated in version 9.0 and will likely be removed in a future release.
   [junit4] <<< JVM J0: EOF ----

[...truncated 1130 lines...]
   [junit4] JVM J1: stderr was not empty, see: C:\Users\jenkins\workspace\Lucene-Solr-7.x-Windows\solr\build\contrib\solr-dataimporthandler-extras\test\temp\junit4-J1-20170824_101453_21713571788874894247551.syserr
   [junit4] >>> JVM J1 emitted unexpected output (verbatim) ----
   [junit4] Java HotSpot(TM) Server VM warning: Option UseConcMarkSweepGC was deprecated in version 9.0 and will likely be removed in a future release.
   [junit4] <<< JVM J1: EOF ----

[...truncated 3 lines...]
   [junit4] JVM J0: stderr was not empty, see: C:\Users\jenkins\workspace\Lucene-Solr-7.x-Windows\solr\build\contrib\solr-dataimporthandler-extras\test\temp\junit4-J0-20170824_101453_21310888259316458275764.syserr
   [junit4] >>> JVM J0 emitted unexpected output (verbatim) ----
   [junit4] Java HotSpot(TM) Server VM warning: Option UseConcMarkSweepGC was deprecated in version 9.0 and will likely be removed in a future release.
   [junit4] <<< JVM J0: EOF ----

[...truncated 596 lines...]
   [junit4] JVM J1: stderr was not empty, see: C:\Users\jenkins\workspace\Lucene-Solr-7.x-Windows\solr\build\contrib\solr-dataimporthandler\test\temp\junit4-J1-20170824_101517_18612951072315169111607.syserr
   [junit4] >>> JVM J1 emitted unexpected output (verbatim) ----
   [junit4] Java HotSpot(TM) Server VM warning: Option UseConcMarkSweepGC was deprecated in version 9.0 and will likely be removed in a future release.
   [junit4] <<< JVM J1: EOF ----

   [junit4] JVM J0: stderr was not empty, see: C:\Users\jenkins\workspace\Lucene-Solr-7.x-Windows\solr\build\contrib\solr-dataimporthandler\test\temp\junit4-J0-20170824_101517_1855964968618703731450.syserr
   [junit4] >>> JVM J0 emitted unexpected output (verbatim) ----
   [junit4] Java HotSpot(TM) Server VM warning: Option UseConcMarkSweepGC was deprecated in version 9.0 and will likely be removed in a future release.
   [junit4] <<< JVM J0: EOF ----

[...truncated 504 lines...]
   [junit4] JVM J0: stderr was not empty, see: C:\Users\jenkins\workspace\Lucene-Solr-7.x-Windows\solr\build\contrib\solr-cell\test\temp\junit4-J0-20170824_101605_669556818971873632181.syserr
   [junit4] >>> JVM J0 emitted unexpected output (verbatim) ----
   [junit4] Java HotSpot(TM) Server VM warning: Option UseConcMarkSweepGC was deprecated in version 9.0 and will likely be removed in a future release.
   [junit4] <<< JVM J0: EOF ----

[...truncated 3 lines...]
   [junit4] JVM J1: stderr was not empty, see: C:\Users\jenkins\workspace\Lucene-Solr-7.x-Windows\solr\build\contrib\solr-cell\test\temp\junit4-J1-20170824_101605_66910766332312322478303.syserr
   [junit4] >>> JVM J1 emitted unexpected output (verbatim) ----
   [junit4] Java HotSpot(TM) Server VM warning: Option UseConcMarkSweepGC was deprecated in version 9.0 and will likely be removed in a future release.
   [junit4] <<< JVM J1: EOF ----

[...truncated 506 lines...]
   [junit4] JVM J1: stderr was not empty, see: C:\Users\jenkins\workspace\Lucene-Solr-7.x-Windows\solr\build\contrib\solr-langid\test\temp\junit4-J1-20170824_101630_8278742512903987694588.syserr
   [junit4] >>> JVM J1 emitted unexpected output (verbatim) ----
   [junit4] Java HotSpot(TM) Server VM warning: Option UseConcMarkSweepGC was deprecated in version 9.0 and will likely be removed in a future release.
   [junit4] <<< JVM J1: EOF ----

   [junit4] JVM J0: stderr was not empty, see: C:\Users\jenkins\workspace\Lucene-Solr-7.x-Windows\solr\build\contrib\solr-langid\test\temp\junit4-J0-20170824_101630_82714943251243664442173.syserr
   [junit4] >>> JVM J0 emitted unexpected output (verbatim) ----
   [junit4] Java HotSpot(TM) Server VM warning: Option UseConcMarkSweepGC was deprecated in version 9.0 and will likely be removed in a future release.
   [junit4] <<< JVM J0: EOF ----

[...truncated 595 lines...]
   [junit4] JVM J1: stderr was not empty, see: C:\Users\jenkins\workspace\Lucene-Solr-7.x-Windows\solr\build\contrib\solr-ltr\test\temp\junit4-J1-20170824_101659_8148542495099208313568.syserr
   [junit4] >>> JVM J1 emitted unexpected output (verbatim) ----
   [junit4] Java HotSpot(TM) Server VM warning: Option UseConcMarkSweepGC was deprecated in version 9.0 and will likely be removed in a future release.
   [junit4] <<< JVM J1: EOF ----

[...truncated 3 lines...]
   [junit4] JVM J0: stderr was not empty, see: C:\Users\jenkins\workspace\Lucene-Solr-7.x-Windows\solr\build\contrib\solr-ltr\test\temp\junit4-J0-20170824_101659_8148896155019618778601.syserr
   [junit4] >>> JVM J0 emitted unexpected output (verbatim) ----
   [junit4] Java HotSpot(TM) Server VM warning: Option UseConcMarkSweepGC was deprecated in version 9.0 and will likely be removed in a future release.
   [junit4] <<< JVM J0: EOF ----

[...truncated 538 lines...]
   [junit4] JVM J1: stderr was not empty, see: C:\Users\jenkins\workspace\Lucene-Solr-7.x-Windows\solr\build\contrib\solr-uima\test\temp\junit4-J1-20170824_101813_05517823940049561740195.syserr
   [junit4] >>> JVM J1 emitted unexpected output (verbatim) ----
   [junit4] Java HotSpot(TM) Server VM warning: Option UseConcMarkSweepGC was deprecated in version 9.0 and will likely be removed in a future release.
   [junit4] <<< JVM J1: EOF ----

[...truncated 3 lines...]
   [junit4] JVM J0: stderr was not empty, see: C:\Users\jenkins\workspace\Lucene-Solr-7.x-Windows\solr\build\contrib\solr-uima\test\temp\junit4-J0-20170824_101813_05314364659671975708454.syserr
   [junit4] >>> JVM J0 emitted unexpected output (verbatim) ----
   [junit4] Java HotSpot(TM) Server VM warning: Option UseConcMarkSweepGC was deprecated in version 9.0 and will likely be removed in a future release.
   [junit4] <<< JVM J0: EOF ----

[...truncated 495 lines...]
   [junit4] JVM J0: stderr was not empty, see: C:\Users\jenkins\workspace\Lucene-Solr-7.x-Windows\solr\build\contrib\solr-velocity\test\temp\junit4-J0-20170824_101848_80717576098875899059789.syserr
   [junit4] >>> JVM J0 emitted unexpected output (verbatim) ----
   [junit4] Java HotSpot(TM) Server VM warning: Option UseConcMarkSweepGC was deprecated in version 9.0 and will likely be removed in a future release.
   [junit4] <<< JVM J0: EOF ----

[...truncated 29025 lines...]

Mime
View raw message