lucene-dev mailing list archives

Site index · List index
Message view « Date » · « Thread »
Top « Date » · « Thread »
From Apache Jenkins Server <jenk...@builds.apache.org>
Subject [JENKINS] Lucene-Solr-NightlyTests-master - Build # 1378 - Still unstable
Date Mon, 21 Aug 2017 13:50:13 GMT
Build: https://builds.apache.org/job/Lucene-Solr-NightlyTests-master/1378/

4 tests failed.
FAILED:  org.apache.solr.cloud.ChaosMonkeyNothingIsSafeWithPullReplicasTest.test

Error Message:
The Monkey ran for over 45 seconds and no jetties were stopped - this is worth investigating!

Stack Trace:
java.lang.AssertionError: The Monkey ran for over 45 seconds and no jetties were stopped - this is worth investigating!
	at __randomizedtesting.SeedInfo.seed([D8359DE4DB9BC7F:85D76604E345D187]:0)
	at org.junit.Assert.fail(Assert.java:93)
	at org.apache.solr.cloud.ChaosMonkey.stopTheMonkey(ChaosMonkey.java:587)
	at org.apache.solr.cloud.ChaosMonkeyNothingIsSafeWithPullReplicasTest.test(ChaosMonkeyNothingIsSafeWithPullReplicasTest.java:222)
	at sun.reflect.NativeMethodAccessorImpl.invoke0(Native Method)
	at sun.reflect.NativeMethodAccessorImpl.invoke(NativeMethodAccessorImpl.java:62)
	at sun.reflect.DelegatingMethodAccessorImpl.invoke(DelegatingMethodAccessorImpl.java:43)
	at java.lang.reflect.Method.invoke(Method.java:498)
	at com.carrotsearch.randomizedtesting.RandomizedRunner.invoke(RandomizedRunner.java:1713)
	at com.carrotsearch.randomizedtesting.RandomizedRunner$8.evaluate(RandomizedRunner.java:907)
	at com.carrotsearch.randomizedtesting.RandomizedRunner$9.evaluate(RandomizedRunner.java:943)
	at com.carrotsearch.randomizedtesting.RandomizedRunner$10.evaluate(RandomizedRunner.java:957)
	at org.apache.solr.BaseDistributedSearchTestCase$ShardsRepeatRule$ShardsFixedStatement.callStatement(BaseDistributedSearchTestCase.java:993)
	at org.apache.solr.BaseDistributedSearchTestCase$ShardsRepeatRule$ShardsStatement.evaluate(BaseDistributedSearchTestCase.java:968)
	at com.carrotsearch.randomizedtesting.rules.SystemPropertiesRestoreRule$1.evaluate(SystemPropertiesRestoreRule.java:57)
	at org.apache.lucene.util.TestRuleSetupTeardownChained$1.evaluate(TestRuleSetupTeardownChained.java:49)
	at org.apache.lucene.util.AbstractBeforeAfterRule$1.evaluate(AbstractBeforeAfterRule.java:45)
	at org.apache.lucene.util.TestRuleThreadAndTestName$1.evaluate(TestRuleThreadAndTestName.java:48)
	at org.apache.lucene.util.TestRuleIgnoreAfterMaxFailures$1.evaluate(TestRuleIgnoreAfterMaxFailures.java:64)
	at org.apache.lucene.util.TestRuleMarkFailure$1.evaluate(TestRuleMarkFailure.java:47)
	at com.carrotsearch.randomizedtesting.rules.StatementAdapter.evaluate(StatementAdapter.java:36)
	at com.carrotsearch.randomizedtesting.ThreadLeakControl$StatementRunner.run(ThreadLeakControl.java:368)
	at com.carrotsearch.randomizedtesting.ThreadLeakControl.forkTimeoutingTask(ThreadLeakControl.java:817)
	at com.carrotsearch.randomizedtesting.ThreadLeakControl$3.evaluate(ThreadLeakControl.java:468)
	at com.carrotsearch.randomizedtesting.RandomizedRunner.runSingleTest(RandomizedRunner.java:916)
	at com.carrotsearch.randomizedtesting.RandomizedRunner$5.evaluate(RandomizedRunner.java:802)
	at com.carrotsearch.randomizedtesting.RandomizedRunner$6.evaluate(RandomizedRunner.java:852)
	at com.carrotsearch.randomizedtesting.RandomizedRunner$7.evaluate(RandomizedRunner.java:863)
	at com.carrotsearch.randomizedtesting.rules.StatementAdapter.evaluate(StatementAdapter.java:36)
	at com.carrotsearch.randomizedtesting.rules.SystemPropertiesRestoreRule$1.evaluate(SystemPropertiesRestoreRule.java:57)
	at org.apache.lucene.util.AbstractBeforeAfterRule$1.evaluate(AbstractBeforeAfterRule.java:45)
	at com.carrotsearch.randomizedtesting.rules.StatementAdapter.evaluate(StatementAdapter.java:36)
	at org.apache.lucene.util.TestRuleStoreClassName$1.evaluate(TestRuleStoreClassName.java:41)
	at com.carrotsearch.randomizedtesting.rules.NoShadowingOrOverridesOnMethodsRule$1.evaluate(NoShadowingOrOverridesOnMethodsRule.java:40)
	at com.carrotsearch.randomizedtesting.rules.NoShadowingOrOverridesOnMethodsRule$1.evaluate(NoShadowingOrOverridesOnMethodsRule.java:40)
	at com.carrotsearch.randomizedtesting.rules.StatementAdapter.evaluate(StatementAdapter.java:36)
	at com.carrotsearch.randomizedtesting.rules.StatementAdapter.evaluate(StatementAdapter.java:36)
	at com.carrotsearch.randomizedtesting.rules.StatementAdapter.evaluate(StatementAdapter.java:36)
	at org.apache.lucene.util.TestRuleAssertionsRequired$1.evaluate(TestRuleAssertionsRequired.java:53)
	at org.apache.lucene.util.TestRuleMarkFailure$1.evaluate(TestRuleMarkFailure.java:47)
	at org.apache.lucene.util.TestRuleIgnoreAfterMaxFailures$1.evaluate(TestRuleIgnoreAfterMaxFailures.java:64)
	at org.apache.lucene.util.TestRuleIgnoreTestSuites$1.evaluate(TestRuleIgnoreTestSuites.java:54)
	at com.carrotsearch.randomizedtesting.rules.StatementAdapter.evaluate(StatementAdapter.java:36)
	at com.carrotsearch.randomizedtesting.ThreadLeakControl$StatementRunner.run(ThreadLeakControl.java:368)
	at java.lang.Thread.run(Thread.java:748)


FAILED:  junit.framework.TestSuite.org.apache.solr.cloud.ChaosMonkeyNothingIsSafeWithPullReplicasTest

Error Message:
16 threads leaked from SUITE scope at org.apache.solr.cloud.ChaosMonkeyNothingIsSafeWithPullReplicasTest:     1) Thread[id=30947, name=Connection evictor, state=TIMED_WAITING, group=TGRP-ChaosMonkeyNothingIsSafeWithPullReplicasTest]         at java.lang.Thread.sleep(Native Method)         at org.apache.http.impl.client.IdleConnectionEvictor$1.run(IdleConnectionEvictor.java:66)         at java.lang.Thread.run(Thread.java:748)    2) Thread[id=31154, name=StoppableIndexingThread, state=TIMED_WAITING, group=TGRP-ChaosMonkeyNothingIsSafeWithPullReplicasTest]         at java.lang.Thread.sleep(Native Method)         at org.apache.solr.cloud.StoppableIndexingThread.run(StoppableIndexingThread.java:135)    3) Thread[id=31260, name=StoppableCommitThread-SendThread(127.0.0.1:33043), state=TIMED_WAITING, group=TGRP-ChaosMonkeyNothingIsSafeWithPullReplicasTest]         at java.lang.Thread.sleep(Native Method)         at org.apache.zookeeper.ClientCnxn$SendThread.run(ClientCnxn.java:1051)    4) Thread[id=31152, name=StoppableIndexingThread, state=TIMED_WAITING, group=TGRP-ChaosMonkeyNothingIsSafeWithPullReplicasTest]         at java.lang.Thread.sleep(Native Method)         at org.apache.solr.cloud.StoppableIndexingThread.run(StoppableIndexingThread.java:135)    5) Thread[id=31153, name=StoppableIndexingThread, state=TIMED_WAITING, group=TGRP-ChaosMonkeyNothingIsSafeWithPullReplicasTest]         at java.lang.Thread.sleep(Native Method)         at org.apache.solr.cloud.StoppableIndexingThread.run(StoppableIndexingThread.java:135)    6) Thread[id=31326, name=zkCallback-240-thread-3, state=TIMED_WAITING, group=TGRP-ChaosMonkeyNothingIsSafeWithPullReplicasTest]         at sun.misc.Unsafe.park(Native Method)         at java.util.concurrent.locks.LockSupport.parkNanos(LockSupport.java:215)         at java.util.concurrent.SynchronousQueue$TransferStack.awaitFulfill(SynchronousQueue.java:460)         at java.util.concurrent.SynchronousQueue$TransferStack.transfer(SynchronousQueue.java:362)         at java.util.concurrent.SynchronousQueue.poll(SynchronousQueue.java:941)         at java.util.concurrent.ThreadPoolExecutor.getTask(ThreadPoolExecutor.java:1073)         at java.util.concurrent.ThreadPoolExecutor.runWorker(ThreadPoolExecutor.java:1134)         at java.util.concurrent.ThreadPoolExecutor$Worker.run(ThreadPoolExecutor.java:624)         at java.lang.Thread.run(Thread.java:748)    7) Thread[id=31264, name=zkCallback-282-thread-1, state=TIMED_WAITING, group=TGRP-ChaosMonkeyNothingIsSafeWithPullReplicasTest]         at sun.misc.Unsafe.park(Native Method)         at java.util.concurrent.locks.LockSupport.parkNanos(LockSupport.java:215)         at java.util.concurrent.SynchronousQueue$TransferStack.awaitFulfill(SynchronousQueue.java:460)         at java.util.concurrent.SynchronousQueue$TransferStack.transfer(SynchronousQueue.java:362)         at java.util.concurrent.SynchronousQueue.poll(SynchronousQueue.java:941)         at java.util.concurrent.ThreadPoolExecutor.getTask(ThreadPoolExecutor.java:1073)         at java.util.concurrent.ThreadPoolExecutor.runWorker(ThreadPoolExecutor.java:1134)         at java.util.concurrent.ThreadPoolExecutor$Worker.run(ThreadPoolExecutor.java:624)         at java.lang.Thread.run(Thread.java:748)    8) Thread[id=31269, name=zkCallback-240-thread-2, state=TIMED_WAITING, group=TGRP-ChaosMonkeyNothingIsSafeWithPullReplicasTest]         at sun.misc.Unsafe.park(Native Method)         at java.util.concurrent.locks.LockSupport.parkNanos(LockSupport.java:215)         at java.util.concurrent.SynchronousQueue$TransferStack.awaitFulfill(SynchronousQueue.java:460)         at java.util.concurrent.SynchronousQueue$TransferStack.transfer(SynchronousQueue.java:362)         at java.util.concurrent.SynchronousQueue.poll(SynchronousQueue.java:941)         at java.util.concurrent.ThreadPoolExecutor.getTask(ThreadPoolExecutor.java:1073)         at java.util.concurrent.ThreadPoolExecutor.runWorker(ThreadPoolExecutor.java:1134)         at java.util.concurrent.ThreadPoolExecutor$Worker.run(ThreadPoolExecutor.java:624)         at java.lang.Thread.run(Thread.java:748)    9) Thread[id=30948, name=TEST-ChaosMonkeyNothingIsSafeWithPullReplicasTest.test-seed#[D8359DE4DB9BC7F]-SendThread(127.0.0.1:33043), state=TIMED_WAITING, group=TGRP-ChaosMonkeyNothingIsSafeWithPullReplicasTest]         at java.lang.Thread.sleep(Native Method)         at org.apache.zookeeper.client.StaticHostProvider.next(StaticHostProvider.java:101)         at org.apache.zookeeper.ClientCnxn$SendThread.startConnect(ClientCnxn.java:997)         at org.apache.zookeeper.ClientCnxn$SendThread.run(ClientCnxn.java:1060)   10) Thread[id=31324, name=zkCallback-282-thread-2, state=TIMED_WAITING, group=TGRP-ChaosMonkeyNothingIsSafeWithPullReplicasTest]         at sun.misc.Unsafe.park(Native Method)         at java.util.concurrent.locks.LockSupport.parkNanos(LockSupport.java:215)         at java.util.concurrent.SynchronousQueue$TransferStack.awaitFulfill(SynchronousQueue.java:460)         at java.util.concurrent.SynchronousQueue$TransferStack.transfer(SynchronousQueue.java:362)         at java.util.concurrent.SynchronousQueue.poll(SynchronousQueue.java:941)         at java.util.concurrent.ThreadPoolExecutor.getTask(ThreadPoolExecutor.java:1073)         at java.util.concurrent.ThreadPoolExecutor.runWorker(ThreadPoolExecutor.java:1134)         at java.util.concurrent.ThreadPoolExecutor$Worker.run(ThreadPoolExecutor.java:624)         at java.lang.Thread.run(Thread.java:748)   11) Thread[id=31325, name=zkCallback-282-thread-3, state=TIMED_WAITING, group=TGRP-ChaosMonkeyNothingIsSafeWithPullReplicasTest]         at sun.misc.Unsafe.park(Native Method)         at java.util.concurrent.locks.LockSupport.parkNanos(LockSupport.java:215)         at java.util.concurrent.SynchronousQueue$TransferStack.awaitFulfill(SynchronousQueue.java:460)         at java.util.concurrent.SynchronousQueue$TransferStack.transfer(SynchronousQueue.java:362)         at java.util.concurrent.SynchronousQueue.poll(SynchronousQueue.java:941)         at java.util.concurrent.ThreadPoolExecutor.getTask(ThreadPoolExecutor.java:1073)         at java.util.concurrent.ThreadPoolExecutor.runWorker(ThreadPoolExecutor.java:1134)         at java.util.concurrent.ThreadPoolExecutor$Worker.run(ThreadPoolExecutor.java:624)         at java.lang.Thread.run(Thread.java:748)   12) Thread[id=31155, name=StoppableSearchThread, state=WAITING, group=TGRP-ChaosMonkeyNothingIsSafeWithPullReplicasTest]         at java.lang.Object.wait(Native Method)         at java.lang.Object.wait(Object.java:502)         at org.apache.zookeeper.ClientCnxn.submitRequest(ClientCnxn.java:1406)         at org.apache.zookeeper.ZooKeeper.getData(ZooKeeper.java:1210)         at org.apache.solr.common.cloud.SolrZkClient$7.execute(SolrZkClient.java:357)         at org.apache.solr.common.cloud.SolrZkClient$7.execute(SolrZkClient.java:354)         at org.apache.solr.common.cloud.ZkCmdExecutor.retryOperation(ZkCmdExecutor.java:60)         at org.apache.solr.common.cloud.SolrZkClient.getData(SolrZkClient.java:354)         at org.apache.solr.common.cloud.ZkStateReader.fetchCollectionState(ZkStateReader.java:1127)         at org.apache.solr.common.cloud.ZkStateReader.getCollectionLive(ZkStateReader.java:1113)         at org.apache.solr.common.cloud.ZkStateReader$LazyCollectionRef.get(ZkStateReader.java:648)         at org.apache.solr.client.solrj.impl.CloudSolrClient.getDocCollection(CloudSolrClient.java:1227)         at org.apache.solr.client.solrj.impl.CloudSolrClient.requestWithRetryOnStaleState(CloudSolrClient.java:827)         at org.apache.solr.client.solrj.impl.CloudSolrClient.request(CloudSolrClient.java:793)         at org.apache.solr.client.solrj.SolrRequest.process(SolrRequest.java:178)         at org.apache.solr.client.solrj.SolrClient.query(SolrClient.java:942)         at org.apache.solr.client.solrj.SolrClient.query(SolrClient.java:957)         at org.apache.solr.cloud.StoppableSearchThread.run(StoppableSearchThread.java:54)   13) Thread[id=31261, name=StoppableCommitThread-EventThread, state=WAITING, group=TGRP-ChaosMonkeyNothingIsSafeWithPullReplicasTest]         at sun.misc.Unsafe.park(Native Method)         at java.util.concurrent.locks.LockSupport.park(LockSupport.java:175)         at java.util.concurrent.locks.AbstractQueuedSynchronizer$ConditionObject.await(AbstractQueuedSynchronizer.java:2039)         at java.util.concurrent.LinkedBlockingQueue.take(LinkedBlockingQueue.java:442)         at org.apache.zookeeper.ClientCnxn$EventThread.run(ClientCnxn.java:501)   14) Thread[id=31327, name=zkCallback-240-thread-4, state=TIMED_WAITING, group=TGRP-ChaosMonkeyNothingIsSafeWithPullReplicasTest]         at sun.misc.Unsafe.park(Native Method)         at java.util.concurrent.locks.LockSupport.parkNanos(LockSupport.java:215)         at java.util.concurrent.SynchronousQueue$TransferStack.awaitFulfill(SynchronousQueue.java:460)         at java.util.concurrent.SynchronousQueue$TransferStack.transfer(SynchronousQueue.java:362)         at java.util.concurrent.SynchronousQueue.poll(SynchronousQueue.java:941)         at java.util.concurrent.ThreadPoolExecutor.getTask(ThreadPoolExecutor.java:1073)         at java.util.concurrent.ThreadPoolExecutor.runWorker(ThreadPoolExecutor.java:1134)         at java.util.concurrent.ThreadPoolExecutor$Worker.run(ThreadPoolExecutor.java:624)         at java.lang.Thread.run(Thread.java:748)   15) Thread[id=30949, name=TEST-ChaosMonkeyNothingIsSafeWithPullReplicasTest.test-seed#[D8359DE4DB9BC7F]-EventThread, state=WAITING, group=TGRP-ChaosMonkeyNothingIsSafeWithPullReplicasTest]         at sun.misc.Unsafe.park(Native Method)         at java.util.concurrent.locks.LockSupport.park(LockSupport.java:175)         at java.util.concurrent.locks.AbstractQueuedSynchronizer$ConditionObject.await(AbstractQueuedSynchronizer.java:2039)         at java.util.concurrent.LinkedBlockingQueue.take(LinkedBlockingQueue.java:442)         at org.apache.zookeeper.ClientCnxn$EventThread.run(ClientCnxn.java:501)   16) Thread[id=31157, name=StoppableCommitThread, state=BLOCKED, group=TGRP-ChaosMonkeyNothingIsSafeWithPullReplicasTest]         at org.apache.solr.client.solrj.impl.CloudSolrClient.getDocCollection(CloudSolrClient.java:1217)         at org.apache.solr.client.solrj.impl.CloudSolrClient.requestWithRetryOnStaleState(CloudSolrClient.java:827)         at org.apache.solr.client.solrj.impl.CloudSolrClient.request(CloudSolrClient.java:793)         at org.apache.solr.client.solrj.SolrRequest.process(SolrRequest.java:178)         at org.apache.solr.client.solrj.SolrClient.commit(SolrClient.java:524)         at org.apache.solr.client.solrj.SolrClient.commit(SolrClient.java:544)         at org.apache.solr.cloud.StoppableCommitThread.run(StoppableCommitThread.java:49)

Stack Trace:
com.carrotsearch.randomizedtesting.ThreadLeakError: 16 threads leaked from SUITE scope at org.apache.solr.cloud.ChaosMonkeyNothingIsSafeWithPullReplicasTest: 
   1) Thread[id=30947, name=Connection evictor, state=TIMED_WAITING, group=TGRP-ChaosMonkeyNothingIsSafeWithPullReplicasTest]
        at java.lang.Thread.sleep(Native Method)
        at org.apache.http.impl.client.IdleConnectionEvictor$1.run(IdleConnectionEvictor.java:66)
        at java.lang.Thread.run(Thread.java:748)
   2) Thread[id=31154, name=StoppableIndexingThread, state=TIMED_WAITING, group=TGRP-ChaosMonkeyNothingIsSafeWithPullReplicasTest]
        at java.lang.Thread.sleep(Native Method)
        at org.apache.solr.cloud.StoppableIndexingThread.run(StoppableIndexingThread.java:135)
   3) Thread[id=31260, name=StoppableCommitThread-SendThread(127.0.0.1:33043), state=TIMED_WAITING, group=TGRP-ChaosMonkeyNothingIsSafeWithPullReplicasTest]
        at java.lang.Thread.sleep(Native Method)
        at org.apache.zookeeper.ClientCnxn$SendThread.run(ClientCnxn.java:1051)
   4) Thread[id=31152, name=StoppableIndexingThread, state=TIMED_WAITING, group=TGRP-ChaosMonkeyNothingIsSafeWithPullReplicasTest]
        at java.lang.Thread.sleep(Native Method)
        at org.apache.solr.cloud.StoppableIndexingThread.run(StoppableIndexingThread.java:135)
   5) Thread[id=31153, name=StoppableIndexingThread, state=TIMED_WAITING, group=TGRP-ChaosMonkeyNothingIsSafeWithPullReplicasTest]
        at java.lang.Thread.sleep(Native Method)
        at org.apache.solr.cloud.StoppableIndexingThread.run(StoppableIndexingThread.java:135)
   6) Thread[id=31326, name=zkCallback-240-thread-3, state=TIMED_WAITING, group=TGRP-ChaosMonkeyNothingIsSafeWithPullReplicasTest]
        at sun.misc.Unsafe.park(Native Method)
        at java.util.concurrent.locks.LockSupport.parkNanos(LockSupport.java:215)
        at java.util.concurrent.SynchronousQueue$TransferStack.awaitFulfill(SynchronousQueue.java:460)
        at java.util.concurrent.SynchronousQueue$TransferStack.transfer(SynchronousQueue.java:362)
        at java.util.concurrent.SynchronousQueue.poll(SynchronousQueue.java:941)
        at java.util.concurrent.ThreadPoolExecutor.getTask(ThreadPoolExecutor.java:1073)
        at java.util.concurrent.ThreadPoolExecutor.runWorker(ThreadPoolExecutor.java:1134)
        at java.util.concurrent.ThreadPoolExecutor$Worker.run(ThreadPoolExecutor.java:624)
        at java.lang.Thread.run(Thread.java:748)
   7) Thread[id=31264, name=zkCallback-282-thread-1, state=TIMED_WAITING, group=TGRP-ChaosMonkeyNothingIsSafeWithPullReplicasTest]
        at sun.misc.Unsafe.park(Native Method)
        at java.util.concurrent.locks.LockSupport.parkNanos(LockSupport.java:215)
        at java.util.concurrent.SynchronousQueue$TransferStack.awaitFulfill(SynchronousQueue.java:460)
        at java.util.concurrent.SynchronousQueue$TransferStack.transfer(SynchronousQueue.java:362)
        at java.util.concurrent.SynchronousQueue.poll(SynchronousQueue.java:941)
        at java.util.concurrent.ThreadPoolExecutor.getTask(ThreadPoolExecutor.java:1073)
        at java.util.concurrent.ThreadPoolExecutor.runWorker(ThreadPoolExecutor.java:1134)
        at java.util.concurrent.ThreadPoolExecutor$Worker.run(ThreadPoolExecutor.java:624)
        at java.lang.Thread.run(Thread.java:748)
   8) Thread[id=31269, name=zkCallback-240-thread-2, state=TIMED_WAITING, group=TGRP-ChaosMonkeyNothingIsSafeWithPullReplicasTest]
        at sun.misc.Unsafe.park(Native Method)
        at java.util.concurrent.locks.LockSupport.parkNanos(LockSupport.java:215)
        at java.util.concurrent.SynchronousQueue$TransferStack.awaitFulfill(SynchronousQueue.java:460)
        at java.util.concurrent.SynchronousQueue$TransferStack.transfer(SynchronousQueue.java:362)
        at java.util.concurrent.SynchronousQueue.poll(SynchronousQueue.java:941)
        at java.util.concurrent.ThreadPoolExecutor.getTask(ThreadPoolExecutor.java:1073)
        at java.util.concurrent.ThreadPoolExecutor.runWorker(ThreadPoolExecutor.java:1134)
        at java.util.concurrent.ThreadPoolExecutor$Worker.run(ThreadPoolExecutor.java:624)
        at java.lang.Thread.run(Thread.java:748)
   9) Thread[id=30948, name=TEST-ChaosMonkeyNothingIsSafeWithPullReplicasTest.test-seed#[D8359DE4DB9BC7F]-SendThread(127.0.0.1:33043), state=TIMED_WAITING, group=TGRP-ChaosMonkeyNothingIsSafeWithPullReplicasTest]
        at java.lang.Thread.sleep(Native Method)
        at org.apache.zookeeper.client.StaticHostProvider.next(StaticHostProvider.java:101)
        at org.apache.zookeeper.ClientCnxn$SendThread.startConnect(ClientCnxn.java:997)
        at org.apache.zookeeper.ClientCnxn$SendThread.run(ClientCnxn.java:1060)
  10) Thread[id=31324, name=zkCallback-282-thread-2, state=TIMED_WAITING, group=TGRP-ChaosMonkeyNothingIsSafeWithPullReplicasTest]
        at sun.misc.Unsafe.park(Native Method)
        at java.util.concurrent.locks.LockSupport.parkNanos(LockSupport.java:215)
        at java.util.concurrent.SynchronousQueue$TransferStack.awaitFulfill(SynchronousQueue.java:460)
        at java.util.concurrent.SynchronousQueue$TransferStack.transfer(SynchronousQueue.java:362)
        at java.util.concurrent.SynchronousQueue.poll(SynchronousQueue.java:941)
        at java.util.concurrent.ThreadPoolExecutor.getTask(ThreadPoolExecutor.java:1073)
        at java.util.concurrent.ThreadPoolExecutor.runWorker(ThreadPoolExecutor.java:1134)
        at java.util.concurrent.ThreadPoolExecutor$Worker.run(ThreadPoolExecutor.java:624)
        at java.lang.Thread.run(Thread.java:748)
  11) Thread[id=31325, name=zkCallback-282-thread-3, state=TIMED_WAITING, group=TGRP-ChaosMonkeyNothingIsSafeWithPullReplicasTest]
        at sun.misc.Unsafe.park(Native Method)
        at java.util.concurrent.locks.LockSupport.parkNanos(LockSupport.java:215)
        at java.util.concurrent.SynchronousQueue$TransferStack.awaitFulfill(SynchronousQueue.java:460)
        at java.util.concurrent.SynchronousQueue$TransferStack.transfer(SynchronousQueue.java:362)
        at java.util.concurrent.SynchronousQueue.poll(SynchronousQueue.java:941)
        at java.util.concurrent.ThreadPoolExecutor.getTask(ThreadPoolExecutor.java:1073)
        at java.util.concurrent.ThreadPoolExecutor.runWorker(ThreadPoolExecutor.java:1134)
        at java.util.concurrent.ThreadPoolExecutor$Worker.run(ThreadPoolExecutor.java:624)
        at java.lang.Thread.run(Thread.java:748)
  12) Thread[id=31155, name=StoppableSearchThread, state=WAITING, group=TGRP-ChaosMonkeyNothingIsSafeWithPullReplicasTest]
        at java.lang.Object.wait(Native Method)
        at java.lang.Object.wait(Object.java:502)
        at org.apache.zookeeper.ClientCnxn.submitRequest(ClientCnxn.java:1406)
        at org.apache.zookeeper.ZooKeeper.getData(ZooKeeper.java:1210)
        at org.apache.solr.common.cloud.SolrZkClient$7.execute(SolrZkClient.java:357)
        at org.apache.solr.common.cloud.SolrZkClient$7.execute(SolrZkClient.java:354)
        at org.apache.solr.common.cloud.ZkCmdExecutor.retryOperation(ZkCmdExecutor.java:60)
        at org.apache.solr.common.cloud.SolrZkClient.getData(SolrZkClient.java:354)
        at org.apache.solr.common.cloud.ZkStateReader.fetchCollectionState(ZkStateReader.java:1127)
        at org.apache.solr.common.cloud.ZkStateReader.getCollectionLive(ZkStateReader.java:1113)
        at org.apache.solr.common.cloud.ZkStateReader$LazyCollectionRef.get(ZkStateReader.java:648)
        at org.apache.solr.client.solrj.impl.CloudSolrClient.getDocCollection(CloudSolrClient.java:1227)
        at org.apache.solr.client.solrj.impl.CloudSolrClient.requestWithRetryOnStaleState(CloudSolrClient.java:827)
        at org.apache.solr.client.solrj.impl.CloudSolrClient.request(CloudSolrClient.java:793)
        at org.apache.solr.client.solrj.SolrRequest.process(SolrRequest.java:178)
        at org.apache.solr.client.solrj.SolrClient.query(SolrClient.java:942)
        at org.apache.solr.client.solrj.SolrClient.query(SolrClient.java:957)
        at org.apache.solr.cloud.StoppableSearchThread.run(StoppableSearchThread.java:54)
  13) Thread[id=31261, name=StoppableCommitThread-EventThread, state=WAITING, group=TGRP-ChaosMonkeyNothingIsSafeWithPullReplicasTest]
        at sun.misc.Unsafe.park(Native Method)
        at java.util.concurrent.locks.LockSupport.park(LockSupport.java:175)
        at java.util.concurrent.locks.AbstractQueuedSynchronizer$ConditionObject.await(AbstractQueuedSynchronizer.java:2039)
        at java.util.concurrent.LinkedBlockingQueue.take(LinkedBlockingQueue.java:442)
        at org.apache.zookeeper.ClientCnxn$EventThread.run(ClientCnxn.java:501)
  14) Thread[id=31327, name=zkCallback-240-thread-4, state=TIMED_WAITING, group=TGRP-ChaosMonkeyNothingIsSafeWithPullReplicasTest]
        at sun.misc.Unsafe.park(Native Method)
        at java.util.concurrent.locks.LockSupport.parkNanos(LockSupport.java:215)
        at java.util.concurrent.SynchronousQueue$TransferStack.awaitFulfill(SynchronousQueue.java:460)
        at java.util.concurrent.SynchronousQueue$TransferStack.transfer(SynchronousQueue.java:362)
        at java.util.concurrent.SynchronousQueue.poll(SynchronousQueue.java:941)
        at java.util.concurrent.ThreadPoolExecutor.getTask(ThreadPoolExecutor.java:1073)
        at java.util.concurrent.ThreadPoolExecutor.runWorker(ThreadPoolExecutor.java:1134)
        at java.util.concurrent.ThreadPoolExecutor$Worker.run(ThreadPoolExecutor.java:624)
        at java.lang.Thread.run(Thread.java:748)
  15) Thread[id=30949, name=TEST-ChaosMonkeyNothingIsSafeWithPullReplicasTest.test-seed#[D8359DE4DB9BC7F]-EventThread, state=WAITING, group=TGRP-ChaosMonkeyNothingIsSafeWithPullReplicasTest]
        at sun.misc.Unsafe.park(Native Method)
        at java.util.concurrent.locks.LockSupport.park(LockSupport.java:175)
        at java.util.concurrent.locks.AbstractQueuedSynchronizer$ConditionObject.await(AbstractQueuedSynchronizer.java:2039)
        at java.util.concurrent.LinkedBlockingQueue.take(LinkedBlockingQueue.java:442)
        at org.apache.zookeeper.ClientCnxn$EventThread.run(ClientCnxn.java:501)
  16) Thread[id=31157, name=StoppableCommitThread, state=BLOCKED, group=TGRP-ChaosMonkeyNothingIsSafeWithPullReplicasTest]
        at org.apache.solr.client.solrj.impl.CloudSolrClient.getDocCollection(CloudSolrClient.java:1217)
        at org.apache.solr.client.solrj.impl.CloudSolrClient.requestWithRetryOnStaleState(CloudSolrClient.java:827)
        at org.apache.solr.client.solrj.impl.CloudSolrClient.request(CloudSolrClient.java:793)
        at org.apache.solr.client.solrj.SolrRequest.process(SolrRequest.java:178)
        at org.apache.solr.client.solrj.SolrClient.commit(SolrClient.java:524)
        at org.apache.solr.client.solrj.SolrClient.commit(SolrClient.java:544)
        at org.apache.solr.cloud.StoppableCommitThread.run(StoppableCommitThread.java:49)
	at __randomizedtesting.SeedInfo.seed([D8359DE4DB9BC7F]:0)


FAILED:  junit.framework.TestSuite.org.apache.solr.cloud.ChaosMonkeyNothingIsSafeWithPullReplicasTest

Error Message:
There are still zombie threads that couldn't be terminated:    1) Thread[id=31324, name=zkCallback-282-thread-2, state=TIMED_WAITING, group=TGRP-ChaosMonkeyNothingIsSafeWithPullReplicasTest]         at sun.misc.Unsafe.park(Native Method)         at java.util.concurrent.locks.LockSupport.parkNanos(LockSupport.java:215)         at java.util.concurrent.SynchronousQueue$TransferStack.awaitFulfill(SynchronousQueue.java:460)         at java.util.concurrent.SynchronousQueue$TransferStack.transfer(SynchronousQueue.java:362)         at java.util.concurrent.SynchronousQueue.poll(SynchronousQueue.java:941)         at java.util.concurrent.ThreadPoolExecutor.getTask(ThreadPoolExecutor.java:1073)         at java.util.concurrent.ThreadPoolExecutor.runWorker(ThreadPoolExecutor.java:1134)         at java.util.concurrent.ThreadPoolExecutor$Worker.run(ThreadPoolExecutor.java:624)         at java.lang.Thread.run(Thread.java:748)    2) Thread[id=31154, name=StoppableIndexingThread, state=BLOCKED, group=TGRP-ChaosMonkeyNothingIsSafeWithPullReplicasTest]         at java.io.PrintStream.println(PrintStream.java:805)         at org.apache.solr.cloud.StoppableIndexingThread.run(StoppableIndexingThread.java:120)    3) Thread[id=31260, name=StoppableCommitThread-SendThread(127.0.0.1:33043), state=TIMED_WAITING, group=TGRP-ChaosMonkeyNothingIsSafeWithPullReplicasTest]         at java.lang.Thread.sleep(Native Method)         at org.apache.zookeeper.ClientCnxn$SendThread.run(ClientCnxn.java:1051)    4) Thread[id=31152, name=StoppableIndexingThread, state=BLOCKED, group=TGRP-ChaosMonkeyNothingIsSafeWithPullReplicasTest]         at java.io.PrintStream.println(PrintStream.java:805)         at org.apache.solr.cloud.StoppableIndexingThread.run(StoppableIndexingThread.java:120)    5) Thread[id=31153, name=StoppableIndexingThread, state=RUNNABLE, group=TGRP-ChaosMonkeyNothingIsSafeWithPullReplicasTest]         at org.apache.lucene.util.TestRuleLimitSysouts$DelegateStream.write(TestRuleLimitSysouts.java:128)         at java.io.PrintStream.write(PrintStream.java:480)         at sun.nio.cs.StreamEncoder.writeBytes(StreamEncoder.java:221)         at sun.nio.cs.StreamEncoder.implFlushBuffer(StreamEncoder.java:291)         at sun.nio.cs.StreamEncoder.flushBuffer(StreamEncoder.java:104)         at java.io.OutputStreamWriter.flushBuffer(OutputStreamWriter.java:185)         at java.io.PrintStream.write(PrintStream.java:527)         at java.io.PrintStream.print(PrintStream.java:669)         at java.io.PrintStream.println(PrintStream.java:823)         at java.lang.Throwable$WrappedPrintStream.println(Throwable.java:748)         at java.lang.Throwable.printStackTrace(Throwable.java:658)         at java.lang.Throwable.printStackTrace(Throwable.java:643)         at java.lang.Throwable.printStackTrace(Throwable.java:634)         at org.apache.solr.cloud.StoppableIndexingThread.run(StoppableIndexingThread.java:121)    6) Thread[id=31326, name=zkCallback-240-thread-3, state=TIMED_WAITING, group=TGRP-ChaosMonkeyNothingIsSafeWithPullReplicasTest]         at sun.misc.Unsafe.park(Native Method)         at java.util.concurrent.locks.LockSupport.parkNanos(LockSupport.java:215)         at java.util.concurrent.SynchronousQueue$TransferStack.awaitFulfill(SynchronousQueue.java:460)         at java.util.concurrent.SynchronousQueue$TransferStack.transfer(SynchronousQueue.java:362)         at java.util.concurrent.SynchronousQueue.poll(SynchronousQueue.java:941)         at java.util.concurrent.ThreadPoolExecutor.getTask(ThreadPoolExecutor.java:1073)         at java.util.concurrent.ThreadPoolExecutor.runWorker(ThreadPoolExecutor.java:1134)         at java.util.concurrent.ThreadPoolExecutor$Worker.run(ThreadPoolExecutor.java:624)         at java.lang.Thread.run(Thread.java:748)    7) Thread[id=31325, name=zkCallback-282-thread-3, state=TIMED_WAITING, group=TGRP-ChaosMonkeyNothingIsSafeWithPullReplicasTest]         at sun.misc.Unsafe.park(Native Method)         at java.util.concurrent.locks.LockSupport.parkNanos(LockSupport.java:215)         at java.util.concurrent.SynchronousQueue$TransferStack.awaitFulfill(SynchronousQueue.java:460)         at java.util.concurrent.SynchronousQueue$TransferStack.transfer(SynchronousQueue.java:362)         at java.util.concurrent.SynchronousQueue.poll(SynchronousQueue.java:941)         at java.util.concurrent.ThreadPoolExecutor.getTask(ThreadPoolExecutor.java:1073)         at java.util.concurrent.ThreadPoolExecutor.runWorker(ThreadPoolExecutor.java:1134)         at java.util.concurrent.ThreadPoolExecutor$Worker.run(ThreadPoolExecutor.java:624)         at java.lang.Thread.run(Thread.java:748)    8) Thread[id=31264, name=zkCallback-282-thread-1, state=TIMED_WAITING, group=TGRP-ChaosMonkeyNothingIsSafeWithPullReplicasTest]         at sun.misc.Unsafe.park(Native Method)         at java.util.concurrent.locks.LockSupport.parkNanos(LockSupport.java:215)         at java.util.concurrent.SynchronousQueue$TransferStack.awaitFulfill(SynchronousQueue.java:460)         at java.util.concurrent.SynchronousQueue$TransferStack.transfer(SynchronousQueue.java:362)         at java.util.concurrent.SynchronousQueue.poll(SynchronousQueue.java:941)         at java.util.concurrent.ThreadPoolExecutor.getTask(ThreadPoolExecutor.java:1073)         at java.util.concurrent.ThreadPoolExecutor.runWorker(ThreadPoolExecutor.java:1134)         at java.util.concurrent.ThreadPoolExecutor$Worker.run(ThreadPoolExecutor.java:624)         at java.lang.Thread.run(Thread.java:748)    9) Thread[id=31155, name=StoppableSearchThread, state=BLOCKED, group=TGRP-ChaosMonkeyNothingIsSafeWithPullReplicasTest]         at java.io.PrintStream.println(PrintStream.java:805)         at org.apache.solr.cloud.StoppableSearchThread.run(StoppableSearchThread.java:56)   10) Thread[id=31269, name=zkCallback-240-thread-2, state=TIMED_WAITING, group=TGRP-ChaosMonkeyNothingIsSafeWithPullReplicasTest]         at sun.misc.Unsafe.park(Native Method)         at java.util.concurrent.locks.LockSupport.parkNanos(LockSupport.java:215)         at java.util.concurrent.SynchronousQueue$TransferStack.awaitFulfill(SynchronousQueue.java:460)         at java.util.concurrent.SynchronousQueue$TransferStack.transfer(SynchronousQueue.java:362)         at java.util.concurrent.SynchronousQueue.poll(SynchronousQueue.java:941)         at java.util.concurrent.ThreadPoolExecutor.getTask(ThreadPoolExecutor.java:1073)         at java.util.concurrent.ThreadPoolExecutor.runWorker(ThreadPoolExecutor.java:1134)         at java.util.concurrent.ThreadPoolExecutor$Worker.run(ThreadPoolExecutor.java:624)         at java.lang.Thread.run(Thread.java:748)   11) Thread[id=31327, name=zkCallback-240-thread-4, state=TIMED_WAITING, group=TGRP-ChaosMonkeyNothingIsSafeWithPullReplicasTest]         at sun.misc.Unsafe.park(Native Method)         at java.util.concurrent.locks.LockSupport.parkNanos(LockSupport.java:215)         at java.util.concurrent.SynchronousQueue$TransferStack.awaitFulfill(SynchronousQueue.java:460)         at java.util.concurrent.SynchronousQueue$TransferStack.transfer(SynchronousQueue.java:362)         at java.util.concurrent.SynchronousQueue.poll(SynchronousQueue.java:941)         at java.util.concurrent.ThreadPoolExecutor.getTask(ThreadPoolExecutor.java:1073)         at java.util.concurrent.ThreadPoolExecutor.runWorker(ThreadPoolExecutor.java:1134)         at java.util.concurrent.ThreadPoolExecutor$Worker.run(ThreadPoolExecutor.java:624)         at java.lang.Thread.run(Thread.java:748)   12) Thread[id=30948, name=TEST-ChaosMonkeyNothingIsSafeWithPullReplicasTest.test-seed#[D8359DE4DB9BC7F]-SendThread(127.0.0.1:33043), state=TIMED_WAITING, group=TGRP-ChaosMonkeyNothingIsSafeWithPullReplicasTest]         at java.lang.Thread.sleep(Native Method)         at org.apache.zookeeper.ClientCnxn$SendThread.run(ClientCnxn.java:1051)

Stack Trace:
com.carrotsearch.randomizedtesting.ThreadLeakError: There are still zombie threads that couldn't be terminated:
   1) Thread[id=31324, name=zkCallback-282-thread-2, state=TIMED_WAITING, group=TGRP-ChaosMonkeyNothingIsSafeWithPullReplicasTest]
        at sun.misc.Unsafe.park(Native Method)
        at java.util.concurrent.locks.LockSupport.parkNanos(LockSupport.java:215)
        at java.util.concurrent.SynchronousQueue$TransferStack.awaitFulfill(SynchronousQueue.java:460)
        at java.util.concurrent.SynchronousQueue$TransferStack.transfer(SynchronousQueue.java:362)
        at java.util.concurrent.SynchronousQueue.poll(SynchronousQueue.java:941)
        at java.util.concurrent.ThreadPoolExecutor.getTask(ThreadPoolExecutor.java:1073)
        at java.util.concurrent.ThreadPoolExecutor.runWorker(ThreadPoolExecutor.java:1134)
        at java.util.concurrent.ThreadPoolExecutor$Worker.run(ThreadPoolExecutor.java:624)
        at java.lang.Thread.run(Thread.java:748)
   2) Thread[id=31154, name=StoppableIndexingThread, state=BLOCKED, group=TGRP-ChaosMonkeyNothingIsSafeWithPullReplicasTest]
        at java.io.PrintStream.println(PrintStream.java:805)
        at org.apache.solr.cloud.StoppableIndexingThread.run(StoppableIndexingThread.java:120)
   3) Thread[id=31260, name=StoppableCommitThread-SendThread(127.0.0.1:33043), state=TIMED_WAITING, group=TGRP-ChaosMonkeyNothingIsSafeWithPullReplicasTest]
        at java.lang.Thread.sleep(Native Method)
        at org.apache.zookeeper.ClientCnxn$SendThread.run(ClientCnxn.java:1051)
   4) Thread[id=31152, name=StoppableIndexingThread, state=BLOCKED, group=TGRP-ChaosMonkeyNothingIsSafeWithPullReplicasTest]
        at java.io.PrintStream.println(PrintStream.java:805)
        at org.apache.solr.cloud.StoppableIndexingThread.run(StoppableIndexingThread.java:120)
   5) Thread[id=31153, name=StoppableIndexingThread, state=RUNNABLE, group=TGRP-ChaosMonkeyNothingIsSafeWithPullReplicasTest]
        at org.apache.lucene.util.TestRuleLimitSysouts$DelegateStream.write(TestRuleLimitSysouts.java:128)
        at java.io.PrintStream.write(PrintStream.java:480)
        at sun.nio.cs.StreamEncoder.writeBytes(StreamEncoder.java:221)
        at sun.nio.cs.StreamEncoder.implFlushBuffer(StreamEncoder.java:291)
        at sun.nio.cs.StreamEncoder.flushBuffer(StreamEncoder.java:104)
        at java.io.OutputStreamWriter.flushBuffer(OutputStreamWriter.java:185)
        at java.io.PrintStream.write(PrintStream.java:527)
        at java.io.PrintStream.print(PrintStream.java:669)
        at java.io.PrintStream.println(PrintStream.java:823)
        at java.lang.Throwable$WrappedPrintStream.println(Throwable.java:748)
        at java.lang.Throwable.printStackTrace(Throwable.java:658)
        at java.lang.Throwable.printStackTrace(Throwable.java:643)
        at java.lang.Throwable.printStackTrace(Throwable.java:634)
        at org.apache.solr.cloud.StoppableIndexingThread.run(StoppableIndexingThread.java:121)
   6) Thread[id=31326, name=zkCallback-240-thread-3, state=TIMED_WAITING, group=TGRP-ChaosMonkeyNothingIsSafeWithPullReplicasTest]
        at sun.misc.Unsafe.park(Native Method)
        at java.util.concurrent.locks.LockSupport.parkNanos(LockSupport.java:215)
        at java.util.concurrent.SynchronousQueue$TransferStack.awaitFulfill(SynchronousQueue.java:460)
        at java.util.concurrent.SynchronousQueue$TransferStack.transfer(SynchronousQueue.java:362)
        at java.util.concurrent.SynchronousQueue.poll(SynchronousQueue.java:941)
        at java.util.concurrent.ThreadPoolExecutor.getTask(ThreadPoolExecutor.java:1073)
        at java.util.concurrent.ThreadPoolExecutor.runWorker(ThreadPoolExecutor.java:1134)
        at java.util.concurrent.ThreadPoolExecutor$Worker.run(ThreadPoolExecutor.java:624)
        at java.lang.Thread.run(Thread.java:748)
   7) Thread[id=31325, name=zkCallback-282-thread-3, state=TIMED_WAITING, group=TGRP-ChaosMonkeyNothingIsSafeWithPullReplicasTest]
        at sun.misc.Unsafe.park(Native Method)
        at java.util.concurrent.locks.LockSupport.parkNanos(LockSupport.java:215)
        at java.util.concurrent.SynchronousQueue$TransferStack.awaitFulfill(SynchronousQueue.java:460)
        at java.util.concurrent.SynchronousQueue$TransferStack.transfer(SynchronousQueue.java:362)
        at java.util.concurrent.SynchronousQueue.poll(SynchronousQueue.java:941)
        at java.util.concurrent.ThreadPoolExecutor.getTask(ThreadPoolExecutor.java:1073)
        at java.util.concurrent.ThreadPoolExecutor.runWorker(ThreadPoolExecutor.java:1134)
        at java.util.concurrent.ThreadPoolExecutor$Worker.run(ThreadPoolExecutor.java:624)
        at java.lang.Thread.run(Thread.java:748)
   8) Thread[id=31264, name=zkCallback-282-thread-1, state=TIMED_WAITING, group=TGRP-ChaosMonkeyNothingIsSafeWithPullReplicasTest]
        at sun.misc.Unsafe.park(Native Method)
        at java.util.concurrent.locks.LockSupport.parkNanos(LockSupport.java:215)
        at java.util.concurrent.SynchronousQueue$TransferStack.awaitFulfill(SynchronousQueue.java:460)
        at java.util.concurrent.SynchronousQueue$TransferStack.transfer(SynchronousQueue.java:362)
        at java.util.concurrent.SynchronousQueue.poll(SynchronousQueue.java:941)
        at java.util.concurrent.ThreadPoolExecutor.getTask(ThreadPoolExecutor.java:1073)
        at java.util.concurrent.ThreadPoolExecutor.runWorker(ThreadPoolExecutor.java:1134)
        at java.util.concurrent.ThreadPoolExecutor$Worker.run(ThreadPoolExecutor.java:624)
        at java.lang.Thread.run(Thread.java:748)
   9) Thread[id=31155, name=StoppableSearchThread, state=BLOCKED, group=TGRP-ChaosMonkeyNothingIsSafeWithPullReplicasTest]
        at java.io.PrintStream.println(PrintStream.java:805)
        at org.apache.solr.cloud.StoppableSearchThread.run(StoppableSearchThread.java:56)
  10) Thread[id=31269, name=zkCallback-240-thread-2, state=TIMED_WAITING, group=TGRP-ChaosMonkeyNothingIsSafeWithPullReplicasTest]
        at sun.misc.Unsafe.park(Native Method)
        at java.util.concurrent.locks.LockSupport.parkNanos(LockSupport.java:215)
        at java.util.concurrent.SynchronousQueue$TransferStack.awaitFulfill(SynchronousQueue.java:460)
        at java.util.concurrent.SynchronousQueue$TransferStack.transfer(SynchronousQueue.java:362)
        at java.util.concurrent.SynchronousQueue.poll(SynchronousQueue.java:941)
        at java.util.concurrent.ThreadPoolExecutor.getTask(ThreadPoolExecutor.java:1073)
        at java.util.concurrent.ThreadPoolExecutor.runWorker(ThreadPoolExecutor.java:1134)
        at java.util.concurrent.ThreadPoolExecutor$Worker.run(ThreadPoolExecutor.java:624)
        at java.lang.Thread.run(Thread.java:748)
  11) Thread[id=31327, name=zkCallback-240-thread-4, state=TIMED_WAITING, group=TGRP-ChaosMonkeyNothingIsSafeWithPullReplicasTest]
        at sun.misc.Unsafe.park(Native Method)
        at java.util.concurrent.locks.LockSupport.parkNanos(LockSupport.java:215)
        at java.util.concurrent.SynchronousQueue$TransferStack.awaitFulfill(SynchronousQueue.java:460)
        at java.util.concurrent.SynchronousQueue$TransferStack.transfer(SynchronousQueue.java:362)
        at java.util.concurrent.SynchronousQueue.poll(SynchronousQueue.java:941)
        at java.util.concurrent.ThreadPoolExecutor.getTask(ThreadPoolExecutor.java:1073)
        at java.util.concurrent.ThreadPoolExecutor.runWorker(ThreadPoolExecutor.java:1134)
        at java.util.concurrent.ThreadPoolExecutor$Worker.run(ThreadPoolExecutor.java:624)
        at java.lang.Thread.run(Thread.java:748)
  12) Thread[id=30948, name=TEST-ChaosMonkeyNothingIsSafeWithPullReplicasTest.test-seed#[D8359DE4DB9BC7F]-SendThread(127.0.0.1:33043), state=TIMED_WAITING, group=TGRP-ChaosMonkeyNothingIsSafeWithPullReplicasTest]
        at java.lang.Thread.sleep(Native Method)
        at org.apache.zookeeper.ClientCnxn$SendThread.run(ClientCnxn.java:1051)
	at __randomizedtesting.SeedInfo.seed([D8359DE4DB9BC7F]:0)


FAILED:  org.apache.solr.cloud.HttpPartitionTest.test

Error Message:
Doc with id=1 not found in http://127.0.0.1:54597/collMinRf_1x3 due to: Path not found: /id; rsp={doc=null}

Stack Trace:
java.lang.AssertionError: Doc with id=1 not found in http://127.0.0.1:54597/collMinRf_1x3 due to: Path not found: /id; rsp={doc=null}
	at __randomizedtesting.SeedInfo.seed([D8359DE4DB9BC7F:85D76604E345D187]:0)
	at org.junit.Assert.fail(Assert.java:93)
	at org.junit.Assert.assertTrue(Assert.java:43)
	at org.apache.solr.cloud.HttpPartitionTest.assertDocExists(HttpPartitionTest.java:603)
	at org.apache.solr.cloud.HttpPartitionTest.assertDocsExistInAllReplicas(HttpPartitionTest.java:558)
	at org.apache.solr.cloud.HttpPartitionTest.testMinRf(HttpPartitionTest.java:249)
	at org.apache.solr.cloud.HttpPartitionTest.test(HttpPartitionTest.java:127)
	at sun.reflect.NativeMethodAccessorImpl.invoke0(Native Method)
	at sun.reflect.NativeMethodAccessorImpl.invoke(NativeMethodAccessorImpl.java:62)
	at sun.reflect.DelegatingMethodAccessorImpl.invoke(DelegatingMethodAccessorImpl.java:43)
	at java.lang.reflect.Method.invoke(Method.java:498)
	at com.carrotsearch.randomizedtesting.RandomizedRunner.invoke(RandomizedRunner.java:1713)
	at com.carrotsearch.randomizedtesting.RandomizedRunner$8.evaluate(RandomizedRunner.java:907)
	at com.carrotsearch.randomizedtesting.RandomizedRunner$9.evaluate(RandomizedRunner.java:943)
	at com.carrotsearch.randomizedtesting.RandomizedRunner$10.evaluate(RandomizedRunner.java:957)
	at org.apache.solr.BaseDistributedSearchTestCase$ShardsRepeatRule$ShardsFixedStatement.callStatement(BaseDistributedSearchTestCase.java:993)
	at org.apache.solr.BaseDistributedSearchTestCase$ShardsRepeatRule$ShardsStatement.evaluate(BaseDistributedSearchTestCase.java:968)
	at com.carrotsearch.randomizedtesting.rules.SystemPropertiesRestoreRule$1.evaluate(SystemPropertiesRestoreRule.java:57)
	at org.apache.lucene.util.TestRuleSetupTeardownChained$1.evaluate(TestRuleSetupTeardownChained.java:49)
	at org.apache.lucene.util.AbstractBeforeAfterRule$1.evaluate(AbstractBeforeAfterRule.java:45)
	at org.apache.lucene.util.TestRuleThreadAndTestName$1.evaluate(TestRuleThreadAndTestName.java:48)
	at org.apache.lucene.util.TestRuleIgnoreAfterMaxFailures$1.evaluate(TestRuleIgnoreAfterMaxFailures.java:64)
	at org.apache.lucene.util.TestRuleMarkFailure$1.evaluate(TestRuleMarkFailure.java:47)
	at com.carrotsearch.randomizedtesting.rules.StatementAdapter.evaluate(StatementAdapter.java:36)
	at com.carrotsearch.randomizedtesting.ThreadLeakControl$StatementRunner.run(ThreadLeakControl.java:368)
	at com.carrotsearch.randomizedtesting.ThreadLeakControl.forkTimeoutingTask(ThreadLeakControl.java:817)
	at com.carrotsearch.randomizedtesting.ThreadLeakControl$3.evaluate(ThreadLeakControl.java:468)
	at com.carrotsearch.randomizedtesting.RandomizedRunner.runSingleTest(RandomizedRunner.java:916)
	at com.carrotsearch.randomizedtesting.RandomizedRunner$5.evaluate(RandomizedRunner.java:802)
	at com.carrotsearch.randomizedtesting.RandomizedRunner$6.evaluate(RandomizedRunner.java:852)
	at com.carrotsearch.randomizedtesting.RandomizedRunner$7.evaluate(RandomizedRunner.java:863)
	at com.carrotsearch.randomizedtesting.rules.StatementAdapter.evaluate(StatementAdapter.java:36)
	at com.carrotsearch.randomizedtesting.rules.SystemPropertiesRestoreRule$1.evaluate(SystemPropertiesRestoreRule.java:57)
	at org.apache.lucene.util.AbstractBeforeAfterRule$1.evaluate(AbstractBeforeAfterRule.java:45)
	at com.carrotsearch.randomizedtesting.rules.StatementAdapter.evaluate(StatementAdapter.java:36)
	at org.apache.lucene.util.TestRuleStoreClassName$1.evaluate(TestRuleStoreClassName.java:41)
	at com.carrotsearch.randomizedtesting.rules.NoShadowingOrOverridesOnMethodsRule$1.evaluate(NoShadowingOrOverridesOnMethodsRule.java:40)
	at com.carrotsearch.randomizedtesting.rules.NoShadowingOrOverridesOnMethodsRule$1.evaluate(NoShadowingOrOverridesOnMethodsRule.java:40)
	at com.carrotsearch.randomizedtesting.rules.StatementAdapter.evaluate(StatementAdapter.java:36)
	at com.carrotsearch.randomizedtesting.rules.StatementAdapter.evaluate(StatementAdapter.java:36)
	at com.carrotsearch.randomizedtesting.rules.StatementAdapter.evaluate(StatementAdapter.java:36)
	at org.apache.lucene.util.TestRuleAssertionsRequired$1.evaluate(TestRuleAssertionsRequired.java:53)
	at org.apache.lucene.util.TestRuleMarkFailure$1.evaluate(TestRuleMarkFailure.java:47)
	at org.apache.lucene.util.TestRuleIgnoreAfterMaxFailures$1.evaluate(TestRuleIgnoreAfterMaxFailures.java:64)
	at org.apache.lucene.util.TestRuleIgnoreTestSuites$1.evaluate(TestRuleIgnoreTestSuites.java:54)
	at com.carrotsearch.randomizedtesting.rules.StatementAdapter.evaluate(StatementAdapter.java:36)
	at com.carrotsearch.randomizedtesting.ThreadLeakControl$StatementRunner.run(ThreadLeakControl.java:368)
	at java.lang.Thread.run(Thread.java:748)




Build Log:
[...truncated 11829 lines...]
   [junit4] Suite: org.apache.solr.cloud.ChaosMonkeyNothingIsSafeWithPullReplicasTest
   [junit4]   2> Creating dataDir: /x1/jenkins/jenkins-slave/workspace/Lucene-Solr-NightlyTests-master/checkout/solr/build/solr-core/test/J0/temp/solr.cloud.ChaosMonkeyNothingIsSafeWithPullReplicasTest_D8359DE4DB9BC7F-001/init-core-data-001
   [junit4]   2> 1036578 WARN  (SUITE-ChaosMonkeyNothingIsSafeWithPullReplicasTest-seed#[D8359DE4DB9BC7F]-worker) [    ] o.a.s.SolrTestCaseJ4 startTrackingSearchers: numOpens=1 numCloses=1
   [junit4]   2> 1036578 INFO  (SUITE-ChaosMonkeyNothingIsSafeWithPullReplicasTest-seed#[D8359DE4DB9BC7F]-worker) [    ] o.a.s.SolrTestCaseJ4 Using PointFields (NUMERIC_POINTS_SYSPROP=true) w/NUMERIC_DOCVALUES_SYSPROP=false
   [junit4]   2> 1036579 INFO  (SUITE-ChaosMonkeyNothingIsSafeWithPullReplicasTest-seed#[D8359DE4DB9BC7F]-worker) [    ] o.a.s.SolrTestCaseJ4 Randomized ssl (false) and clientAuth (false) via: @org.apache.solr.SolrTestCaseJ4$SuppressSSL(bugUrl=https://issues.apache.org/jira/browse/SOLR-5776)
   [junit4]   2> 1036579 INFO  (SUITE-ChaosMonkeyNothingIsSafeWithPullReplicasTest-seed#[D8359DE4DB9BC7F]-worker) [    ] o.a.s.SolrTestCaseJ4 SecureRandom sanity checks: test.solr.allowed.securerandom=null & java.security.egd=file:/dev/./urandom
   [junit4]   2> 1036579 INFO  (SUITE-ChaosMonkeyNothingIsSafeWithPullReplicasTest-seed#[D8359DE4DB9BC7F]-worker) [    ] o.a.s.BaseDistributedSearchTestCase Setting hostContext system property: /
   [junit4]   2> 1036580 INFO  (TEST-ChaosMonkeyNothingIsSafeWithPullReplicasTest.test-seed#[D8359DE4DB9BC7F]) [    ] o.a.s.c.ChaosMonkeyNothingIsSafeWithPullReplicasTest Starting ChaosMonkey test with 2 shards and 6 nodes
   [junit4]   2> 1036589 INFO  (TEST-ChaosMonkeyNothingIsSafeWithPullReplicasTest.test-seed#[D8359DE4DB9BC7F]) [    ] o.a.s.c.ZkTestServer STARTING ZK TEST SERVER
   [junit4]   2> 1036597 INFO  (Thread-28578) [    ] o.a.s.c.ZkTestServer client port:0.0.0.0/0.0.0.0:0
   [junit4]   2> 1036597 INFO  (Thread-28578) [    ] o.a.s.c.ZkTestServer Starting server
   [junit4]   2> 1036638 ERROR (Thread-28578) [    ] o.a.z.s.ZooKeeperServer ZKShutdownHandler is not registered, so ZooKeeper server won't take any action on ERROR or SHUTDOWN server state changes
   [junit4]   2> 1036697 INFO  (TEST-ChaosMonkeyNothingIsSafeWithPullReplicasTest.test-seed#[D8359DE4DB9BC7F]) [    ] o.a.s.c.ZkTestServer start zk server on port:33043
   [junit4]   2> 1036719 INFO  (TEST-ChaosMonkeyNothingIsSafeWithPullReplicasTest.test-seed#[D8359DE4DB9BC7F]) [    ] o.a.s.c.AbstractZkTestCase put /x1/jenkins/jenkins-slave/workspace/Lucene-Solr-NightlyTests-master/checkout/solr/core/src/test-files/solr/collection1/conf/solrconfig-tlog.xml to /configs/conf1/solrconfig.xml
   [junit4]   2> 1036720 INFO  (TEST-ChaosMonkeyNothingIsSafeWithPullReplicasTest.test-seed#[D8359DE4DB9BC7F]) [    ] o.a.s.c.AbstractZkTestCase put /x1/jenkins/jenkins-slave/workspace/Lucene-Solr-NightlyTests-master/checkout/solr/core/src/test-files/solr/collection1/conf/schema15.xml to /configs/conf1/schema.xml
   [junit4]   2> 1036720 INFO  (TEST-ChaosMonkeyNothingIsSafeWithPullReplicasTest.test-seed#[D8359DE4DB9BC7F]) [    ] o.a.s.c.AbstractZkTestCase put /x1/jenkins/jenkins-slave/workspace/Lucene-Solr-NightlyTests-master/checkout/solr/core/src/test-files/solr/collection1/conf/solrconfig.snippet.randomindexconfig.xml to /configs/conf1/solrconfig.snippet.randomindexconfig.xml
   [junit4]   2> 1036721 INFO  (TEST-ChaosMonkeyNothingIsSafeWithPullReplicasTest.test-seed#[D8359DE4DB9BC7F]) [    ] o.a.s.c.AbstractZkTestCase put /x1/jenkins/jenkins-slave/workspace/Lucene-Solr-NightlyTests-master/checkout/solr/core/src/test-files/solr/collection1/conf/stopwords.txt to /configs/conf1/stopwords.txt
   [junit4]   2> 1036722 INFO  (TEST-ChaosMonkeyNothingIsSafeWithPullReplicasTest.test-seed#[D8359DE4DB9BC7F]) [    ] o.a.s.c.AbstractZkTestCase put /x1/jenkins/jenkins-slave/workspace/Lucene-Solr-NightlyTests-master/checkout/solr/core/src/test-files/solr/collection1/conf/protwords.txt to /configs/conf1/protwords.txt
   [junit4]   2> 1036722 INFO  (TEST-ChaosMonkeyNothingIsSafeWithPullReplicasTest.test-seed#[D8359DE4DB9BC7F]) [    ] o.a.s.c.AbstractZkTestCase put /x1/jenkins/jenkins-slave/workspace/Lucene-Solr-NightlyTests-master/checkout/solr/core/src/test-files/solr/collection1/conf/currency.xml to /configs/conf1/currency.xml
   [junit4]   2> 1036723 INFO  (TEST-ChaosMonkeyNothingIsSafeWithPullReplicasTest.test-seed#[D8359DE4DB9BC7F]) [    ] o.a.s.c.AbstractZkTestCase put /x1/jenkins/jenkins-slave/workspace/Lucene-Solr-NightlyTests-master/checkout/solr/core/src/test-files/solr/collection1/conf/enumsConfig.xml to /configs/conf1/enumsConfig.xml
   [junit4]   2> 1036724 INFO  (TEST-ChaosMonkeyNothingIsSafeWithPullReplicasTest.test-seed#[D8359DE4DB9BC7F]) [    ] o.a.s.c.AbstractZkTestCase put /x1/jenkins/jenkins-slave/workspace/Lucene-Solr-NightlyTests-master/checkout/solr/core/src/test-files/solr/collection1/conf/open-exchange-rates.json to /configs/conf1/open-exchange-rates.json
   [junit4]   2> 1036725 INFO  (TEST-ChaosMonkeyNothingIsSafeWithPullReplicasTest.test-seed#[D8359DE4DB9BC7F]) [    ] o.a.s.c.AbstractZkTestCase put /x1/jenkins/jenkins-slave/workspace/Lucene-Solr-NightlyTests-master/checkout/solr/core/src/test-files/solr/collection1/conf/mapping-ISOLatin1Accent.txt to /configs/conf1/mapping-ISOLatin1Accent.txt
   [junit4]   2> 1036725 INFO  (TEST-ChaosMonkeyNothingIsSafeWithPullReplicasTest.test-seed#[D8359DE4DB9BC7F]) [    ] o.a.s.c.AbstractZkTestCase put /x1/jenkins/jenkins-slave/workspace/Lucene-Solr-NightlyTests-master/checkout/solr/core/src/test-files/solr/collection1/conf/old_synonyms.txt to /configs/conf1/old_synonyms.txt
   [junit4]   2> 1036726 INFO  (TEST-ChaosMonkeyNothingIsSafeWithPullReplicasTest.test-seed#[D8359DE4DB9BC7F]) [    ] o.a.s.c.AbstractZkTestCase put /x1/jenkins/jenkins-slave/workspace/Lucene-Solr-NightlyTests-master/checkout/solr/core/src/test-files/solr/collection1/conf/synonyms.txt to /configs/conf1/synonyms.txt
   [junit4]   2> 1036733 INFO  (TEST-ChaosMonkeyNothingIsSafeWithPullReplicasTest.test-seed#[D8359DE4DB9BC7F]) [    ] o.a.s.c.AbstractFullDistribZkTestBase Will use TLOG replicas unless explicitly asked otherwise
   [junit4]   2> 1037053 INFO  (TEST-ChaosMonkeyNothingIsSafeWithPullReplicasTest.test-seed#[D8359DE4DB9BC7F]) [    ] o.e.j.s.Server jetty-9.3.20.v20170531
   [junit4]   2> 1037056 INFO  (TEST-ChaosMonkeyNothingIsSafeWithPullReplicasTest.test-seed#[D8359DE4DB9BC7F]) [    ] o.e.j.s.h.ContextHandler Started o.e.j.s.ServletContextHandler@2df00ca3{/,null,AVAILABLE}
   [junit4]   2> 1037065 INFO  (TEST-ChaosMonkeyNothingIsSafeWithPullReplicasTest.test-seed#[D8359DE4DB9BC7F]) [    ] o.e.j.s.AbstractConnector Started ServerConnector@330a8677{HTTP/1.1,[http/1.1]}{127.0.0.1:59220}
   [junit4]   2> 1037065 INFO  (TEST-ChaosMonkeyNothingIsSafeWithPullReplicasTest.test-seed#[D8359DE4DB9BC7F]) [    ] o.e.j.s.Server Started @1041569ms
   [junit4]   2> 1037065 INFO  (TEST-ChaosMonkeyNothingIsSafeWithPullReplicasTest.test-seed#[D8359DE4DB9BC7F]) [    ] o.a.s.c.s.e.JettySolrRunner Jetty properties: {solr.data.dir=/x1/jenkins/jenkins-slave/workspace/Lucene-Solr-NightlyTests-master/checkout/solr/build/solr-core/test/J0/temp/solr.cloud.ChaosMonkeyNothingIsSafeWithPullReplicasTest_D8359DE4DB9BC7F-001/tempDir-001/control/data, hostContext=/, hostPort=59220, coreRootDirectory=/x1/jenkins/jenkins-slave/workspace/Lucene-Solr-NightlyTests-master/checkout/solr/build/solr-core/test/J0/../../../../../../../../../../../x1/jenkins/jenkins-slave/workspace/Lucene-Solr-NightlyTests-master/checkout/solr/build/solr-core/test/J0/temp/solr.cloud.ChaosMonkeyNothingIsSafeWithPullReplicasTest_D8359DE4DB9BC7F-001/control-001/cores}
   [junit4]   2> 1037065 ERROR (TEST-ChaosMonkeyNothingIsSafeWithPullReplicasTest.test-seed#[D8359DE4DB9BC7F]) [    ] o.a.s.s.StartupLoggingUtils Missing Java Option solr.log.dir. Logging may be missing or incomplete.
   [junit4]   2> 1037065 INFO  (TEST-ChaosMonkeyNothingIsSafeWithPullReplicasTest.test-seed#[D8359DE4DB9BC7F]) [    ] o.a.s.s.SolrDispatchFilter  ___      _       Welcome to Apache Solr? version 8.0.0
   [junit4]   2> 1037065 INFO  (TEST-ChaosMonkeyNothingIsSafeWithPullReplicasTest.test-seed#[D8359DE4DB9BC7F]) [    ] o.a.s.s.SolrDispatchFilter / __| ___| |_ _   Starting in cloud mode on port null
   [junit4]   2> 1037065 INFO  (TEST-ChaosMonkeyNothingIsSafeWithPullReplicasTest.test-seed#[D8359DE4DB9BC7F]) [    ] o.a.s.s.SolrDispatchFilter \__ \/ _ \ | '_|  Install dir: null, Default config dir: null
   [junit4]   2> 1037065 INFO  (TEST-ChaosMonkeyNothingIsSafeWithPullReplicasTest.test-seed#[D8359DE4DB9BC7F]) [    ] o.a.s.s.SolrDispatchFilter |___/\___/_|_|    Start time: 2017-08-21T13:14:02.342Z
   [junit4]   2> 1037080 INFO  (TEST-ChaosMonkeyNothingIsSafeWithPullReplicasTest.test-seed#[D8359DE4DB9BC7F]) [    ] o.a.s.s.SolrDispatchFilter Loading solr.xml from SolrHome (not found in ZooKeeper)
   [junit4]   2> 1037080 INFO  (TEST-ChaosMonkeyNothingIsSafeWithPullReplicasTest.test-seed#[D8359DE4DB9BC7F]) [    ] o.a.s.c.SolrXmlConfig Loading container configuration from /x1/jenkins/jenkins-slave/workspace/Lucene-Solr-NightlyTests-master/checkout/solr/build/solr-core/test/J0/temp/solr.cloud.ChaosMonkeyNothingIsSafeWithPullReplicasTest_D8359DE4DB9BC7F-001/control-001/solr.xml
   [junit4]   2> 1037090 INFO  (TEST-ChaosMonkeyNothingIsSafeWithPullReplicasTest.test-seed#[D8359DE4DB9BC7F]) [    ] o.a.s.c.SolrXmlConfig MBean server found: com.sun.jmx.mbeanserver.JmxMBeanServer@210a7a72, but no JMX reporters were configured - adding default JMX reporter.
   [junit4]   2> 1037096 INFO  (TEST-ChaosMonkeyNothingIsSafeWithPullReplicasTest.test-seed#[D8359DE4DB9BC7F]) [    ] o.a.s.c.ZkContainer Zookeeper client=127.0.0.1:33043/solr
   [junit4]   2> 1037179 INFO  (TEST-ChaosMonkeyNothingIsSafeWithPullReplicasTest.test-seed#[D8359DE4DB9BC7F]) [n:127.0.0.1:59220_    ] o.a.s.c.Overseer Overseer (id=null) closing
   [junit4]   2> 1037179 INFO  (TEST-ChaosMonkeyNothingIsSafeWithPullReplicasTest.test-seed#[D8359DE4DB9BC7F]) [n:127.0.0.1:59220_    ] o.a.s.c.OverseerElectionContext I am going to be the leader 127.0.0.1:59220_
   [junit4]   2> 1037180 INFO  (TEST-ChaosMonkeyNothingIsSafeWithPullReplicasTest.test-seed#[D8359DE4DB9BC7F]) [n:127.0.0.1:59220_    ] o.a.s.c.Overseer Overseer (id=98521660908830724-127.0.0.1:59220_-n_0000000000) starting
   [junit4]   2> 1037183 INFO  (TEST-ChaosMonkeyNothingIsSafeWithPullReplicasTest.test-seed#[D8359DE4DB9BC7F]) [n:127.0.0.1:59220_    ] o.a.s.c.ZkController Register node as live in ZooKeeper:/live_nodes/127.0.0.1:59220_
   [junit4]   2> 1037187 INFO  (zkCallback-233-thread-1-processing-n:127.0.0.1:59220_) [n:127.0.0.1:59220_    ] o.a.s.c.c.ZkStateReader Updated live nodes from ZooKeeper... (0) -> (1)
   [junit4]   2> 1037233 INFO  (TEST-ChaosMonkeyNothingIsSafeWithPullReplicasTest.test-seed#[D8359DE4DB9BC7F]) [n:127.0.0.1:59220_    ] o.a.s.m.r.SolrJmxReporter JMX monitoring for 'solr.node' (registry 'solr.node') enabled at server: com.sun.jmx.mbeanserver.JmxMBeanServer@210a7a72
   [junit4]   2> 1037257 INFO  (TEST-ChaosMonkeyNothingIsSafeWithPullReplicasTest.test-seed#[D8359DE4DB9BC7F]) [n:127.0.0.1:59220_    ] o.a.s.m.r.SolrJmxReporter JMX monitoring for 'solr.jvm' (registry 'solr.jvm') enabled at server: com.sun.jmx.mbeanserver.JmxMBeanServer@210a7a72
   [junit4]   2> 1037257 INFO  (TEST-ChaosMonkeyNothingIsSafeWithPullReplicasTest.test-seed#[D8359DE4DB9BC7F]) [n:127.0.0.1:59220_    ] o.a.s.m.r.SolrJmxReporter JMX monitoring for 'solr.jetty' (registry 'solr.jetty') enabled at server: com.sun.jmx.mbeanserver.JmxMBeanServer@210a7a72
   [junit4]   2> 1037259 INFO  (TEST-ChaosMonkeyNothingIsSafeWithPullReplicasTest.test-seed#[D8359DE4DB9BC7F]) [n:127.0.0.1:59220_    ] o.a.s.c.CorePropertiesLocator Found 0 core definitions underneath /x1/jenkins/jenkins-slave/workspace/Lucene-Solr-NightlyTests-master/checkout/solr/build/solr-core/test/J0/../../../../../../../../../../../x1/jenkins/jenkins-slave/workspace/Lucene-Solr-NightlyTests-master/checkout/solr/build/solr-core/test/J0/temp/solr.cloud.ChaosMonkeyNothingIsSafeWithPullReplicasTest_D8359DE4DB9BC7F-001/control-001/cores
   [junit4]   2> 1037311 INFO  (TEST-ChaosMonkeyNothingIsSafeWithPullReplicasTest.test-seed#[D8359DE4DB9BC7F]) [    ] o.a.s.c.c.ZkStateReader Updated live nodes from ZooKeeper... (0) -> (1)
   [junit4]   2> 1037311 INFO  (TEST-ChaosMonkeyNothingIsSafeWithPullReplicasTest.test-seed#[D8359DE4DB9BC7F]) [    ] o.a.s.c.s.i.ZkClientClusterStateProvider Cluster at 127.0.0.1:33043/solr ready
   [junit4]   2> 1037334 INFO  (qtp1882123562-30914) [n:127.0.0.1:59220_    ] o.a.s.h.a.CollectionsHandler Invoked Collection Action :create with params replicationFactor=1&collection.configName=conf1&name=control_collection&nrtReplicas=1&action=CREATE&numShards=1&createNodeSet=127.0.0.1:59220_&wt=javabin&version=2 and sendToOCPQueue=true
   [junit4]   2> 1037342 INFO  (OverseerThreadFactory-667-thread-1-processing-n:127.0.0.1:59220_) [n:127.0.0.1:59220_    ] o.a.s.c.CreateCollectionCmd Create collection control_collection
   [junit4]   2> 1037454 INFO  (qtp1882123562-30912) [n:127.0.0.1:59220_    ] o.a.s.h.a.CoreAdminOperation core create command qt=/admin/cores&collection.configName=conf1&newCollection=true&name=control_collection_shard1_replica_n1&action=CREATE&numShards=1&collection=control_collection&shard=shard1&wt=javabin&version=2&replicaType=NRT
   [junit4]   2> 1037454 INFO  (qtp1882123562-30912) [n:127.0.0.1:59220_    ] o.a.s.c.TransientSolrCoreCacheDefault Allocating transient cache for 4 transient cores
   [junit4]   2> 1037562 INFO  (zkCallback-233-thread-1-processing-n:127.0.0.1:59220_) [n:127.0.0.1:59220_    ] o.a.s.c.c.ZkStateReader A cluster state change: [WatchedEvent state:SyncConnected type:NodeDataChanged path:/collections/control_collection/state.json] for collection [control_collection] has occurred - updating... (live nodes size: [1])
   [junit4]   2> 1038473 INFO  (qtp1882123562-30912) [n:127.0.0.1:59220_ c:control_collection s:shard1  x:control_collection_shard1_replica_n1] o.a.s.c.SolrConfig Using Lucene MatchVersion: 8.0.0
   [junit4]   2> 1038484 INFO  (qtp1882123562-30912) [n:127.0.0.1:59220_ c:control_collection s:shard1  x:control_collection_shard1_replica_n1] o.a.s.s.IndexSchema [control_collection_shard1_replica_n1] Schema name=test
   [junit4]   2> 1038555 INFO  (qtp1882123562-30912) [n:127.0.0.1:59220_ c:control_collection s:shard1  x:control_collection_shard1_replica_n1] o.a.s.s.IndexSchema Loaded schema test/1.6 with uniqueid field id
   [junit4]   2> 1038572 INFO  (qtp1882123562-30912) [n:127.0.0.1:59220_ c:control_collection s:shard1  x:control_collection_shard1_replica_n1] o.a.s.c.CoreContainer Creating SolrCore 'control_collection_shard1_replica_n1' using configuration from collection control_collection, trusted=true
   [junit4]   2> 1038572 INFO  (qtp1882123562-30912) [n:127.0.0.1:59220_ c:control_collection s:shard1  x:control_collection_shard1_replica_n1] o.a.s.m.r.SolrJmxReporter JMX monitoring for 'solr.core.control_collection.shard1.replica_n1' (registry 'solr.core.control_collection.shard1.replica_n1') enabled at server: com.sun.jmx.mbeanserver.JmxMBeanServer@210a7a72
   [junit4]   2> 1038572 INFO  (qtp1882123562-30912) [n:127.0.0.1:59220_ c:control_collection s:shard1  x:control_collection_shard1_replica_n1] o.a.s.c.SolrCore solr.RecoveryStrategy.Builder
   [junit4]   2> 1038572 INFO  (qtp1882123562-30912) [n:127.0.0.1:59220_ c:control_collection s:shard1  x:control_collection_shard1_replica_n1] o.a.s.c.SolrCore [[control_collection_shard1_replica_n1] ] Opening new SolrCore at [/x1/jenkins/jenkins-slave/workspace/Lucene-Solr-NightlyTests-master/checkout/solr/build/solr-core/test/J0/temp/solr.cloud.ChaosMonkeyNothingIsSafeWithPullReplicasTest_D8359DE4DB9BC7F-001/control-001/cores/control_collection_shard1_replica_n1], dataDir=[/x1/jenkins/jenkins-slave/workspace/Lucene-Solr-NightlyTests-master/checkout/solr/build/solr-core/test/J0/../../../../../../../../../../../x1/jenkins/jenkins-slave/workspace/Lucene-Solr-NightlyTests-master/checkout/solr/build/solr-core/test/J0/temp/solr.cloud.ChaosMonkeyNothingIsSafeWithPullReplicasTest_D8359DE4DB9BC7F-001/control-001/cores/control_collection_shard1_replica_n1/data/]
   [junit4]   2> 1038575 INFO  (qtp1882123562-30912) [n:127.0.0.1:59220_ c:control_collection s:shard1  x:control_collection_shard1_replica_n1] o.a.s.u.RandomMergePolicy RandomMergePolicy wrapping class org.apache.lucene.index.LogDocMergePolicy: [LogDocMergePolicy: minMergeSize=1000, mergeFactor=10, maxMergeSize=9223372036854775807, maxMergeSizeForForcedMerge=9223372036854775807, calibrateSizeByDeletes=true, maxMergeDocs=2147483647, maxCFSSegmentSizeMB=1.5751953125, noCFSRatio=0.2850912637047934]
   [junit4]   2> 1038587 WARN  (qtp1882123562-30912) [n:127.0.0.1:59220_ c:control_collection s:shard1  x:control_collection_shard1_replica_n1] o.a.s.c.RequestHandlers INVALID paramSet a in requestHandler {type = requestHandler,name = /dump,class = DumpRequestHandler,attributes = {initParams=a, name=/dump, class=DumpRequestHandler},args = {defaults={a=A,b=B}}}
   [junit4]   2> 1038620 INFO  (qtp1882123562-30912) [n:127.0.0.1:59220_ c:control_collection s:shard1  x:control_collection_shard1_replica_n1] o.a.s.u.UpdateHandler Using UpdateLog implementation: org.apache.solr.update.UpdateLog
   [junit4]   2> 1038620 INFO  (qtp1882123562-30912) [n:127.0.0.1:59220_ c:control_collection s:shard1  x:control_collection_shard1_replica_n1] o.a.s.u.UpdateLog Initializing UpdateLog: dataDir= defaultSyncLevel=FLUSH numRecordsToKeep=100 maxNumLogsToKeep=10 numVersionBuckets=65536
   [junit4]   2> 1038621 INFO  (qtp1882123562-30912) [n:127.0.0.1:59220_ c:control_collection s:shard1  x:control_collection_shard1_replica_n1] o.a.s.u.CommitTracker Hard AutoCommit: if uncommited for 15000ms; 
   [junit4]   2> 1038621 INFO  (qtp1882123562-30912) [n:127.0.0.1:59220_ c:control_collection s:shard1  x:control_collection_shard1_replica_n1] o.a.s.u.CommitTracker Soft AutoCommit: disabled
   [junit4]   2> 1038622 INFO  (qtp1882123562-30912) [n:127.0.0.1:59220_ c:control_collection s:shard1  x:control_collection_shard1_replica_n1] o.a.s.u.RandomMergePolicy RandomMergePolicy wrapping class org.apache.lucene.index.TieredMergePolicy: [TieredMergePolicy: maxMergeAtOnce=43, maxMergeAtOnceExplicit=48, maxMergedSegmentMB=89.6240234375, floorSegmentMB=0.908203125, forceMergeDeletesPctAllowed=0.8862775720749139, segmentsPerTier=26.0, maxCFSSegmentSizeMB=8.796093022207999E12, noCFSRatio=0.0
   [junit4]   2> 1038623 INFO  (qtp1882123562-30912) [n:127.0.0.1:59220_ c:control_collection s:shard1  x:control_collection_shard1_replica_n1] o.a.s.s.SolrIndexSearcher Opening [Searcher@2c10a23b[control_collection_shard1_replica_n1] main]
   [junit4]   2> 1038624 INFO  (qtp1882123562-30912) [n:127.0.0.1:59220_ c:control_collection s:shard1  x:control_collection_shard1_replica_n1] o.a.s.r.ManagedResourceStorage Configured ZooKeeperStorageIO with znodeBase: /configs/conf1
   [junit4]   2> 1038624 INFO  (qtp1882123562-30912) [n:127.0.0.1:59220_ c:control_collection s:shard1  x:control_collection_shard1_replica_n1] o.a.s.r.ManagedResourceStorage Loaded null at path _rest_managed.json using ZooKeeperStorageIO:path=/configs/conf1
   [junit4]   2> 1038625 INFO  (qtp1882123562-30912) [n:127.0.0.1:59220_ c:control_collection s:shard1  x:control_collection_shard1_replica_n1] o.a.s.h.ReplicationHandler Commits will be reserved for  10000
   [junit4]   2> 1038625 INFO  (qtp1882123562-30912) [n:127.0.0.1:59220_ c:control_collection s:shard1  x:control_collection_shard1_replica_n1] o.a.s.u.UpdateLog Could not find max version in index or recent updates, using new clock 1576346576645783552
   [junit4]   2> 1038631 INFO  (searcherExecutor-670-thread-1-processing-n:127.0.0.1:59220_ x:control_collection_shard1_replica_n1 s:shard1 c:control_collection) [n:127.0.0.1:59220_ c:control_collection s:shard1  x:control_collection_shard1_replica_n1] o.a.s.c.SolrCore [control_collection_shard1_replica_n1] Registered new searcher Searcher@2c10a23b[control_collection_shard1_replica_n1] main{ExitableDirectoryReader(UninvertingDirectoryReader())}
   [junit4]   2> 1038631 INFO  (qtp1882123562-30912) [n:127.0.0.1:59220_ c:control_collection s:shard1  x:control_collection_shard1_replica_n1] o.a.s.c.ShardLeaderElectionContext Enough replicas found to continue.
   [junit4]   2> 1038631 INFO  (qtp1882123562-30912) [n:127.0.0.1:59220_ c:control_collection s:shard1  x:control_collection_shard1_replica_n1] o.a.s.c.ShardLeaderElectionContext I may be the new leader - try and sync
   [junit4]   2> 1038631 INFO  (qtp1882123562-30912) [n:127.0.0.1:59220_ c:control_collection s:shard1  x:control_collection_shard1_replica_n1] o.a.s.c.SyncStrategy Sync replicas to http://127.0.0.1:59220/control_collection_shard1_replica_n1/
   [junit4]   2> 1038631 INFO  (qtp1882123562-30912) [n:127.0.0.1:59220_ c:control_collection s:shard1  x:control_collection_shard1_replica_n1] o.a.s.c.SyncStrategy Sync Success - now sync replicas to me
   [junit4]   2> 1038631 INFO  (qtp1882123562-30912) [n:127.0.0.1:59220_ c:control_collection s:shard1  x:control_collection_shard1_replica_n1] o.a.s.c.SyncStrategy http://127.0.0.1:59220/control_collection_shard1_replica_n1/ has no replicas
   [junit4]   2> 1038631 INFO  (qtp1882123562-30912) [n:127.0.0.1:59220_ c:control_collection s:shard1  x:control_collection_shard1_replica_n1] o.a.s.c.ShardLeaderElectionContext Found all replicas participating in election, clear LIR
   [junit4]   2> 1038634 INFO  (qtp1882123562-30912) [n:127.0.0.1:59220_ c:control_collection s:shard1  x:control_collection_shard1_replica_n1] o.a.s.c.ShardLeaderElectionContext I am the new leader: http://127.0.0.1:59220/control_collection_shard1_replica_n1/ shard1
   [junit4]   2> 1038736 INFO  (zkCallback-233-thread-1-processing-n:127.0.0.1:59220_) [n:127.0.0.1:59220_    ] o.a.s.c.c.ZkStateReader A cluster state change: [WatchedEvent state:SyncConnected type:NodeDataChanged path:/collections/control_collection/state.json] for collection [control_collection] has occurred - updating... (live nodes size: [1])
   [junit4]   2> 1038821 INFO  (qtp1882123562-30912) [n:127.0.0.1:59220_ c:control_collection s:shard1  x:control_collection_shard1_replica_n1] o.a.s.c.ZkController I am the leader, no recovery necessary
   [junit4]   2> 1038839 INFO  (qtp1882123562-30912) [n:127.0.0.1:59220_ c:control_collection s:shard1  x:control_collection_shard1_replica_n1] o.a.s.s.HttpSolrCall [admin] webapp=null path=/admin/cores params={qt=/admin/cores&collection.configName=conf1&newCollection=true&name=control_collection_shard1_replica_n1&action=CREATE&numShards=1&collection=control_collection&shard=shard1&wt=javabin&version=2&replicaType=NRT} status=0 QTime=1384
   [junit4]   2> 1038847 INFO  (qtp1882123562-30914) [n:127.0.0.1:59220_    ] o.a.s.h.a.CollectionsHandler Wait for new collection to be active for at most 30 seconds. Check all shard replicas
   [junit4]   2> 1038947 INFO  (zkCallback-233-thread-1-processing-n:127.0.0.1:59220_) [n:127.0.0.1:59220_    ] o.a.s.c.c.ZkStateReader A cluster state change: [WatchedEvent state:SyncConnected type:NodeDataChanged path:/collections/control_collection/state.json] for collection [control_collection] has occurred - updating... (live nodes size: [1])
   [junit4]   2> 1039344 INFO  (OverseerCollectionConfigSetProcessor-98521660908830724-127.0.0.1:59220_-n_0000000000) [n:127.0.0.1:59220_    ] o.a.s.c.OverseerTaskQueue Response ZK path: /overseer/collection-queue-work/qnr-0000000000 doesn't exist.  Requestor may have disconnected from ZooKeeper
   [junit4]   2> 1039847 INFO  (qtp1882123562-30914) [n:127.0.0.1:59220_    ] o.a.s.s.HttpSolrCall [admin] webapp=null path=/admin/collections params={replicationFactor=1&collection.configName=conf1&name=control_collection&nrtReplicas=1&action=CREATE&numShards=1&createNodeSet=127.0.0.1:59220_&wt=javabin&version=2} status=0 QTime=2513
   [junit4]   2> 1039854 INFO  (TEST-ChaosMonkeyNothingIsSafeWithPullReplicasTest.test-seed#[D8359DE4DB9BC7F]) [    ] o.a.s.c.c.ZkStateReader Updated live nodes from ZooKeeper... (0) -> (1)
   [junit4]   2> 1039855 INFO  (TEST-ChaosMonkeyNothingIsSafeWithPullReplicasTest.test-seed#[D8359DE4DB9BC7F]) [    ] o.a.s.c.s.i.ZkClientClusterStateProvider Cluster at 127.0.0.1:33043/solr ready
   [junit4]   2> 1039855 INFO  (TEST-ChaosMonkeyNothingIsSafeWithPullReplicasTest.test-seed#[D8359DE4DB9BC7F]) [    ] o.a.s.c.ChaosMonkey monkey: init - expire sessions:false cause connection loss:false
   [junit4]   2> 1039856 INFO  (qtp1882123562-30911) [n:127.0.0.1:59220_    ] o.a.s.h.a.CollectionsHandler Invoked Collection Action :create with params replicationFactor=1&collection.configName=conf1&name=collection1&nrtReplicas=1&action=CREATE&numShards=2&createNodeSet=&stateFormat=2&wt=javabin&version=2 and sendToOCPQueue=true
   [junit4]   2> 1039857 INFO  (OverseerThreadFactory-667-thread-2-processing-n:127.0.0.1:59220_) [n:127.0.0.1:59220_    ] o.a.s.c.CreateCollectionCmd Create collection collection1
   [junit4]   2> 1039858 WARN  (OverseerThreadFactory-667-thread-2-processing-n:127.0.0.1:59220_) [n:127.0.0.1:59220_    ] o.a.s.c.CreateCollectionCmd It is unusual to create a collection (collection1) without cores.
   [junit4]   2> 1040067 INFO  (qtp1882123562-30911) [n:127.0.0.1:59220_    ] o.a.s.h.a.CollectionsHandler Wait for new collection to be active for at most 30 seconds. Check all shard replicas
   [junit4]   2> 1040068 INFO  (qtp1882123562-30911) [n:127.0.0.1:59220_    ] o.a.s.s.HttpSolrCall [admin] webapp=null path=/admin/collections params={replicationFactor=1&collection.configName=conf1&name=collection1&nrtReplicas=1&action=CREATE&numShards=2&createNodeSet=&stateFormat=2&wt=javabin&version=2} status=0 QTime=211
   [junit4]   2> 1040173 INFO  (TEST-ChaosMonkeyNothingIsSafeWithPullReplicasTest.test-seed#[D8359DE4DB9BC7F]) [    ] o.a.s.c.AbstractFullDistribZkTestBase create jetty 1 in directory /x1/jenkins/jenkins-slave/workspace/Lucene-Solr-NightlyTests-master/checkout/solr/build/solr-core/test/J0/temp/solr.cloud.ChaosMonkeyNothingIsSafeWithPullReplicasTest_D8359DE4DB9BC7F-001/shard-1-001 of type TLOG
   [junit4]   2> 1040173 INFO  (TEST-ChaosMonkeyNothingIsSafeWithPullReplicasTest.test-seed#[D8359DE4DB9BC7F]) [    ] o.e.j.s.Server jetty-9.3.20.v20170531
   [junit4]   2> 1040174 INFO  (TEST-ChaosMonkeyNothingIsSafeWithPullReplicasTest.test-seed#[D8359DE4DB9BC7F]) [    ] o.e.j.s.h.ContextHandler Started o.e.j.s.ServletContextHandler@4b3c15e{/,null,AVAILABLE}
   [junit4]   2> 1040174 INFO  (TEST-ChaosMonkeyNothingIsSafeWithPullReplicasTest.test-seed#[D8359DE4DB9BC7F]) [    ] o.e.j.s.AbstractConnector Started ServerConnector@45661fc3{HTTP/1.1,[http/1.1]}{127.0.0.1:60664}
   [junit4]   2> 1040174 INFO  (TEST-ChaosMonkeyNothingIsSafeWithPullReplicasTest.test-seed#[D8359DE4DB9BC7F]) [    ] o.e.j.s.Server Started @1044679ms
   [junit4]   2> 1040174 INFO  (TEST-ChaosMonkeyNothingIsSafeWithPullReplicasTest.test-seed#[D8359DE4DB9BC7F]) [    ] o.a.s.c.s.e.JettySolrRunner Jetty properties: {solr.data.dir=/x1/jenkins/jenkins-slave/workspace/Lucene-Solr-NightlyTests-master/checkout/solr/build/solr-core/test/J0/temp/solr.cloud.ChaosMonkeyNothingIsSafeWithPullReplicasTest_D8359DE4DB9BC7F-001/tempDir-001/jetty1, replicaType=TLOG, solrconfig=solrconfig.xml, hostContext=/, hostPort=60664, coreRootDirectory=/x1/jenkins/jenkins-slave/workspace/Lucene-Solr-NightlyTests-master/checkout/solr/build/solr-core/test/J0/temp/solr.cloud.ChaosMonkeyNothingIsSafeWithPullReplicasTest_D8359DE4DB9BC7F-001/shard-1-001/cores}
   [junit4]   2> 1040175 ERROR (TEST-ChaosMonkeyNothingIsSafeWithPullReplicasTest.test-seed#[D8359DE4DB9BC7F]) [    ] o.a.s.s.StartupLoggingUtils Missing Java Option solr.log.dir. Logging may be missing or incomplete.
   [junit4]   2> 1040175 INFO  (TEST-ChaosMonkeyNothingIsSafeWithPullReplicasTest.test-seed#[D8359DE4DB9BC7F]) [    ] o.a.s.s.SolrDispatchFilter  ___      _       Welcome to Apache Solr? version 8.0.0
   [junit4]   2> 1040175 INFO  (TEST-ChaosMonkeyNothingIsSafeWithPullReplicasTest.test-seed#[D8359DE4DB9BC7F]) [    ] o.a.s.s.SolrDispatchFilter / __| ___| |_ _   Starting in cloud mode on port null
   [junit4]   2> 1040175 INFO  (TEST-ChaosMonkeyNothingIsSafeWithPullReplicasTest.test-seed#[D8359DE4DB9BC7F]) [    ] o.a.s.s.SolrDispatchFilter \__ \/ _ \ | '_|  Install dir: null, Default config dir: null
   [junit4]   2> 1040175 INFO  (TEST-ChaosMonkeyNothingIsSafeWithPullReplicasTest.test-seed#[D8359DE4DB9BC7F]) [    ] o.a.s.s.SolrDispatchFilter |___/\___/_|_|    Start time: 2017-08-21T13:14:05.452Z
   [junit4]   2> 1040180 INFO  (TEST-ChaosMonkeyNothingIsSafeWithPullReplicasTest.test-seed#[D8359DE4DB9BC7F]) [    ] o.a.s.s.SolrDispatchFilter Loading solr.xml from SolrHome (not found in ZooKeeper)
   [junit4]   2> 1040180 INFO  (TEST-ChaosMonkeyNothingIsSafeWithPullReplicasTest.test-seed#[D8359DE4DB9BC7F]) [    ] o.a.s.c.SolrXmlConfig Loading container configuration from /x1/jenkins/jenkins-slave/workspace/Lucene-Solr-NightlyTests-master/checkout/solr/build/solr-core/test/J0/temp/solr.cloud.ChaosMonkeyNothingIsSafeWithPullReplicasTest_D8359DE4DB9BC7F-001/shard-1-001/solr.xml
   [junit4]   2> 1040185 INFO  (TEST-ChaosMonkeyNothingIsSafeWithPullReplicasTest.test-seed#[D8359DE4DB9BC7F]) [    ] o.a.s.c.SolrXmlConfig MBean server found: com.sun.jmx.mbeanserver.JmxMBeanServer@210a7a72, but no JMX reporters were configured - adding default JMX reporter.
   [junit4]   2> 1040187 INFO  (TEST-ChaosMonkeyNothingIsSafeWithPullReplicasTest.test-seed#[D8359DE4DB9BC7F]) [    ] o.a.s.c.ZkContainer Zookeeper client=127.0.0.1:33043/solr
   [junit4]   2> 1040193 INFO  (TEST-ChaosMonkeyNothingIsSafeWithPullReplicasTest.test-seed#[D8359DE4DB9BC7F]) [n:127.0.0.1:60664_    ] o.a.s.c.c.ZkStateReader Updated live nodes from ZooKeeper... (0) -> (1)
   [junit4]   2> 1040194 INFO  (TEST-ChaosMonkeyNothingIsSafeWithPullReplicasTest.test-seed#[D8359DE4DB9BC7F]) [n:127.0.0.1:60664_    ] o.a.s.c.Overseer Overseer (id=null) closing
   [junit4]   2> 1040196 INFO  (TEST-ChaosMonkeyNothingIsSafeWithPullReplicasTest.test-seed#[D8359DE4DB9BC7F]) [n:127.0.0.1:60664_    ] o.a.s.c.ZkController Register node as live in ZooKeeper:/live_nodes/127.0.0.1:60664_
   [junit4]   2> 1040197 INFO  (zkCallback-240-thread-1) [    ] o.a.s.c.c.ZkStateReader Updated live nodes from ZooKeeper... (1) -> (2)
   [junit4]   2> 1040197 INFO  (zkCallback-233-thread-1-processing-n:127.0.0.1:59220_) [n:127.0.0.1:59220_    ] o.a.s.c.c.ZkStateReader Updated live nodes from ZooKeeper... (1) -> (2)
   [junit4]   2> 1040206 INFO  (zkCallback-245-thread-1-processing-n:127.0.0.1:60664_) [n:127.0.0.1:60664_    ] o.a.s.c.c.ZkStateReader Updated live nodes from ZooKeeper... (1) -> (2)
   [junit4]   2> 1040266 INFO  (TEST-ChaosMonkeyNothingIsSafeWithPullReplicasTest.test-seed#[D8359DE4DB9BC7F]) [n:127.0.0.1:60664_    ] o.a.s.m.r.SolrJmxReporter JMX monitoring for 'solr.node' (registry 'solr.node') enabled at server: com.sun.jmx.mbeanserver.JmxMBeanServer@210a7a72
   [junit4]   2> 1040274 INFO  (TEST-ChaosMonkeyNothingIsSafeWithPullReplicasTest.test-seed#[D8359DE4DB9BC7F]) [n:127.0.0.1:60664_    ] o.a.s.m.r.SolrJmxReporter JMX monitoring for 'solr.jvm' (registry 'solr.jvm') enabled at server: com.sun.jmx.mbeanserver.JmxMBeanServer@210a7a72
   [junit4]   2> 1040274 INFO  (TEST-ChaosMonkeyNothingIsSafeWithPullReplicasTest.test-seed#[D8359DE4DB9BC7F]) [n:127.0.0.1:60664_    ] o.a.s.m.r.SolrJmxReporter JMX monitoring for 'solr.jetty' (registry 'solr.jetty') enabled at server: com.sun.jmx.mbeanserver.JmxMBeanServer@210a7a72
   [junit4]   2> 1040276 INFO  (TEST-ChaosMonkeyNothingIsSafeWithPullReplicasTest.test-seed#[D8359DE4DB9BC7F]) [n:127.0.0.1:60664_    ] o.a.s.c.CorePropertiesLocator Found 0 core definitions underneath /x1/jenkins/jenkins-slave/workspace/Lucene-Solr-NightlyTests-master/checkout/solr/build/solr-core/test/J0/temp/solr.cloud.ChaosMonkeyNothingIsSafeWithPullReplicasTest_D8359DE4DB9BC7F-001/shard-1-001/cores
   [junit4]   2> 1040312 INFO  (qtp1093093133-30955) [n:127.0.0.1:60664_    ] o.a.s.h.a.CollectionsHandler Invoked Collection Action :addreplica with params node=127.0.0.1:60664_&action=ADDREPLICA&collection=collection1&shard=shard2&type=TLOG&wt=javabin&version=2 and sendToOCPQueue=true
   [junit4]   2> 1040314 INFO  (OverseerCollectionConfigSetProcessor-98521660908830724-127.0.0.1:59220_-n_0000000000) [n:127.0.0.1:59220_    ] o.a.s.c.OverseerTaskQueue Response ZK path: /overseer/collection-queue-work/qnr-0000000002 doesn't exist.  Requestor may have disconnected from ZooKeeper
   [junit4]   2> 1040315 INFO  (OverseerThreadFactory-667-thread-3-processing-n:127.0.0.1:59220_) [n:127.0.0.1:59220_    ] o.a.s.c.AddReplicaCmd Node Identified 127.0.0.1:60664_ for creating new replica
   [junit4]   2> 1040317 INFO  (qtp1093093133-30953) [n:127.0.0.1:60664_    ] o.a.s.h.a.CoreAdminOperation core create command qt=/admin/cores&collection.configName=conf1&name=collection1_shard2_replica_t41&action=CREATE&collection=collection1&shard=shard2&wt=javabin&version=2&replicaType=TLOG
   [junit4]   2> 1040319 INFO  (qtp1093093133-30953) [n:127.0.0.1:60664_    ] o.a.s.c.TransientSolrCoreCacheDefault Allocating transient cache for 4 transient cores
   [junit4]   2> 1040424 INFO  (zkCallback-245-thread-1-processing-n:127.0.0.1:60664_) [n:127.0.0.1:60664_    ] o.a.s.c.c.ZkStateReader A cluster state change: [WatchedEvent state:SyncConnected type:NodeDataChanged path:/collections/collection1/state.json] for collection [collection1] has occurred - updating... (live nodes size: [2])
   [junit4]   2> 1041337 INFO  (qtp1093093133-30953) [n:127.0.0.1:60664_ c:collection1 s:shard2  x:collection1_shard2_replica_t41] o.a.s.c.SolrConfig Using Lucene MatchVersion: 8.0.0
   [junit4]   2> 1041347 INFO  (qtp1093093133-30953) [n:127.0.0.1:60664_ c:collection1 s:shard2  x:collection1_shard2_replica_t41] o.a.s.s.IndexSchema [collection1_shard2_replica_t41] Schema name=test
   [junit4]   2> 1041501 INFO  (qtp1093093133-30953) [n:127.0.0.1:60664_ c:collection1 s:shard2  x:collection1_shard2_replica_t41] o.a.s.s.IndexSchema Loaded schema test/1.6 with uniqueid field id
   [junit4]   2> 1041513 INFO  (qtp1093093133-30953) [n:127.0.0.1:60664_ c:collection1 s:shard2  x:collection1_shard2_replica_t41] o.a.s.c.CoreContainer Creating SolrCore 'collection1_shard2_replica_t41' using configuration from collection collection1, trusted=true
   [junit4]   2> 1041513 INFO  (qtp1093093133-30953) [n:127.0.0.1:60664_ c:collection1 s:shard2  x:collection1_shard2_replica_t41] o.a.s.m.r.SolrJmxReporter JMX monitoring for 'solr.core.collection1.shard2.replica_t41' (registry 'solr.core.collection1.shard2.replica_t41') enabled at server: com.sun.jmx.mbeanserver.JmxMBeanServer@210a7a72
   [junit4]   2> 1041513 INFO  (qtp1093093133-30953) [n:127.0.0.1:60664_ c:collection1 s:shard2  x:collection1_shard2_replica_t41] o.a.s.c.SolrCore solr.RecoveryStrategy.Builder
   [junit4]   2> 1041513 INFO  (qtp1093093133-30953) [n:127.0.0.1:60664_ c:collection1 s:shard2  x:collection1_shard2_replica_t41] o.a.s.c.SolrCore [[collection1_shard2_replica_t41] ] Opening new SolrCore at [/x1/jenkins/jenkins-slave/workspace/Lucene-Solr-NightlyTests-master/checkout/solr/build/solr-core/test/J0/temp/solr.cloud.ChaosMonkeyNothingIsSafeWithPullReplicasTest_D8359DE4DB9BC7F-001/shard-1-001/cores/collection1_shard2_replica_t41], dataDir=[/x1/jenkins/jenkins-slave/workspace/Lucene-Solr-NightlyTests-master/checkout/solr/build/solr-core/test/J0/temp/solr.cloud.ChaosMonkeyNothingIsSafeWithPullReplicasTest_D8359DE4DB9BC7F-001/shard-1-001/cores/collection1_shard2_replica_t41/data/]
   [junit4]   2> 1041516 INFO  (qtp1093093133-30953) [n:127.0.0.1:60664_ c:collection1 s:shard2  x:collection1_shard2_replica_t41] o.a.s.u.RandomMergePolicy RandomMergePolicy wrapping class org.apache.lucene.index.LogDocMergePolicy: [LogDocMergePolicy: minMergeSize=1000, mergeFactor=10, maxMergeSize=9223372036854775807, maxMergeSizeForForcedMerge=9223372036854775807, calibrateSizeByDeletes=true, maxMergeDocs=2147483647, maxCFSSegmentSizeMB=1.5751953125, noCFSRatio=0.2850912637047934]
   [junit4]   2> 1041530 WARN  (qtp1093093133-30953) [n:127.0.0.1:60664_ c:collection1 s:shard2  x:collection1_shard2_replica_t41] o.a.s.c.RequestHandlers INVALID paramSet a in requestHandler {type = requestHandler,name = /dump,class = DumpRequestHandler,attributes = {initParams=a, name=/dump, class=DumpRequestHandler},args = {defaults={a=A,b=B}}}
   [junit4]   2> 1041647 INFO  (qtp1093093133-30953) [n:127.0.0.1:60664_ c:collection1 s:shard2  x:collection1_shard2_replica_t41] o.a.s.u.UpdateHandler Using UpdateLog implementation: org.apache.solr.update.UpdateLog
   [junit4]   2> 1041647 INFO  (qtp1093093133-30953) [n:127.0.0.1:60664_ c:collection1 s:shard2  x:collection1_shard2_replica_t41] o.a.s.u.UpdateLog Initializing UpdateLog: dataDir= defaultSyncLevel=FLUSH numRecordsToKeep=100 maxNumLogsToKeep=10 numVersionBuckets=65536
   [junit4]   2> 1041648 INFO  (qtp1093093133-30953) [n:127.0.0.1:60664_ c:collection1 s:shard2  x:collection1_shard2_replica_t41] o.a.s.u.CommitTracker Hard AutoCommit: if uncommited for 15000ms; 
   [junit4]   2> 1041648 INFO  (qtp1093093133-30953) [n:127.0.0.1:60664_ c:collection1 s:shard2  x:collection1_shard2_replica_t41] o.a.s.u.CommitTracker Soft AutoCommit: disabled
   [junit4]   2> 1041650 INFO  (qtp1093093133-30953) [n:127.0.0.1:60664_ c:collection1 s:shard2  x:collection1_shard2_replica_t41] o.a.s.u.RandomMergePolicy RandomMergePolicy wrapping class org.apache.lucene.index.TieredMergePolicy: [TieredMergePolicy: maxMergeAtOnce=43, maxMergeAtOnceExplicit=48, maxMergedSegmentMB=89.6240234375, floorSegmentMB=0.908203125, forceMergeDeletesPctAllowed=0.8862775720749139, segmentsPerTier=26.0, maxCFSSegmentSizeMB=8.796093022207999E12, noCFSRatio=0.0
   [junit4]   2> 1041662 INFO  (qtp1093093133-30953) [n:127.0.0.1:60664_ c:collection1 s:shard2  x:collection1_shard2_replica_t41] o.a.s.s.SolrIndexSearcher Opening [Searcher@2313acb4[collection1_shard2_replica_t41] main]
   [junit4]   2> 1041663 INFO  (qtp1093093133-30953) [n:127.0.0.1:60664_ c:collection1 s:shard2  x:collection1_shard2_replica_t41] o.a.s.r.ManagedResourceStorage Configured ZooKeeperStorageIO with znodeBase: /configs/conf1
   [junit4]   2> 1041663 INFO  (qtp1093093133-30953) [n:127.0.0.1:60664_ c:collection1 s:shard2  x:collection1_shard2_replica_t41] o.a.s.r.ManagedResourceStorage Loaded null at path _rest_managed.json using ZooKeeperStorageIO:path=/configs/conf1
   [junit4]   2> 1041664 INFO  (qtp1093093133-30953) [n:127.0.0.1:60664_ c:collection1 s:shard2  x:collection1_shard2_replica_t41] o.a.s.h.ReplicationHandler Commits will be reserved for  10000
   [junit4]   2> 1041665 INFO  (searcherExecutor-681-thread-1-processing-n:127.0.0.1:60664_ x:collection1_shard2_replica_t41 s:shard2 c:collection1) [n:127.0.0.1:60664_ c:collection1 s:shard2  x:collection1_shard2_replica_t41] o.a.s.c.SolrCore [collection1_shard2_replica_t41] Registered new searcher Searcher@2313acb4[collection1_shard2_replica_t41] main{ExitableDirectoryReader(UninvertingDirectoryReader())}
   [junit4]   2> 1041665 INFO  (qtp1093093133-30953) [n:127.0.0.1:60664_ c:collection1 s:shard2  x:collection1_shard2_replica_t41] o.a.s.u.UpdateLog Could not find max version in index or recent updates, using new clock 1576346579833454592
   [junit4]   2> 1041670 INFO  (qtp1093093133-30953) [n:127.0.0.1:60664_ c:collection1 s:shard2  x:collection1_shard2_replica_t41] o.a.s.c.ShardLeaderElectionContext Enough replicas found to continue.
   [junit4]   2> 1041670 INFO  (qtp1093093133-30953) [n:127.0.0.1:60664_ c:collection1 s:shard2  x:collection1_shard2_replica_t41] o.a.s.c.ShardLeaderElectionContext I may be the new leader - try and sync
   [junit4]   2> 1041670 INFO  (qtp1093093133-30953) [n:127.0.0.1:60664_ c:collection1 s:shard2  x:collection1_shard2_replica_t41] o.a.s.c.SyncStrategy Sync replicas to http://127.0.0.1:60664/collection1_shard2_replica_t41/
   [junit4]   2> 1041670 INFO  (qtp1093093133-30953) [n:127.0.0.1:60664_ c:collection1 s:shard2  x:collection1_shard2_replica_t41] o.a.s.c.SyncStrategy Sync Success - now sync replicas to me
   [junit4]   2> 1041670 INFO  (qtp1093093133-30953) [n:127.0.0.1:60664_ c:collection1 s:shard2  x:collection1_shard2_replica_t41] o.a.s.c.SyncStrategy http://127.0.0.1:60664/collection1_shard2_replica_t41/ has no replicas
   [junit4]   2> 1041670 INFO  (qtp1093093133-30953) [n:127.0.0.1:60664_ c:collection1 s:shard2  x:collection1_shard2_replica_t41] o.a.s.c.ShardLeaderElectionContext Found all replicas participating in election, clear LIR
   [junit4]   2> 1041671 INFO  (qtp1093093133-30953) [n:127.0.0.1:60664_ c:collection1 s:shard2  x:collection1_shard2_replica_t41] o.a.s.c.ZkController collection1_shard2_replica_t41 stopping background replication from leader
   [junit4]   2> 1041674 INFO  (qtp1093093133-30953) [n:127.0.0.1:60664_ c:collection1 s:shard2  x:collection1_shard2_replica_t41] o.a.s.c.ShardLeaderElectionContext I am the new leader: http://127.0.0.1:60664/collection1_shard2_replica_t41/ shard2
   [junit4]   2> 1041891 INFO  (zkCallback-245-thread-1-processing-n:127.0.0.1:60664_) [n:127.0.0.1:60664_    ] o.a.s.c.c.ZkStateReader A cluster state change: [WatchedEvent state:SyncConnected type:NodeDataChanged path:/collections/collection1/state.json] for collection [collection1] has occurred - updating... (live nodes size: [2])
   [junit4]   2> 1041937 INFO  (qtp1093093133-30953) [n:127.0.0.1:60664_ c:collection1 s:shard2  x:collection1_shard2_replica_t41] o.a.s.c.ZkController I am the leader, no recovery necessary
   [junit4]   2> 1041939 INFO  (qtp1093093133-30953) [n:127.0.0.1:60664_ c:collection1 s:shard2  x:collection1_shard2_replica_t41] o.a.s.s.HttpSolrCall [admin] webapp=null path=/admin/cores params={qt=/admin/cores&collection.configName=conf1&name=collection1_shard2_replica_t41&action=CREATE&collection=collection1&shard=shard2&wt=javabin&version=2&replicaType=TLOG} status=0 QTime=1622
   [junit4]   2> 1041941 INFO  (qtp1093093133-30955) [n:127.0.0.1:60664_    ] o.a.s.s.HttpSolrCall [admin] webapp=null path=/admin/collections params={node=127.0.0.1:60664_&action=ADDREPLICA&collection=collection1&shard=shard2&type=TLOG&wt=javabin&versio

[...truncated too long message...]

cd859
   [junit4]   2> 1536340 INFO  (coreCloseExecutor-3309-thread-2) [n:127.0.0.1:54597_ c:collMinRf_1x3 s:shard1 r:core_node5 x:collMinRf_1x3_shard1_replica_t2] o.a.s.c.SolrCore [collMinRf_1x3_shard1_replica_t2]  CLOSING SolrCore org.apache.solr.core.SolrCore@4b43e864
   [junit4]   2> 1536349 INFO  (coreCloseExecutor-3309-thread-1) [n:127.0.0.1:54597_ c:collection1 s:shard2 r:core_node46 x:collection1_shard2_replica_t45] o.a.s.m.SolrMetricManager Closing metric reporters for registry=solr.collection.collection1.shard2.leader, tag=628389004
   [junit4]   2> 1536349 INFO  (coreCloseExecutor-3309-thread-2) [n:127.0.0.1:54597_ c:collMinRf_1x3 s:shard1 r:core_node5 x:collMinRf_1x3_shard1_replica_t2] o.a.s.m.SolrMetricManager Closing metric reporters for registry=solr.core.collMinRf_1x3.shard1.replica_t2, tag=1262741604
   [junit4]   2> 1536349 INFO  (coreCloseExecutor-3309-thread-2) [n:127.0.0.1:54597_ c:collMinRf_1x3 s:shard1 r:core_node5 x:collMinRf_1x3_shard1_replica_t2] o.a.s.m.r.SolrJmxReporter Closing reporter [org.apache.solr.metrics.reporters.SolrJmxReporter@4687d1a5: rootName = null, domain = solr.core.collMinRf_1x3.shard1.replica_t2, service url = null, agent id = null] for registry solr.core.collMinRf_1x3.shard1.replica_t2 / com.codahale.metrics.MetricRegistry@6fa0e4f7
   [junit4]   2> 1536360 INFO  (coreCloseExecutor-3309-thread-2) [n:127.0.0.1:54597_ c:collMinRf_1x3 s:shard1 r:core_node5 x:collMinRf_1x3_shard1_replica_t2] o.a.s.m.SolrMetricManager Closing metric reporters for registry=solr.collection.collMinRf_1x3.shard1.leader, tag=1262741604
   [junit4]   2> 1536361 INFO  (TEST-HttpPartitionTest.test-seed#[D8359DE4DB9BC7F]) [    ] o.a.s.c.Overseer Overseer (id=98521691720843279-127.0.0.1:54597_-n_0000000003) closing
   [junit4]   2> 1536362 INFO  (OverseerStateUpdate-98521691720843279-127.0.0.1:54597_-n_0000000003) [n:127.0.0.1:54597_    ] o.a.s.c.Overseer Overseer Loop exiting : 127.0.0.1:54597_
   [junit4]   2> 1537863 WARN  (zkCallback-2995-thread-2-processing-n:127.0.0.1:54597_) [n:127.0.0.1:54597_    ] o.a.s.c.c.ZkStateReader ZooKeeper watch triggered, but Solr cannot talk to ZK: [KeeperErrorCode = Session expired for /live_nodes]
   [junit4]   2> 1537867 INFO  (TEST-HttpPartitionTest.test-seed#[D8359DE4DB9BC7F]) [    ] o.e.j.s.AbstractConnector Stopped ServerConnector@3b8b57ba{HTTP/1.1,[http/1.1]}{127.0.0.1:0}
   [junit4]   2> 1537867 INFO  (TEST-HttpPartitionTest.test-seed#[D8359DE4DB9BC7F]) [    ] o.e.j.s.h.ContextHandler Stopped o.e.j.s.ServletContextHandler@28d27b46{/,null,UNAVAILABLE}
   [junit4]   2> 1537870 ERROR (TEST-HttpPartitionTest.test-seed#[D8359DE4DB9BC7F]) [    ] o.a.z.s.ZooKeeperServer ZKShutdownHandler is not registered, so ZooKeeper server won't take any action on ERROR or SHUTDOWN server state changes
   [junit4]   2> 1537871 INFO  (TEST-HttpPartitionTest.test-seed#[D8359DE4DB9BC7F]) [    ] o.a.s.c.ZkTestServer connecting to 127.0.0.1:44623 44623
   [junit4]   2> 1537976 INFO  (Thread-5941) [    ] o.a.s.c.ZkTestServer connecting to 127.0.0.1:44623 44623
   [junit4]   2> 1537977 WARN  (Thread-5941) [    ] o.a.s.c.ZkTestServer Watch limit violations: 
   [junit4]   2> Maximum concurrent create/delete watches above limit:
   [junit4]   2> 
   [junit4]   2> 	6	/solr/aliases.json
   [junit4]   2> 	4	/solr/security.json
   [junit4]   2> 	4	/solr/configs/conf1
   [junit4]   2> 
   [junit4]   2> Maximum concurrent data watches above limit:
   [junit4]   2> 
   [junit4]   2> 	6	/solr/clusterprops.json
   [junit4]   2> 	6	/solr/clusterstate.json
   [junit4]   2> 	3	/solr/collections/collection1/state.json
   [junit4]   2> 	3	/solr/collections/collMinRf_1x3/state.json
   [junit4]   2> 	2	/solr/collections/c8n_crud_1x2/state.json
   [junit4]   2> 
   [junit4]   2> Maximum concurrent children watches above limit:
   [junit4]   2> 
   [junit4]   2> 	6	/solr/live_nodes
   [junit4]   2> 	6	/solr/collections
   [junit4]   2> 	4	/solr/overseer/queue
   [junit4]   2> 	4	/solr/overseer/collection-queue-work
   [junit4]   2> 
   [junit4]   2> 1537977 WARN  (TEST-HttpPartitionTest.test-seed#[D8359DE4DB9BC7F]) [    ] o.a.s.c.SocketProxy Closing 9 connections to: http://127.0.0.1:59070/, target: http://127.0.0.1:57472/
   [junit4]   2> 1537977 WARN  (TEST-HttpPartitionTest.test-seed#[D8359DE4DB9BC7F]) [    ] o.a.s.c.SocketProxy Closing 7 connections to: http://127.0.0.1:54597/, target: http://127.0.0.1:40228/
   [junit4]   2> 1537979 WARN  (TEST-HttpPartitionTest.test-seed#[D8359DE4DB9BC7F]) [    ] o.a.s.c.SocketProxy Closing 3 connections to: http://127.0.0.1:38141/, target: http://127.0.0.1:39014/
   [junit4]   2> 1537979 WARN  (TEST-HttpPartitionTest.test-seed#[D8359DE4DB9BC7F]) [    ] o.a.s.c.SocketProxy Closing 8 connections to: http://127.0.0.1:51199/, target: http://127.0.0.1:41602/
   [junit4]   2> NOTE: download the large Jenkins line-docs file by running 'ant get-jenkins-line-docs' in the lucene directory.
   [junit4]   2> NOTE: reproduce with: ant test  -Dtestcase=HttpPartitionTest -Dtests.method=test -Dtests.seed=D8359DE4DB9BC7F -Dtests.multiplier=2 -Dtests.nightly=true -Dtests.slow=true -Dtests.linedocsfile=/home/jenkins/jenkins-slave/workspace/Lucene-Solr-NightlyTests-master/test-data/enwiki.random.lines.txt -Dtests.locale=en-NZ -Dtests.timezone=Atlantic/Bermuda -Dtests.asserts=true -Dtests.file.encoding=ISO-8859-1
   [junit4] FAILURE 32.2s J2 | HttpPartitionTest.test <<<
   [junit4]    > Throwable #1: java.lang.AssertionError: Doc with id=1 not found in http://127.0.0.1:54597/collMinRf_1x3 due to: Path not found: /id; rsp={doc=null}
   [junit4]    > 	at __randomizedtesting.SeedInfo.seed([D8359DE4DB9BC7F:85D76604E345D187]:0)
   [junit4]    > 	at org.apache.solr.cloud.HttpPartitionTest.assertDocExists(HttpPartitionTest.java:603)
   [junit4]    > 	at org.apache.solr.cloud.HttpPartitionTest.assertDocsExistInAllReplicas(HttpPartitionTest.java:558)
   [junit4]    > 	at org.apache.solr.cloud.HttpPartitionTest.testMinRf(HttpPartitionTest.java:249)
   [junit4]    > 	at org.apache.solr.cloud.HttpPartitionTest.test(HttpPartitionTest.java:127)
   [junit4]    > 	at org.apache.solr.BaseDistributedSearchTestCase$ShardsRepeatRule$ShardsFixedStatement.callStatement(BaseDistributedSearchTestCase.java:993)
   [junit4]    > 	at org.apache.solr.BaseDistributedSearchTestCase$ShardsRepeatRule$ShardsStatement.evaluate(BaseDistributedSearchTestCase.java:968)
   [junit4]    > 	at java.lang.Thread.run(Thread.java:748)
   [junit4]   2> NOTE: leaving temporary files on disk at: /x1/jenkins/jenkins-slave/workspace/Lucene-Solr-NightlyTests-master/checkout/solr/build/solr-core/test/J2/temp/solr.cloud.HttpPartitionTest_D8359DE4DB9BC7F-001
   [junit4]   2> Aug 21, 2017 1:22:24 PM com.carrotsearch.randomizedtesting.ThreadLeakControl checkThreadLeaks
   [junit4]   2> WARNING: Will linger awaiting termination of 1 leaked thread(s).
   [junit4]   2> NOTE: test params are: codec=Asserting(Lucene70): {multiDefault=PostingsFormat(name=LuceneVarGapFixedInterval), a_t=PostingsFormat(name=LuceneVarGapFixedInterval), id=PostingsFormat(name=Memory), text=Lucene50(blocksize=128)}, docValues:{range_facet_l_dv=DocValuesFormat(name=Asserting), _version_=DocValuesFormat(name=Memory), intDefault=DocValuesFormat(name=Memory), id_i1=DocValuesFormat(name=Memory), range_facet_i_dv=DocValuesFormat(name=Lucene70), intDvoDefault=DocValuesFormat(name=Asserting), range_facet_l=DocValuesFormat(name=Lucene70), timestamp=DocValuesFormat(name=Lucene70)}, maxPointsInLeafNode=1034, maxMBSortInHeap=7.618368394679848, sim=RandomSimilarity(queryNorm=true): {}, locale=en-NZ, timezone=Atlantic/Bermuda
   [junit4]   2> NOTE: Linux 3.13.0-88-generic amd64/Oracle Corporation 1.8.0_144 (64-bit)/cpus=4,threads=1,free=308113384,total=522190848
   [junit4]   2> NOTE: All tests run in this JVM: [TermsComponentTest, DistributedFacetPivotLongTailTest, SolrMetricReporterTest, TestReplicationHandlerBackup, TestNumericTerms32, UniqFieldsUpdateProcessorFactoryTest, HdfsChaosMonkeySafeLeaderTest, TestSSLRandomization, ResponseLogComponentTest, TestManagedSchemaThreadSafety, SSLMigrationTest, URLClassifyProcessorTest, TestCustomDocTransformer, DocValuesNotIndexedTest, AtomicUpdatesTest, EnumFieldTest, PolyFieldTest, StatsComponentTest, CopyFieldTest, ConfigSetsAPITest, TestCollectionAPI, RequiredFieldsTest, OverseerTest, HdfsSyncSliceTest, SimpleFacetsTest, TestTrackingShardHandlerFactory, TestLeaderElectionZkExpiry, HdfsUnloadDistributedZkTest, TestBlobHandler, PingRequestHandlerTest, LeaderFailureAfterFreshStartTest, ClassificationUpdateProcessorTest, MultiTermTest, TestOrdValues, SpellPossibilityIteratorTest, CloudMLTQParserTest, TestReversedWildcardFilterFactory, TestStreamBody, TestSchemaVersionResource, TestQuerySenderListener, TestDFRSimilarityFactory, DateMathParserTest, StatsReloadRaceTest, TermVectorComponentDistributedTest, TestSolrConfigHandlerConcurrent, TestConfigsApi, ReplicationFactorTest, TestStressReorder, NodeMutatorTest, TestSmileRequest, TestLockTree, TestSQLHandler, CdcrReplicationDistributedZkTest, TestNoOpRegenerator, TestUtils, TestGraphMLResponseWriter, AnalyticsMergeStrategyTest, SearchHandlerTest, ConfigureRecoveryStrategyTest, TestFastWriter, TestCloudManagedSchema, DistributedExpandComponentTest, TestFieldCacheReopen, DirectUpdateHandlerTest, TestMaxTokenLenTokenizer, TestDFISimilarityFactory, TestManagedStopFilterFactory, TestGroupingSearch, IgnoreCommitOptimizeUpdateProcessorFactoryTest, UnloadDistributedZkTest, MoveReplicaHDFSUlogDirTest, CoreMergeIndexesAdminHandlerTest, TestExactSharedStatsCache, ImplicitSnitchTest, TestFieldCacheVsDocValues, TestSchemalessBufferedUpdates, TestLegacyFieldReuse, TolerantUpdateProcessorTest, SuggesterFSTTest, TestTolerantUpdateProcessorRandomCloud, TestInPlaceUpdatesDistrib, TestFieldSortValues, AsyncCallRequestStatusResponseTest, TestCodecSupport, MetricsConfigTest, HttpPartitionTest]
   [junit4] Completed [682/730 (2!)] on J2 in 33.03s, 1 test, 1 failure <<< FAILURES!

[...truncated 43465 lines...]

Mime
View raw message