lucene-dev mailing list archives

Site index · List index
Message view « Date » · « Thread »
Top « Date » · « Thread »
From Policeman Jenkins Server <jenk...@thetaphi.de>
Subject [JENKINS-EA] Lucene-Solr-master-Linux (64bit/jdk-9-ea+181) - Build # 20294 - Unstable!
Date Thu, 10 Aug 2017 21:46:38 GMT
Build: https://jenkins.thetaphi.de/job/Lucene-Solr-master-Linux/20294/
Java: 64bit/jdk-9-ea+181 -XX:-UseCompressedOops -XX:+UseParallelGC --illegal-access=deny

2 tests failed.
FAILED:  org.apache.solr.cloud.TestSolrCloudWithDelegationTokens.testDelegationTokenRenew

Error Message:
expected:<200> but was:<403>

Stack Trace:
java.lang.AssertionError: expected:<200> but was:<403>
	at __randomizedtesting.SeedInfo.seed([8AD1266E4C07868A:BD4AD27074CB5B2E]:0)
	at org.junit.Assert.fail(Assert.java:93)
	at org.junit.Assert.failNotEquals(Assert.java:647)
	at org.junit.Assert.assertEquals(Assert.java:128)
	at org.junit.Assert.assertEquals(Assert.java:472)
	at org.junit.Assert.assertEquals(Assert.java:456)
	at org.apache.solr.cloud.TestSolrCloudWithDelegationTokens.renewDelegationToken(TestSolrCloudWithDelegationTokens.java:130)
	at org.apache.solr.cloud.TestSolrCloudWithDelegationTokens.verifyDelegationTokenRenew(TestSolrCloudWithDelegationTokens.java:316)
	at org.apache.solr.cloud.TestSolrCloudWithDelegationTokens.testDelegationTokenRenew(TestSolrCloudWithDelegationTokens.java:333)
	at java.base/jdk.internal.reflect.NativeMethodAccessorImpl.invoke0(Native Method)
	at java.base/jdk.internal.reflect.NativeMethodAccessorImpl.invoke(NativeMethodAccessorImpl.java:62)
	at java.base/jdk.internal.reflect.DelegatingMethodAccessorImpl.invoke(DelegatingMethodAccessorImpl.java:43)
	at java.base/java.lang.reflect.Method.invoke(Method.java:564)
	at com.carrotsearch.randomizedtesting.RandomizedRunner.invoke(RandomizedRunner.java:1713)
	at com.carrotsearch.randomizedtesting.RandomizedRunner$8.evaluate(RandomizedRunner.java:907)
	at com.carrotsearch.randomizedtesting.RandomizedRunner$9.evaluate(RandomizedRunner.java:943)
	at com.carrotsearch.randomizedtesting.RandomizedRunner$10.evaluate(RandomizedRunner.java:957)
	at com.carrotsearch.randomizedtesting.rules.SystemPropertiesRestoreRule$1.evaluate(SystemPropertiesRestoreRule.java:57)
	at org.apache.lucene.util.TestRuleSetupTeardownChained$1.evaluate(TestRuleSetupTeardownChained.java:49)
	at org.apache.lucene.util.AbstractBeforeAfterRule$1.evaluate(AbstractBeforeAfterRule.java:45)
	at org.apache.lucene.util.TestRuleThreadAndTestName$1.evaluate(TestRuleThreadAndTestName.java:48)
	at org.apache.lucene.util.TestRuleIgnoreAfterMaxFailures$1.evaluate(TestRuleIgnoreAfterMaxFailures.java:64)
	at org.apache.lucene.util.TestRuleMarkFailure$1.evaluate(TestRuleMarkFailure.java:47)
	at com.carrotsearch.randomizedtesting.rules.StatementAdapter.evaluate(StatementAdapter.java:36)
	at com.carrotsearch.randomizedtesting.ThreadLeakControl$StatementRunner.run(ThreadLeakControl.java:368)
	at com.carrotsearch.randomizedtesting.ThreadLeakControl.forkTimeoutingTask(ThreadLeakControl.java:817)
	at com.carrotsearch.randomizedtesting.ThreadLeakControl$3.evaluate(ThreadLeakControl.java:468)
	at com.carrotsearch.randomizedtesting.RandomizedRunner.runSingleTest(RandomizedRunner.java:916)
	at com.carrotsearch.randomizedtesting.RandomizedRunner$5.evaluate(RandomizedRunner.java:802)
	at com.carrotsearch.randomizedtesting.RandomizedRunner$6.evaluate(RandomizedRunner.java:852)
	at com.carrotsearch.randomizedtesting.RandomizedRunner$7.evaluate(RandomizedRunner.java:863)
	at com.carrotsearch.randomizedtesting.rules.StatementAdapter.evaluate(StatementAdapter.java:36)
	at com.carrotsearch.randomizedtesting.rules.SystemPropertiesRestoreRule$1.evaluate(SystemPropertiesRestoreRule.java:57)
	at org.apache.lucene.util.AbstractBeforeAfterRule$1.evaluate(AbstractBeforeAfterRule.java:45)
	at com.carrotsearch.randomizedtesting.rules.StatementAdapter.evaluate(StatementAdapter.java:36)
	at org.apache.lucene.util.TestRuleStoreClassName$1.evaluate(TestRuleStoreClassName.java:41)
	at com.carrotsearch.randomizedtesting.rules.NoShadowingOrOverridesOnMethodsRule$1.evaluate(NoShadowingOrOverridesOnMethodsRule.java:40)
	at com.carrotsearch.randomizedtesting.rules.NoShadowingOrOverridesOnMethodsRule$1.evaluate(NoShadowingOrOverridesOnMethodsRule.java:40)
	at com.carrotsearch.randomizedtesting.rules.StatementAdapter.evaluate(StatementAdapter.java:36)
	at com.carrotsearch.randomizedtesting.rules.StatementAdapter.evaluate(StatementAdapter.java:36)
	at org.apache.lucene.util.TestRuleAssertionsRequired$1.evaluate(TestRuleAssertionsRequired.java:53)
	at org.apache.lucene.util.TestRuleMarkFailure$1.evaluate(TestRuleMarkFailure.java:47)
	at org.apache.lucene.util.TestRuleIgnoreAfterMaxFailures$1.evaluate(TestRuleIgnoreAfterMaxFailures.java:64)
	at org.apache.lucene.util.TestRuleIgnoreTestSuites$1.evaluate(TestRuleIgnoreTestSuites.java:54)
	at com.carrotsearch.randomizedtesting.rules.StatementAdapter.evaluate(StatementAdapter.java:36)
	at com.carrotsearch.randomizedtesting.ThreadLeakControl$StatementRunner.run(ThreadLeakControl.java:368)
	at java.base/java.lang.Thread.run(Thread.java:844)


FAILED:  org.apache.solr.core.TestJmxIntegration.testJmxRegistration

Error Message:
org.apache.lucene.store.AlreadyClosedException: Already closed

Stack Trace:
javax.management.RuntimeMBeanException: org.apache.lucene.store.AlreadyClosedException: Already closed
	at __randomizedtesting.SeedInfo.seed([8AD1266E4C07868A:40042542146DEEF]:0)
	at java.management/com.sun.jmx.interceptor.DefaultMBeanServerInterceptor.rethrow(DefaultMBeanServerInterceptor.java:829)
	at java.management/com.sun.jmx.interceptor.DefaultMBeanServerInterceptor.rethrowMaybeMBeanException(DefaultMBeanServerInterceptor.java:842)
	at java.management/com.sun.jmx.interceptor.DefaultMBeanServerInterceptor.getAttribute(DefaultMBeanServerInterceptor.java:645)
	at java.management/com.sun.jmx.mbeanserver.JmxMBeanServer.getAttribute(JmxMBeanServer.java:678)
	at org.apache.solr.core.TestJmxIntegration.testJmxRegistration(TestJmxIntegration.java:120)
	at java.base/jdk.internal.reflect.NativeMethodAccessorImpl.invoke0(Native Method)
	at java.base/jdk.internal.reflect.NativeMethodAccessorImpl.invoke(NativeMethodAccessorImpl.java:62)
	at java.base/jdk.internal.reflect.DelegatingMethodAccessorImpl.invoke(DelegatingMethodAccessorImpl.java:43)
	at java.base/java.lang.reflect.Method.invoke(Method.java:564)
	at com.carrotsearch.randomizedtesting.RandomizedRunner.invoke(RandomizedRunner.java:1713)
	at com.carrotsearch.randomizedtesting.RandomizedRunner$8.evaluate(RandomizedRunner.java:907)
	at com.carrotsearch.randomizedtesting.RandomizedRunner$9.evaluate(RandomizedRunner.java:943)
	at com.carrotsearch.randomizedtesting.RandomizedRunner$10.evaluate(RandomizedRunner.java:957)
	at com.carrotsearch.randomizedtesting.rules.SystemPropertiesRestoreRule$1.evaluate(SystemPropertiesRestoreRule.java:57)
	at org.apache.lucene.util.TestRuleSetupTeardownChained$1.evaluate(TestRuleSetupTeardownChained.java:49)
	at org.apache.lucene.util.AbstractBeforeAfterRule$1.evaluate(AbstractBeforeAfterRule.java:45)
	at org.apache.lucene.util.TestRuleThreadAndTestName$1.evaluate(TestRuleThreadAndTestName.java:48)
	at org.apache.lucene.util.TestRuleIgnoreAfterMaxFailures$1.evaluate(TestRuleIgnoreAfterMaxFailures.java:64)
	at org.apache.lucene.util.TestRuleMarkFailure$1.evaluate(TestRuleMarkFailure.java:47)
	at com.carrotsearch.randomizedtesting.rules.StatementAdapter.evaluate(StatementAdapter.java:36)
	at com.carrotsearch.randomizedtesting.ThreadLeakControl$StatementRunner.run(ThreadLeakControl.java:368)
	at com.carrotsearch.randomizedtesting.ThreadLeakControl.forkTimeoutingTask(ThreadLeakControl.java:817)
	at com.carrotsearch.randomizedtesting.ThreadLeakControl$3.evaluate(ThreadLeakControl.java:468)
	at com.carrotsearch.randomizedtesting.RandomizedRunner.runSingleTest(RandomizedRunner.java:916)
	at com.carrotsearch.randomizedtesting.RandomizedRunner$5.evaluate(RandomizedRunner.java:802)
	at com.carrotsearch.randomizedtesting.RandomizedRunner$6.evaluate(RandomizedRunner.java:852)
	at com.carrotsearch.randomizedtesting.RandomizedRunner$7.evaluate(RandomizedRunner.java:863)
	at com.carrotsearch.randomizedtesting.rules.StatementAdapter.evaluate(StatementAdapter.java:36)
	at com.carrotsearch.randomizedtesting.rules.SystemPropertiesRestoreRule$1.evaluate(SystemPropertiesRestoreRule.java:57)
	at org.apache.lucene.util.AbstractBeforeAfterRule$1.evaluate(AbstractBeforeAfterRule.java:45)
	at com.carrotsearch.randomizedtesting.rules.StatementAdapter.evaluate(StatementAdapter.java:36)
	at org.apache.lucene.util.TestRuleStoreClassName$1.evaluate(TestRuleStoreClassName.java:41)
	at com.carrotsearch.randomizedtesting.rules.NoShadowingOrOverridesOnMethodsRule$1.evaluate(NoShadowingOrOverridesOnMethodsRule.java:40)
	at com.carrotsearch.randomizedtesting.rules.NoShadowingOrOverridesOnMethodsRule$1.evaluate(NoShadowingOrOverridesOnMethodsRule.java:40)
	at com.carrotsearch.randomizedtesting.rules.StatementAdapter.evaluate(StatementAdapter.java:36)
	at com.carrotsearch.randomizedtesting.rules.StatementAdapter.evaluate(StatementAdapter.java:36)
	at org.apache.lucene.util.TestRuleAssertionsRequired$1.evaluate(TestRuleAssertionsRequired.java:53)
	at org.apache.lucene.util.TestRuleMarkFailure$1.evaluate(TestRuleMarkFailure.java:47)
	at org.apache.lucene.util.TestRuleIgnoreAfterMaxFailures$1.evaluate(TestRuleIgnoreAfterMaxFailures.java:64)
	at org.apache.lucene.util.TestRuleIgnoreTestSuites$1.evaluate(TestRuleIgnoreTestSuites.java:54)
	at com.carrotsearch.randomizedtesting.rules.StatementAdapter.evaluate(StatementAdapter.java:36)
	at com.carrotsearch.randomizedtesting.ThreadLeakControl$StatementRunner.run(ThreadLeakControl.java:368)
	at java.base/java.lang.Thread.run(Thread.java:844)
Caused by: org.apache.lucene.store.AlreadyClosedException: Already closed
	at org.apache.solr.core.CachingDirectoryFactory.get(CachingDirectoryFactory.java:337)
	at org.apache.solr.core.SolrCore.getNewIndexDir(SolrCore.java:349)
	at org.apache.solr.core.SolrCore.getIndexDir(SolrCore.java:328)
	at org.apache.solr.handler.ReplicationHandler.lambda$initializeMetrics$5(ReplicationHandler.java:873)
	at com.codahale.metrics.JmxReporter$JmxGauge.getValue(JmxReporter.java:188)
	at jdk.internal.reflect.GeneratedMethodAccessor93.invoke(Unknown Source)
	at java.base/jdk.internal.reflect.DelegatingMethodAccessorImpl.invoke(DelegatingMethodAccessorImpl.java:43)
	at java.base/java.lang.reflect.Method.invoke(Method.java:564)
	at sun.reflect.misc.Trampoline.invoke(MethodUtil.java:71)
	at jdk.internal.reflect.GeneratedMethodAccessor85.invoke(Unknown Source)
	at java.base/jdk.internal.reflect.DelegatingMethodAccessorImpl.invoke(DelegatingMethodAccessorImpl.java:43)
	at java.base/java.lang.reflect.Method.invoke(Method.java:564)
	at java.base/sun.reflect.misc.MethodUtil.invoke(MethodUtil.java:260)
	at java.management/com.sun.jmx.mbeanserver.StandardMBeanIntrospector.invokeM2(StandardMBeanIntrospector.java:112)
	at java.management/com.sun.jmx.mbeanserver.StandardMBeanIntrospector.invokeM2(StandardMBeanIntrospector.java:46)
	at java.management/com.sun.jmx.mbeanserver.MBeanIntrospector.invokeM(MBeanIntrospector.java:237)
	at java.management/com.sun.jmx.mbeanserver.PerInterface.getAttribute(PerInterface.java:83)
	at java.management/com.sun.jmx.mbeanserver.MBeanSupport.getAttribute(MBeanSupport.java:206)
	at java.management/com.sun.jmx.interceptor.DefaultMBeanServerInterceptor.getAttribute(DefaultMBeanServerInterceptor.java:641)
	... 40 more




Build Log:
[...truncated 11375 lines...]
   [junit4] Suite: org.apache.solr.cloud.TestSolrCloudWithDelegationTokens
   [junit4]   2> 552887 INFO  (SUITE-TestSolrCloudWithDelegationTokens-seed#[8AD1266E4C07868A]-worker) [    ] o.a.s.SolrTestCaseJ4 SecureRandom sanity checks: test.solr.allowed.securerandom=null & java.security.egd=file:/dev/./urandom
   [junit4]   2> Creating dataDir: /home/jenkins/workspace/Lucene-Solr-master-Linux/solr/build/solr-core/test/J0/temp/solr.cloud.TestSolrCloudWithDelegationTokens_8AD1266E4C07868A-001/init-core-data-001
   [junit4]   2> 552887 WARN  (SUITE-TestSolrCloudWithDelegationTokens-seed#[8AD1266E4C07868A]-worker) [    ] o.a.s.SolrTestCaseJ4 startTrackingSearchers: numOpens=128 numCloses=128
   [junit4]   2> 552888 INFO  (SUITE-TestSolrCloudWithDelegationTokens-seed#[8AD1266E4C07868A]-worker) [    ] o.a.s.SolrTestCaseJ4 Using PointFields (NUMERIC_POINTS_SYSPROP=true) w/NUMERIC_DOCVALUES_SYSPROP=true
   [junit4]   2> 552889 INFO  (SUITE-TestSolrCloudWithDelegationTokens-seed#[8AD1266E4C07868A]-worker) [    ] o.a.s.SolrTestCaseJ4 Randomized ssl (true) and clientAuth (false) via: @org.apache.solr.util.RandomizeSSL(reason="", ssl=0.0/0.0, value=0.0/0.0, clientAuth=0.0/0.0)
   [junit4]   2> 552890 INFO  (SUITE-TestSolrCloudWithDelegationTokens-seed#[8AD1266E4C07868A]-worker) [    ] o.a.s.c.MiniSolrCloudCluster Starting cluster of 2 servers in /home/jenkins/workspace/Lucene-Solr-master-Linux/solr/build/solr-core/test/J0/temp/solr.cloud.TestSolrCloudWithDelegationTokens_8AD1266E4C07868A-001/tempDir-001
   [junit4]   2> 552890 INFO  (SUITE-TestSolrCloudWithDelegationTokens-seed#[8AD1266E4C07868A]-worker) [    ] o.a.s.c.ZkTestServer STARTING ZK TEST SERVER
   [junit4]   2> 552895 INFO  (Thread-3228) [    ] o.a.s.c.ZkTestServer client port:0.0.0.0/0.0.0.0:0
   [junit4]   2> 552895 INFO  (Thread-3228) [    ] o.a.s.c.ZkTestServer Starting server
   [junit4]   2> 552933 ERROR (Thread-3228) [    ] o.a.z.s.ZooKeeperServer ZKShutdownHandler is not registered, so ZooKeeper server won't take any action on ERROR or SHUTDOWN server state changes
   [junit4]   2> 552995 INFO  (SUITE-TestSolrCloudWithDelegationTokens-seed#[8AD1266E4C07868A]-worker) [    ] o.a.s.c.ZkTestServer start zk server on port:36827
   [junit4]   2> 553017 WARN  (NIOServerCxn.Factory:0.0.0.0/0.0.0.0:0) [    ] o.a.z.s.NIOServerCnxn caught end of stream exception
   [junit4]   2> EndOfStreamException: Unable to read additional data from client sessionid 0x15dcdf837bc0000, likely client has closed socket
   [junit4]   2> 	at org.apache.zookeeper.server.NIOServerCnxn.doIO(NIOServerCnxn.java:239)
   [junit4]   2> 	at org.apache.zookeeper.server.NIOServerCnxnFactory.run(NIOServerCnxnFactory.java:203)
   [junit4]   2> 	at java.base/java.lang.Thread.run(Thread.java:844)
   [junit4]   2> 553023 INFO  (jetty-launcher-543-thread-1) [    ] o.e.j.s.Server jetty-9.3.14.v20161028
   [junit4]   2> 553026 INFO  (jetty-launcher-543-thread-2) [    ] o.e.j.s.Server jetty-9.3.14.v20161028
   [junit4]   2> 553046 INFO  (jetty-launcher-543-thread-1) [    ] o.e.j.s.h.ContextHandler Started o.e.j.s.ServletContextHandler@6759a986{/solr,null,AVAILABLE}
   [junit4]   2> 553047 INFO  (jetty-launcher-543-thread-1) [    ] o.e.j.s.AbstractConnector Started ServerConnector@4cd91493{SSL,[ssl, http/1.1]}{127.0.0.1:41307}
   [junit4]   2> 553047 INFO  (jetty-launcher-543-thread-1) [    ] o.e.j.s.Server Started @554897ms
   [junit4]   2> 553047 INFO  (jetty-launcher-543-thread-1) [    ] o.a.s.c.s.e.JettySolrRunner Jetty properties: {hostContext=/solr, hostPort=41307}
   [junit4]   2> 553047 ERROR (jetty-launcher-543-thread-1) [    ] o.a.s.s.StartupLoggingUtils Missing Java Option solr.log.dir. Logging may be missing or incomplete.
   [junit4]   2> 553047 INFO  (jetty-launcher-543-thread-1) [    ] o.a.s.s.SolrDispatchFilter  ___      _       Welcome to Apache Solr™ version 8.0.0
   [junit4]   2> 553047 INFO  (jetty-launcher-543-thread-1) [    ] o.a.s.s.SolrDispatchFilter / __| ___| |_ _   Starting in cloud mode on port null
   [junit4]   2> 553047 INFO  (jetty-launcher-543-thread-1) [    ] o.a.s.s.SolrDispatchFilter \__ \/ _ \ | '_|  Install dir: null, Default config dir: null
   [junit4]   2> 553047 INFO  (jetty-launcher-543-thread-1) [    ] o.a.s.s.SolrDispatchFilter |___/\___/_|_|    Start time: 2017-08-10T21:06:22.926367Z
   [junit4]   2> 553108 INFO  (jetty-launcher-543-thread-2) [    ] o.e.j.s.h.ContextHandler Started o.e.j.s.ServletContextHandler@6f43f5cf{/solr,null,AVAILABLE}
   [junit4]   2> 553109 INFO  (jetty-launcher-543-thread-2) [    ] o.e.j.s.AbstractConnector Started ServerConnector@4d18cd31{SSL,[ssl, http/1.1]}{127.0.0.1:34721}
   [junit4]   2> 553109 INFO  (jetty-launcher-543-thread-2) [    ] o.e.j.s.Server Started @554959ms
   [junit4]   2> 553109 INFO  (jetty-launcher-543-thread-2) [    ] o.a.s.c.s.e.JettySolrRunner Jetty properties: {hostContext=/solr, hostPort=34721}
   [junit4]   2> 553109 ERROR (jetty-launcher-543-thread-2) [    ] o.a.s.s.StartupLoggingUtils Missing Java Option solr.log.dir. Logging may be missing or incomplete.
   [junit4]   2> 553109 INFO  (jetty-launcher-543-thread-2) [    ] o.a.s.s.SolrDispatchFilter  ___      _       Welcome to Apache Solr™ version 8.0.0
   [junit4]   2> 553109 INFO  (jetty-launcher-543-thread-2) [    ] o.a.s.s.SolrDispatchFilter / __| ___| |_ _   Starting in cloud mode on port null
   [junit4]   2> 553109 INFO  (jetty-launcher-543-thread-2) [    ] o.a.s.s.SolrDispatchFilter \__ \/ _ \ | '_|  Install dir: null, Default config dir: null
   [junit4]   2> 553109 INFO  (jetty-launcher-543-thread-2) [    ] o.a.s.s.SolrDispatchFilter |___/\___/_|_|    Start time: 2017-08-10T21:06:22.988859Z
   [junit4]   2> 553141 INFO  (jetty-launcher-543-thread-1) [    ] o.a.s.s.SolrDispatchFilter solr.xml found in ZooKeeper. Loading...
   [junit4]   2> 553144 INFO  (jetty-launcher-543-thread-2) [    ] o.a.s.s.SolrDispatchFilter solr.xml found in ZooKeeper. Loading...
   [junit4]   2> 553177 INFO  (jetty-launcher-543-thread-1) [    ] o.a.s.c.ZkContainer Zookeeper client=127.0.0.1:36827/solr
   [junit4]   2> 553207 INFO  (jetty-launcher-543-thread-2) [    ] o.a.s.c.ZkContainer Zookeeper client=127.0.0.1:36827/solr
   [junit4]   2> 553304 INFO  (jetty-launcher-543-thread-2) [    ] o.a.s.c.Overseer Overseer (id=null) closing
   [junit4]   2> 553304 INFO  (jetty-launcher-543-thread-2) [    ] o.a.s.c.OverseerElectionContext I am going to be the leader 127.0.0.1:34721_solr
   [junit4]   2> 553304 INFO  (jetty-launcher-543-thread-2) [    ] o.a.s.c.Overseer Overseer (id=98461232842670086-127.0.0.1:34721_solr-n_0000000000) starting
   [junit4]   2> 553329 INFO  (jetty-launcher-543-thread-2) [    ] o.a.s.c.ZkController Register node as live in ZooKeeper:/live_nodes/127.0.0.1:34721_solr
   [junit4]   2> 553330 INFO  (jetty-launcher-543-thread-1) [    ] o.a.s.c.c.ZkStateReader Updated live nodes from ZooKeeper... (0) -> (1)
   [junit4]   2> 553338 INFO  (zkCallback-555-thread-1) [    ] o.a.s.c.c.ZkStateReader Updated live nodes from ZooKeeper... (0) -> (1)
   [junit4]   2> 553339 INFO  (jetty-launcher-543-thread-1) [    ] o.a.s.c.Overseer Overseer (id=null) closing
   [junit4]   2> 553340 INFO  (jetty-launcher-543-thread-1) [    ] o.a.s.c.ZkController Register node as live in ZooKeeper:/live_nodes/127.0.0.1:41307_solr
   [junit4]   2> 553344 INFO  (zkCallback-554-thread-1) [    ] o.a.s.c.c.ZkStateReader Updated live nodes from ZooKeeper... (1) -> (2)
   [junit4]   2> 553345 INFO  (zkCallback-555-thread-1) [    ] o.a.s.c.c.ZkStateReader Updated live nodes from ZooKeeper... (1) -> (2)
   [junit4]   2> 553355 INFO  (jetty-launcher-543-thread-2) [    ] o.a.s.c.CoreContainer Initializing authentication plugin: org.apache.solr.security.HttpParamDelegationTokenPlugin
   [junit4]   2> 553356 INFO  (jetty-launcher-543-thread-1) [    ] o.a.s.c.CoreContainer Initializing authentication plugin: org.apache.solr.security.HttpParamDelegationTokenPlugin
   [junit4]   2> 553359 WARN  (jetty-launcher-543-thread-2) [    ] o.a.s.c.s.i.Krb5HttpClientBuilder org.apache.solr.client.solrj.impl.Krb5HttpClientBuilder is configured without specifying system property 'java.security.auth.login.config'
   [junit4]   2> 553369 WARN  (jetty-launcher-543-thread-1) [    ] o.a.s.c.s.i.Krb5HttpClientBuilder org.apache.solr.client.solrj.impl.Krb5HttpClientBuilder is configured without specifying system property 'java.security.auth.login.config'
   [junit4]   2> 553371 INFO  (jetty-launcher-543-thread-1) [    ] o.a.s.s.KerberosPlugin Params: {token.valid=30, delegation-token.token-kind=solr-dt, cookie.domain=127.0.0.1, cookie.path=/, zk-dt-secret-manager.znodeWorkingPath=solr/security/zkdtsm, token.validity=36000, signer.secret.provider.zookeeper.path=/token, type=kerberos, zk-dt-secret-manager.enable=true, kerberos.name.rules=DEFAULT, signer.secret.provider=zookeeper}
   [junit4]   2> 553377 INFO  (jetty-launcher-543-thread-2) [    ] o.a.s.s.KerberosPlugin Params: {token.valid=30, delegation-token.token-kind=solr-dt, cookie.domain=127.0.0.1, cookie.path=/, zk-dt-secret-manager.znodeWorkingPath=solr/security/zkdtsm, token.validity=36000, signer.secret.provider.zookeeper.path=/token, type=kerberos, zk-dt-secret-manager.enable=true, kerberos.name.rules=DEFAULT, signer.secret.provider=zookeeper}
   [junit4]   2> 553444 INFO  (jetty-launcher-543-thread-2) [    ] o.a.c.f.i.CuratorFrameworkImpl Starting
   [junit4]   2> 553449 INFO  (jetty-launcher-543-thread-1) [    ] o.a.c.f.i.CuratorFrameworkImpl Starting
   [junit4]   2> 553501 INFO  (jetty-launcher-543-thread-1-EventThread) [    ] o.a.c.f.s.ConnectionStateManager State change: CONNECTED
   [junit4]   2> 553503 INFO  (jetty-launcher-543-thread-2-EventThread) [    ] o.a.c.f.s.ConnectionStateManager State change: CONNECTED
   [junit4]   2> 553591 WARN  (jetty-launcher-543-thread-1) [    ] o.a.s.c.s.i.Krb5HttpClientBuilder org.apache.solr.client.solrj.impl.Krb5HttpClientBuilder is configured without specifying system property 'java.security.auth.login.config'
   [junit4]   2> 553630 WARN  (jetty-launcher-543-thread-2) [    ] o.a.s.c.s.i.Krb5HttpClientBuilder org.apache.solr.client.solrj.impl.Krb5HttpClientBuilder is configured without specifying system property 'java.security.auth.login.config'
   [junit4]   2> 553657 INFO  (jetty-launcher-543-thread-2) [    ] o.a.s.m.r.SolrJmxReporter JMX monitoring for 'solr_34721.solr.node' (registry 'solr.node') enabled at server: com.sun.jmx.mbeanserver.JmxMBeanServer@34e8f8d5
   [junit4]   2> 553661 INFO  (jetty-launcher-543-thread-2) [    ] o.a.s.m.r.SolrJmxReporter JMX monitoring for 'solr_34721.solr.jvm' (registry 'solr.jvm') enabled at server: com.sun.jmx.mbeanserver.JmxMBeanServer@34e8f8d5
   [junit4]   2> 553661 INFO  (jetty-launcher-543-thread-2) [    ] o.a.s.m.r.SolrJmxReporter JMX monitoring for 'solr_34721.solr.jetty' (registry 'solr.jetty') enabled at server: com.sun.jmx.mbeanserver.JmxMBeanServer@34e8f8d5
   [junit4]   2> 553661 INFO  (jetty-launcher-543-thread-1) [    ] o.a.s.m.r.SolrJmxReporter JMX monitoring for 'solr_41307.solr.node' (registry 'solr.node') enabled at server: com.sun.jmx.mbeanserver.JmxMBeanServer@34e8f8d5
   [junit4]   2> 553662 INFO  (jetty-launcher-543-thread-2) [    ] o.a.s.c.CorePropertiesLocator Found 0 core definitions underneath /home/jenkins/workspace/Lucene-Solr-master-Linux/solr/build/solr-core/test/J0/temp/solr.cloud.TestSolrCloudWithDelegationTokens_8AD1266E4C07868A-001/tempDir-001/node2/.
   [junit4]   2> 553664 INFO  (jetty-launcher-543-thread-1) [    ] o.a.s.m.r.SolrJmxReporter JMX monitoring for 'solr_41307.solr.jvm' (registry 'solr.jvm') enabled at server: com.sun.jmx.mbeanserver.JmxMBeanServer@34e8f8d5
   [junit4]   2> 553664 INFO  (jetty-launcher-543-thread-1) [    ] o.a.s.m.r.SolrJmxReporter JMX monitoring for 'solr_41307.solr.jetty' (registry 'solr.jetty') enabled at server: com.sun.jmx.mbeanserver.JmxMBeanServer@34e8f8d5
   [junit4]   2> 553665 INFO  (jetty-launcher-543-thread-1) [    ] o.a.s.c.CorePropertiesLocator Found 0 core definitions underneath /home/jenkins/workspace/Lucene-Solr-master-Linux/solr/build/solr-core/test/J0/temp/solr.cloud.TestSolrCloudWithDelegationTokens_8AD1266E4C07868A-001/tempDir-001/node1/.
   [junit4]   2> 553799 INFO  (TEST-TestSolrCloudWithDelegationTokens.testDelegationTokenRenewFail-seed#[8AD1266E4C07868A]) [    ] o.a.s.SolrTestCaseJ4 ###Starting testDelegationTokenRenewFail
   [junit4]   2> 553866 WARN  (qtp85702771-6295) [    ] o.a.h.s.a.s.AuthenticationFilter Authentication exception: org.apache.hadoop.security.AccessControlException: foo tries to renew a token with renewer bar
   [junit4]   2> 553871 WARN  (qtp85702771-6295) [    ] o.a.s.s.KerberosPlugin Could not find org.apache.solr.security.authentication.requestcontinues
   [junit4]   2> 553874 WARN  (TEST-TestSolrCloudWithDelegationTokens.testDelegationTokenRenewFail-seed#[8AD1266E4C07868A]) [    ] o.a.h.c.p.ResponseProcessCookies Invalid cookie header: "Set-Cookie: hadoop.auth=; Path=/; Domain=127.0.0.1; Expires=do, 01-jan.-1970 00:00:00 GMT; Secure; HttpOnly". Invalid 'expires' attribute: do, 01-jan.-1970 00:00:00 GMT
   [junit4]   2> 553900 WARN  (qtp678257949-6278) [    ] o.a.h.s.a.s.AuthenticationFilter Authentication exception: org.apache.hadoop.security.AccessControlException: foo tries to renew a token with renewer bar
   [junit4]   2> 553901 WARN  (qtp678257949-6278) [    ] o.a.s.s.KerberosPlugin Could not find org.apache.solr.security.authentication.requestcontinues
   [junit4]   2> 553901 WARN  (TEST-TestSolrCloudWithDelegationTokens.testDelegationTokenRenewFail-seed#[8AD1266E4C07868A]) [    ] o.a.h.c.p.ResponseProcessCookies Invalid cookie header: "Set-Cookie: hadoop.auth=; Path=/; Domain=127.0.0.1; Expires=do, 01-jan.-1970 00:00:00 GMT; Secure; HttpOnly". Invalid 'expires' attribute: do, 01-jan.-1970 00:00:00 GMT
   [junit4]   2> 553910 WARN  (qtp85702771-6294) [    ] o.a.h.s.a.s.AuthenticationFilter Authentication exception: org.apache.hadoop.security.AccessControlException: notRenewUser tries to renew a token with renewer renewUser
   [junit4]   2> 553910 WARN  (qtp85702771-6294) [    ] o.a.s.s.KerberosPlugin Could not find org.apache.solr.security.authentication.requestcontinues
   [junit4]   2> 553913 WARN  (TEST-TestSolrCloudWithDelegationTokens.testDelegationTokenRenewFail-seed#[8AD1266E4C07868A]) [    ] o.a.h.c.p.ResponseProcessCookies Invalid cookie header: "Set-Cookie: hadoop.auth=; Path=/; Domain=127.0.0.1; Expires=do, 01-jan.-1970 00:00:00 GMT; Secure; HttpOnly". Invalid 'expires' attribute: do, 01-jan.-1970 00:00:00 GMT
   [junit4]   2> 553914 WARN  (qtp678257949-6284) [    ] o.a.h.s.a.s.AuthenticationFilter Authentication exception: org.apache.hadoop.security.AccessControlException: notRenewUser tries to renew a token with renewer renewUser
   [junit4]   2> 553914 WARN  (qtp678257949-6284) [    ] o.a.s.s.KerberosPlugin Could not find org.apache.solr.security.authentication.requestcontinues
   [junit4]   2> 553915 WARN  (TEST-TestSolrCloudWithDelegationTokens.testDelegationTokenRenewFail-seed#[8AD1266E4C07868A]) [    ] o.a.h.c.p.ResponseProcessCookies Invalid cookie header: "Set-Cookie: hadoop.auth=; Path=/; Domain=127.0.0.1; Expires=do, 01-jan.-1970 00:00:00 GMT; Secure; HttpOnly". Invalid 'expires' attribute: do, 01-jan.-1970 00:00:00 GMT
   [junit4]   2> 553915 INFO  (TEST-TestSolrCloudWithDelegationTokens.testDelegationTokenRenewFail-seed#[8AD1266E4C07868A]) [    ] o.a.s.SolrTestCaseJ4 ###Ending testDelegationTokenRenewFail
   [junit4]   2> 553927 INFO  (TEST-TestSolrCloudWithDelegationTokens.testDelegationTokenCancel-seed#[8AD1266E4C07868A]) [    ] o.a.s.SolrTestCaseJ4 ###Starting testDelegationTokenCancel
   [junit4]   2> 553980 INFO  (TEST-TestSolrCloudWithDelegationTokens.testDelegationTokenCancel-seed#[8AD1266E4C07868A]) [    ] o.a.s.c.c.ZkStateReader Updated live nodes from ZooKeeper... (0) -> (2)
   [junit4]   2> 553981 INFO  (TEST-TestSolrCloudWithDelegationTokens.testDelegationTokenCancel-seed#[8AD1266E4C07868A]) [    ] o.a.s.c.s.i.ZkClientClusterStateProvider Cluster at 127.0.0.1:36827/solr ready
   [junit4]   2> 553987 ERROR (qtp85702771-6294) [    ] o.a.h.s.t.d.ZKDelegationTokenSecretManager No node in path [/ZKDTSMTokensRoot/DT_3]
   [junit4]   2> 553994 WARN  (TEST-TestSolrCloudWithDelegationTokens.testDelegationTokenCancel-seed#[8AD1266E4C07868A]) [    ] o.a.h.c.p.ResponseProcessCookies Invalid cookie header: "Set-Cookie: hadoop.auth=; Path=/; Domain=127.0.0.1; Expires=do, 01-jan.-1970 00:00:00 GMT; Secure; HttpOnly". Invalid 'expires' attribute: do, 01-jan.-1970 00:00:00 GMT
   [junit4]   2> 553999 INFO  (TEST-TestSolrCloudWithDelegationTokens.testDelegationTokenCancel-seed#[8AD1266E4C07868A]) [    ] o.a.s.c.c.ZkStateReader Updated live nodes from ZooKeeper... (0) -> (2)
   [junit4]   2> 553999 INFO  (TEST-TestSolrCloudWithDelegationTokens.testDelegationTokenCancel-seed#[8AD1266E4C07868A]) [    ] o.a.s.c.s.i.ZkClientClusterStateProvider Cluster at 127.0.0.1:36827/solr ready
   [junit4]   2> 554003 WARN  (TEST-TestSolrCloudWithDelegationTokens.testDelegationTokenCancel-seed#[8AD1266E4C07868A]) [    ] o.a.h.c.p.ResponseProcessCookies Invalid cookie header: "Set-Cookie: hadoop.auth=; Path=/; Domain=127.0.0.1; Expires=do, 01-jan.-1970 00:00:00 GMT; Secure; HttpOnly". Invalid 'expires' attribute: do, 01-jan.-1970 00:00:00 GMT
   [junit4]   2> 554033 ERROR (qtp678257949-6285) [    ] o.a.h.s.t.d.ZKDelegationTokenSecretManager No node in path [/ZKDTSMTokensRoot/DT_4]
   [junit4]   2> 554058 WARN  (TEST-TestSolrCloudWithDelegationTokens.testDelegationTokenCancel-seed#[8AD1266E4C07868A]) [    ] o.a.h.c.p.ResponseProcessCookies Invalid cookie header: "Set-Cookie: hadoop.auth=; Path=/; Domain=127.0.0.1; Expires=do, 01-jan.-1970 00:00:00 GMT; Secure; HttpOnly". Invalid 'expires' attribute: do, 01-jan.-1970 00:00:00 GMT
   [junit4]   2> 554063 WARN  (TEST-TestSolrCloudWithDelegationTokens.testDelegationTokenCancel-seed#[8AD1266E4C07868A]) [    ] o.a.h.c.p.ResponseProcessCookies Invalid cookie header: "Set-Cookie: hadoop.auth=; Path=/; Domain=127.0.0.1; Expires=do, 01-jan.-1970 00:00:00 GMT; Secure; HttpOnly". Invalid 'expires' attribute: do, 01-jan.-1970 00:00:00 GMT
   [junit4]   2> 554064 INFO  (TEST-TestSolrCloudWithDelegationTokens.testDelegationTokenCancel-seed#[8AD1266E4C07868A]) [    ] o.a.s.SolrTestCaseJ4 ###Ending testDelegationTokenCancel
   [junit4]   2> 554078 INFO  (TEST-TestSolrCloudWithDelegationTokens.testZNodePaths-seed#[8AD1266E4C07868A]) [    ] o.a.s.SolrTestCaseJ4 ###Starting testZNodePaths
   [junit4]   2> 554125 INFO  (TEST-TestSolrCloudWithDelegationTokens.testZNodePaths-seed#[8AD1266E4C07868A]) [    ] o.a.s.SolrTestCaseJ4 ###Ending testZNodePaths
   [junit4]   2> 554134 INFO  (TEST-TestSolrCloudWithDelegationTokens.testDelegationTokenSolrClient-seed#[8AD1266E4C07868A]) [    ] o.a.s.SolrTestCaseJ4 ###Starting testDelegationTokenSolrClient
   [junit4]   2> 554140 WARN  (TEST-TestSolrCloudWithDelegationTokens.testDelegationTokenSolrClient-seed#[8AD1266E4C07868A]) [    ] o.a.h.c.p.ResponseProcessCookies Invalid cookie header: "Set-Cookie: hadoop.auth=; Path=/; Domain=127.0.0.1; Expires=do, 01-jan.-1970 00:00:00 GMT; Secure; HttpOnly". Invalid 'expires' attribute: do, 01-jan.-1970 00:00:00 GMT
   [junit4]   2> 554152 INFO  (qtp85702771-6294) [    ] o.a.s.h.a.CollectionsHandler Invoked Collection Action :list with params action=LIST&delegation=GgADYmFyA2JhcgCKAV3N-DyNigFd8gTAjQYEFOPhPcOxFPZ_51tsJVb9L2KJTJc7B3NvbHItZHQA&wt=javabin&version=2 and sendToOCPQueue=true
   [junit4]   2> 554152 INFO  (qtp85702771-6294) [    ] o.a.s.s.HttpSolrCall [admin] webapp=null path=/admin/collections params={action=LIST&delegation=GgADYmFyA2JhcgCKAV3N-DyNigFd8gTAjQYEFOPhPcOxFPZ_51tsJVb9L2KJTJc7B3NvbHItZHQA&wt=javabin&version=2} status=0 QTime=0
   [junit4]   2> 554153 INFO  (TEST-TestSolrCloudWithDelegationTokens.testDelegationTokenSolrClient-seed#[8AD1266E4C07868A]) [    ] o.a.s.SolrTestCaseJ4 ###Ending testDelegationTokenSolrClient
   [junit4] IGNOR/A 0.00s J0 | TestSolrCloudWithDelegationTokens.testDelegationTokenCancelFail
   [junit4]    > Assumption #1: 'awaitsfix' test group is disabled (@AwaitsFix(bugUrl="https://issues.apache.org/jira/browse/HADOOP-14044"))
   [junit4]   2> 554186 INFO  (TEST-TestSolrCloudWithDelegationTokens.testDelegationOtherOp-seed#[8AD1266E4C07868A]) [    ] o.a.s.SolrTestCaseJ4 ###Starting testDelegationOtherOp
   [junit4]   2> 554193 INFO  (qtp85702771-6291) [    ] o.a.s.h.a.CollectionsHandler Invoked Collection Action :list with params op=someSolrOperation&action=LIST&wt=javabin&version=2 and sendToOCPQueue=true
   [junit4]   2> 554194 INFO  (qtp85702771-6291) [    ] o.a.s.s.HttpSolrCall [admin] webapp=null path=/admin/collections params={op=someSolrOperation&action=LIST&wt=javabin&version=2} status=0 QTime=0
   [junit4]   2> 554194 WARN  (TEST-TestSolrCloudWithDelegationTokens.testDelegationOtherOp-seed#[8AD1266E4C07868A]) [    ] o.a.h.c.p.ResponseProcessCookies Invalid cookie header: "Set-Cookie: hadoop.auth="u=bar&p=bar&t=test&e=1502435184071&s=dkbodmnPN9Qn4Ne5is7y0L8R5eg="; Path=/; Domain=127.0.0.1; Expires=vr, 11-aug.-2017 07:06:24 GMT; Secure; HttpOnly". Invalid 'expires' attribute: vr, 11-aug.-2017 07:06:24 GMT
   [junit4]   2> 554194 INFO  (TEST-TestSolrCloudWithDelegationTokens.testDelegationOtherOp-seed#[8AD1266E4C07868A]) [    ] o.a.s.SolrTestCaseJ4 ###Ending testDelegationOtherOp
   [junit4]   2> 554203 INFO  (TEST-TestSolrCloudWithDelegationTokens.testDelegationTokenVerify-seed#[8AD1266E4C07868A]) [    ] o.a.s.SolrTestCaseJ4 ###Starting testDelegationTokenVerify
   [junit4]   2> 554250 INFO  (TEST-TestSolrCloudWithDelegationTokens.testDelegationTokenVerify-seed#[8AD1266E4C07868A]) [    ] o.a.s.c.c.ZkStateReader Updated live nodes from ZooKeeper... (0) -> (2)
   [junit4]   2> 554250 INFO  (TEST-TestSolrCloudWithDelegationTokens.testDelegationTokenVerify-seed#[8AD1266E4C07868A]) [    ] o.a.s.c.s.i.ZkClientClusterStateProvider Cluster at 127.0.0.1:36827/solr ready
   [junit4]   2> 554254 INFO  (qtp85702771-6290) [    ] o.a.s.h.a.CollectionsHandler Invoked Collection Action :list with params action=LIST&delegation=GgADYmFyA2JhcgCKAV3N-DzTigFd8gTA0wcEFP4AIqD-n_hxTbnV_SFASkZae1bEB3NvbHItZHQA&wt=javabin&version=2 and sendToOCPQueue=true
   [junit4]   2> 554254 INFO  (qtp85702771-6290) [    ] o.a.s.s.HttpSolrCall [admin] webapp=null path=/admin/collections params={action=LIST&delegation=GgADYmFyA2JhcgCKAV3N-DzTigFd8gTA0wcEFP4AIqD-n_hxTbnV_SFASkZae1bEB3NvbHItZHQA&wt=javabin&version=2} status=0 QTime=0
   [junit4]   2> 554270 WARN  (TEST-TestSolrCloudWithDelegationTokens.testDelegationTokenVerify-seed#[8AD1266E4C07868A]) [    ] o.a.h.c.p.ResponseProcessCookies Invalid cookie header: "Set-Cookie: hadoop.auth=; Path=/; Domain=127.0.0.1; Expires=do, 01-jan.-1970 00:00:00 GMT; Secure; HttpOnly". Invalid 'expires' attribute: do, 01-jan.-1970 00:00:00 GMT
   [junit4]   2> 554291 INFO  (TEST-TestSolrCloudWithDelegationTokens.testDelegationTokenVerify-seed#[8AD1266E4C07868A]) [    ] o.a.s.c.c.ZkStateReader Updated live nodes from ZooKeeper... (0) -> (2)
   [junit4]   2> 554291 INFO  (TEST-TestSolrCloudWithDelegationTokens.testDelegationTokenVerify-seed#[8AD1266E4C07868A]) [    ] o.a.s.c.s.i.ZkClientClusterStateProvider Cluster at 127.0.0.1:36827/solr ready
   [junit4]   2> 554297 INFO  (qtp85702771-6291) [    ] o.a.s.h.a.CollectionsHandler Invoked Collection Action :list with params action=LIST&delegation=GgADYmFyA2JhcgCKAV3N-DzTigFd8gTA0wcEFP4AIqD-n_hxTbnV_SFASkZae1bEB3NvbHItZHQA&wt=javabin&version=2 and sendToOCPQueue=true
   [junit4]   2> 554297 INFO  (qtp85702771-6291) [    ] o.a.s.s.HttpSolrCall [admin] webapp=null path=/admin/collections params={action=LIST&delegation=GgADYmFyA2JhcgCKAV3N-DzTigFd8gTA0wcEFP4AIqD-n_hxTbnV_SFASkZae1bEB3NvbHItZHQA&wt=javabin&version=2} status=0 QTime=0
   [junit4]   2> 554301 INFO  (TEST-TestSolrCloudWithDelegationTokens.testDelegationTokenVerify-seed#[8AD1266E4C07868A]) [    ] o.a.s.c.c.ZkStateReader Updated live nodes from ZooKeeper... (0) -> (2)
   [junit4]   2> 554302 INFO  (TEST-TestSolrCloudWithDelegationTokens.testDelegationTokenVerify-seed#[8AD1266E4C07868A]) [    ] o.a.s.c.s.i.ZkClientClusterStateProvider Cluster at 127.0.0.1:36827/solr ready
   [junit4]   2> 554306 WARN  (TEST-TestSolrCloudWithDelegationTokens.testDelegationTokenVerify-seed#[8AD1266E4C07868A]) [    ] o.a.h.c.p.ResponseProcessCookies Invalid cookie header: "Set-Cookie: hadoop.auth=; Path=/; Domain=127.0.0.1; Expires=do, 01-jan.-1970 00:00:00 GMT; Secure; HttpOnly". Invalid 'expires' attribute: do, 01-jan.-1970 00:00:00 GMT
   [junit4]   2> 554306 INFO  (TEST-TestSolrCloudWithDelegationTokens.testDelegationTokenVerify-seed#[8AD1266E4C07868A]) [    ] o.a.s.SolrTestCaseJ4 ###Ending testDelegationTokenVerify
   [junit4]   2> 554319 INFO  (TEST-TestSolrCloudWithDelegationTokens.testDelegationTokenRenew-seed#[8AD1266E4C07868A]) [    ] o.a.s.SolrTestCaseJ4 ###Starting testDelegationTokenRenew
   [junit4]   2> 554326 WARN  (qtp85702771-6290) [    ] o.a.h.s.a.s.AuthenticationFilter Authentication exception: org.apache.hadoop.security.AccessControlException: bar is trying to renew a token with wrong password
   [junit4]   2> 554326 WARN  (qtp85702771-6290) [    ] o.a.s.s.KerberosPlugin Could not find org.apache.solr.security.authentication.requestcontinues
   [junit4]   2> 554326 WARN  (TEST-TestSolrCloudWithDelegationTokens.testDelegationTokenRenew-seed#[8AD1266E4C07868A]) [    ] o.a.h.c.p.ResponseProcessCookies Invalid cookie header: "Set-Cookie: hadoop.auth=; Path=/; Domain=127.0.0.1; Expires=do, 01-jan.-1970 00:00:00 GMT; Secure; HttpOnly". Invalid 'expires' attribute: do, 01-jan.-1970 00:00:00 GMT
   [junit4]   2> 554326 INFO  (TEST-TestSolrCloudWithDelegationTokens.testDelegationTokenRenew-seed#[8AD1266E4C07868A]) [    ] o.a.s.SolrTestCaseJ4 ###Ending testDelegationTokenRenew
   [junit4]   2> NOTE: reproduce with: ant test  -Dtestcase=TestSolrCloudWithDelegationTokens -Dtests.method=testDelegationTokenRenew -Dtests.seed=8AD1266E4C07868A -Dtests.multiplier=3 -Dtests.slow=true -Dtests.locale=nl-CW -Dtests.timezone=Europe/Tallinn -Dtests.asserts=true -Dtests.file.encoding=UTF-8
   [junit4] FAILURE 0.02s J0 | TestSolrCloudWithDelegationTokens.testDelegationTokenRenew <<<
   [junit4]    > Throwable #1: java.lang.AssertionError: expected:<200> but was:<403>
   [junit4]    > 	at __randomizedtesting.SeedInfo.seed([8AD1266E4C07868A:BD4AD27074CB5B2E]:0)
   [junit4]    > 	at org.apache.solr.cloud.TestSolrCloudWithDelegationTokens.renewDelegationToken(TestSolrCloudWithDelegationTokens.java:130)
   [junit4]    > 	at org.apache.solr.cloud.TestSolrCloudWithDelegationTokens.verifyDelegationTokenRenew(TestSolrCloudWithDelegationTokens.java:316)
   [junit4]    > 	at org.apache.solr.cloud.TestSolrCloudWithDelegationTokens.testDelegationTokenRenew(TestSolrCloudWithDelegationTokens.java:333)
   [junit4]    > 	at java.base/jdk.internal.reflect.NativeMethodAccessorImpl.invoke0(Native Method)
   [junit4]    > 	at java.base/jdk.internal.reflect.NativeMethodAccessorImpl.invoke(NativeMethodAccessorImpl.java:62)
   [junit4]    > 	at java.base/jdk.internal.reflect.DelegatingMethodAccessorImpl.invoke(DelegatingMethodAccessorImpl.java:43)
   [junit4]    > 	at java.base/java.lang.reflect.Method.invoke(Method.java:564)
   [junit4]    > 	at java.base/java.lang.Thread.run(Thread.java:844)
   [junit4]   2> 554329 INFO  (jetty-closer-544-thread-1) [    ] o.e.j.s.AbstractConnector Stopped ServerConnector@4d18cd31{SSL,[ssl, http/1.1]}{127.0.0.1:0}
   [junit4]   2> 554329 INFO  (jetty-closer-544-thread-2) [    ] o.e.j.s.AbstractConnector Stopped ServerConnector@4cd91493{SSL,[ssl, http/1.1]}{127.0.0.1:0}
   [junit4]   2> 554329 INFO  (jetty-closer-544-thread-2) [    ] o.a.s.c.CoreContainer Shutting down CoreContainer instance=1860169729
   [junit4]   2> 554330 INFO  (jetty-closer-544-thread-2) [    ] o.a.s.m.SolrMetricManager Closing metric reporters for registry=solr.node, tag=null
   [junit4]   2> 554331 INFO  (jetty-closer-544-thread-2) [    ] o.a.s.m.SolrMetricManager Closing metric reporters for registry=solr.jvm, tag=null
   [junit4]   2> 554331 INFO  (jetty-closer-544-thread-1) [    ] o.a.s.c.CoreContainer Shutting down CoreContainer instance=46830898
   [junit4]   2> 554331 INFO  (jetty-closer-544-thread-1) [    ] o.a.s.m.SolrMetricManager Closing metric reporters for registry=solr.node, tag=null
   [junit4]   2> 554333 INFO  (jetty-closer-544-thread-1) [    ] o.a.s.m.SolrMetricManager Closing metric reporters for registry=solr.jvm, tag=null
   [junit4]   2> 554334 INFO  (jetty-closer-544-thread-2) [    ] o.a.s.m.SolrMetricManager Closing metric reporters for registry=solr.jetty, tag=null
   [junit4]   2> 554334 INFO  (jetty-closer-544-thread-1) [    ] o.a.s.m.SolrMetricManager Closing metric reporters for registry=solr.jetty, tag=null
   [junit4]   2> 554336 INFO  (jetty-closer-544-thread-1) [    ] o.a.s.m.SolrMetricManager Closing metric reporters for registry=solr.cluster, tag=null
   [junit4]   2> 554336 INFO  (jetty-closer-544-thread-2) [    ] o.a.s.m.SolrMetricManager Closing metric reporters for registry=solr.cluster, tag=null
   [junit4]   2> 554336 INFO  (jetty-closer-544-thread-2) [    ] o.a.s.c.TransientSolrCoreCacheDefault Allocating transient cache for 2147483647 transient cores
   [junit4]   2> 554336 INFO  (jetty-closer-544-thread-1) [    ] o.a.s.c.TransientSolrCoreCacheDefault Allocating transient cache for 2147483647 transient cores
   [junit4]   2> 554336 INFO  (jetty-closer-544-thread-1) [    ] o.a.s.c.Overseer Overseer (id=98461232842670086-127.0.0.1:34721_solr-n_0000000000) closing
   [junit4]   2> 554336 INFO  (OverseerStateUpdate-98461232842670086-127.0.0.1:34721_solr-n_0000000000) [    ] o.a.s.c.Overseer Overseer Loop exiting : 127.0.0.1:34721_solr
   [junit4]   2> 554337 INFO  (zkCallback-555-thread-1) [    ] o.a.s.c.c.ZkStateReader Updated live nodes from ZooKeeper... (2) -> (1)
   [junit4]   2> 554341 ERROR (Thread[Thread-3245,5,TGRP-TestSolrCloudWithDelegationTokens]) [    ] o.a.h.s.t.d.AbstractDelegationTokenSecretManager ExpiredTokenRemover received java.lang.InterruptedException: sleep interrupted
   [junit4]   2> 554349 INFO  (jetty-closer-544-thread-2) [    ] o.e.j.s.h.ContextHandler Stopped o.e.j.s.ServletContextHandler@6759a986{/solr,null,UNAVAILABLE}
   [junit4]   2> 555842 WARN  (zkCallback-555-thread-1) [    ] o.a.s.c.c.ZkStateReader ZooKeeper watch triggered, but Solr cannot talk to ZK: [KeeperErrorCode = Session expired for /live_nodes]
   [junit4]   2> 555845 ERROR (Thread[Thread-3247,5,TGRP-TestSolrCloudWithDelegationTokens]) [    ] o.a.h.s.t.d.AbstractDelegationTokenSecretManager ExpiredTokenRemover received java.lang.InterruptedException: sleep interrupted
   [junit4]   2> 555846 INFO  (jetty-closer-544-thread-1) [    ] o.e.j.s.h.ContextHandler Stopped o.e.j.s.ServletContextHandler@6f43f5cf{/solr,null,UNAVAILABLE}
   [junit4]   2> 555849 ERROR (SUITE-TestSolrCloudWithDelegationTokens-seed#[8AD1266E4C07868A]-worker) [    ] o.a.z.s.ZooKeeperServer ZKShutdownHandler is not registered, so ZooKeeper server won't take any action on ERROR or SHUTDOWN server state changes
   [junit4]   2> 555849 INFO  (SUITE-TestSolrCloudWithDelegationTokens-seed#[8AD1266E4C07868A]-worker) [    ] o.a.s.c.ZkTestServer connecting to 127.0.0.1:36827 36827
   [junit4]   2> 557085 INFO  (Thread-3228) [    ] o.a.s.c.ZkTestServer connecting to 127.0.0.1:36827 36827
   [junit4]   2> 557086 WARN  (Thread-3228) [    ] o.a.s.c.ZkTestServer Watch limit violations: 
   [junit4]   2> Maximum concurrent create/delete watches above limit:
   [junit4]   2> 
   [junit4]   2> 	7	/solr/aliases.json
   [junit4]   2> 	2	/solr/security.json
   [junit4]   2> 
   [junit4]   2> Maximum concurrent data watches above limit:
   [junit4]   2> 
   [junit4]   2> 	7	/solr/clusterprops.json
   [junit4]   2> 	7	/solr/clusterstate.json
   [junit4]   2> 	2	/solr/security/zkdtsm/ZKDTSMRoot/ZKDTSMTokensRoot/DT_7
   [junit4]   2> 	2	/solr/security/zkdtsm/ZKDTSMRoot/ZKDTSMTokensRoot/DT_6
   [junit4]   2> 	2	/solr/security/zkdtsm/ZKDTSMRoot/ZKDTSMTokensRoot/DT_8
   [junit4]   2> 	2	/solr/security/zkdtsm/ZKDTSMRoot/ZKDTSMKeyIdRoot
   [junit4]   2> 	2	/solr/security/zkdtsm/ZKDTSMRoot/ZKDTSMMasterKeyRoot/DK_1
   [junit4]   2> 	2	/solr/security/zkdtsm/ZKDTSMRoot/ZKDTSMTokensRoot/DT_1
   [junit4]   2> 	2	/solr/security/zkdtsm/ZKDTSMRoot/ZKDTSMTokensRoot/DT_3
   [junit4]   2> 	2	/solr/security/zkdtsm/ZKDTSMRoot/ZKDTSMMasterKeyRoot/DK_2
   [junit4]   2> 	2	/solr/security/zkdtsm/ZKDTSMRoot/ZKDTSMTokensRoot/DT_2
   [junit4]   2> 	2	/solr/security/zkdtsm/ZKDTSMRoot/ZKDTSMTokensRoot/DT_5
   [junit4]   2> 	2	/solr/security/zkdtsm/ZKDTSMRoot/ZKDTSMMasterKeyRoot/DK_4
   [junit4]   2> 	2	/solr/security/zkdtsm/ZKDTSMRoot/ZKDTSMTokensRoot/DT_4
   [junit4]   2> 	2	/solr/security/zkdtsm/ZKDTSMRoot/ZKDTSMSeqNumRoot
   [junit4]   2> 
   [junit4]   2> Maximum concurrent children watches above limit:
   [junit4]   2> 
   [junit4]   2> 	7	/solr/live_nodes
   [junit4]   2> 	7	/solr/collections
   [junit4]   2> 	2	/solr/security/zkdtsm/ZKDTSMRoot/ZKDTSMMasterKeyRoot
   [junit4]   2> 	2	/solr/security/zkdtsm/ZKDTSMRoot/ZKDTSMTokensRoot
   [junit4]   2> 
   [junit4]   2> NOTE: leaving temporary files on disk at: /home/jenkins/workspace/Lucene-Solr-master-Linux/solr/build/solr-core/test/J0/temp/solr.cloud.TestSolrCloudWithDelegationTokens_8AD1266E4C07868A-001
   [junit4]   2> NOTE: test params are: codec=Asserting(Lucene70): {}, docValues:{}, maxPointsInLeafNode=70, maxMBSortInHeap=5.593626499815866, sim=RandomSimilarity(queryNorm=true): {}, locale=nl-CW, timezone=Europe/Tallinn
   [junit4]   2> NOTE: Linux 4.10.0-27-generic amd64/Oracle Corporation 9 (64-bit)/cpus=8,threads=1,free=33234864,total=506986496
   [junit4]   2> NOTE: All tests run in this JVM: [TestFaceting, UUIDFieldTest, TestConfigOverlay, IndexBasedSpellCheckerTest, ZkStateReaderTest, TestSystemCollAutoCreate, SolrIndexConfigTest, PeerSyncTest, LeaderElectionIntegrationTest, TestClassicSimilarityFactory, TestNumericRangeQuery32, TestLeaderInitiatedRecoveryThread, BasicZkTest, TestCrossCoreJoin, TestSolrQueryParser, TestCloudSearcherWarming, SuggestComponentTest, TestManagedSynonymGraphFilterFactory, ConnectionReuseTest, TestUninvertingReader, HttpSolrCallGetCoreTest, HdfsWriteToMultipleCollectionsTest, DefaultValueUpdateProcessorTest, TestRuleBasedAuthorizationPlugin, HdfsBasicDistributedZkTest, TestDistribIDF, TestCloudPivotFacet, SparseHLLTest, TestCopyFieldCollectionResource, TestHdfsUpdateLog, HdfsDirectoryFactoryTest, UpdateLogTest, TestPerFieldSimilarityWithDefaultOverride, TestHighlightDedupGrouping, TestUseDocValuesAsStored2, TestSubQueryTransformerCrossCore, HdfsCollectionsAPIDistributedZkTest, TestIndexingPerformance, TestRecoveryHdfs, TestRequestForwarding, ExternalFileFieldSortTest, TestFileDictionaryLookup, RankQueryTest, TestTlogReplica, TestHttpShardHandlerFactory, TestMinMaxOnMultiValuedField, TestSolrCloudWithDelegationTokens]
   [junit4] Completed [194/729 (1!)] on J0 in 4.28s, 8 tests, 1 failure, 1 skipped <<< FAILURES!

[...truncated 799 lines...]
   [junit4] Suite: org.apache.solr.core.TestJmxIntegration
   [junit4]   2> 1241848 INFO  (SUITE-TestJmxIntegration-seed#[8AD1266E4C07868A]-worker) [    ] o.a.s.SolrTestCaseJ4 SecureRandom sanity checks: test.solr.allowed.securerandom=null & java.security.egd=file:/dev/./urandom
   [junit4]   2> Creating dataDir: /home/jenkins/workspace/Lucene-Solr-master-Linux/solr/build/solr-core/test/J2/temp/solr.core.TestJmxIntegration_8AD1266E4C07868A-001/init-core-data-001
   [junit4]   2> 1241848 WARN  (SUITE-TestJmxIntegration-seed#[8AD1266E4C07868A]-worker) [    ] o.a.s.SolrTestCaseJ4 startTrackingSearchers: numOpens=3 numCloses=3
   [junit4]   2> 1241848 INFO  (SUITE-TestJmxIntegration-seed#[8AD1266E4C07868A]-worker) [    ] o.a.s.SolrTestCaseJ4 Using PointFields (NUMERIC_POINTS_SYSPROP=true) w/NUMERIC_DOCVALUES_SYSPROP=true
   [junit4]   2> 1241849 INFO  (SUITE-TestJmxIntegration-seed#[8AD1266E4C07868A]-worker) [    ] o.a.s.SolrTestCaseJ4 Randomized ssl (false) and clientAuth (false) via: @org.apache.solr.util.RandomizeSSL(reason="", ssl=0.0/0.0, value=0.0/0.0, clientAuth=0.0/0.0)
   [junit4]   2> 1241849 INFO  (SUITE-TestJmxIntegration-seed#[8AD1266E4C07868A]-worker) [    ] o.a.s.SolrTestCaseJ4 ####initCore
   [junit4]   2> 1241849 INFO  (SUITE-TestJmxIntegration-seed#[8AD1266E4C07868A]-worker) [    ] o.a.s.c.SolrResourceLoader [null] Added 2 libs to classloader, from paths: [/home/jenkins/workspace/Lucene-Solr-master-Linux/solr/core/src/test-files/solr/collection1/lib, /home/jenkins/workspace/Lucene-Solr-master-Linux/solr/core/src/test-files/solr/collection1/lib/classes]
   [junit4]   2> 1241862 INFO  (SUITE-TestJmxIntegration-seed#[8AD1266E4C07868A]-worker) [    ] o.a.s.c.SolrConfig Using Lucene MatchVersion: 8.0.0
   [junit4]   2> 1241873 INFO  (SUITE-TestJmxIntegration-seed#[8AD1266E4C07868A]-worker) [    ] o.a.s.s.IndexSchema [null] Schema name=test
   [junit4]   2> 1241937 INFO  (SUITE-TestJmxIntegration-seed#[8AD1266E4C07868A]-worker) [    ] o.a.s.s.IndexSchema Loaded schema test/1.0 with uniqueid field id
   [junit4]   2> 1241954 INFO  (SUITE-TestJmxIntegration-seed#[8AD1266E4C07868A]-worker) [    ] o.a.s.m.r.SolrJmxReporter JMX monitoring for 'solr.node' (registry 'solr.node') enabled at server: com.sun.jmx.mbeanserver.JmxMBeanServer@7bb142d
   [junit4]   2> 1241956 INFO  (SUITE-TestJmxIntegration-seed#[8AD1266E4C07868A]-worker) [    ] o.a.s.m.r.SolrJmxReporter JMX monitoring for 'solr.jvm' (registry 'solr.jvm') enabled at server: com.sun.jmx.mbeanserver.JmxMBeanServer@7bb142d
   [junit4]   2> 1241956 INFO  (SUITE-TestJmxIntegration-seed#[8AD1266E4C07868A]-worker) [    ] o.a.s.m.r.SolrJmxReporter JMX monitoring for 'solr.jetty' (registry 'solr.jetty') enabled at server: com.sun.jmx.mbeanserver.JmxMBeanServer@7bb142d
   [junit4]   2> 1241957 INFO  (coreLoadExecutor-6375-thread-1) [    ] o.a.s.c.SolrResourceLoader [null] Added 2 libs to classloader, from paths: [/home/jenkins/workspace/Lucene-Solr-master-Linux/solr/core/src/test-files/solr/collection1/lib, /home/jenkins/workspace/Lucene-Solr-master-Linux/solr/core/src/test-files/solr/collection1/lib/classes]
   [junit4]   2> 1241971 INFO  (coreLoadExecutor-6375-thread-1) [    ] o.a.s.c.SolrConfig Using Lucene MatchVersion: 8.0.0
   [junit4]   2> 1241981 INFO  (coreLoadExecutor-6375-thread-1) [    ] o.a.s.s.IndexSchema [collection1] Schema name=test
   [junit4]   2> 1242068 INFO  (coreLoadExecutor-6375-thread-1) [    ] o.a.s.s.IndexSchema Loaded schema test/1.0 with uniqueid field id
   [junit4]   2> 1242074 INFO  (coreLoadExecutor-6375-thread-1) [    ] o.a.s.c.CoreContainer Creating SolrCore 'collection1' using configuration from instancedir /home/jenkins/workspace/Lucene-Solr-master-Linux/solr/core/src/test-files/solr/collection1, trusted=true
   [junit4]   2> 1242074 INFO  (coreLoadExecutor-6375-thread-1) [    ] o.a.s.m.r.SolrJmxReporter JMX monitoring for 'solr.core.collection1' (registry 'solr.core.collection1') enabled at server: com.sun.jmx.mbeanserver.JmxMBeanServer@7bb142d
   [junit4]   2> 1242074 INFO  (coreLoadExecutor-6375-thread-1) [    ] o.a.s.c.SolrCore solr.RecoveryStrategy.Builder
   [junit4]   2> 1242074 INFO  (coreLoadExecutor-6375-thread-1) [    ] o.a.s.c.SolrCore [[collection1] ] Opening new SolrCore at [/home/jenkins/workspace/Lucene-Solr-master-Linux/solr/core/src/test-files/solr/collection1], dataDir=[/home/jenkins/workspace/Lucene-Solr-master-Linux/solr/build/solr-core/test/J2/temp/solr.core.TestJmxIntegration_8AD1266E4C07868A-001/init-core-data-001/]
   [junit4]   2> 1242075 INFO  (coreLoadExecutor-6375-thread-1) [    ] o.a.s.u.RandomMergePolicy RandomMergePolicy wrapping class org.apache.lucene.index.TieredMergePolicy: [TieredMergePolicy: maxMergeAtOnce=47, maxMergeAtOnceExplicit=40, maxMergedSegmentMB=14.5400390625, floorSegmentMB=1.65234375, forceMergeDeletesPctAllowed=23.2345209213156, segmentsPerTier=38.0, maxCFSSegmentSizeMB=8.796093022207999E12, noCFSRatio=1.0
   [junit4]   2> 1242106 INFO  (coreLoadExecutor-6375-thread-1) [    ] o.a.s.u.UpdateHandler Using UpdateLog implementation: org.apache.solr.update.UpdateLog
   [junit4]   2> 1242106 INFO  (coreLoadExecutor-6375-thread-1) [    ] o.a.s.u.UpdateLog Initializing UpdateLog: dataDir= defaultSyncLevel=FLUSH numRecordsToKeep=100 maxNumLogsToKeep=10 numVersionBuckets=65536
   [junit4]   2> 1242106 INFO  (coreLoadExecutor-6375-thread-1) [    ] o.a.s.u.CommitTracker Hard AutoCommit: disabled
   [junit4]   2> 1242106 INFO  (coreLoadExecutor-6375-thread-1) [    ] o.a.s.u.CommitTracker Soft AutoCommit: disabled
   [junit4]   2> 1242107 INFO  (coreLoadExecutor-6375-thread-1) [    ] o.a.s.u.RandomMergePolicy RandomMergePolicy wrapping class org.apache.lucene.index.LogByteSizeMergePolicy: [LogByteSizeMergePolicy: minMergeSize=1677721, mergeFactor=19, maxMergeSize=2147483648, maxMergeSizeForForcedMerge=9223372036854775807, calibrateSizeByDeletes=false, maxMergeDocs=2147483647, maxCFSSegmentSizeMB=8.796093022207999E12, noCFSRatio=0.0]
   [junit4]   2> 1242107 INFO  (coreLoadExecutor-6375-thread-1) [    ] o.a.s.s.SolrIndexSearcher Opening [Searcher@744ec04b[collection1] main]
   [junit4]   2> 1242107 INFO  (coreLoadExecutor-6375-thread-1) [    ] o.a.s.h.c.SpellCheckComponent Initializing spell checkers
   [junit4]   2> 1242118 INFO  (coreLoadExecutor-6375-thread-1) [    ] o.a.s.s.DirectSolrSpellChecker init: {name=direct,classname=DirectSolrSpellChecker,field=lowerfilt,minQueryLength=3}
   [junit4]   2> 1242189 INFO  (coreLoadExecutor-6375-thread-1) [    ] o.a.s.h.ReplicationHandler Commits will be reserved for  10000
   [junit4]   2> 1242189 INFO  (searcherExecutor-6376-thread-1) [    ] o.a.s.h.c.SpellCheckComponent Loading spell index for spellchecker: default
   [junit4]   2> 1242189 INFO  (coreLoadExecutor-6375-thread-1) [    ] o.a.s.u.UpdateLog Could not find max version in index or recent updates, using new clock 1575380447971508224
   [junit4]   2> 1242189 INFO  (searcherExecutor-6376-thread-1) [    ] o.a.s.h.c.SpellCheckComponent Loading spell index for spellchecker: direct
   [junit4]   2> 1242190 INFO  (searcherExecutor-6376-thread-1) [    ] o.a.s.h.c.SpellCheckComponent Loading spell index for spellchecker: wordbreak
   [junit4]   2> 1242190 INFO  (searcherExecutor-6376-thread-1) [    ] o.a.s.h.c.SpellCheckComponent Loading spell index for spellchecker: multipleFields
   [junit4]   2> 1242190 INFO  (searcherExecutor-6376-thread-1) [    ] o.a.s.h.c.SpellCheckComponent Loading spell index for spellchecker: jarowinkler
   [junit4]   2> 1242190 INFO  (searcherExecutor-6376-thread-1) [    ] o.a.s.h.c.SpellCheckComponent Loading spell index for spellchecker: external
   [junit4]   2> 1242190 INFO  (searcherExecutor-6376-thread-1) [    ] o.a.s.h.c.SpellCheckComponent Loading spell index for spellchecker: freq
   [junit4]   2> 1242190 INFO  (searcherExecutor-6376-thread-1) [    ] o.a.s.h.c.SpellCheckComponent Loading spell index for spellchecker: fqcn
   [junit4]   2> 1242190 INFO  (searcherExecutor-6376-thread-1) [    ] o.a.s.h.c.SpellCheckComponent Loading spell index for spellchecker: perDict
   [junit4]   2> 1242191 INFO  (searcherExecutor-6376-thread-1) [    ] o.a.s.c.SolrCore [collection1] Registered new searcher Searcher@744ec04b[collection1] main{ExitableDirectoryReader(UninvertingDirectoryReader())}
   [junit4]   2> 1242191 INFO  (SUITE-TestJmxIntegration-seed#[8AD1266E4C07868A]-worker) [    ] o.a.s.SolrTestCaseJ4 ####initCore end
   [junit4]   2> 1242192 INFO  (TEST-TestJmxIntegration.testJmxUpdate-seed#[8AD1266E4C07868A]) [    ] o.a.s.SolrTestCaseJ4 ###Starting testJmxUpdate
   [junit4]   2> 1242208 INFO  (TEST-TestJmxIntegration.testJmxUpdate-seed#[8AD1266E4C07868A]) [    ] o.a.s.c.TestJmxIntegration Mbeans in server: [solr:dom1=jvm,name0=memory,name1=pools,name2=PS-Survivor-Space,name=max, java.lang:type=Threading, solr:dom1=core,dom2=collection1,category=QUERY,scope=/mock,name=errors, solr:dom1=core,dom2=collection1,category=QUERY,scope=/get,name=errors, solr:dom1=core,dom2=collection1,category=UPDATE,scope=update,name=requestTimes, solr:dom1=node,category=UPDATE,scope=updateShardHandler,name=threadPool.updateExecutor.running, solr:dom1=core,dom2=collection1,category=QUERY,scope=/mock,name=handlerStart, solr:dom1=core,dom2=collection1,dom3=shard2,dom4=replica_n41,category=QUERY,scope=/stream,name=requestTimes, solr:dom1=node,category=QUERY,scope=httpShardHandler,name=threadPool.httpShardExecutor.duration, solr:dom1=core,dom2=collection1,category=UPDATE,scope=/update,name=handlerStart, solr:dom1=node,category=ADMIN,scope=/admin/health,name=errors, solr:dom1=jvm,name0=buffers,name1=mapped,name=TotalCapacity, solr:dom1=core,dom2=collection1,category=UPDATE,scope=/update,name=totalTime, solr:dom1=jvm,name0=memory,name1=pools,name2=CodeHeap-'non-profiled-nmethods',name=usage, solr:dom1=core,dom2=collection1,dom3=shard2,dom4=replica_n41,category=ADMIN,scope=/admin/luke,name=clientErrors, solr:dom1=core,dom2=collection1,dom3=shard2,dom4=replica_n41,category=ADMIN,scope=/admin/logging,name=requests, solr:dom1=core,dom2=collection1,category=UPDATE,scope=updateHandler,name=rollbacks, solr:dom1=core,dom2=collection1,category=QUERY,scope=/search-facet-def,name=timeouts, solr:dom1=core,dom2=collection1,dom3=shard2,dom4=replica_n41,category=ADMIN,scope=/schema,name=errors, solr:dom1=node,category=ADMIN,scope=/admin/cores,name=serverErrors, solr:dom1=core,dom2=collection1,category=QUERY,scope=/stream,name=requestTimes, solr:dom1=node,category=CONTAINER,scope=threadPool,name=coreContainerWorkExecutor.running, solr:dom1=core,dom2=collection1,category=QUERY,scope=/terms,name=timeouts, solr:dom1=core,dom2=collection1,dom3=shard2,dom4=replica_n41,category=UPDATE,scope=/update/json/docs,name=timeouts, solr:dom1=node,category=ADMIN,scope=/admin/collections,name=requestTimes, solr:dom1=core,dom2=collection1,category=HIGHLIGHTER,scope=SolrFragmenter,name=gap.requests, solr:dom1=core,dom2=collection1,dom3=shard2,dom4=replica_n41,category=QUERY,scope=/export,name=totalTime, solr:dom1=node,category=ADMIN,scope=/admin/authorization,name=requestTimes, solr:dom1=core,dom2=collection1,dom3=shard2,dom4=replica_n41,category=UPDATE,scope=/update,name=timeouts, solr:dom1=core,dom2=collection1,category=ADMIN,scope=/admin/segments,name=totalTime, solr:dom1=core,dom2=collection1,category=ADMIN,scope=/admin/ping,name=errors, solr:dom1=core,dom2=collection1,category=ADMIN,scope=/schema,name=clientErrors, solr:dom1=core,dom2=collection1,dom3=shard2,dom4=replica_n41,category=ADMIN,scope=/admin/plugins,name=requestTimes, solr:dom1=core,dom2=collection1,dom3=shard2,dom4=replica_n41,category=UPDATE,scope=updateHandler,name=cumulativeDeletesByQuery, solr:dom1=core,dom2=collection1,dom3=shard2,dom4=replica_n41,category=SEARCHER,scope=new,name=warmup, solr:dom1=core,dom2=collection1,dom3=shard2,dom4=replica_n41,category=TLOG,scope=replay,name=ops, solr:dom1=core,dom2=collection1,dom3=shard2,dom4=replica_n41,category=ADMIN,scope=/admin/segments,name=totalTime, solr:dom1=core,dom2=collection1,dom3=shard2,dom4=replica_n41,category=QUERY,scope=/graph,name=errors, solr:dom1=core,dom2=collection1,dom3=shard2,dom4=replica_n41,category=ADMIN,scope=/admin/threads,name=errors, solr:dom1=core,dom2=collection1,category=QUERY,scope=/search-facet-def,name=errors, solr:dom1=jvm,name0=threads,name1=waiting,name=count, solr:dom1=jvm,name0=classes,name=unloaded, solr:dom1=core,dom2=collection1,category=ADMIN,scope=/admin/properties,name=timeouts, solr:dom1=node,category=CONTAINER,scope=cores,name=loaded, solr:dom1=core,dom2=collection1,category=ADMIN,scope=/schema,name=handlerStart, solr:dom1=node,category=ADMIN,scope=/admin/authorization,name=handlerStart, solr:dom1=core,dom2=collection1,dom3=shard2,dom4=replica_n41,category=HIGHLIGHTER,scope=SolrFragListBuilder,name=default.requests, solr:dom1=core,dom2=collection1,category=UPDATE,scope=/update,name=clientErrors, solr:dom1=core,dom2=collection1,category=QUERY,scope=/search-facet-invariants,name=clientErrors, solr:dom1=core,dom2=collection1,category=QUERY,scope=/export,name=totalTime, solr:dom1=core,dom2=collection1,category=SEARCHER,scope=new,name=errors, solr:dom1=core,dom2=collection1,dom3=shard2,dom4=replica_n41,category=SEARCHER,scope=new,name=maxReached, solr:dom1=core,dom2=collection1,category=ADMIN,scope=/config,name=clientErrors, solr:dom1=node,category=QUERY,scope=httpShardHandler,name=threadPool.httpShardExecutor.completed, solr:dom1=core,dom2=collection1,dom3=shard2,dom4=replica_n41,category=ADMIN,scope=/config,name=serverErrors, solr:dom1=core,dom2=collection1,category=QUERY,scope=/debug/dump,name=clientErrors, solr:dom1=core,dom2=collection1,category=QUERY,scope=/spellCheckWithWordbreak_Direct,name=serverErrors, java.lang:type=Runtime, solr:dom1=core,dom2=collection1,dom3=shard2,dom4=replica_n41,category=ADMIN,scope=/config,name=requests, solr:dom1=core,dom2=collection1,category=QUERY,scope=/defaults,name=timeouts, solr:dom1=node,category=ADMIN,scope=/admin/authorization,name=errors, solr:dom1=node,category=UPDATE,scope=updateShardHandler,name=threadPool.recoveryExecutor.duration, solr:dom1=core,dom2=collection1,category=QUERY,scope=/spellCheckWithWordbreak_Direct,name=timeouts, solr:dom1=core,dom2=collection1,category=CORE,scope=fs,name=totalSpace, solr:dom1=core,dom2=collection1,dom3=shard2,dom4=replica_n41,category=QUERY,scope=/sql,name=errors, solr:dom1=core,dom2=collection1,category=QUERY,scope=/search-facet-def,name=handlerStart, solr:dom1=core,dom2=collection1,dom3=shard2,dom4=replica_n41,category=TLOG,scope=replay,name=remaining.logs, solr:dom1=node,category=CONTAINER,scope=threadPool,name=coreContainerWorkExecutor.duration, solr:dom1=core,dom2=collection1,dom3=shard2,dom4=replica_n41,category=UPDATE,scope=update,name=timeouts, solr:dom1=core,dom2=collection1,category=ADMIN,scope=/admin/segments,name=timeouts, solr:dom1=core,dom2=collection1,category=QUERY,scope=/spellCheckWithWordbreak_Direct,name=clientErrors, solr:dom1=jvm,name0=threads,name1=termınated,name=count, solr:dom1=node,category=CONTAINER,scope=cores,name=unloaded, solr:dom1=core,dom2=collection1,category=QUERY,scope=/search-facet-invariants,name=serverErrors, solr:dom1=node,category=ADMIN,scope=/admin/metrics,name=timeouts, solr:dom1=core,dom2=collection1,category=QUERY,scope=/spellCheckCompRH,name=serverErrors, solr:dom1=jvm,name0=os,name=totalSwapSpaceSize, solr:dom1=core,dom2=collection1,category=UPDATE,scope=updateHandler,name=cumulativeErrors, java.lang:name=PS Survivor Space,type=MemoryPool, solr:dom1=core,dom2=collection1,category=QUERY,scope=/spellCheckCompRH,name=errors, solr:dom1=jvm,name0=os,name=availableProcessors, solr:dom1=node,category=UPDATE,scope=updateShardHandler,name=threadPool.recoveryExecutor.running, solr:dom1=core,dom2=collection1,dom3=shard2,dom4=replica_n41,category=ADMIN,scope=/admin/segments,name=clientErrors, solr:dom1=core,dom2=collection1,category=QUERY,scope=/spellCheckWithWordbreak,name=errors, solr:dom1=node,category=CONTAINER,scope=fs,name=path, solr:dom1=core,dom2=collection1,dom3=shard2,dom4=replica_n41,category=QUERY,scope=/terms,name=requests, solr:dom1=core,dom2=collection1,dom3=shard2,dom4=replica_n41,category=ADMIN,scope=/admin/luke,name=errors, solr:dom1=jvm,name0=threads,name=count, solr:dom1=core,dom2=collection1,category=SEARCHER,scope=searcher,name=caching, solr:dom1=jvm,name0=memory,name1=total,name=used, solr:dom1=core,dom2=collection1,category=HIGHLIGHTER,scope=SolrFormatter,name=html.requests, solr:dom1=core,dom2=collection1,dom3=shard2,dom4=replica_n41,category=ADMIN,scope=/admin/threads,name=requestTimes, solr:dom1=node,category=ADMIN,scope=/admin/cores,name=clientErrors, solr:dom1=core,dom2=collection1,category=ADMIN,scope=/schema,name=timeouts, solr:dom1=core,dom2=collection1,dom3=shard2,dom4=replica_n41,category=ADMIN,scope=/admin/luke,name=totalTime, solr:dom1=core,dom2=collection1,category=QUERY,scope=/spellCheckWithWordbreak,name=handlerStart, solr:dom1=core,dom2=collection1,category=TLOG,scope=replay,name=ops, solr:dom1=core,dom2=collection1,category=QUERY,scope=/spellCheckCompRH1,name=handlerStart, solr:dom1=core,dom2=collection1,category=ADMIN,scope=/admin/threads,name=serverErrors, solr:dom1=core,dom2=collection1,category=ADMIN,scope=/admin/ping,name=requests, solr:dom1=core,dom2=collection1,category=QUERY,scope=/export,name=timeouts, solr:dom1=jvm,name0=threads,name1=waıtıng,name=count, solr:dom1=node,category=ADMIN,scope=/admin/configs,name=errors, solr:dom1=core,dom2=collection1,category=QUERY,scope=/mock,name=initCount, solr:dom1=core,dom2=collection1,category=UPDATE,scope=update,name=clientErrors, solr:dom1=core,dom2=collection1,dom3=shard2,dom4=replica_n41,category=ADMIN,scope=/admin/file,name=clientErrors, solr:dom1=node,category=ADMIN,scope=/admin/cores,name=handlerStart, solr:dom1=core,dom2=collection1,dom3=shard2,dom4=replica_n41,category=ADMIN,scope=/admin/plugins,name=errors, solr:dom1=core,dom2=collection1,category=QUERY,scope=/select,name=requests, solr:dom1=core,dom2=collection1,dom3=shard2,dom4=replica_n41,category=QUERY,scope=/select,name=timeouts, solr:dom1=jvm,name0=memory,name1=pools,name2=CodeHeap-'profiled-nmethods',name=committed, solr:dom1=core,dom2=collection1,category=ADMIN,scope=/admin/segments,name=serverErrors, solr:dom1=node,category=QUERY,scope=/admin/autoscaling,name=handlerStart, solr:dom1=node,category=ADMIN,scope=/admin/zookeeper,name=serverErrors, solr:dom1=node,category=CONTAINER,scope=fs,name=coreRoot.path, solr:dom1=core,dom2=collection1,category=ADMIN,scope=/admin/segments,name=errors, solr:dom1=node,category=ADMIN,scope=/admin/configs,name=requests, solr:dom1=jvm,name0=memory,name1=pools,name2=CodeHeap-'non-nmethods',name=max, solr:dom1=core,dom2=collection1,category=QUERY,scope=/search-facet-invariants,name=totalTime, solr:dom1=core,dom2=collection1,dom3=shard2,dom4=replica_n41,category=QUERY,scope=/get,name=errors, solr:dom1=node,category=CONTAINER,scope=threadPool,name=coreLoadExecutor.duration, solr:dom1=core,dom2=collection1,dom3=shard2,dom4=replica_n41,category=QUERY,scope=/get,name=clientErrors, solr:dom1=jvm,name0=memory,name1=pools,name2=CodeHeap-'non-nmethods',name=committed, solr:dom1=core,dom2=collection1,dom3=shard2,dom4=replica_n41,category=ADMIN,scope=/admin/threads,name=timeouts, solr:dom1=core,dom2=collection1,dom3=shard2,dom4=replica_n41,category=QUERY,scope=/stream,name=requests, solr:dom1=core,dom2=collection1,category=ADMIN,scope=/admin/file,name=timeouts, solr:dom1=core,dom2=collection1,dom3=shard2,dom4=replica_n41,category=ADMIN,scope=/admin/plugins,name=serverErrors, java.lang:name=CodeHeap 'non-profiled nmethods',type=MemoryPool, solr:dom1=core,dom2=collection1,dom3=shard2,dom4=replica_n41,category=QUERY,scope=/graph,name=totalTime, solr:dom1=core,dom2=collection1,category=QUERY,scope=/graph,name=requests, solr:dom1=node,category=ADMIN,scope=/admin/cores,name=requestTimes, solr:dom1=core,dom2=collection1,category=ADMIN,scope=/admin/segments,name=requests, solr:dom1=core,dom2=collection1,dom3=shard2,dom4=replica_n41,category=ADMIN,scope=/schema,name=serverErrors, solr:dom1=core,dom2=collection1,dom3=shard2,dom4=replica_n41,category=UPDATE,scope=/update/json/docs,name=serverErrors, solr:dom1=core,dom2=collection1,category=QUERY,scope=/search-facet-invariants,name=timeouts, solr:dom1=core,dom2=collection1,category=UPDATE,scope=update,name=totalTime, solr:dom1=core,dom2=collection1,category=QUERY,scope=/spellCheckCompRH1,name=clientErrors, solr:dom1=core,dom2=collection1,category=REPLICATION,scope=/replication,name=timeouts, solr:dom1=core,dom2=collection1,category=UPDATE,scope=updateHandler,name=adds, solr:dom1=core,dom2=collection1,category=ADMIN,scope=/admin/properties,name=errors, solr:dom1=core,dom2=collection1,dom3=shard2,dom4=replica_n41,category=QUERY,scope=/terms,name=requestTimes, solr:dom1=jvm,name0=os,name=version, solr:dom1=core,dom2=collection1,category=UPDATE,scope=update,name=serverErrors, solr:dom1=jvm,name0=memory,name1=pools,name2=Metaspace,name=usage, solr:dom1=core,dom2=collection1,dom3=shard2,dom4=replica_n41,category=QUERY,scope=/select,name=requests, solr:dom1=core,dom2=collection1,category=ADMIN,scope=/admin/plugins,name=totalTime, solr:dom1=core,dom2=collection1,category=QUERY,scope=/mlt,name=errors, solr:dom1=core,dom2=collection1,category=QUERY,scope=/spellCheckWithWordbreak_Direct,name=handlerStart, solr:dom1=core,dom2=collection1,category=ADMIN,scope=/schema,name=errors, solr:dom1=core,dom2=collection1,category=ADMIN,scope=/admin/properties,name=totalTime, solr:dom1=core,dom2=collection1,category=UPDATE,scope=/update/csv,name=clientErrors, solr:dom1=core,dom2=collection1,dom3=shard2,dom4=replica_n41,category=QUERY,scope=/export,name=timeouts, solr:dom1=node,category=QUERY,scope=/admin/autoscaling,name=errors, solr:dom1=core,dom2=collection1,dom3=shard2,dom4=replica_n41,category=ADMIN,scope=/admin/plugins,name=timeouts, solr:dom1=core,dom2=collection1,category=QUERY,scope=/terms,name=requests, solr:dom1=jvm,name0=os,name=maxFileDescriptorCount, solr:dom1=core,dom2=collection1,category=HIGHLIGHTER,scope=SolrFragmentsBuilder,name=simple.requests, solr:dom1=core,dom2=collection1,dom3=shard2,dom4=replica_n41,category=QUERY,scope=/get,name=totalTime, solr:dom1=core,dom2=collection1,dom3=shard2,dom4=replica_n41,category=ADMIN,scope=/admin/file,name=totalTime, solr:dom1=core,dom2=collection1,category=ADMIN,scope=/admin/logging,name=requests, solr:dom1=core,dom2=collection1,category=QUERY,scope=/sql,name=errors, solr:dom1=core,dom2=collection1,category=REPLICATION,scope=/replication,name=confFilesToReplicate, solr:dom1=node,category=CONTAINER,scope=fs,name=coreRoot.usableSpace, solr:dom1=core,dom2=collection1,category=HIGHLIGHTER,scope=SolrFragListBuilder,name=default.requests, solr:dom1=core,dom2=collection1,dom3=shard2,dom4=replica_n41,category=UPDATE,scope=/update/json/docs,name=requests, solr:dom1=core,dom2=collection1,category=UPDATE,scope=updateHandler,name=splits, solr:dom1=core,dom2=collection1,dom3=shard2,dom4=replica_n41,category=ADMIN,scope=/config,name=errors, solr:dom1=core,dom2=collection1,dom3=shard2,dom4=replica_n41,category=QUERY,scope=/terms,name=totalTime, solr:dom1=core,dom2=collection1,dom3=shard2,dom4=replica_n41,category=UPDATE,scope=/update/json/docs,name=totalTime, solr:dom1=core,dom2=collection1,dom3=shard2,dom4=replica_n41,category=ADMIN,scope=/admin/properties,name=requestTimes, solr:dom1=jvm,name0=memory,name1=pools,name2=CodeHeap-'profiled-nmethods',name=max, solr:dom1=core,dom2=collection1,category=REPLICATION,scope=/replication,name=fetcher, solr:dom1=core,dom2=collection1,category=QUERY,scope=/graph,name=timeouts, solr:dom1=jvm,name0=threads,name1=blocked,name=count, solr:dom1=core,dom2=collection1,category=REPLICATION,scope=/replication,name=totalTime, solr:dom1=jvm,name0=gc,name1=PS-MarkSweep,name=time, solr:dom1=node,category=ADMIN,scope=/admin/collections,name=requests, solr:dom1=core,dom2=collection1,dom3=shard2,dom4=replica_n41,category=QUERY,scope=/terms,name=errors, solr:dom1=core,dom2=collection1,dom3=shard2,dom4=replica_n41,category=ADMIN,scope=/admin/segments,name=serverErrors, solr:dom1=node,category=ADMIN,scope=/admin/info,name=handlerStart, solr:dom1=core,dom2=collection1,dom3=shard2,dom4=replica_n41,category=QUERY,scope=/select,name=requestTimes, solr:dom1=core,dom2=collection1,dom3=shard2,dom4=replica_n41,category=ADMIN,scope=/admin/segments,name=errors, solr:dom1=core,dom2=collection1,dom3=shard2,dom4=replica_n41,category=QUERY,scope=/get,name=serverErrors, solr:dom1=core,dom2=collection1,dom3=shard2,dom4=replica_n41,category=QUERY,scope=/export,name=serverErrors, solr:dom1=core,dom2=collection1,category=UPDATE,scope=update,name=handlerStart, solr:dom1=core,dom2=collection1,dom3=shard2,dom4=replica_n41,category=ADMIN,scope=/admin/logging,name=totalTime, solr:dom1=core,dom2=collection1,category=UPDATE,scope=/update/csv,name=timeouts, solr:dom1=core,dom2=collection1,dom3=shard2,dom4=replic
   [junit4]   2> a_n41,category=ADMIN,scope=/schema,name=requests, solr:dom1=core,dom2=collection1,category=ADMIN,scope=/admin/luke,name=timeouts, solr:dom1=core,dom2=collection1,category=ADMIN,scope=/admin/threads,name=totalTime, solr:dom1=jvm,name0=threads,name1=tımed_waıtıng,name=count, solr:dom1=core,dom2=collection1,dom3=shard2,dom4=replica_n41,category=QUERY,scope=/dump,name=serverErrors, solr:dom1=core,dom2=collection1,dom3=shard2,dom4=replica_n41,category=REPLICATION,scope=/replication,name=serverErrors, solr:dom1=core,dom2=collection1,category=QUERY,scope=/mock,name=clientErrors, solr:dom1=jvm,name0=threads,name1=terminated,name=count, java.lang:name=Metaspace Manager,type=MemoryManager, solr:dom1=core,dom2=collection1,dom3=shard2,dom4=replica_n41,category=QUERY,scope=/stream,name=errors, solr:dom1=node,category=QUERY,scope=/admin/metrics/collector,name=timeouts, solr:dom1=core,dom2=collection1,category=QUERY,scope=/spellCheckCompRH1,name=errors, solr:dom1=core,dom2=collection1,dom3=shard2,dom4=replica_n41,category=QUERY,scope=/graph,name=requests, solr:dom1=core,dom2=collection1,dom3=shard2,dom4=replica_n41,category=ADMIN,scope=/admin/mbeans,name=timeouts, java.lang:name=CodeHeap 'profiled nmethods',type=MemoryPool, solr:dom1=core,dom2=collection1,dom3=shard2,dom4=replica_n41,category=QUERY,scope=/dump,name=totalTime, solr:dom1=jvm,name0=memory,name1=pools,name2=CodeHeap-'non-nmethods',name=init, solr:dom1=core,dom2=collection1,dom3=shard2,dom4=replica_n41,category=UPDATE,scope=update,name=errors, solr:dom1=node,category=CONTAINER,scope=threadPool,name=coreContainerWorkExecutor.completed, solr:dom1=core,dom2=collection1,category=ADMIN,scope=/admin/luke,name=serverErrors, solr:dom1=node,category=QUERY,scope=/admin/autoscaling,name=requests, solr:dom1=core,dom2=collection1,dom3=shard2,dom4=replica_n41,category=UPDATE,scope=/update/csv,name=requests, solr:dom1=core,dom2=collection1,dom3=shard2,dom4=replica_n41,category=ADMIN,scope=/schema,name=timeouts, solr:dom1=jvm,name0=memory,name1=pools,name2=Metaspace,name=max, solr:dom1=node,category=ADMIN,scope=/admin/info,name=requestTimes, solr:dom1=core,dom2=collection1,category=REPLICATION,scope=/replication,name=isSlave, solr:dom1=core,dom2=collection1,category=ADMIN,scope=/admin/threads,name=requests, solr:dom1=core,dom2=collection1,category=ADMIN,scope=/schema,name=serverErrors, solr:dom1=node,category=ADMIN,scope=/admin/authorization,name=clientErrors, solr:dom1=core,dom2=collection1,category=ADMIN,scope=/admin/mbeans,name=timeouts, solr:dom1=jvm,name0=os,name=freeSwapSpaceSize, solr:dom1=core,dom2=collection1,category=QUERY,scope=/mltrh,name=clientErrors, solr:dom1=node,category=QUERY,scope=httpShardHandler,name=availableConnections, solr:dom1=core,dom2=collection1,category=REPLICATION,scope=/replication,name=indexPath, solr:dom1=core,dom2=collection1,category=ADMIN,scope=/admin/threads,name=handlerStart, solr:dom1=core,dom2=collection1,category=QUERY,scope=/debug/dump,name=requestTimes, solr:dom1=jvm,name0=memory,name1=pools,name2=PS-Eden-Space,name=committed, solr:dom1=core,dom2=collection1,category=QUERY,scope=/export,name=requests, solr:dom1=node,category=ADMIN,scope=/admin/configs,name=handlerStart, solr:dom1=core,dom2=collection1,category=REPLICATION,scope=/replication,name=requestTimes, solr:dom1=jvm,name0=memory,name1=pools,name2=PS-Old-Gen,name=used-after-gc, solr:dom1=node,category=ADMIN,scope=/admin/collections,name=timeouts, java.lang:name=PS Scavenge,type=GarbageCollector, solr:dom1=core,dom2=collection1,dom3=shard2,dom4=replica_n41,category=ADMIN,scope=/admin/file,name=serverErrors, solr:dom1=node,category=ADMIN,scope=/admin/info,name=clientErrors, solr:dom1=jvm,name0=memory,name1=heap,name=usage, java.nio:name=mapped,type=BufferPool, com.sun.management:type=DiagnosticCommand, solr:dom1=jvm,name0=memory,name1=pools,name2=PS-Eden-Space,name=used-after-gc, solr:dom1=core,dom2=collection1,category=REPLICATION,scope=/replication,name=replicationEnabled, solr:dom1=core,dom2=collection1,category=SEARCHER,scope=new,name=maxReached, solr:dom1=core,dom2=collection1,dom3=shard2,dom4=replica_n41,category=REPLICATION,scope=/replication,name=clientErrors, solr:dom1=node,category=ADMIN,scope=/admin/info,name=totalTime, solr:dom1=core,dom2=collection1,category=ADMIN,scope=/admin/plugins,name=clientErrors, solr:dom1=node,category=ADMIN,scope=/admin/cores,name=threadPool.parallelCoreAdminExecutor.running, solr:dom1=node,category=UPDATE,scope=updateShardHandler,name=threadPool.updateExecutor.duration, solr:dom1=core,dom2=collection1,category=UPDATE,scope=/update/csv,name=serverErrors, solr:dom1=node,category=ADMIN,scope=/admin/health,name=handlerStart, solr:dom1=node,category=CONTAINER,scope=fs,name=usableSpace, solr:dom1=core,dom2=collection1,category=QUERY,scope=/spellCheckCompRH1,name=serverErrors, solr:dom1=core,dom2=collection1,dom3=shard2,dom4=replica_n41,category=UPDATE,scope=updateHandler,name=optimizes, solr:dom1=node,category=ADMIN,scope=/admin/metrics,name=errors, solr:dom1=core,dom2=collection1,category=UPDATE,scope=updateHandler,name=merges, solr:dom1=core,dom2=collection1,dom3=shard2,dom4=replica_n41,category=QUERY,scope=/debug/dump,name=requests, solr:dom1=core,dom2=collection1,category=QUERY,scope=/tvrh,name=serverErrors, solr:dom1=node,category=CONTAINER,scope=version,name=specification, solr:dom1=core,dom2=collection1,category=ADMIN,scope=/admin/plugins,name=errors, solr:dom1=jvm,name0=threads,name1=timed_waiting,name=count, solr:dom1=core,dom2=collection1,dom3=shard2,dom4=replica_n41,category=UPDATE,scope=/update,name=requests, solr:dom1=core,dom2=collection1,category=CORE,name=instanceDir, solr:dom1=core,dom2=collection1,category=QUERY,scope=/tvrh,name=clientErrors, solr:dom1=core,dom2=collection1,category=ADMIN,scope=/admin/file,name=totalTime, solr:dom1=core,dom2=collection1,category=ADMIN,scope=/admin/plugins,name=handlerStart, solr:dom1=core,dom2=collection1,category=UPDATE,scope=/update/json,name=clientErrors, solr:dom1=jvm,name0=memory,name1=pools,name2=Metaspace,name=used, solr:dom1=core,dom2=collection1,dom3=shard2,dom4=replica_n41,category=ADMIN,scope=/admin/ping,name=requestTimes, solr:dom1=jvm,name0=memory,name1=pools,name2=CodeHeap-'profiled-nmethods',name=used, solr:dom1=core,dom2=collection1,dom3=shard2,dom4=replica_n41,category=QUERY,scope=/select,name=errors, solr:dom1=core,dom2=collection1,category=SEARCHER,scope=searcher,name=readerDir, solr:dom1=core,dom2=collection1,dom3=shard2,dom4=replica_n41,category=ADMIN,scope=/admin/luke,name=timeouts, solr:dom1=node,category=ADMIN,scope=/admin/zookeeper,name=requests, solr:dom1=core,dom2=collection1,dom3=shard2,dom4=replica_n41,category=ADMIN,scope=/schema,name=requestTimes, solr:dom1=core,dom2=collection1,category=ADMIN,scope=/admin/mbeans,name=requests, solr:dom1=node,category=ADMIN,scope=/admin/collections,name=totalTime, solr:dom1=core,dom2=collection1,dom3=shard2,dom4=replica_n41,category=QUERY,scope=/select,name=totalTime, solr:dom1=core,dom2=collection1,category=ADMIN,scope=/admin/plugins,name=requests, solr:dom1=core,dom2=collection1,category=ADMIN,scope=/admin/ping,name=clientErrors, solr:dom1=node,category=CONTAINER,scope=threadPool,name=coreContainerWorkExecutor.submitted, solr:dom1=core,dom2=collection1,dom3=shard2,dom4=replica_n41,category=ADMIN,scope=/admin/threads,name=serverErrors, solr:dom1=core,dom2=collection1,dom3=shard2,dom4=replica_n41,category=UPDATE,scope=/update/csv,name=clientErrors, solr:dom1=core,dom2=collection1,category=QUERY,scope=/spellCheckWithWordbreak,name=clientErrors, solr:dom1=core,dom2=collection1,dom3=shard2,dom4=replica_n41,category=ADMIN,scope=/schema,name=totalTime, solr:dom1=core,dom2=collection1,dom3=shard2,dom4=replica_n41,category=ADMIN,scope=/admin/system,name=timeouts, solr:dom1=core,dom2=collection1,category=CACHE,scope=core,name=fieldCache, solr:dom1=core,dom2=collection1,dom3=shard2,dom4=replica_n41,category=ADMIN,scope=/schema,name=clientErrors, solr:dom1=core,dom2=collection1,category=QUERY,scope=/spellCheckCompRH_Direct,name=timeouts, solr:dom1=core,dom2=collection1,category=QUERY,scope=/terms,name=totalTime, solr:dom1=core,dom2=collection1,category=QUERY,scope=/select,name=handlerStart, solr:dom1=core,dom2=collection1,dom3=shard2,dom4=replica_n41,category=UPDATE,scope=/update/json/docs,name=clientErrors, solr:dom1=core,dom2=collection1,dom3=shard2,dom4=replica_n41,category=REPLICATION,scope=/replication,name=generation, solr:dom1=core,dom2=collection1,category=ADMIN,scope=/admin/file,name=serverErrors, solr:dom1=core,dom2=collection1,dom3=shard2,dom4=replica_n41,category=ADMIN,scope=/admin/logging,name=requestTimes, solr:dom1=jvm,name0=memory,name1=pools,name2=PS-Survivor-Space,name=committed, solr:dom1=core,dom2=collection1,dom3=shard2,dom4=replica_n41,category=UPDATE,scope=/update/json,name=timeouts, solr:dom1=core,dom2=collection1,category=HIGHLIGHTER,scope=SolrFragmenter,name=default.requests, solr:dom1=core,dom2=collection1,category=QUERY,scope=/tvrh,name=requests, solr:dom1=node,category=ADMIN,scope=/admin/info,name=requests, solr:dom1=core,dom2=collection1,dom3=shard2,dom4=replica_n41,category=QUERY,scope=/graph,name=timeouts, solr:dom1=core,dom2=collection1,category=ADMIN,scope=/admin/threads,name=clientErrors, solr:dom1=core,dom2=collection1,category=QUERY,scope=/mltrh,name=timeouts, solr:dom1=core,dom2=collection1,category=HIGHLIGHTER,scope=SolrFragmentsBuilder,name=default.requests, solr:dom1=core,dom2=collection1,category=UPDATE,scope=updateHandler,name=docsPending, solr:dom1=jvm,name0=memory,name1=pools,name2=PS-Survivor-Space,name=used-after-gc, solr:dom1=core,dom2=collection1,dom3=shard2,dom4=replica_n41,category=QUERY,scope=/select,name=clientErrors, solr:dom1=node,category=ADMIN,scope=/admin/collections,name=serverErrors, solr:dom1=core,dom2=collection1,category=UPDATE,scope=/update/json,name=serverErrors, solr:dom1=core,dom2=collection1,dom3=shard2,dom4=replica_n41,category=QUERY,scope=/export,name=clientErrors, solr:dom1=core,dom2=collection1,category=QUERY,scope=/spellCheckCompRH1,name=totalTime, solr:dom1=core,dom2=collection1,category=UPDATE,scope=/update/json,name=requestTimes, solr:dom1=core,dom2=collection1,category=QUERY,scope=/export,name=clientErrors, solr:dom1=core,dom2=collection1,category=ADMIN,scope=/admin/logging,name=requestTimes, solr:dom1=jvm,name0=memory,name1=total,name=max, solr:dom1=core,dom2=collection1,category=CORE,name=aliases, solr:dom1=core,dom2=collection1,dom3=shard2,dom4=replica_n41,category=QUERY,scope=/dump,name=timeouts, solr:dom1=core,dom2=collection1,category=ADMIN,scope=/admin/plugins,name=timeouts, solr:dom1=core,dom2=collection1,category=QUERY,scope=/debug/dump,name=errors, solr:dom1=core,dom2=collection1,category=REPLICATION,scope=/replication,name=requests, solr:dom1=core,dom2=collection1,category=SEARCHER,scope=searcher,name=registeredAt, solr:dom1=core,dom2=collection1,dom3=shard2,dom4=replica_n41,category=UPDATE,scope=update,name=requests, solr:dom1=core,dom2=collection1,dom3=shard2,dom4=replica_n41,category=UPDATE,scope=/update/csv,name=requestTimes, solr:dom1=core,dom2=collection1,category=ADMIN,scope=/admin/file,name=requests, solr:dom1=core,dom2=collection1,category=QUERY,scope=/mltrh,name=handlerStart, solr:dom1=node,category=ADMIN,scope=/admin/info,name=serverErrors, solr:dom1=core,dom2=collection1,category=ADMIN,scope=/admin/segments,name=clientErrors, solr:dom1=core,dom2=collection1,category=QUERY,scope=/export,name=handlerStart, solr:dom1=jvm,name0=memory,name1=pools,name2=PS-Survivor-Space,name=used, solr:dom1=core,dom2=collection1,category=CORE,name=startTime, solr:dom1=core,dom2=collection1,dom3=shard2,dom4=replica_n41,category=ADMIN,scope=/admin/plugins,name=requests, solr:dom1=core,dom2=collection1,category=UPDATE,scope=/update/json/docs,name=requestTimes, java.lang:name=PS Old Gen,type=MemoryPool, solr:dom1=jvm,name0=memory,name1=pools,name2=PS-Survivor-Space,name=init, solr:dom1=core,dom2=collection1,category=ADMIN,scope=/admin/ping,name=requestTimes, solr:dom1=core,dom2=collection1,category=QUERY,scope=/defaults,name=requests, solr:dom1=core,dom2=collection1,dom3=shard2,dom4=replica_n41,category=ADMIN,scope=/admin/segments,name=requestTimes, solr:dom1=core,dom2=collection1,category=QUERY,scope=/mltrh,name=requestTimes, solr:dom1=core,dom2=collection1,dom3=shard2,dom4=replica_n41,category=REPLICATION,scope=/replication,name=handlerStart, com.sun.management:type=HotSpotDiagnostic, solr:dom1=core,dom2=collection1,dom3=shard2,dom4=replica_n41,category=HIGHLIGHTER,scope=SolrBoundaryScanner,name=default.requests, solr:dom1=core,dom2=collection1,category=QUERY,scope=/spellCheckCompRH,name=requests, solr:dom1=core,dom2=collection1,dom3=shard2,dom4=replica_n41,category=QUERY,scope=/graph,name=requestTimes, solr:dom1=jvm,name0=memory,name1=non-heap,name=committed, solr:dom1=jvm,name0=buffers,name1=mapped,name=MemoryUsed, solr:dom1=jvm,name0=buffers,name1=direct,name=Count, solr:dom1=core,dom2=collection1,dom3=shard2,dom4=replica_n41,category=UPDATE,scope=updateHandler,name=commits, solr:dom1=jvm,name0=os,name=processCpuTime, solr:dom1=core,dom2=collection1,dom3=shard2,dom4=replica_n41,category=ADMIN,scope=/admin/threads,name=clientErrors, solr:dom1=core,dom2=collection1,category=ADMIN,scope=/admin/plugins,name=serverErrors, solr:dom1=core,dom2=collection1,category=QUERY,scope=/spellCheckWithWordbreak,name=totalTime, solr:dom1=core,dom2=collection1,category=ADMIN,scope=/config,name=handlerStart, solr:dom1=core,dom2=collection1,category=QUERY,scope=/stream,name=errors, solr:dom1=jvm,name0=memory,name1=heap,name=committed, solr:dom1=core,dom2=collection1,category=ADMIN,scope=/admin/file,name=handlerStart, solr:dom1=core,dom2=collection1,category=QUERY,scope=/defaults,name=requestTimes, solr:dom1=jvm,name0=threads,name1=deadlock,name=count, solr:dom1=core,dom2=collection1,category=QUERY,scope=/spellCheckCompRH1,name=requests, solr:dom1=core,dom2=collection1,category=QUERY,scope=/search-facet-invariants,name=errors, solr:dom1=core,dom2=collection1,category=SEARCHER,scope=searcher,name=warmupTime, solr:dom1=jvm,name0=threads,name1=runnable,name=count, solr:dom1=node,category=ADMIN,scope=/admin/metrics,name=clientErrors, solr:dom1=core,dom2=collection1,dom3=shard2,dom4=replica_n41,category=ADMIN,scope=/admin/logging,name=errors, solr:dom1=core,dom2=collection1,category=SEARCHER,scope=searcher,name=indexVersion, solr:dom1=jvm,name0=memory,name1=heap,name=init, solr:dom1=core,dom2=collection1,category=SEARCHER,scope=searcher,name=numDocs, solr:dom1=core,dom2=collection1,category=QUERY,scope=/spellCheckWithWordbreak,name=requestTimes, solr:dom1=core,dom2=collection1,category=HIGHLIGHTER,scope=SolrFormatter,name=default.requests, solr:dom1=core,dom2=collection1,category=HIGHLIGHTER,scope=SolrFragmenter,name=regex.requests, solr:dom1=node,category=ADMIN,scope=/admin/configs,name=requestTimes, solr:dom1=core,dom2=collection1,category=QUERY,scope=/select,name=clientErrors, solr:dom1=core,dom2=collection1,dom3=shard2,dom4=replica_n41,category=UPDATE,scope=update,name=serverErrors, solr:dom1=core,dom2=collection1,dom3=shard2,dom4=replica_n41,category=ADMIN,scope=/admin/threads,name=requests, solr:dom1=core,dom2=collection1,dom3=shard2,dom4=replica_n41,category=HIGHLIGHTER,scope=SolrFragmentsBuilder,name=default.requests, solr:dom1=core,dom2=collection1,category=ADMIN,scope=/config,name=requests, solr:dom1=core,dom2=collection1,dom3=shard2,dom4=replica_n41,category=REPLICATION,scope=/replication,name=confFilesToReplicate, solr:dom1=core,dom2=collection1,dom3=shard2,dom4=replica_n41,category=ADMIN,scope=/admin/properties,name=totalTime, solr:dom1=core,dom2=collection1,dom3=shard2,dom4=replica_n41,category=UPDATE,scope=updateHandler,name=expungeDeletes, java.lang:name=PS MarkSweep,type=GarbageCollector, solr:dom1=core,dom2=collection1,dom3=shard2,dom4=replica_n41,category=UPDATE,scope=/update,name=serverErrors, solr:dom1=core,dom2=collection1,category=ADMIN,scope=/admin/threads,name=timeouts, solr:dom1=core,dom2=collection1,dom3=shard2,dom4=replica_n41,category=ADMIN,scope=/admin/file,name=timeouts, solr:dom1=node,category=CONTAINER,scope=fs,name=coreRoot.totalSpace, solr:dom1=core,dom2=collection1,category=ADMIN,scope=/admin/system,name=requests, solr:dom1=core,dom2=collection1,category=UPDATE,scope=/update/csv,name=totalTime, solr:dom1=core,dom2=
   [junit4]   2> collection1,category=QUERY,scope=/debug/dump,name=requests, solr:dom1=core,dom2=collection1,category=UPDATE,scope=/update/json/docs,name=handlerStart, solr:dom1=core,dom2=collection1,category=ADMIN,scope=/admin/luke,name=handlerStart, solr:dom1=node,category=CONTAINER,scope=cores,name=lazy, solr:dom1=core,dom2=collection1,category=QUERY,scope=/search-facet-invariants,name=handlerStart, solr:dom1=node,category=QUERY,scope=/admin/metrics/collector,name=errors, solr:dom1=core,dom2=collection1,category=QUERY,scope=/search-facet-invariants,name=requests, solr:dom1=core,dom2=collection1,category=QUERY,scope=/defaults,name=handlerStart, java.lang:name=CodeHeap 'non-nmethods',type=MemoryPool, solr:dom1=core,dom2=collection1,dom3=shard2,dom4=replica_n41,category=UPDATE,scope=/update,name=requestTimes, solr:dom1=core,dom2=collection1,category=UPDATE,scope=updateHandler,name=optimizes, solr:dom1=core,dom2=collection1,category=QUERY,scope=/tvrh,name=totalTime, solr:dom1=jvm,name0=memory,name1=pools,name2=PS-Eden-Space,name=init, solr:dom1=jvm,name0=os,name=openFileDescriptorCount, solr:dom1=node,category=QUERY,scope=httpShardHandler,name=pendingConnections, solr:dom1=core,dom2=collection1,dom3=shard2,dom4=replica_n41,category=QUERY,scope=/debug/dump,name=serverErrors, solr:dom1=core,dom2=collection1,dom3=shard2,dom4=replica_n41,category=QUERY,scope=/dump,name=errors, solr:dom1=core,dom2=collection1,category=ADMIN,scope=/admin/threads,name=errors, solr:dom1=core,dom2=collection1,dom3=shard2,dom4=replica_n41,category=UPDATE,scope=update,name=totalTime, solr:dom1=node,category=CACHE,name=fieldCache, solr:dom1=core,dom2=collection1,category=QUERY,scope=/spellCheckWithWordbreak_Direct,name=totalTime, solr:dom1=core,dom2=collection1,dom3=shard2,dom4=replica_n41,category=QUERY,scope=/terms,name=timeouts, solr:dom1=jvm,name0=memory,name1=pools,name2=CodeHeap-'non-nmethods',name=usage, solr:dom1=core,dom2=collection1,category=QUERY,scope=/mock,name=requestTimes, solr:dom1=core,dom2=collection1,category=QUERY,scope=/stream,name=serverErrors, solr:dom1=core,dom2=collection1,dom3=shard2,dom4=replica_n41,category=UPDATE,scope=updateHandler,name=cumulativeAdds, solr:d

[...truncated too long message...]

browse/SOLR-2715"))
   [junit4]   2> 1242239 INFO  (TEST-TestJmxIntegration.testJmxRegistration-seed#[8AD1266E4C07868A]) [    ] o.a.s.SolrTestCaseJ4 ###Starting testJmxRegistration
   [junit4]   2> 1242349 INFO  (TEST-TestJmxIntegration.testJmxRegistration-seed#[8AD1266E4C07868A]) [    ] o.a.s.SolrTestCaseJ4 ###Ending testJmxRegistration
   [junit4]   2> NOTE: reproduce with: ant test  -Dtestcase=TestJmxIntegration -Dtests.method=testJmxRegistration -Dtests.seed=8AD1266E4C07868A -Dtests.multiplier=3 -Dtests.slow=true -Dtests.locale=fa-AF -Dtests.timezone=Asia/Hong_Kong -Dtests.asserts=true -Dtests.file.encoding=UTF-8
   [junit4] ERROR   0.12s J2 | TestJmxIntegration.testJmxRegistration <<<
   [junit4]    > Throwable #1: javax.management.RuntimeMBeanException: org.apache.lucene.store.AlreadyClosedException: Already closed
   [junit4]    > 	at __randomizedtesting.SeedInfo.seed([8AD1266E4C07868A:40042542146DEEF]:0)
   [junit4]    > 	at java.management/com.sun.jmx.interceptor.DefaultMBeanServerInterceptor.rethrow(DefaultMBeanServerInterceptor.java:829)
   [junit4]    > 	at java.management/com.sun.jmx.interceptor.DefaultMBeanServerInterceptor.rethrowMaybeMBeanException(DefaultMBeanServerInterceptor.java:842)
   [junit4]    > 	at java.management/com.sun.jmx.interceptor.DefaultMBeanServerInterceptor.getAttribute(DefaultMBeanServerInterceptor.java:645)
   [junit4]    > 	at java.management/com.sun.jmx.mbeanserver.JmxMBeanServer.getAttribute(JmxMBeanServer.java:678)
   [junit4]    > 	at org.apache.solr.core.TestJmxIntegration.testJmxRegistration(TestJmxIntegration.java:120)
   [junit4]    > 	at java.base/jdk.internal.reflect.NativeMethodAccessorImpl.invoke0(Native Method)
   [junit4]    > 	at java.base/jdk.internal.reflect.NativeMethodAccessorImpl.invoke(NativeMethodAccessorImpl.java:62)
   [junit4]    > 	at java.base/jdk.internal.reflect.DelegatingMethodAccessorImpl.invoke(DelegatingMethodAccessorImpl.java:43)
   [junit4]    > 	at java.base/java.lang.reflect.Method.invoke(Method.java:564)
   [junit4]    > 	at java.base/java.lang.Thread.run(Thread.java:844)
   [junit4]    > Caused by: org.apache.lucene.store.AlreadyClosedException: Already closed
   [junit4]    > 	at org.apache.solr.core.CachingDirectoryFactory.get(CachingDirectoryFactory.java:337)
   [junit4]    > 	at org.apache.solr.core.SolrCore.getNewIndexDir(SolrCore.java:349)
   [junit4]    > 	at org.apache.solr.core.SolrCore.getIndexDir(SolrCore.java:328)
   [junit4]    > 	at org.apache.solr.handler.ReplicationHandler.lambda$initializeMetrics$5(ReplicationHandler.java:873)
   [junit4]    > 	at com.codahale.metrics.JmxReporter$JmxGauge.getValue(JmxReporter.java:188)
   [junit4]    > 	at jdk.internal.reflect.GeneratedMethodAccessor93.invoke(Unknown Source)
   [junit4]    > 	at java.base/jdk.internal.reflect.DelegatingMethodAccessorImpl.invoke(DelegatingMethodAccessorImpl.java:43)
   [junit4]    > 	at java.base/java.lang.reflect.Method.invoke(Method.java:564)
   [junit4]    > 	at jdk.internal.reflect.GeneratedMethodAccessor85.invoke(Unknown Source)
   [junit4]    > 	at java.base/jdk.internal.reflect.DelegatingMethodAccessorImpl.invoke(DelegatingMethodAccessorImpl.java:43)
   [junit4]    > 	at java.base/java.lang.reflect.Method.invoke(Method.java:564)
   [junit4]    > 	at java.base/sun.reflect.misc.MethodUtil.invoke(MethodUtil.java:260)
   [junit4]    > 	at java.management/com.sun.jmx.mbeanserver.StandardMBeanIntrospector.invokeM2(StandardMBeanIntrospector.java:112)
   [junit4]    > 	at java.management/com.sun.jmx.mbeanserver.StandardMBeanIntrospector.invokeM2(StandardMBeanIntrospector.java:46)
   [junit4]    > 	at java.management/com.sun.jmx.mbeanserver.MBeanIntrospector.invokeM(MBeanIntrospector.java:237)
   [junit4]    > 	at java.management/com.sun.jmx.mbeanserver.PerInterface.getAttribute(PerInterface.java:83)
   [junit4]    > 	at java.management/com.sun.jmx.mbeanserver.MBeanSupport.getAttribute(MBeanSupport.java:206)
   [junit4]    > 	at java.management/com.sun.jmx.interceptor.DefaultMBeanServerInterceptor.getAttribute(DefaultMBeanServerInterceptor.java:641)
   [junit4]    > 	... 40 more
   [junit4]   2> 1242350 INFO  (SUITE-TestJmxIntegration-seed#[8AD1266E4C07868A]-worker) [    ] o.a.s.SolrTestCaseJ4 ###deleteCore
   [junit4]   2> 1242350 INFO  (SUITE-TestJmxIntegration-seed#[8AD1266E4C07868A]-worker) [    ] o.a.s.c.CoreContainer Shutting down CoreContainer instance=1792374999
   [junit4]   2> 1242350 INFO  (SUITE-TestJmxIntegration-seed#[8AD1266E4C07868A]-worker) [    ] o.a.s.m.SolrMetricManager Closing metric reporters for registry=solr.node, tag=null
   [junit4]   2> 1242352 INFO  (SUITE-TestJmxIntegration-seed#[8AD1266E4C07868A]-worker) [    ] o.a.s.m.SolrMetricManager Closing metric reporters for registry=solr.jvm, tag=null
   [junit4]   2> 1242353 INFO  (SUITE-TestJmxIntegration-seed#[8AD1266E4C07868A]-worker) [    ] o.a.s.m.SolrMetricManager Closing metric reporters for registry=solr.jetty, tag=null
   [junit4]   2> 1242353 INFO  (SUITE-TestJmxIntegration-seed#[8AD1266E4C07868A]-worker) [    ] o.a.s.c.TransientSolrCoreCacheDefault Allocating transient cache for 2147483647 transient cores
   [junit4]   2> 1242353 INFO  (coreCloseExecutor-6381-thread-1) [    ] o.a.s.c.SolrCore [collection1]  CLOSING SolrCore org.apache.solr.core.SolrCore@7de1e8d6
   [junit4]   2> 1242357 INFO  (coreCloseExecutor-6381-thread-1) [    ] o.a.s.m.SolrMetricManager Closing metric reporters for registry=solr.core.collection1, tag=2111957206
   [junit4]   2> NOTE: leaving temporary files on disk at: /home/jenkins/workspace/Lucene-Solr-master-Linux/solr/build/solr-core/test/J2/temp/solr.core.TestJmxIntegration_8AD1266E4C07868A-001
   [junit4]   2> Aug 10, 2017 9:17:51 PM com.carrotsearch.randomizedtesting.ThreadLeakControl checkThreadLeaks
   [junit4]   2> WARNING: Will linger awaiting termination of 2 leaked thread(s).
   [junit4]   2> NOTE: test params are: codec=HighCompressionCompressingStoredFields(storedFieldsFormat=CompressingStoredFieldsFormat(compressionMode=HIGH_COMPRESSION, chunkSize=6894, maxDocsPerChunk=5, blockSize=8), termVectorsFormat=CompressingTermVectorsFormat(compressionMode=HIGH_COMPRESSION, chunkSize=6894, blockSize=8)), sim=RandomSimilarity(queryNorm=false): {}, locale=fa-AF, timezone=Asia/Hong_Kong
   [junit4]   2> NOTE: Linux 4.10.0-27-generic amd64/Oracle Corporation 9 (64-bit)/cpus=8,threads=1,free=370572712,total=529006592
   [junit4]   2> NOTE: All tests run in this JVM: [TestBulkSchemaAPI, URLClassifyProcessorTest, V2StandaloneTest, DocValuesNotIndexedTest, NumericFieldsTest, TestReload, TestSort, TestObjectReleaseTracker, TestGroupingSearch, TestStressLiveNodes, ReturnFieldsTest, TestSolrDeletionPolicy2, MergeStrategyTest, TestDelegationWithHadoopAuth, TestPseudoReturnFields, PropertiesRequestHandlerTest, TestSSLRandomization, HdfsBasicDistributedZk2Test, TermsComponentTest, SuggesterFSTTest, TestSolrConfigHandlerConcurrent, TestTrie, TestDynamicFieldResource, CoreMergeIndexesAdminHandlerTest, TestCloudSchemaless, TestTolerantSearch, DistribJoinFromCollectionTest, CopyFieldTest, TestFoldingMultitermQuery, TestUtils, TestBlendedInfixSuggestions, TestBackupRepositoryFactory, TestCodecSupport, TestDeleteCollectionOnDownNodes, TestReRankQParserPlugin, TestOverriddenPrefixQueryForCustomFieldType, ConjunctionSolrSpellCheckerTest, TestConfigsApi, TestDFRSimilarityFactory, DirectUpdateHandlerOptimizeTest, TestQueryUtils, CircularListTest, SimpleMLTQParserTest, TestCloudNestedDocsSort, TestScoreJoinQPScore, TestReversedWildcardFilterFactory, SolrInfoBeanTest, DistributedExpandComponentTest, SolrGraphiteReporterTest, TemplateUpdateProcessorTest, SuggesterTest, TestRawTransformer, AnalysisErrorHandlingTest, TestComplexPhraseQParserPlugin, DeleteNodeTest, RecoveryAfterSoftCommitTest, TestSizeLimitedDistributedMap, TestTolerantUpdateProcessorRandomCloud, TestSolr4Spatial2, TestInPlaceUpdatesStandalone, ClusterStateTest, TestRecovery, TestNumericTerms64, SolrTestCaseJ4Test, SharedFSAutoReplicaFailoverTest, TestJsonFacets, TestManagedSchema, ConfigureRecoveryStrategyTest, NotRequiredUniqueKeyTest, MinimalSchemaTest, PreAnalyzedFieldTest, BlobRepositoryCloudTest, TestSQLHandler, TestConfigSetsAPIExclusivity, TestNonDefinedSimilarityFactory, SortByFunctionTest, OverseerCollectionConfigSetProcessorTest, TestLFUCache, HLLUtilTest, TestBlobHandler, ConfigSetsAPITest, BigEndianAscendingWordDeserializerTest, FullSolrCloudDistribCmdsTest, SolrMetricReporterTest, CdcrReplicationDistributedZkTest, LeaderFailureAfterFreshStartTest, BasicDistributedZk2Test, DistributedSuggestComponentTest, TestAddFieldRealTimeGet, TestPrepRecovery, TestSolrConfigHandler, DateFieldTest, TestExpandComponent, WrapperMergePolicyFactoryTest, TestFastWriter, AutoCommitTest, TestExclusionRuleCollectionAccess, TestIndexSearcher, TestLegacyFieldReuse, TestSolrCoreSnapshots, CustomCollectionTest, UnloadDistributedZkTest, AnalyticsQueryTest, TestQueryWrapperFilter, AddSchemaFieldsUpdateProcessorFactoryTest, DirectUpdateHandlerTest, TestQuerySenderListener, DateMathParserTest, ShowFileRequestHandlerTest, TestSerializedLuceneMatchVersion, HdfsRecoverLeaseTest, ExplicitHLLTest, SignatureUpdateProcessorFactoryTest, PolyFieldTest, TestReloadAndDeleteDocs, ImplicitSnitchTest, SyncSliceTest, ShardRoutingTest, RecoveryZkTest, TestReplicationHandler, ZkSolrClientTest, DistributedSpellCheckComponentTest, ZkControllerTest, TestStressVersions, HardAutoCommitTest, SimpleFacetsTest, SpellCheckComponentTest, TestLazyCores, SpellCheckCollatorTest, TestCSVLoader, SolrCoreCheckLockOnStartupTest, FieldMutatingUpdateProcessorTest, TestWordDelimiterFilterFactory, StatelessScriptUpdateProcessorFactoryTest, TestSurroundQueryParser, TestWriterPerf, TestQueryTypes, TestOmitPositions, DocumentBuilderTest, PathHierarchyTokenizerFactoryTest, RequiredFieldsTest, FastVectorHighlighterTest, TestJmxIntegration]
   [junit4] Completed [433/729 (2!)] on J2 in 0.77s, 3 tests, 1 error, 1 skipped <<< FAILURES!

[...truncated 37472 lines...]

Mime
View raw message