lucene-dev mailing list archives

Site index · List index
Message view « Date » · « Thread »
Top « Date » · « Thread »
From Policeman Jenkins Server <jenk...@thetaphi.de>
Subject [JENKINS] Lucene-Solr-7.x-Windows (64bit/jdk1.8.0_144) - Build # 117 - Still Unstable!
Date Mon, 14 Aug 2017 22:41:37 GMT
Build: https://jenkins.thetaphi.de/job/Lucene-Solr-7.x-Windows/117/
Java: 64bit/jdk1.8.0_144 -XX:-UseCompressedOops -XX:+UseConcMarkSweepGC

2 tests failed.
FAILED:  org.apache.solr.cloud.ForceLeaderTest.testReplicasInLIRNoLeader

Error Message:
Doc with id=1 not found in http://127.0.0.1:56558/forceleader_test_collection due to: Path not found: /id; rsp={doc=null}

Stack Trace:
java.lang.AssertionError: Doc with id=1 not found in http://127.0.0.1:56558/forceleader_test_collection due to: Path not found: /id; rsp={doc=null}
	at __randomizedtesting.SeedInfo.seed([502470BC77FC2F8A:B6B3447C4E7ED6EB]:0)
	at org.junit.Assert.fail(Assert.java:93)
	at org.junit.Assert.assertTrue(Assert.java:43)
	at org.apache.solr.cloud.HttpPartitionTest.assertDocExists(HttpPartitionTest.java:603)
	at org.apache.solr.cloud.HttpPartitionTest.assertDocsExistInAllReplicas(HttpPartitionTest.java:556)
	at org.apache.solr.cloud.ForceLeaderTest.testReplicasInLIRNoLeader(ForceLeaderTest.java:142)
	at sun.reflect.NativeMethodAccessorImpl.invoke0(Native Method)
	at sun.reflect.NativeMethodAccessorImpl.invoke(NativeMethodAccessorImpl.java:62)
	at sun.reflect.DelegatingMethodAccessorImpl.invoke(DelegatingMethodAccessorImpl.java:43)
	at java.lang.reflect.Method.invoke(Method.java:498)
	at com.carrotsearch.randomizedtesting.RandomizedRunner.invoke(RandomizedRunner.java:1713)
	at com.carrotsearch.randomizedtesting.RandomizedRunner$8.evaluate(RandomizedRunner.java:907)
	at com.carrotsearch.randomizedtesting.RandomizedRunner$9.evaluate(RandomizedRunner.java:943)
	at com.carrotsearch.randomizedtesting.RandomizedRunner$10.evaluate(RandomizedRunner.java:957)
	at org.apache.solr.BaseDistributedSearchTestCase$ShardsRepeatRule$ShardsFixedStatement.callStatement(BaseDistributedSearchTestCase.java:993)
	at org.apache.solr.BaseDistributedSearchTestCase$ShardsRepeatRule$ShardsStatement.evaluate(BaseDistributedSearchTestCase.java:968)
	at com.carrotsearch.randomizedtesting.rules.SystemPropertiesRestoreRule$1.evaluate(SystemPropertiesRestoreRule.java:57)
	at org.apache.lucene.util.TestRuleSetupTeardownChained$1.evaluate(TestRuleSetupTeardownChained.java:49)
	at org.apache.lucene.util.AbstractBeforeAfterRule$1.evaluate(AbstractBeforeAfterRule.java:45)
	at org.apache.lucene.util.TestRuleThreadAndTestName$1.evaluate(TestRuleThreadAndTestName.java:48)
	at org.apache.lucene.util.TestRuleIgnoreAfterMaxFailures$1.evaluate(TestRuleIgnoreAfterMaxFailures.java:64)
	at org.apache.lucene.util.TestRuleMarkFailure$1.evaluate(TestRuleMarkFailure.java:47)
	at com.carrotsearch.randomizedtesting.rules.StatementAdapter.evaluate(StatementAdapter.java:36)
	at com.carrotsearch.randomizedtesting.ThreadLeakControl$StatementRunner.run(ThreadLeakControl.java:368)
	at com.carrotsearch.randomizedtesting.ThreadLeakControl.forkTimeoutingTask(ThreadLeakControl.java:817)
	at com.carrotsearch.randomizedtesting.ThreadLeakControl$3.evaluate(ThreadLeakControl.java:468)
	at com.carrotsearch.randomizedtesting.RandomizedRunner.runSingleTest(RandomizedRunner.java:916)
	at com.carrotsearch.randomizedtesting.RandomizedRunner$5.evaluate(RandomizedRunner.java:802)
	at com.carrotsearch.randomizedtesting.RandomizedRunner$6.evaluate(RandomizedRunner.java:852)
	at com.carrotsearch.randomizedtesting.RandomizedRunner$7.evaluate(RandomizedRunner.java:863)
	at com.carrotsearch.randomizedtesting.rules.StatementAdapter.evaluate(StatementAdapter.java:36)
	at com.carrotsearch.randomizedtesting.rules.SystemPropertiesRestoreRule$1.evaluate(SystemPropertiesRestoreRule.java:57)
	at org.apache.lucene.util.AbstractBeforeAfterRule$1.evaluate(AbstractBeforeAfterRule.java:45)
	at com.carrotsearch.randomizedtesting.rules.StatementAdapter.evaluate(StatementAdapter.java:36)
	at org.apache.lucene.util.TestRuleStoreClassName$1.evaluate(TestRuleStoreClassName.java:41)
	at com.carrotsearch.randomizedtesting.rules.NoShadowingOrOverridesOnMethodsRule$1.evaluate(NoShadowingOrOverridesOnMethodsRule.java:40)
	at com.carrotsearch.randomizedtesting.rules.NoShadowingOrOverridesOnMethodsRule$1.evaluate(NoShadowingOrOverridesOnMethodsRule.java:40)
	at com.carrotsearch.randomizedtesting.rules.StatementAdapter.evaluate(StatementAdapter.java:36)
	at com.carrotsearch.randomizedtesting.rules.StatementAdapter.evaluate(StatementAdapter.java:36)
	at com.carrotsearch.randomizedtesting.rules.StatementAdapter.evaluate(StatementAdapter.java:36)
	at org.apache.lucene.util.TestRuleAssertionsRequired$1.evaluate(TestRuleAssertionsRequired.java:53)
	at org.apache.lucene.util.TestRuleMarkFailure$1.evaluate(TestRuleMarkFailure.java:47)
	at org.apache.lucene.util.TestRuleIgnoreAfterMaxFailures$1.evaluate(TestRuleIgnoreAfterMaxFailures.java:64)
	at org.apache.lucene.util.TestRuleIgnoreTestSuites$1.evaluate(TestRuleIgnoreTestSuites.java:54)
	at com.carrotsearch.randomizedtesting.rules.StatementAdapter.evaluate(StatementAdapter.java:36)
	at com.carrotsearch.randomizedtesting.ThreadLeakControl$StatementRunner.run(ThreadLeakControl.java:368)
	at java.lang.Thread.run(Thread.java:748)


FAILED:  org.apache.solr.cloud.TestAuthenticationFramework.testBasics

Error Message:
Error from server at http://127.0.0.1:49710/solr/testcollection_shard1_replica_n2: Expected mime type application/octet-stream but got text/html. <html> <head> <meta http-equiv="Content-Type" content="text/html;charset=ISO-8859-1"/> <title>Error 404 </title> </head> <body> <h2>HTTP ERROR: 404</h2> <p>Problem accessing /solr/testcollection_shard1_replica_n2/update. Reason: <pre>    Can not find: /solr/testcollection_shard1_replica_n2/update</pre></p> <hr /><a href="http://eclipse.org/jetty">Powered by Jetty:// 9.3.14.v20161028</a><hr/> </body> </html> 

Stack Trace:
org.apache.solr.client.solrj.impl.CloudSolrClient$RouteException: Error from server at http://127.0.0.1:49710/solr/testcollection_shard1_replica_n2: Expected mime type application/octet-stream but got text/html. <html>
<head>
<meta http-equiv="Content-Type" content="text/html;charset=ISO-8859-1"/>
<title>Error 404 </title>
</head>
<body>
<h2>HTTP ERROR: 404</h2>
<p>Problem accessing /solr/testcollection_shard1_replica_n2/update. Reason:
<pre>    Can not find: /solr/testcollection_shard1_replica_n2/update</pre></p>
<hr /><a href="http://eclipse.org/jetty">Powered by Jetty:// 9.3.14.v20161028</a><hr/>
</body>
</html>

	at __randomizedtesting.SeedInfo.seed([502470BC77FC2F8A:6DFCDE904F1271FA]:0)
	at org.apache.solr.client.solrj.impl.CloudSolrClient.directUpdate(CloudSolrClient.java:539)
	at org.apache.solr.client.solrj.impl.CloudSolrClient.sendRequest(CloudSolrClient.java:993)
	at org.apache.solr.client.solrj.impl.CloudSolrClient.requestWithRetryOnStaleState(CloudSolrClient.java:862)
	at org.apache.solr.client.solrj.impl.CloudSolrClient.request(CloudSolrClient.java:793)
	at org.apache.solr.client.solrj.SolrRequest.process(SolrRequest.java:178)
	at org.apache.solr.client.solrj.request.UpdateRequest.commit(UpdateRequest.java:233)
	at org.apache.solr.cloud.TestAuthenticationFramework.collectionCreateSearchDeleteTwice(TestAuthenticationFramework.java:126)
	at org.apache.solr.cloud.TestAuthenticationFramework.testBasics(TestAuthenticationFramework.java:74)
	at sun.reflect.NativeMethodAccessorImpl.invoke0(Native Method)
	at sun.reflect.NativeMethodAccessorImpl.invoke(NativeMethodAccessorImpl.java:62)
	at sun.reflect.DelegatingMethodAccessorImpl.invoke(DelegatingMethodAccessorImpl.java:43)
	at java.lang.reflect.Method.invoke(Method.java:498)
	at com.carrotsearch.randomizedtesting.RandomizedRunner.invoke(RandomizedRunner.java:1713)
	at com.carrotsearch.randomizedtesting.RandomizedRunner$8.evaluate(RandomizedRunner.java:907)
	at com.carrotsearch.randomizedtesting.RandomizedRunner$9.evaluate(RandomizedRunner.java:943)
	at com.carrotsearch.randomizedtesting.RandomizedRunner$10.evaluate(RandomizedRunner.java:957)
	at com.carrotsearch.randomizedtesting.rules.SystemPropertiesRestoreRule$1.evaluate(SystemPropertiesRestoreRule.java:57)
	at org.apache.lucene.util.TestRuleSetupTeardownChained$1.evaluate(TestRuleSetupTeardownChained.java:49)
	at org.apache.lucene.util.AbstractBeforeAfterRule$1.evaluate(AbstractBeforeAfterRule.java:45)
	at org.apache.lucene.util.TestRuleThreadAndTestName$1.evaluate(TestRuleThreadAndTestName.java:48)
	at org.apache.lucene.util.TestRuleIgnoreAfterMaxFailures$1.evaluate(TestRuleIgnoreAfterMaxFailures.java:64)
	at org.apache.lucene.util.TestRuleMarkFailure$1.evaluate(TestRuleMarkFailure.java:47)
	at com.carrotsearch.randomizedtesting.rules.StatementAdapter.evaluate(StatementAdapter.java:36)
	at com.carrotsearch.randomizedtesting.ThreadLeakControl$StatementRunner.run(ThreadLeakControl.java:368)
	at com.carrotsearch.randomizedtesting.ThreadLeakControl.forkTimeoutingTask(ThreadLeakControl.java:817)
	at com.carrotsearch.randomizedtesting.ThreadLeakControl$3.evaluate(ThreadLeakControl.java:468)
	at com.carrotsearch.randomizedtesting.RandomizedRunner.runSingleTest(RandomizedRunner.java:916)
	at com.carrotsearch.randomizedtesting.RandomizedRunner$5.evaluate(RandomizedRunner.java:802)
	at com.carrotsearch.randomizedtesting.RandomizedRunner$6.evaluate(RandomizedRunner.java:852)
	at com.carrotsearch.randomizedtesting.RandomizedRunner$7.evaluate(RandomizedRunner.java:863)
	at com.carrotsearch.randomizedtesting.rules.StatementAdapter.evaluate(StatementAdapter.java:36)
	at com.carrotsearch.randomizedtesting.rules.SystemPropertiesRestoreRule$1.evaluate(SystemPropertiesRestoreRule.java:57)
	at org.apache.lucene.util.AbstractBeforeAfterRule$1.evaluate(AbstractBeforeAfterRule.java:45)
	at com.carrotsearch.randomizedtesting.rules.StatementAdapter.evaluate(StatementAdapter.java:36)
	at org.apache.lucene.util.TestRuleStoreClassName$1.evaluate(TestRuleStoreClassName.java:41)
	at com.carrotsearch.randomizedtesting.rules.NoShadowingOrOverridesOnMethodsRule$1.evaluate(NoShadowingOrOverridesOnMethodsRule.java:40)
	at com.carrotsearch.randomizedtesting.rules.NoShadowingOrOverridesOnMethodsRule$1.evaluate(NoShadowingOrOverridesOnMethodsRule.java:40)
	at com.carrotsearch.randomizedtesting.rules.StatementAdapter.evaluate(StatementAdapter.java:36)
	at com.carrotsearch.randomizedtesting.rules.StatementAdapter.evaluate(StatementAdapter.java:36)
	at com.carrotsearch.randomizedtesting.rules.StatementAdapter.evaluate(StatementAdapter.java:36)
	at org.apache.lucene.util.TestRuleAssertionsRequired$1.evaluate(TestRuleAssertionsRequired.java:53)
	at org.apache.lucene.util.TestRuleMarkFailure$1.evaluate(TestRuleMarkFailure.java:47)
	at org.apache.lucene.util.TestRuleIgnoreAfterMaxFailures$1.evaluate(TestRuleIgnoreAfterMaxFailures.java:64)
	at org.apache.lucene.util.TestRuleIgnoreTestSuites$1.evaluate(TestRuleIgnoreTestSuites.java:54)
	at com.carrotsearch.randomizedtesting.rules.StatementAdapter.evaluate(StatementAdapter.java:36)
	at com.carrotsearch.randomizedtesting.ThreadLeakControl$StatementRunner.run(ThreadLeakControl.java:368)
	at java.lang.Thread.run(Thread.java:748)
Caused by: org.apache.solr.client.solrj.impl.HttpSolrClient$RemoteSolrException: Error from server at http://127.0.0.1:49710/solr/testcollection_shard1_replica_n2: Expected mime type application/octet-stream but got text/html. <html>
<head>
<meta http-equiv="Content-Type" content="text/html;charset=ISO-8859-1"/>
<title>Error 404 </title>
</head>
<body>
<h2>HTTP ERROR: 404</h2>
<p>Problem accessing /solr/testcollection_shard1_replica_n2/update. Reason:
<pre>    Can not find: /solr/testcollection_shard1_replica_n2/update</pre></p>
<hr /><a href="http://eclipse.org/jetty">Powered by Jetty:// 9.3.14.v20161028</a><hr/>
</body>
</html>

	at org.apache.solr.client.solrj.impl.HttpSolrClient.executeMethod(HttpSolrClient.java:591)
	at org.apache.solr.client.solrj.impl.HttpSolrClient.request(HttpSolrClient.java:253)
	at org.apache.solr.client.solrj.impl.HttpSolrClient.request(HttpSolrClient.java:242)
	at org.apache.solr.client.solrj.impl.LBHttpSolrClient.doRequest(LBHttpSolrClient.java:483)
	at org.apache.solr.client.solrj.impl.LBHttpSolrClient.request(LBHttpSolrClient.java:413)
	at org.apache.solr.client.solrj.impl.CloudSolrClient.lambda$directUpdate$0(CloudSolrClient.java:516)
	at java.util.concurrent.FutureTask.run(FutureTask.java:266)
	at org.apache.solr.common.util.ExecutorUtil$MDCAwareThreadPoolExecutor.lambda$execute$0(ExecutorUtil.java:188)
	at java.util.concurrent.ThreadPoolExecutor.runWorker(ThreadPoolExecutor.java:1149)
	at java.util.concurrent.ThreadPoolExecutor$Worker.run(ThreadPoolExecutor.java:624)
	... 1 more




Build Log:
[...truncated 10805 lines...]
   [junit4] Suite: org.apache.solr.cloud.TestAuthenticationFramework
   [junit4]   2> 62702 INFO  (SUITE-TestAuthenticationFramework-seed#[502470BC77FC2F8A]-worker) [    ] o.a.s.SolrTestCaseJ4 SecureRandom sanity checks: test.solr.allowed.securerandom=null & java.security.egd=file:/dev/./urandom
   [junit4]   2> Creating dataDir: C:\Users\jenkins\workspace\Lucene-Solr-7.x-Windows\solr\build\solr-core\test\J0\temp\solr.cloud.TestAuthenticationFramework_502470BC77FC2F8A-001\init-core-data-001
   [junit4]   2> 62703 INFO  (SUITE-TestAuthenticationFramework-seed#[502470BC77FC2F8A]-worker) [    ] o.a.s.SolrTestCaseJ4 Using TrieFields (NUMERIC_POINTS_SYSPROP=false) w/NUMERIC_DOCVALUES_SYSPROP=true
   [junit4]   2> 62704 INFO  (SUITE-TestAuthenticationFramework-seed#[502470BC77FC2F8A]-worker) [    ] o.a.s.SolrTestCaseJ4 Randomized ssl (false) and clientAuth (false) via: @org.apache.solr.util.RandomizeSSL(reason=, value=NaN, ssl=NaN, clientAuth=NaN)
   [junit4]   2> 62732 INFO  (TEST-TestAuthenticationFramework.testBasics-seed#[502470BC77FC2F8A]) [    ] o.a.s.c.MiniSolrCloudCluster Starting cluster of 2 servers in C:\Users\jenkins\workspace\Lucene-Solr-7.x-Windows\solr\build\solr-core\test\J0\temp\solr.cloud.TestAuthenticationFramework_502470BC77FC2F8A-001\tempDir-001
   [junit4]   2> 62733 INFO  (TEST-TestAuthenticationFramework.testBasics-seed#[502470BC77FC2F8A]) [    ] o.a.s.c.ZkTestServer STARTING ZK TEST SERVER
   [junit4]   2> 62733 INFO  (Thread-48) [    ] o.a.s.c.ZkTestServer client port:0.0.0.0/0.0.0.0:0
   [junit4]   2> 62733 INFO  (Thread-48) [    ] o.a.s.c.ZkTestServer Starting server
   [junit4]   2> 62742 ERROR (Thread-48) [    ] o.a.z.s.ZooKeeperServer ZKShutdownHandler is not registered, so ZooKeeper server won't take any action on ERROR or SHUTDOWN server state changes
   [junit4]   2> 62833 INFO  (TEST-TestAuthenticationFramework.testBasics-seed#[502470BC77FC2F8A]) [    ] o.a.s.c.ZkTestServer start zk server on port:49703
   [junit4]   2> 62881 INFO  (jetty-launcher-22-thread-1) [    ] o.e.j.s.Server jetty-9.3.14.v20161028
   [junit4]   2> 62881 INFO  (jetty-launcher-22-thread-2) [    ] o.e.j.s.Server jetty-9.3.14.v20161028
   [junit4]   2> 62883 INFO  (jetty-launcher-22-thread-2) [    ] o.e.j.s.h.ContextHandler Started o.e.j.s.ServletContextHandler@3b92111{/solr,null,AVAILABLE}
   [junit4]   2> 62889 INFO  (jetty-launcher-22-thread-1) [    ] o.e.j.s.h.ContextHandler Started o.e.j.s.ServletContextHandler@3583fd6d{/solr,null,AVAILABLE}
   [junit4]   2> 62890 INFO  (jetty-launcher-22-thread-1) [    ] o.e.j.s.AbstractConnector Started ServerConnector@151501cc{HTTP/1.1,[http/1.1]}{127.0.0.1:49710}
   [junit4]   2> 62890 INFO  (jetty-launcher-22-thread-1) [    ] o.e.j.s.Server Started @70718ms
   [junit4]   2> 62890 INFO  (jetty-launcher-22-thread-1) [    ] o.a.s.c.s.e.JettySolrRunner Jetty properties: {hostContext=/solr, hostPort=49710}
   [junit4]   2> 62891 ERROR (jetty-launcher-22-thread-1) [    ] o.a.s.s.StartupLoggingUtils Missing Java Option solr.log.dir. Logging may be missing or incomplete.
   [junit4]   2> 62891 INFO  (jetty-launcher-22-thread-1) [    ] o.a.s.s.SolrDispatchFilter  ___      _       Welcome to Apache Solr? version 7.1.0
   [junit4]   2> 62891 INFO  (jetty-launcher-22-thread-1) [    ] o.a.s.s.SolrDispatchFilter / __| ___| |_ _   Starting in cloud mode on port null
   [junit4]   2> 62891 INFO  (jetty-launcher-22-thread-1) [    ] o.a.s.s.SolrDispatchFilter \__ \/ _ \ | '_|  Install dir: null, Default config dir: null
   [junit4]   2> 62891 INFO  (jetty-launcher-22-thread-1) [    ] o.a.s.s.SolrDispatchFilter |___/\___/_|_|    Start time: 2017-08-14T21:23:59.697Z
   [junit4]   2> 62893 INFO  (jetty-launcher-22-thread-2) [    ] o.e.j.s.AbstractConnector Started ServerConnector@7dc09500{HTTP/1.1,[http/1.1]}{127.0.0.1:49707}
   [junit4]   2> 62898 INFO  (jetty-launcher-22-thread-2) [    ] o.e.j.s.Server Started @70723ms
   [junit4]   2> 62900 INFO  (jetty-launcher-22-thread-2) [    ] o.a.s.c.s.e.JettySolrRunner Jetty properties: {hostContext=/solr, hostPort=49707}
   [junit4]   2> 62903 ERROR (jetty-launcher-22-thread-2) [    ] o.a.s.s.StartupLoggingUtils Missing Java Option solr.log.dir. Logging may be missing or incomplete.
   [junit4]   2> 62906 INFO  (jetty-launcher-22-thread-2) [    ] o.a.s.s.SolrDispatchFilter  ___      _       Welcome to Apache Solr? version 7.1.0
   [junit4]   2> 62907 INFO  (jetty-launcher-22-thread-2) [    ] o.a.s.s.SolrDispatchFilter / __| ___| |_ _   Starting in cloud mode on port null
   [junit4]   2> 62907 INFO  (jetty-launcher-22-thread-2) [    ] o.a.s.s.SolrDispatchFilter \__ \/ _ \ | '_|  Install dir: null, Default config dir: null
   [junit4]   2> 62907 INFO  (jetty-launcher-22-thread-2) [    ] o.a.s.s.SolrDispatchFilter |___/\___/_|_|    Start time: 2017-08-14T21:23:59.713Z
   [junit4]   2> 62914 INFO  (jetty-launcher-22-thread-1) [    ] o.a.s.s.SolrDispatchFilter solr.xml found in ZooKeeper. Loading...
   [junit4]   2> 62923 INFO  (jetty-launcher-22-thread-2) [    ] o.a.s.s.SolrDispatchFilter solr.xml found in ZooKeeper. Loading...
   [junit4]   2> 62936 WARN  (NIOServerCxn.Factory:0.0.0.0/0.0.0.0:0) [    ] o.a.z.s.NIOServerCnxn caught end of stream exception
   [junit4]   2> EndOfStreamException: Unable to read additional data from client sessionid 0x15de2a1c7b60001, likely client has closed socket
   [junit4]   2> 	at org.apache.zookeeper.server.NIOServerCnxn.doIO(NIOServerCnxn.java:239)
   [junit4]   2> 	at org.apache.zookeeper.server.NIOServerCnxnFactory.run(NIOServerCnxnFactory.java:203)
   [junit4]   2> 	at java.lang.Thread.run(Thread.java:748)
   [junit4]   2> 62945 WARN  (NIOServerCxn.Factory:0.0.0.0/0.0.0.0:0) [    ] o.a.z.s.NIOServerCnxn caught end of stream exception
   [junit4]   2> EndOfStreamException: Unable to read additional data from client sessionid 0x15de2a1c7b60002, likely client has closed socket
   [junit4]   2> 	at org.apache.zookeeper.server.NIOServerCnxn.doIO(NIOServerCnxn.java:239)
   [junit4]   2> 	at org.apache.zookeeper.server.NIOServerCnxnFactory.run(NIOServerCnxnFactory.java:203)
   [junit4]   2> 	at java.lang.Thread.run(Thread.java:748)
   [junit4]   2> 62951 INFO  (jetty-launcher-22-thread-2) [    ] o.a.s.c.ZkContainer Zookeeper client=127.0.0.1:49703/solr
   [junit4]   2> 62951 INFO  (jetty-launcher-22-thread-1) [    ] o.a.s.c.ZkContainer Zookeeper client=127.0.0.1:49703/solr
   [junit4]   2> 63384 INFO  (jetty-launcher-22-thread-1) [n:127.0.0.1:49710_solr    ] o.a.s.c.Overseer Overseer (id=null) closing
   [junit4]   2> 63384 INFO  (jetty-launcher-22-thread-2) [n:127.0.0.1:49707_solr    ] o.a.s.c.Overseer Overseer (id=null) closing
   [junit4]   2> 63392 INFO  (jetty-launcher-22-thread-1) [n:127.0.0.1:49710_solr    ] o.a.s.c.OverseerElectionContext I am going to be the leader 127.0.0.1:49710_solr
   [junit4]   2> 63396 INFO  (jetty-launcher-22-thread-1) [n:127.0.0.1:49710_solr    ] o.a.s.c.Overseer Overseer (id=98483951340224517-127.0.0.1:49710_solr-n_0000000000) starting
   [junit4]   2> 63411 INFO  (jetty-launcher-22-thread-2) [n:127.0.0.1:49707_solr    ] o.a.s.c.ZkController Register node as live in ZooKeeper:/live_nodes/127.0.0.1:49707_solr
   [junit4]   2> 63425 INFO  (zkCallback-33-thread-1-processing-n:127.0.0.1:49707_solr) [n:127.0.0.1:49707_solr    ] o.a.s.c.c.ZkStateReader Updated live nodes from ZooKeeper... (0) -> (1)
   [junit4]   2> 63426 INFO  (zkCallback-34-thread-1-processing-n:127.0.0.1:49710_solr) [n:127.0.0.1:49710_solr    ] o.a.s.c.c.ZkStateReader Updated live nodes from ZooKeeper... (0) -> (1)
   [junit4]   2> 63537 INFO  (jetty-launcher-22-thread-2) [n:127.0.0.1:49707_solr    ] o.a.s.c.CoreContainer Initializing authentication plugin: org.apache.solr.cloud.TestAuthenticationFramework$MockAuthenticationPlugin
   [junit4]   2> 63598 INFO  (jetty-launcher-22-thread-1) [n:127.0.0.1:49710_solr    ] o.a.s.c.ZkController Register node as live in ZooKeeper:/live_nodes/127.0.0.1:49710_solr
   [junit4]   2> 63612 INFO  (zkCallback-33-thread-1-processing-n:127.0.0.1:49707_solr) [n:127.0.0.1:49707_solr    ] o.a.s.c.c.ZkStateReader Updated live nodes from ZooKeeper... (1) -> (2)
   [junit4]   2> 63637 INFO  (OverseerStateUpdate-98483951340224517-127.0.0.1:49710_solr-n_0000000000) [n:127.0.0.1:49710_solr    ] o.a.s.c.c.ZkStateReader Updated live nodes from ZooKeeper... (1) -> (2)
   [junit4]   2> 63721 INFO  (jetty-launcher-22-thread-1) [n:127.0.0.1:49710_solr    ] o.a.s.c.CoreContainer Initializing authentication plugin: org.apache.solr.cloud.TestAuthenticationFramework$MockAuthenticationPlugin
   [junit4]   2> 63890 INFO  (jetty-launcher-22-thread-1) [n:127.0.0.1:49710_solr    ] o.a.s.m.r.SolrJmxReporter JMX monitoring for 'solr_49710.solr.node' (registry 'solr.node') enabled at server: com.sun.jmx.mbeanserver.JmxMBeanServer@48f6a78e
   [junit4]   2> 63896 INFO  (jetty-launcher-22-thread-2) [n:127.0.0.1:49707_solr    ] o.a.s.m.r.SolrJmxReporter JMX monitoring for 'solr_49707.solr.node' (registry 'solr.node') enabled at server: com.sun.jmx.mbeanserver.JmxMBeanServer@48f6a78e
   [junit4]   2> 63915 INFO  (jetty-launcher-22-thread-2) [n:127.0.0.1:49707_solr    ] o.a.s.m.r.SolrJmxReporter JMX monitoring for 'solr_49707.solr.jvm' (registry 'solr.jvm') enabled at server: com.sun.jmx.mbeanserver.JmxMBeanServer@48f6a78e
   [junit4]   2> 63915 INFO  (jetty-launcher-22-thread-2) [n:127.0.0.1:49707_solr    ] o.a.s.m.r.SolrJmxReporter JMX monitoring for 'solr_49707.solr.jetty' (registry 'solr.jetty') enabled at server: com.sun.jmx.mbeanserver.JmxMBeanServer@48f6a78e
   [junit4]   2> 63920 INFO  (jetty-launcher-22-thread-2) [n:127.0.0.1:49707_solr    ] o.a.s.c.CorePropertiesLocator Found 0 core definitions underneath C:\Users\jenkins\workspace\Lucene-Solr-7.x-Windows\solr\build\solr-core\test\J0\temp\solr.cloud.TestAuthenticationFramework_502470BC77FC2F8A-001\tempDir-001\node2\.
   [junit4]   2> 63935 INFO  (jetty-launcher-22-thread-1) [n:127.0.0.1:49710_solr    ] o.a.s.m.r.SolrJmxReporter JMX monitoring for 'solr_49710.solr.jvm' (registry 'solr.jvm') enabled at server: com.sun.jmx.mbeanserver.JmxMBeanServer@48f6a78e
   [junit4]   2> 63935 INFO  (jetty-launcher-22-thread-1) [n:127.0.0.1:49710_solr    ] o.a.s.m.r.SolrJmxReporter JMX monitoring for 'solr_49710.solr.jetty' (registry 'solr.jetty') enabled at server: com.sun.jmx.mbeanserver.JmxMBeanServer@48f6a78e
   [junit4]   2> 63937 INFO  (jetty-launcher-22-thread-1) [n:127.0.0.1:49710_solr    ] o.a.s.c.CorePropertiesLocator Found 0 core definitions underneath C:\Users\jenkins\workspace\Lucene-Solr-7.x-Windows\solr\build\solr-core\test\J0\temp\solr.cloud.TestAuthenticationFramework_502470BC77FC2F8A-001\tempDir-001\node1\.
   [junit4]   2> 64029 WARN  (NIOServerCxn.Factory:0.0.0.0/0.0.0.0:0) [    ] o.a.z.s.NIOServerCnxn caught end of stream exception
   [junit4]   2> EndOfStreamException: Unable to read additional data from client sessionid 0x15de2a1c7b60007, likely client has closed socket
   [junit4]   2> 	at org.apache.zookeeper.server.NIOServerCnxn.doIO(NIOServerCnxn.java:239)
   [junit4]   2> 	at org.apache.zookeeper.server.NIOServerCnxnFactory.run(NIOServerCnxnFactory.java:203)
   [junit4]   2> 	at java.lang.Thread.run(Thread.java:748)
   [junit4]   2> 64080 INFO  (TEST-TestAuthenticationFramework.testBasics-seed#[502470BC77FC2F8A]) [    ] o.a.s.c.c.ZkStateReader Updated live nodes from ZooKeeper... (0) -> (2)
   [junit4]   2> 64081 INFO  (TEST-TestAuthenticationFramework.testBasics-seed#[502470BC77FC2F8A]) [    ] o.a.s.c.s.i.ZkClientClusterStateProvider Cluster at 127.0.0.1:49703/solr ready
   [junit4]   2> 64088 INFO  (TEST-TestAuthenticationFramework.testBasics-seed#[502470BC77FC2F8A]) [    ] o.a.s.SolrTestCaseJ4 ###Starting testBasics
   [junit4]   2> 64108 INFO  (qtp438818493-1227) [n:127.0.0.1:49707_solr    ] o.a.s.h.a.CollectionsHandler Invoked Collection Action :create with params async=254cbecd-7455-4df3-9fd0-12bd57553464&replicationFactor=2&collection.configName=solrCloudCollectionConfig&maxShardsPerNode=2&name=testcollection&nrtReplicas=2&action=CREATE&numShards=2&wt=javabin&version=2 and sendToOCPQueue=true
   [junit4]   2> 64138 INFO  (qtp438818493-1227) [n:127.0.0.1:49707_solr    ] o.a.s.s.HttpSolrCall [admin] webapp=null path=/admin/collections params={async=254cbecd-7455-4df3-9fd0-12bd57553464&replicationFactor=2&collection.configName=solrCloudCollectionConfig&maxShardsPerNode=2&name=testcollection&nrtReplicas=2&action=CREATE&numShards=2&wt=javabin&version=2} status=0 QTime=30
   [junit4]   2> 64149 INFO  (qtp438818493-1237) [n:127.0.0.1:49707_solr    ] o.a.s.h.a.CollectionsHandler Invoked Collection Action :requeststatus with params requestid=254cbecd-7455-4df3-9fd0-12bd57553464&action=REQUESTSTATUS&wt=javabin&version=2 and sendToOCPQueue=true
   [junit4]   2> 64153 INFO  (qtp438818493-1237) [n:127.0.0.1:49707_solr    ] o.a.s.s.HttpSolrCall [admin] webapp=null path=/admin/collections params={requestid=254cbecd-7455-4df3-9fd0-12bd57553464&action=REQUESTSTATUS&wt=javabin&version=2} status=0 QTime=4
   [junit4]   2> 64163 INFO  (OverseerThreadFactory-119-thread-1-processing-n:127.0.0.1:49710_solr) [n:127.0.0.1:49710_solr    ] o.a.s.c.CreateCollectionCmd Create collection testcollection
   [junit4]   2> 64301 INFO  (OverseerStateUpdate-98483951340224517-127.0.0.1:49710_solr-n_0000000000) [n:127.0.0.1:49710_solr    ] o.a.s.c.o.SliceMutator createReplica() {
   [junit4]   2>   "operation":"ADDREPLICA",
   [junit4]   2>   "collection":"testcollection",
   [junit4]   2>   "shard":"shard1",
   [junit4]   2>   "core":"testcollection_shard1_replica_n1",
   [junit4]   2>   "state":"down",
   [junit4]   2>   "base_url":"http://127.0.0.1:49707/solr",
   [junit4]   2>   "type":"NRT"} 
   [junit4]   2> 64308 INFO  (OverseerStateUpdate-98483951340224517-127.0.0.1:49710_solr-n_0000000000) [n:127.0.0.1:49710_solr    ] o.a.s.c.o.SliceMutator createReplica() {
   [junit4]   2>   "operation":"ADDREPLICA",
   [junit4]   2>   "collection":"testcollection",
   [junit4]   2>   "shard":"shard1",
   [junit4]   2>   "core":"testcollection_shard1_replica_n2",
   [junit4]   2>   "state":"down",
   [junit4]   2>   "base_url":"http://127.0.0.1:49710/solr",
   [junit4]   2>   "type":"NRT"} 
   [junit4]   2> 64310 INFO  (OverseerStateUpdate-98483951340224517-127.0.0.1:49710_solr-n_0000000000) [n:127.0.0.1:49710_solr    ] o.a.s.c.o.SliceMutator createReplica() {
   [junit4]   2>   "operation":"ADDREPLICA",
   [junit4]   2>   "collection":"testcollection",
   [junit4]   2>   "shard":"shard2",
   [junit4]   2>   "core":"testcollection_shard2_replica_n4",
   [junit4]   2>   "state":"down",
   [junit4]   2>   "base_url":"http://127.0.0.1:49707/solr",
   [junit4]   2>   "type":"NRT"} 
   [junit4]   2> 64313 INFO  (OverseerStateUpdate-98483951340224517-127.0.0.1:49710_solr-n_0000000000) [n:127.0.0.1:49710_solr    ] o.a.s.c.o.SliceMutator createReplica() {
   [junit4]   2>   "operation":"ADDREPLICA",
   [junit4]   2>   "collection":"testcollection",
   [junit4]   2>   "shard":"shard2",
   [junit4]   2>   "core":"testcollection_shard2_replica_n5",
   [junit4]   2>   "state":"down",
   [junit4]   2>   "base_url":"http://127.0.0.1:49710/solr",
   [junit4]   2>   "type":"NRT"} 
   [junit4]   2> 64545 INFO  (qtp438818493-1239) [n:127.0.0.1:49707_solr    ] o.a.s.s.HttpSolrCall [admin] webapp=null path=/admin/cores params={qt=/admin/cores&collection.configName=solrCloudCollectionConfig&newCollection=true&collection=testcollection&version=2&replicaType=NRT&async=254cbecd-7455-4df3-9fd0-12bd57553464460862194378579&coreNodeName=core_node3&name=testcollection_shard1_replica_n1&action=CREATE&numShards=2&shard=shard1&wt=javabin} status=0 QTime=6
   [junit4]   2> 64551 INFO  (parallelCoreAdminExecutor-121-thread-1-processing-n:127.0.0.1:49707_solr 254cbecd-7455-4df3-9fd0-12bd57553464460862194378579 CREATE) [n:127.0.0.1:49707_solr    ] o.a.s.h.a.CoreAdminOperation core create command qt=/admin/cores&collection.configName=solrCloudCollectionConfig&newCollection=true&collection=testcollection&version=2&replicaType=NRT&async=254cbecd-7455-4df3-9fd0-12bd57553464460862194378579&coreNodeName=core_node3&name=testcollection_shard1_replica_n1&action=CREATE&numShards=2&shard=shard1&wt=javabin
   [junit4]   2> 64551 INFO  (qtp1540063276-1233) [n:127.0.0.1:49710_solr    ] o.a.s.s.HttpSolrCall [admin] webapp=null path=/admin/cores params={qt=/admin/cores&collection.configName=solrCloudCollectionConfig&newCollection=true&collection=testcollection&version=2&replicaType=NRT&async=254cbecd-7455-4df3-9fd0-12bd57553464460862201624235&coreNodeName=core_node6&name=testcollection_shard1_replica_n2&action=CREATE&numShards=2&shard=shard1&wt=javabin} status=0 QTime=5
   [junit4]   2> 64557 INFO  (qtp438818493-1235) [n:127.0.0.1:49707_solr    ] o.a.s.s.HttpSolrCall [admin] webapp=null path=/admin/cores params={qt=/admin/cores&collection.configName=solrCloudCollectionConfig&newCollection=true&collection=testcollection&version=2&replicaType=NRT&async=254cbecd-7455-4df3-9fd0-12bd57553464460862204216946&coreNodeName=core_node7&name=testcollection_shard2_replica_n4&action=CREATE&numShards=2&shard=shard2&wt=javabin} status=0 QTime=18
   [junit4]   2> 64558 INFO  (qtp1540063276-1241) [n:127.0.0.1:49710_solr    ] o.a.s.s.HttpSolrCall [admin] webapp=null path=/admin/cores params={qt=/admin/cores&collection.configName=solrCloudCollectionConfig&newCollection=true&collection=testcollection&version=2&replicaType=NRT&async=254cbecd-7455-4df3-9fd0-12bd57553464460862206951312&coreNodeName=core_node8&name=testcollection_shard2_replica_n5&action=CREATE&numShards=2&shard=shard2&wt=javabin} status=0 QTime=16
   [junit4]   2> 64551 INFO  (parallelCoreAdminExecutor-120-thread-1-processing-n:127.0.0.1:49710_solr 254cbecd-7455-4df3-9fd0-12bd57553464460862201624235 CREATE) [n:127.0.0.1:49710_solr    ] o.a.s.h.a.CoreAdminOperation core create command qt=/admin/cores&collection.configName=solrCloudCollectionConfig&newCollection=true&collection=testcollection&version=2&replicaType=NRT&async=254cbecd-7455-4df3-9fd0-12bd57553464460862201624235&coreNodeName=core_node6&name=testcollection_shard1_replica_n2&action=CREATE&numShards=2&shard=shard1&wt=javabin
   [junit4]   2> 64559 INFO  (parallelCoreAdminExecutor-121-thread-1-processing-n:127.0.0.1:49707_solr 254cbecd-7455-4df3-9fd0-12bd57553464460862194378579 CREATE) [n:127.0.0.1:49707_solr    ] o.a.s.c.TransientSolrCoreCacheDefault Allocating transient cache for 2147483647 transient cores
   [junit4]   2> 64564 INFO  (qtp438818493-1234) [n:127.0.0.1:49707_solr    ] o.a.s.h.a.CoreAdminOperation Checking request status for : 254cbecd-7455-4df3-9fd0-12bd57553464460862204216946
   [junit4]   2> 64564 INFO  (qtp438818493-1234) [n:127.0.0.1:49707_solr    ] o.a.s.s.HttpSolrCall [admin] webapp=null path=/admin/cores params={qt=/admin/cores&requestid=254cbecd-7455-4df3-9fd0-12bd57553464460862204216946&action=REQUESTSTATUS&wt=javabin&version=2} status=0 QTime=0
   [junit4]   2> 64563 INFO  (parallelCoreAdminExecutor-120-thread-2-processing-n:127.0.0.1:49710_solr 254cbecd-7455-4df3-9fd0-12bd57553464460862206951312 CREATE) [n:127.0.0.1:49710_solr    ] o.a.s.h.a.CoreAdminOperation core create command qt=/admin/cores&collection.configName=solrCloudCollectionConfig&newCollection=true&collection=testcollection&version=2&replicaType=NRT&async=254cbecd-7455-4df3-9fd0-12bd57553464460862206951312&coreNodeName=core_node8&name=testcollection_shard2_replica_n5&action=CREATE&numShards=2&shard=shard2&wt=javabin
   [junit4]   2> 64566 INFO  (parallelCoreAdminExecutor-120-thread-2-processing-n:127.0.0.1:49710_solr 254cbecd-7455-4df3-9fd0-12bd57553464460862206951312 CREATE) [n:127.0.0.1:49710_solr    ] o.a.s.c.TransientSolrCoreCacheDefault Allocating transient cache for 2147483647 transient cores
   [junit4]   2> 64563 INFO  (parallelCoreAdminExecutor-121-thread-2-processing-n:127.0.0.1:49707_solr 254cbecd-7455-4df3-9fd0-12bd57553464460862204216946 CREATE) [n:127.0.0.1:49707_solr    ] o.a.s.h.a.CoreAdminOperation core create command qt=/admin/cores&collection.configName=solrCloudCollectionConfig&newCollection=true&collection=testcollection&version=2&replicaType=NRT&async=254cbecd-7455-4df3-9fd0-12bd57553464460862204216946&coreNodeName=core_node7&name=testcollection_shard2_replica_n4&action=CREATE&numShards=2&shard=shard2&wt=javabin
   [junit4]   2> 64699 INFO  (zkCallback-34-thread-1-processing-n:127.0.0.1:49710_solr) [n:127.0.0.1:49710_solr    ] o.a.s.c.c.ZkStateReader A cluster state change: [WatchedEvent state:SyncConnected type:NodeDataChanged path:/collections/testcollection/state.json] for collection [testcollection] has occurred - updating... (live nodes size: [2])
   [junit4]   2> 64699 INFO  (zkCallback-33-thread-1-processing-n:127.0.0.1:49707_solr) [n:127.0.0.1:49707_solr    ] o.a.s.c.c.ZkStateReader A cluster state change: [WatchedEvent state:SyncConnected type:NodeDataChanged path:/collections/testcollection/state.json] for collection [testcollection] has occurred - updating... (live nodes size: [2])
   [junit4]   2> 65158 INFO  (qtp438818493-1231) [n:127.0.0.1:49707_solr    ] o.a.s.h.a.CollectionsHandler Invoked Collection Action :requeststatus with params requestid=254cbecd-7455-4df3-9fd0-12bd57553464&action=REQUESTSTATUS&wt=javabin&version=2 and sendToOCPQueue=true
   [junit4]   2> 65161 INFO  (qtp438818493-1231) [n:127.0.0.1:49707_solr    ] o.a.s.s.HttpSolrCall [admin] webapp=null path=/admin/collections params={requestid=254cbecd-7455-4df3-9fd0-12bd57553464&action=REQUESTSTATUS&wt=javabin&version=2} status=0 QTime=2
   [junit4]   2> 65568 INFO  (qtp438818493-1229) [n:127.0.0.1:49707_solr    ] o.a.s.h.a.CoreAdminOperation Checking request status for : 254cbecd-7455-4df3-9fd0-12bd57553464460862204216946
   [junit4]   2> 65568 INFO  (qtp438818493-1229) [n:127.0.0.1:49707_solr    ] o.a.s.s.HttpSolrCall [admin] webapp=null path=/admin/cores params={qt=/admin/cores&requestid=254cbecd-7455-4df3-9fd0-12bd57553464460862204216946&action=REQUESTSTATUS&wt=javabin&version=2} status=0 QTime=0
   [junit4]   2> 65638 INFO  (parallelCoreAdminExecutor-120-thread-2-processing-n:127.0.0.1:49710_solr 254cbecd-7455-4df3-9fd0-12bd57553464460862206951312 CREATE) [n:127.0.0.1:49710_solr c:testcollection s:shard2 r:core_node8 x:testcollection_shard2_replica_n5] o.a.s.c.SolrConfig Using Lucene MatchVersion: 7.1.0
   [junit4]   2> 65640 INFO  (parallelCoreAdminExecutor-121-thread-1-processing-n:127.0.0.1:49707_solr 254cbecd-7455-4df3-9fd0-12bd57553464460862194378579 CREATE) [n:127.0.0.1:49707_solr c:testcollection s:shard1 r:core_node3 x:testcollection_shard1_replica_n1] o.a.s.c.SolrConfig Using Lucene MatchVersion: 7.1.0
   [junit4]   2> 65648 INFO  (parallelCoreAdminExecutor-120-thread-1-processing-n:127.0.0.1:49710_solr 254cbecd-7455-4df3-9fd0-12bd57553464460862201624235 CREATE) [n:127.0.0.1:49710_solr c:testcollection s:shard1 r:core_node6 x:testcollection_shard1_replica_n2] o.a.s.c.SolrConfig Using Lucene MatchVersion: 7.1.0
   [junit4]   2> 65657 INFO  (parallelCoreAdminExecutor-121-thread-2-processing-n:127.0.0.1:49707_solr 254cbecd-7455-4df3-9fd0-12bd57553464460862204216946 CREATE) [n:127.0.0.1:49707_solr c:testcollection s:shard2 r:core_node7 x:testcollection_shard2_replica_n4] o.a.s.c.SolrConfig Using Lucene MatchVersion: 7.1.0
   [junit4]   2> 65684 INFO  (parallelCoreAdminExecutor-120-thread-2-processing-n:127.0.0.1:49710_solr 254cbecd-7455-4df3-9fd0-12bd57553464460862206951312 CREATE) [n:127.0.0.1:49710_solr c:testcollection s:shard2 r:core_node8 x:testcollection_shard2_replica_n5] o.a.s.s.IndexSchema [testcollection_shard2_replica_n5] Schema name=minimal
   [junit4]   2> 65685 INFO  (parallelCoreAdminExecutor-121-thread-2-processing-n:127.0.0.1:49707_solr 254cbecd-7455-4df3-9fd0-12bd57553464460862204216946 CREATE) [n:127.0.0.1:49707_solr c:testcollection s:shard2 r:core_node7 x:testcollection_shard2_replica_n4] o.a.s.s.IndexSchema [testcollection_shard2_replica_n4] Schema name=minimal
   [junit4]   2> 65686 INFO  (parallelCoreAdminExecutor-121-thread-1-processing-n:127.0.0.1:49707_solr 254cbecd-7455-4df3-9fd0-12bd57553464460862194378579 CREATE) [n:127.0.0.1:49707_solr c:testcollection s:shard1 r:core_node3 x:testcollection_shard1_replica_n1] o.a.s.s.IndexSchema [testcollection_shard1_replica_n1] Schema name=minimal
   [junit4]   2> 65684 INFO  (parallelCoreAdminExecutor-120-thread-1-processing-n:127.0.0.1:49710_solr 254cbecd-7455-4df3-9fd0-12bd57553464460862201624235 CREATE) [n:127.0.0.1:49710_solr c:testcollection s:shard1 r:core_node6 x:testcollection_shard1_replica_n2] o.a.s.s.IndexSchema [testcollection_shard1_replica_n2] Schema name=minimal
   [junit4]   2> 65695 INFO  (parallelCoreAdminExecutor-121-thread-1-processing-n:127.0.0.1:49707_solr 254cbecd-7455-4df3-9fd0-12bd57553464460862194378579 CREATE) [n:127.0.0.1:49707_solr c:testcollection s:shard1 r:core_node3 x:testcollection_shard1_replica_n1] o.a.s.s.IndexSchema Loaded schema minimal/1.1 with uniqueid field id
   [junit4]   2> 65695 INFO  (parallelCoreAdminExecutor-121-thread-1-processing-n:127.0.0.1:49707_solr 254cbecd-7455-4df3-9fd0-12bd57553464460862194378579 CREATE) [n:127.0.0.1:49707_solr c:testcollection s:shard1 r:core_node3 x:testcollection_shard1_replica_n1] o.a.s.c.CoreContainer Creating SolrCore 'testcollection_shard1_replica_n1' using configuration from collection testcollection, trusted=true
   [junit4]   2> 65695 INFO  (parallelCoreAdminExecutor-120-thread-2-processing-n:127.0.0.1:49710_solr 254cbecd-7455-4df3-9fd0-12bd57553464460862206951312 CREATE) [n:127.0.0.1:49710_solr c:testcollection s:shard2 r:core_node8 x:testcollection_shard2_replica_n5] o.a.s.s.IndexSchema Loaded schema minimal/1.1 with uniqueid field id
   [junit4]   2> 65695 INFO  (parallelCoreAdminExecutor-120-thread-2-processing-n:127.0.0.1:49710_solr 254cbecd-7455-4df3-9fd0-12bd57553464460862206951312 CREATE) [n:127.0.0.1:49710_solr c:testcollection s:shard2 r:core_node8 x:testcollection_shard2_replica_n5] o.a.s.c.CoreContainer Creating SolrCore 'testcollection_shard2_replica_n5' using configuration from collection testcollection, trusted=true
   [junit4]   2> 65700 INFO  (parallelCoreAdminExecutor-121-thread-1-processing-n:127.0.0.1:49707_solr 254cbecd-7455-4df3-9fd0-12bd57553464460862194378579 CREATE) [n:127.0.0.1:49707_solr c:testcollection s:shard1 r:core_node3 x:testcollection_shard1_replica_n1] o.a.s.m.r.SolrJmxReporter JMX monitoring for 'solr_49707.solr.core.testcollection.shard1.replica_n1' (registry 'solr.core.testcollection.shard1.replica_n1') enabled at server: com.sun.jmx.mbeanserver.JmxMBeanServer@48f6a78e
   [junit4]   2> 65700 INFO  (parallelCoreAdminExecutor-121-thread-1-processing-n:127.0.0.1:49707_solr 254cbecd-7455-4df3-9fd0-12bd57553464460862194378579 CREATE) [n:127.0.0.1:49707_solr c:testcollection s:shard1 r:core_node3 x:testcollection_shard1_replica_n1] o.a.s.c.SolrCore solr.RecoveryStrategy.Builder
   [junit4]   2> 65700 INFO  (parallelCoreAdminExecutor-121-thread-1-processing-n:127.0.0.1:49707_solr 254cbecd-7455-4df3-9fd0-12bd57553464460862194378579 CREATE) [n:127.0.0.1:49707_solr c:testcollection s:shard1 r:core_node3 x:testcollection_shard1_replica_n1] o.a.s.c.SolrCore [[testcollection_shard1_replica_n1] ] Opening new SolrCore at [C:\Users\jenkins\workspace\Lucene-Solr-7.x-Windows\solr\build\solr-core\test\J0\temp\solr.cloud.TestAuthenticationFramework_502470BC77FC2F8A-001\tempDir-001\node2\testcollection_shard1_replica_n1], dataDir=[C:\Users\jenkins\workspace\Lucene-Solr-7.x-Windows\solr\build\solr-core\test\J0\temp\solr.cloud.TestAuthenticationFramework_502470BC77FC2F8A-001\tempDir-001\node2\.\testcollection_shard1_replica_n1\data\]
   [junit4]   2> 65707 INFO  (parallelCoreAdminExecutor-120-thread-1-processing-n:127.0.0.1:49710_solr 254cbecd-7455-4df3-9fd0-12bd57553464460862201624235 CREATE) [n:127.0.0.1:49710_solr c:testcollection s:shard1 r:core_node6 x:testcollection_shard1_replica_n2] o.a.s.s.IndexSchema Loaded schema minimal/1.1 with uniqueid field id
   [junit4]   2> 65709 INFO  (parallelCoreAdminExecutor-120-thread-1-processing-n:127.0.0.1:49710_solr 254cbecd-7455-4df3-9fd0-12bd57553464460862201624235 CREATE) [n:127.0.0.1:49710_solr c:testcollection s:shard1 r:core_node6 x:testcollection_shard1_replica_n2] o.a.s.c.CoreContainer Creating SolrCore 'testcollection_shard1_replica_n2' using configuration from collection testcollection, trusted=true
   [junit4]   2> 65710 INFO  (parallelCoreAdminExecutor-120-thread-1-processing-n:127.0.0.1:49710_solr 254cbecd-7455-4df3-9fd0-12bd57553464460862201624235 CREATE) [n:127.0.0.1:49710_solr c:testcollection s:shard1 r:core_node6 x:testcollection_shard1_replica_n2] o.a.s.m.r.SolrJmxReporter JMX monitoring for 'solr_49710.solr.core.testcollection.shard1.replica_n2' (registry 'solr.core.testcollection.shard1.replica_n2') enabled at server: com.sun.jmx.mbeanserver.JmxMBeanServer@48f6a78e
   [junit4]   2> 65710 INFO  (parallelCoreAdminExecutor-120-thread-1-processing-n:127.0.0.1:49710_solr 254cbecd-7455-4df3-9fd0-12bd57553464460862201624235 CREATE) [n:127.0.0.1:49710_solr c:testcollection s:shard1 r:core_node6 x:testcollection_shard1_replica_n2] o.a.s.c.SolrCore solr.RecoveryStrategy.Builder
   [junit4]   2> 65710 INFO  (parallelCoreAdminExecutor-120-thread-1-processing-n:127.0.0.1:49710_solr 254cbecd-7455-4df3-9fd0-12bd57553464460862201624235 CREATE) [n:127.0.0.1:49710_solr c:testcollection s:shard1 r:core_node6 x:testcollection_shard1_replica_n2] o.a.s.c.SolrCore [[testcollection_shard1_replica_n2] ] Opening new SolrCore at [C:\Users\jenkins\workspace\Lucene-Solr-7.x-Windows\solr\build\solr-core\test\J0\temp\solr.cloud.TestAuthenticationFramework_502470BC77FC2F8A-001\tempDir-001\node1\testcollection_shard1_replica_n2], dataDir=[C:\Users\jenkins\workspace\Lucene-Solr-7.x-Windows\solr\build\solr-core\test\J0\temp\solr.cloud.TestAuthenticationFramework_502470BC77FC2F8A-001\tempDir-001\node1\.\testcollection_shard1_replica_n2\data\]
   [junit4]   2> 65706 INFO  (parallelCoreAdminExecutor-120-thread-2-processing-n:127.0.0.1:49710_solr 254cbecd-7455-4df3-9fd0-12bd57553464460862206951312 CREATE) [n:127.0.0.1:49710_solr c:testcollection s:shard2 r:core_node8 x:testcollection_shard2_replica_n5] o.a.s.m.r.SolrJmxReporter JMX monitoring for 'solr_49710.solr.core.testcollection.shard2.replica_n5' (registry 'solr.core.testcollection.shard2.replica_n5') enabled at server: com.sun.jmx.mbeanserver.JmxMBeanServer@48f6a78e
   [junit4]   2> 65711 INFO  (parallelCoreAdminExecutor-120-thread-2-processing-n:127.0.0.1:49710_solr 254cbecd-7455-4df3-9fd0-12bd57553464460862206951312 CREATE) [n:127.0.0.1:49710_solr c:testcollection s:shard2 r:core_node8 x:testcollection_shard2_replica_n5] o.a.s.c.SolrCore solr.RecoveryStrategy.Builder
   [junit4]   2> 65713 INFO  (parallelCoreAdminExecutor-120-thread-2-processing-n:127.0.0.1:49710_solr 254cbecd-7455-4df3-9fd0-12bd57553464460862206951312 CREATE) [n:127.0.0.1:49710_solr c:testcollection s:shard2 r:core_node8 x:testcollection_shard2_replica_n5] o.a.s.c.SolrCore [[testcollection_shard2_replica_n5] ] Opening new SolrCore at [C:\Users\jenkins\workspace\Lucene-Solr-7.x-Windows\solr\build\solr-core\test\J0\temp\solr.cloud.TestAuthenticationFramework_502470BC77FC2F8A-001\tempDir-001\node1\testcollection_shard2_replica_n5], dataDir=[C:\Users\jenkins\workspace\Lucene-Solr-7.x-Windows\solr\build\solr-core\test\J0\temp\solr.cloud.TestAuthenticationFramework_502470BC77FC2F8A-001\tempDir-001\node1\.\testcollection_shard2_replica_n5\data\]
   [junit4]   2> 65706 INFO  (parallelCoreAdminExecutor-121-thread-2-processing-n:127.0.0.1:49707_solr 254cbecd-7455-4df3-9fd0-12bd57553464460862204216946 CREATE) [n:127.0.0.1:49707_solr c:testcollection s:shard2 r:core_node7 x:testcollection_shard2_replica_n4] o.a.s.s.IndexSchema Loaded schema minimal/1.1 with uniqueid field id
   [junit4]   2> 65713 INFO  (parallelCoreAdminExecutor-121-thread-2-processing-n:127.0.0.1:49707_solr 254cbecd-7455-4df3-9fd0-12bd57553464460862204216946 CREATE) [n:127.0.0.1:49707_solr c:testcollection s:shard2 r:core_node7 x:testcollection_shard2_replica_n4] o.a.s.c.CoreContainer Creating SolrCore 'testcollection_shard2_replica_n4' using configuration from collection testcollection, trusted=true
   [junit4]   2> 65713 INFO  (parallelCoreAdminExecutor-121-thread-2-processing-n:127.0.0.1:49707_solr 254cbecd-7455-4df3-9fd0-12bd57553464460862204216946 CREATE) [n:127.0.0.1:49707_solr c:testcollection s:shard2 r:core_node7 x:testcollection_shard2_replica_n4] o.a.s.m.r.SolrJmxReporter JMX monitoring for 'solr_49707.solr.core.testcollection.shard2.replica_n4' (registry 'solr.core.testcollection.shard2.replica_n4') enabled at server: com.sun.jmx.mbeanserver.JmxMBeanServer@48f6a78e
   [junit4]   2> 65714 INFO  (parallelCoreAdminExecutor-121-thread-2-processing-n:127.0.0.1:49707_solr 254cbecd-7455-4df3-9fd0-12bd57553464460862204216946 CREATE) [n:127.0.0.1:49707_solr c:testcollection s:shard2 r:core_node7 x:testcollection_shard2_replica_n4] o.a.s.c.SolrCore solr.RecoveryStrategy.Builder
   [junit4]   2> 65714 INFO  (parallelCoreAdminExecutor-121-thread-2-processing-n:127.0.0.1:49707_solr 254cbecd-7455-4df3-9fd0-12bd57553464460862204216946 CREATE) [n:127.0.0.1:49707_solr c:testcollection s:shard2 r:core_node7 x:testcollection_shard2_replica_n4] o.a.s.c.SolrCore [[testcollection_shard2_replica_n4] ] Opening new SolrCore at [C:\Users\jenkins\workspace\Lucene-Solr-7.x-Windows\solr\build\solr-core\test\J0\temp\solr.cloud.TestAuthenticationFramework_502470BC77FC2F8A-001\tempDir-001\node2\testcollection_shard2_replica_n4], dataDir=[C:\Users\jenkins\workspace\Lucene-Solr-7.x-Windows\solr\build\solr-core\test\J0\temp\solr.cloud.TestAuthenticationFramework_502470BC77FC2F8A-001\tempDir-001\node2\.\testcollection_shard2_replica_n4\data\]
   [junit4]   2> 65883 INFO  (parallelCoreAdminExecutor-121-thread-2-processing-n:127.0.0.1:49707_solr 254cbecd-7455-4df3-9fd0-12bd57553464460862204216946 CREATE) [n:127.0.0.1:49707_solr c:testcollection s:shard2 r:core_node7 x:testcollection_shard2_replica_n4] o.a.s.u.UpdateHandler Using UpdateLog implementation: org.apache.solr.update.UpdateLog
   [junit4]   2> 65883 INFO  (parallelCoreAdminExecutor-121-thread-2-processing-n:127.0.0.1:49707_solr 254cbecd-7455-4df3-9fd0-12bd57553464460862204216946 CREATE) [n:127.0.0.1:49707_solr c:testcollection s:shard2 r:core_node7 x:testcollection_shard2_replica_n4] o.a.s.u.UpdateLog Initializing UpdateLog: dataDir=null defaultSyncLevel=FLUSH numRecordsToKeep=100 maxNumLogsToKeep=10 numVersionBuckets=65536
   [junit4]   2> 65885 INFO  (parallelCoreAdminExecutor-121-thread-2-processing-n:127.0.0.1:49707_solr 254cbecd-7455-4df3-9fd0-12bd57553464460862204216946 CREATE) [n:127.0.0.1:49707_solr c:testcollection s:shard2 r:core_node7 x:testcollection_shard2_replica_n4] o.a.s.u.CommitTracker Hard AutoCommit: disabled
   [junit4]   2> 65885 INFO  (parallelCoreAdminExecutor-121-thread-2-processing-n:127.0.0.1:49707_solr 254cbecd-7455-4df3-9fd0-12bd57553464460862204216946 CREATE) [n:127.0.0.1:49707_solr c:testcollection s:shard2 r:core_node7 x:testcollection_shard2_replica_n4] o.a.s.u.CommitTracker Soft AutoCommit: disabled
   [junit4]   2> 65888 INFO  (parallelCoreAdminExecutor-120-thread-2-processing-n:127.0.0.1:49710_solr 254cbecd-7455-4df3-9fd0-12bd57553464460862206951312 CREATE) [n:127.0.0.1:49710_solr c:testcollection s:shard2 r:core_node8 x:testcollection_shard2_replica_n5] o.a.s.u.UpdateHandler Using UpdateLog implementation: org.apache.solr.update.UpdateLog
   [junit4]   2> 65888 INFO  (parallelCoreAdminExecutor-120-thread-2-processing-n:127.0.0.1:49710_solr 254cbecd-7455-4df3-9fd0-12bd57553464460862206951312 CREATE) [n:127.0.0.1:49710_solr c:testcollection s:shard2 r:core_node8 x:testcollection_shard2_replica_n5] o.a.s.u.UpdateLog Initializing UpdateLog: dataDir=null defaultSyncLevel=FLUSH numRecordsToKeep=100 maxNumLogsToKeep=10 numVersionBuckets=65536
   [junit4]   2> 65889 INFO  (parallelCoreAdminExecutor-120-thread-1-processing-n:127.0.0.1:49710_solr 254cbecd-7455-4df3-9fd0-12bd57553464460862201624235 CREATE) [n:127.0.0.1:49710_solr c:testcollection s:shard1 r:core_node6 x:testcollection_shard1_replica_n2] o.a.s.u.UpdateHandler Using UpdateLog implementation: org.apache.solr.update.UpdateLog
   [junit4]   2> 65889 INFO  (parallelCoreAdminExecutor-120-thread-1-processing-n:127.0.0.1:49710_solr 254cbecd-7455-4df3-9fd0-12bd57553464460862201624235 CREATE) [n:127.0.0.1:49710_solr c:testcollection s:shard1 r:core_node6 x:testcollection_shard1_replica_n2] o.a.s.u.UpdateLog Initializing UpdateLog: dataDir=null defaultSyncLevel=FLUSH numRecordsToKeep=100 maxNumLogsToKeep=10 numVersionBuckets=65536
   [junit4]   2> 65890 INFO  (parallelCoreAdminExecutor-120-thread-2-processing-n:127.0.0.1:49710_solr 254cbecd-7455-4df3-9fd0-12bd57553464460862206951312 CREATE) [n:127.0.0.1:49710_solr c:testcollection s:shard2 r:core_node8 x:testcollection_shard2_replica_n5] o.a.s.u.CommitTracker Hard AutoCommit: disabled
   [junit4]   2> 65890 INFO  (parallelCoreAdminExecutor-120-thread-2-processing-n:127.0.0.1:49710_solr 254cbecd-7455-4df3-9fd0-12bd57553464460862206951312 CREATE) [n:127.0.0.1:49710_solr c:testcollection s:shard2 r:core_node8 x:testcollection_shard2_replica_n5] o.a.s.u.CommitTracker Soft AutoCommit: disabled
   [junit4]   2> 65890 INFO  (parallelCoreAdminExecutor-120-thread-1-processing-n:127.0.0.1:49710_solr 254cbecd-7455-4df3-9fd0-12bd57553464460862201624235 CREATE) [n:127.0.0.1:49710_solr c:testcollection s:shard1 r:core_node6 x:testcollection_shard1_replica_n2] o.a.s.u.CommitTracker Hard AutoCommit: disabled
   [junit4]   2> 65891 INFO  (parallelCoreAdminExecutor-120-thread-1-processing-n:127.0.0.1:49710_solr 254cbecd-7455-4df3-9fd0-12bd57553464460862201624235 CREATE) [n:127.0.0.1:49710_solr c:testcollection s:shard1 r:core_node6 x:testcollection_shard1_replica_n2] o.a.s.u.CommitTracker Soft AutoCommit: disabled
   [junit4]   2> 65893 INFO  (parallelCoreAdminExecutor-121-thread-1-processing-n:127.0.0.1:49707_solr 254cbecd-7455-4df3-9fd0-12bd57553464460862194378579 CREATE) [n:127.0.0.1:49707_solr c:testcollection s:shard1 r:core_node3 x:testcollection_shard1_replica_n1] o.a.s.u.UpdateHandler Using UpdateLog implementation: org.apache.solr.update.UpdateLog
   [junit4]   2> 65893 INFO  (parallelCoreAdminExecutor-121-thread-1-processing-n:127.0.0.1:49707_solr 254cbecd-7455-4df3-9fd0-12bd57553464460862194378579 CREATE) [n:127.0.0.1:49707_solr c:testcollection s:shard1 r:core_node3 x:testcollection_shard1_replica_n1] o.a.s.u.UpdateLog Initializing UpdateLog: dataDir=null defaultSyncLevel=FLUSH numRecordsToKeep=100 maxNumLogsToKeep=10 numVersionBuckets=65536
   [junit4]   2> 65894 INFO  (parallelCoreAdminExecutor-121-thread-2-processing-n:127.0.0.1:49707_solr 254cbecd-7455-4df3-9fd0-12bd57553464460862204216946 CREATE) [n:127.0.0.1:49707_solr c:testcollection s:shard2 r:core_node7 x:testcollection_shard2_replica_n4] o.a.s.s.SolrIndexSearcher Opening [Searcher@38e692dc[testcollection_shard2_replica_n4] main]
   [junit4]   2> 65896 INFO  (parallelCoreAdminExecutor-121-thread-1-processing-n:127.0.0.1:49707_solr 254cbecd-7455-4df3-9fd0-12bd57553464460862194378579 CREATE) [n:127.0.0.1:49707_solr c:testcollection s:shard1 r:core_node3 x:testcollection_shard1_replica_n1] o.a.s.u.CommitTracker Hard AutoCommit: disabled
   [junit4]   2> 65896 INFO  (parallelCoreAdminExecutor-121-thread-1-processing-n:127.0.0.1:49707_solr 254cbecd-7455-4df3-9fd0-12bd57553464460862194378579 CREATE) [n:127.0.0.1:49707_solr c:testcollection s:shard1 r:core_node3 x:testcollection_shard1_replica_n1] o.a.s.u.CommitTracker Soft AutoCommit: disabled
   [junit4]   2> 65897 INFO  (parallelCoreAdminExecutor-120-thread-2-processing-n:127.0.0.1:49710_solr 254cbecd-7455-4df3-9fd0-12bd57553464460862206951312 CREATE) [n:127.0.0.1:49710_solr c:testcollection s:shard2 r:core_node8 x:testcollection_shard2_replica_n5] o.a.s.s.SolrIndexSearcher Opening [Searcher@5ce7a982[testcollection_shard2_replica_n5] main]
   [junit4]   2> 65898 INFO  (parallelCoreAdminExecutor-120-thread-1-processing-n:127.0.0.1:49710_solr 254cbecd-7455-4df3-9fd0-12bd57553464460862201624235 CREATE) [n:127.0.0.1:49710_solr c:testcollection s:shard1 r:core_node6 x:testcollection_shard1_replica_n2] o.a.s.s.SolrIndexSearcher Opening [Searcher@619820d1[testcollection_shard1_replica_n2] main]
   [junit4]   2> 65899 INFO  (parallelCoreAdminExecutor-121-thread-1-processing-n:127.0.0.1:49707_solr 254cbecd-7455-4df3-9fd0-12bd57553464460862194378579 CREATE) [n:127.0.0.1:49707_solr c:testcollection s:shard1 r:core_node3 x:testcollection_shard1_replica_n1] o.a.s.s.SolrIndexSearcher Opening [Searcher@61fc364d[testcollection_shard1_replica_n1] main]
   [junit4]   2> 65904 INFO  (parallelCoreAdminExecutor-120-thread-2-processing-n:127.0.0.1:49710_solr 254cbecd-7455-4df3-9fd0-12bd57553464460862206951312 CREATE) [n:127.0.0.1:49710_solr c:testcollection s:shard2 r:core_node8 x:testcollection_shard2_replica_n5] o.a.s.r.ManagedResourceStorage Configured ZooKeeperStorageIO with znodeBase: /configs/solrCloudCollectionConfig
   [junit4]   2> 65904 INFO  (parallelCoreAdminExecutor-120-thread-1-processing-n:127.0.0.1:49710_solr 254cbecd-7455-4df3-9fd0-12bd57553464460862201624235 CREATE) [n:127.0.0.1:49710_solr c:testcollection s:shard1 r:core_node6 x:testcollection_shard1_replica_n2] o.a.s.r.ManagedResourceStorage Configured ZooKeeperStorageIO with znodeBase: /configs/solrCloudCollectionConfig
   [junit4]   2> 65905 INFO  (parallelCoreAdminExecutor-121-thread-1-processing-n:127.0.0.1:49707_solr 254cbecd-7455-4df3-9fd0-12bd57553464460862194378579 CREATE) [n:127.0.0.1:49707_solr c:testcollection s:shard1 r:core_node3 x:testcollection_shard1_replica_n1] o.a.s.r.ManagedResourceStorage Configured ZooKeeperStorageIO with znodeBase: /configs/solrCloudCollectionConfig
   [junit4]   2> 65905 INFO  (parallelCoreAdminExecutor-121-thread-2-processing-n:127.0.0.1:49707_solr 254cbecd-7455-4df3-9fd0-12bd57553464460862204216946 CREATE) [n:127.0.0.1:49707_solr c:testcollection s:shard2 r:core_node7 x:testcollection_shard2_replica_n4] o.a.s.r.ManagedResourceStorage Configured ZooKeeperStorageIO with znodeBase: /configs/solrCloudCollectionConfig
   [junit4]   2> 65905 INFO  (parallelCoreAdminExecutor-120-thread-2-processing-n:127.0.0.1:49710_solr 254cbecd-7455-4df3-9fd0-12bd57553464460862206951312 CREATE) [n:127.0.0.1:49710_solr c:testcollection s:shard2 r:core_node8 x:testcollection_shard2_replica_n5] o.a.s.r.ManagedResourceStorage Loaded null at path _rest_managed.json using ZooKeeperStorageIO:path=/configs/solrCloudCollectionConfig
   [junit4]   2> 65905 INFO  (parallelCoreAdminExecutor-120-thread-1-processing-n:127.0.0.1:49710_solr 254cbecd-7455-4df3-9fd0-12bd57553464460862201624235 CREATE) [n:127.0.0.1:49710_solr c:testcollection s:shard1 r:core_node6 x:testcollection_shard1_replica_n2] o.a.s.r.ManagedResourceStorage Loaded null at path _rest_managed.json using ZooKeeperStorageIO:path=/configs/solrCloudCollectionConfig
   [junit4]   2> 65906 INFO  (parallelCoreAdminExecutor-120-thread-2-processing-n:127.0.0.1:49710_solr 254cbecd-7455-4df3-9fd0-12bd57553464460862206951312 CREATE) [n:127.0.0.1:49710_solr c:testcollection s:shard2 r:core_node8 x:testcollection_shard2_replica_n5] o.a.s.h.ReplicationHandler Commits will be reserved for  10000
   [junit4]   2> 65906 INFO  (parallelCoreAdminExecutor-121-thread-1-processing-n:127.0.0.1:49707_solr 254cbecd-7455-4df3-9fd0-12bd57553464460862194378579 CREATE) [n:127.0.0.1:49707_solr c:testcollection s:shard1 r:core_node3 x:testcollection_shard1_replica_n1] o.a.s.r.ManagedResourceStorage Loaded null at path _rest_managed.json using ZooKeeperStorageIO:path=/configs/solrCloudCollectionConfig
   [junit4]   2> 65907 INFO  (parallelCoreAdminExecutor-121-thread-1-processing-n:127.0.0.1:49707_solr 254cbecd-7455-4df3-9fd0-12bd57553464460862194378579 CREATE) [n:127.0.0.1:49707_solr c:testcollection s:shard1 r:core_node3 x:testcollection_shard1_replica_n1] o.a.s.h.ReplicationHandler Commits will be reserved for  10000
   [junit4]   2> 65906 INFO  (parallelCoreAdminExecutor-120-thread-1-processing-n:127.0.0.1:49710_solr 254cbecd-7455-4df3-9fd0-12bd57553464460862201624235 CREATE) [n:127.0.0.1:49710_solr c:testcollection s:shard1 r:core_node6 x:testcollection_shard1_replica_n2] o.a.s.h.ReplicationHandler Commits will be reserved for  10000
   [junit4]   2> 65908 INFO  (parallelCoreAdminExecutor-121-thread-2-processing-n:127.0.0.1:49707_solr 254cbecd-7455-4df3-9fd0-12bd57553464460862204216946 CREATE) [n:127.0.0.1:49707_solr c:testcollection s:shard2 r:core_node7 x:testcollection_shard2_replica_n4] o.a.s.r.ManagedResourceStorage Loaded null at path _rest_managed.json using ZooKeeperStorageIO:path=/configs/solrCloudCollectionConfig
   [junit4]   2> 65909 INFO  (parallelCoreAdminExecutor-121-thread-2-processing-n:127.0.0.1:49707_solr 254cbecd-7455-4df3-9fd0-12bd57553464460862204216946 CREATE) [n:127.0.0.1:49707_solr c:testcollection s:shard2 r:core_node7 x:testcollection_shard2_replica_n4] o.a.s.h.ReplicationHandler Commits will be reserved for  10000
   [junit4]   2> 65911 INFO  (parallelCoreAdminExecutor-120-thread-2-processing-n:127.0.0.1:49710_solr 254cbecd-7455-4df3-9fd0-12bd57553464460862206951312 CREATE) [n:127.0.0.1:49710_solr c:testcollection s:shard2 r:core_node8 x:testcollection_shard2_replica_n5] o.a.s.u.UpdateLog Could not find max version in index or recent updates, using new clock 1575743224772820992
   [junit4]   2> 65911 INFO  (parallelCoreAdminExecutor-121-thread-2-processing-n:127.0.0.1:49707_solr 254cbecd-7455-4df3-9fd0-12bd57553464460862204216946 CREATE) [n:127.0.0.1:49707_solr c:testcollection s:shard2 r:core_node7 x:testcollection_shard2_replica_n4] o.a.s.u.UpdateLog Could not find max version in index or recent updates, using new clock 1575743224772820992
   [junit4]   2> 65924 INFO  (parallelCoreAdminExecutor-121-thread-1-processing-n:127.0.0.1:49707_solr 254cbecd-7455-4df3-9fd0-12bd57553464460862194378579 CREATE) [n:127.0.0.1:49707_solr c:testcollection s:shard1 r:core_node3 x:testcollection_shard1_replica_n1] o.a.s.u.UpdateLog Could not find max version in index or recent updates, using new clock 1575743224786452480
   [junit4]   2> 65930 INFO  (searcherExecutor-124-thread-1-processing-x:testcollection_shard1_replica_n1 r:core_node3 254cbecd-7455-4df3-9fd0-12bd57553464460862194378579 CREATE n:127.0.0.1:49707_solr s:shard1 c:testcollection) [n:127.0.0.1:49707_solr c:testcollection s:shard1 r:core_node3 x:testcollection_shard1_replica_n1] o.a.s.c.SolrCore [testcollection_shard1_replica_n1] Registered new searcher Searcher@61fc364d[testcollection_shard1_replica_n1] main{ExitableDirectoryReader(UninvertingDirectoryReader())}
   [junit4]   2> 65930 INFO  (searcherExecutor-126-thread-1-processing-x:testcollection_shard1_replica_n2 r:core_node6 254cbecd-7455-4df3-9fd0-12bd57553464460862201624235 CREATE n:127.0.0.1:49710_solr s:shard1 c:testcollection) [n:127.0.0.1:49710_solr c:testcollection s:shard1 r:core_node6 x:testcollection_shard1_replica_n2] o.a.s.c.SolrCore [testcollection_shard1_replica_n2] Registered new searcher Searcher@619820d1[testcollection_shard1_replica_n2] main{ExitableDirectoryReader(UninvertingDirectoryReader())}
   [junit4]   2> 65930 INFO  (searcherExecutor-127-thread-1-processing-x:testcollection_shard2_replica_n4 r:core_node7 254cbecd-7455-4df3-9fd0-12bd57553464460862204216946 CREATE n:127.0.0.1:49707_solr s:shard2 c:testcollection) [n:127.0.0.1:49707_solr c:testcollection s:shard2 r:core_node7 x:testcollection_shard2_replica_n4] o.a.s.c.SolrCore [testcollection_shard2_replica_n4] Registered new searcher Searcher@38e692dc[testcollection_shard2_replica_n4] main{ExitableDirectoryReader(UninvertingDirectoryReader())}
   [junit4]   2> 65930 INFO  (parallelCoreAdminExecutor-120-thread-1-processing-n:127.0.0.1:49710_solr 254cbecd-7455-4df3-9fd0-12bd57553464460862201624235 CREATE) [n:127.0.0.1:49710_solr c:testcollection s:shard1 r:core_node6 x:testcollection_shard1_replica_n2] o.a.s.u.UpdateLog Could not find max version in index or recent updates, using new clock 1575743224792743936
   [junit4]   2> 65930 INFO  (searcherExecutor-125-thread-1-processing-x:testcollection_shard2_replica_n5 r:core_node8 254cbecd-7455-4df3-9fd0-12bd57553464460862206951312 CREATE n:127.0.0.1:49710_solr s:shard2 c:testcollection) [n:127.0.0.1:49710_solr c:testcollection s:shard2 r:core_node8 x:testcollection_shard2_replica_n5] o.a.s.c.SolrCore [testcollection_shard2_replica_n5] Registered new searcher Searcher@5ce7a982[testcollection_shard2_replica_n5] main{ExitableDirectoryReader(UninvertingDirectoryReader())}
   [junit4]   2> 65999 INFO  (parallelCoreAdminExecutor-120-thread-1-processing-n:127.0.0.1:49710_solr 254cbecd-7455-4df3-9fd0-12bd57553464460862201624235 CREATE) [n:127.0.0.1:49710_solr c:testcollection s:shard1 r:core_node6 x:testcollection_shard1_replica_n2] o.a.s.c.ShardLeaderElectionContext Enough replicas found to continue.
   [junit4]   2> 65999 INFO  (parallelCoreAdminExecutor-120-thread-1-processing-n:127.0.0.1:49710_solr 254cbecd-7455-4df3-9fd0-12bd57553464460862201624235 CREATE) [n:127.0.0.1:49710_solr c:testcollection s:shard1 r:core_node6 x:testcollection_shard1_replica_n2] o.a.s.c.ShardLeaderElectionContext I may be the new leader - try and sync
   [junit4]   2> 66001 INFO  (parallelCoreAdminExecutor-120-thread-1-processing-n:127.0.0.1:49710_solr 254cbecd-7455-4df3-9fd0-12bd57553464460862201624235 CREATE) [n:127.0.0.1:49710_solr c:testcollection s:shard1 r:core_node6 x:testcollection_shard1_replica_n2] o.a.s.c.SyncStrategy Sync replicas to http://127.0.0.1:49710/solr/testcollection_shard1_replica_n2/
   [junit4]   2> 66011 INFO  (parallelCoreAdminExecutor-120-thread-1-processing-n:127.0.0.1:49710_solr 254cbecd-7455-4df3-9fd0-12bd57553464460862201624235 CREATE) [n:127.0.0.1:49710_solr c:testcollection s:shard1 r:core_node6 x:testcollection_shard1_replica_n2] o.a.s.u.PeerSync PeerSync: core=testcollection_shard1_replica_n2 url=http://127.0.0.1:49710/solr START replicas=[http://127.0.0.1:49707/solr/testcollection_shard1_replica_n1/] nUpdates=100
   [junit4]   2> 66011 INFO  (parallelCoreAdminExecutor-121-thread-2-processing-n:127.0.0.1:49707_solr 254cbecd-7455-4df3-9fd0-12bd57553464460862204216946 CREATE) [n:127.0.0.1:49707_solr c:testcollection s:shard2 r:core_node7 x:testcollection_shard2_replica_n4] o.a.s.c.ShardLeaderElectionContext Enough replicas found to continue.
   [junit4]   2> 66011 INFO  (parallelCoreAdminExecutor-121-thread-2-processing-n:127.0.0.1:49707_solr 254cbecd-7455-4df3-9fd0-12bd57553464460862204216946 CREATE) [n:127.0.0.1:49707_solr c:testcollection s:shard2 r:core_node7 x:testcollection_shard2_replica_n4] o.a.s.c.ShardLeaderElectionContext I may be the new leader - try and sync
   [junit4]   2> 66011 INFO  (parallelCoreAdminExecutor-121-thread-2-processing-n:127.0.0.1:49707_solr 254cbecd-7455-4df3-9fd0-12bd57553464460862204216946 CREATE) [n:127.0.0.1:49707_solr c:testcollection s:shard2 r:core_node7 x:testcollection_shard2_replica_n4] o.a.s.c.SyncStrategy Sync replicas to http://127.0.0.1:49707/solr/testcollection_shard2_replica_n4/
   [junit4]   2> 66011 INFO  (parallelCoreAdminExecutor-121-thread-2-processing-n:127.0.0.1:49707_solr 254cbecd-7455-4df3-9fd0-12bd57553464460862204216946 CREATE) [n:127.0.0.1:49707_solr c:testcollection s:shard2 r:core_node7 x:testcollection_shard2_replica_n4] o.a.s.u.PeerSync PeerSync: core=testcollection_shard2_replica_n4 url=http://127.0.0.1:49707/solr START replicas=[http://127.0.0.1:49710/solr/testcollection_shard2_replica_n5/] nUpdates=100
   [junit4]   2> 66023 INFO  (qtp438818493-1227) [n:127.0.0.1:49707_solr c:testcollection s:shard1 r:core_node3 x:testcollection_shard1_replica_n1] o.a.s.c.S.Request [testcollection_shard1_replica_n1]  webapp=/solr path=/get params={distrib=false&qt=/get&fingerprint=false&getVersions=100&wt=javabin&version=2} status=0 QTime=7
   [junit4]   2> 66084 INFO  (qtp1540063276-1230) [n:127.0.0.1:49710_solr c:testcollection s:shard2 r:core_node8 x:testcollection_shard2_replica_n5] o.a.s.c.S.Request [testcollection_shard2_replica_n5]  webapp=/solr path=/get params={distrib=false&qt=/get&fingerprint=false&getVersions=100&wt=javabin&version=2} status=0 QTime=5
   [junit4]   2> 66164 INFO  (qtp438818493-1227) [n:127.0.0.1:49707_solr    ] o.a.s.h.a.CollectionsHandler Invoked Collection Action :requeststatus with params requestid=254cbecd-7455-4df3-9fd0-12bd57553464&action=REQUESTSTATUS&wt=javabin&version=2 and sendToOCPQueue=true
   [junit4]   2> 66165 INFO  (qtp438818493-1227) [n:127.0.0.1:49707_solr    ] o.a.s.s.HttpSolrCall [admin] webapp=null path=/admin/collections params={requestid=254cbecd-7455-4df3-9fd0-12bd57553464&action=REQUESTSTATUS&wt=javabin&version=2} status=0 QTime=1
   [junit4]   2> 66176 INFO  (zkCallback-34-thread-1-processing-n:127.0.0.1:49710_solr) [n:127.0.0.1:49710_solr    ] o.a.s.c.c.ZkStateReader A cluster state change: [WatchedEvent state:SyncConnected type:NodeDataChanged path:/collections/testcollection/state.json] for collection [testcollection] has occurred - updating... (live nodes size: [2])
   [junit4]   2> 66176 INFO  (zkCallback-33-thread-1-processing-n:127.0.0.1:49707_solr) [n:127.0.0.1:49707_solr    ] o.a.s.c.c.ZkStateReader A cluster state change: [WatchedEvent state:SyncConnected type:NodeDataChanged path:/collections/testcollection/state.json] for collection [testcollection] has occurred - updating... (live nodes size: [2])
   [junit4]   2> 66312 INFO  (parallelCoreAdminExecutor-121-thread-2-processing-n:127.0.0.1:49707_solr 254cbecd-7455-4df3-9fd0-12bd57553464460862204216946 CREATE) [n:127.0.0.1:49707_solr c:testcollection s:shard2 r:core_node7 x:testcollection_shard2_replica_n4] o.a.s.u.PeerSync PeerSync: core=testcollection_shard2_replica_n4 url=http://127.0.0.1:49707/solr DONE.  We have no versions.  sync failed.
   [junit4]   2> 66312 INFO  (parallelCoreAdminExecutor-120-thread-1-processing-n:127.0.0.1:49710_solr 254cbecd-7455-4df3-9fd0-12bd57553464460862201624235 CREATE) [n:127.0.0.1:49710_solr c:testcollection s:shard1 r:core_node6 x:testcollection_shard1_replica_n2] o.a.s.u.PeerSync PeerSync: core=testcollection_shard1_replica_n2 url=http://127.0.0.1:49710/solr DONE.  We have no versions.  sync failed.
   [junit4]   2> 66314 INFO  (parallelCoreAdminExecutor-121-thread-2-processing-n:127.0.0.1:49707_solr 254cbecd-7455-4df3-9fd0-12bd57553464460862204216946 CREATE) [n:127.0.0.1:49707_solr c:testcollection s:shard2 r:core_node7 x:testcollection_shard2_replica_n4] o.a.s.c.SyncStrategy Leader's attempt to sync with shard failed, moving to the next candidate
   [junit4]   2> 66314 INFO  (parallelCoreAdminExecutor-120-thread-1-processing-n:127.0.0.1:49710_solr 254cbecd-7455-4df3-9fd0-12bd57553464460862201624235 CREATE) [n:127.0.0.1:49710_solr c:testcollection s:shard1 r:core_node6 x:testcollection_shard1_replica_n2] o.a.s.c.SyncStrategy Leader's attempt to sync with shard failed, moving to the next candidate
   [junit4]   2> 66314 INFO  (parallelCoreAdminExecutor-121-thread-2-processing-n:127.0.0.1:49707_solr 254cbecd-7455-4df3-9fd0-12bd57553464460862204216946 CREATE) [n:127.0.0.1:49707_solr c:testcollection s:shard2 r:core_node7 x:testcollection_shard2_replica_n4] o.a.s.c.ShardLeaderElectionContext We failed sync, but we have no versions - we can't sync in that case - we were active before, so become leader anyway
   [junit4]   2> 66314 INFO  (parallelCoreAdminExecutor-120-thread-1-processing-n:127.0.0.1:49710_solr 254cbecd-7455-4df3-9fd0-12bd57553464460862201624235 CREATE) [n:127.0.0.1:49710_solr c:testcollection s:shard1 r:core_node6 x:testcollection_shard1_replica_n2] o.a.s.c.ShardLeaderElectionContext We failed sync, but we have no versions - we can't sync in that case - we were active before, so become leader anyway
   [junit4]   2> 66314 INFO  (parallelCoreAdminExecutor-121-thread-2-processing-n:127.0.0.1:49707_solr 254cbecd-7455-4df3-9fd0-12bd57553464460862204216946 CREATE) [n:127.0.0.1:49707_solr c:testcollection s:shard2 r:core_node7 x:testcollection_shard2_replica_n4] o.a.s.c.ShardLeaderElectionContext Found all replicas participating in election, clear LIR
   [junit4]   2> 66314 INFO  (parallelCoreAdminExecutor-120-thread-1-processing-n:127.0.0.1:49710_solr 254cbecd-7455-4df3-9fd0-12bd57553464460862201624235 CREATE) [n:127.0.0.1:49710_solr c:testcollection s:shard1 r:core_node6 x:testcollection_shard1_replica_n2] o.a.s.c.ShardLeaderElectionContext Found all replicas participating in election, clear LIR
   [junit4]   2> 66351 INFO  (parallelCoreAdminExecutor-120-thread-1-processing-n:127.0.0.1:49710_solr 254cbecd-7455-4df3-9fd0-12bd57553464460862201624235 CREATE) [n:127.0.0.1:49710_solr c:testcollection s:shard1 r:core_node6 x:testcollection_shard1_replica_n2] o.a.s.c.ShardLeaderElectionContext I am the new leader: http://127.0.0.1:49710/solr/testcollection_shard1_replica_n2/ shard1
   [junit4]   2> 66351 INFO  (parallelCoreAdminExecutor-121-thread-2-processing-n:127.0.0.1:49707_solr 254cbecd-7455-4df3-9fd0-12bd57553464460862204216946 CREATE) [n:127.0.0.1:49707_solr c:testcollection s:shard2 r:core_node7 x:testcollection_shard2_replica_n4] o.a.s.c.ShardLeaderElectionContext I am the new leader: http://127.0.0.1:49707/solr/testcollection_shard2_replica_n4/ shard2
   [junit4]   2> 66458 INFO  (zkCallback-34-thread-1-processing-n:127.0.0.1:49710_solr) [n:127.0.0.1:49710_solr    ] o.a.s.c.c.ZkStateReader A cluster state change: [WatchedEvent state:SyncConnected type:NodeDataChanged path:/collections/testcollection/state.json] for collection [testcollection] has occurred - updating... (live nodes size: [2])
   [junit4]   2> 66458 INFO  (zkCallback-33-thread-1-processing-n:127.0.0.1:49707_solr) [n:127.0.0.1:49707_solr    ] o.a.s.c.c.ZkStateReader A cluster state change: [WatchedEvent state:SyncConnected type:NodeDataChanged path:/collections/testcollection/state.json] for collection [testcollection] has occurred - updating... (live nodes size: [2])
   [junit4]   2> 66504 INFO  (parallelCoreAdminExecutor-121-thread-2-processing-n:127.0.0.1:49707_solr 254cbecd-7455-4df3-9fd0-12bd57553464460862204216946 CREATE) [n:127.0.0.1:49707_solr c:testcollection s:shard2 r:core_node7 x:testcollection_shard2_replica_n4] o.a.s.c.ZkController I am the leader, no recovery necessary
   [junit4]   2> 66504 INFO  (parallelCoreAdminExecutor-120-thread-1-processing-n:127.0.0.1:49710_solr 254cbecd-7455-4df3-9fd0-12bd57553464460862201624235 CREATE) [n:127.0.0.1:49710_solr c:testcollection s:shard1 r:core_node6 x:testcollection_shard1_replica_n2] o.a.s.c.ZkController I am the leader, no recovery necessary
   [junit4]   2> 66571 INFO  (qtp438818493-1239) [n:127.0.0.1:49707_solr    ] o.a.s.h.a.CoreAdminOperation Checking request status for : 254cbecd-7455-4df3-9fd0-12bd57553464460862204216946
   [junit4]   2> 66572 INFO  (qtp438818493-1239) [n:127.0.0.1:49707_solr    ] o.a.s.s.HttpSolrCall [admin] webapp=null path=/admin/cores params={qt=/admin/cores&requestid=254cbecd-7455-4df3-9fd0-12bd57553464460862204216946&action=REQUESTSTATUS&wt=javabin&version=2} status=0 QTime=0
   [junit4]   2> 66574 INFO  (qtp1540063276-1230) [n:127.0.0.1:49710_solr    ] o.a.s.h.a.CoreAdminOperation Checking request status for : 254cbecd-7455-4df3-9fd0-12bd57553464460862206951312
   [junit4]   2> 66574 INFO  (qtp1540063276-1230) [n:127.0.0.1:49710_solr    ] o.a.s.s.HttpSolrCall [admin] webapp=null path=/admin/cores params={qt=/admin/cores&requestid=254cbecd-7455-4df3-9fd0-12bd57553464460862206951312&action=REQUESTSTATUS&wt=javabin&version=2} status=0 QTime=0
   [junit4]   2> 66619 INFO  (zkCallback-34-thread-1-processing-n:127.0.0.1:49710_solr) [n:127.0.0.1:49710_solr    ] o.a.s.c.c.ZkStateReader A cluster state change: [WatchedEvent state:SyncConnected type:NodeDataChanged path:/collections/testcollection/state.json] for collection [testcollection] has occurred - updating... (live nodes size: [2])
   [junit4]   2> 66619 INFO  (zkCallback-33-thread-1-processing-n:127.0.0.1:49707_solr) [n:127.0.0.1:49707_solr    ] o.a.s.c.c.ZkStateReader A cluster state change: [WatchedEvent state:SyncConnected type:NodeDataChanged path:/collections/testcollection/state.json] for collection [testcollection] has occurred - updating... (live nodes size: [2])
   [junit4]   2> 67113 INFO  (zkCallback-34-thread-1-processing-n:127.0.0.1:49710_solr) [n:127.0.0.1:49710_solr    ] o.a.s.c.c.ZkStateReader A cluster state change: [WatchedEvent state:SyncConnected type:NodeDataChanged path:/collections/testcollection/state.json] for collection [testcollection] has occurred - updating... (live nodes size: [2])
   [junit4]   2> 67113 INFO  (zkCallback-33-thread-1-processing-n:127.0.0.1:49707_solr) [n:127.0.0.1:49707_solr    ] o.a.s.c.c.ZkStateReader A cluster state change: [WatchedEvent state:SyncConnected type:NodeDataChanged path:/collections/testcollection/state.json] for collection [testcollection] has occurred - updating... (live nodes size: [2])
   [junit4]   2> 67167 INFO  (qtp438818493-1235) [n:127.0.0.1:49707_solr    ] o.a.s.h.a.CollectionsHandler Invoked Collection Action :requeststatus with params requestid=254cbecd-7455-4df3-9fd0-12bd57553464&action=REQUESTSTATUS&wt=javabin&version=2 and sendToOCPQueue=true
   [junit4]   2> 67170 INFO  (qtp438818493-1235) [n:127.0.0.1:49707_solr    ] o.a.s.s.HttpSolrCall [admin] webapp=null path=/admin/collections params={requestid=254cbecd-7455-4df3-9fd0-12bd57553464&action=REQUESTSTATUS&wt=javabin&version=2} status=0 QTime=2
   [junit4]   2> 67576 INFO  (qtp1540063276-1228) [n:127.0.0.1:49710_solr    ] o.a.s.h.a.CoreAdminOperation Checking request status for : 254cbecd-7455-4df3-9fd0-12bd57553464460862206951312
   [junit4]   2> 67576 INFO  (qtp1540063276-1228) [n:127.0.0.1:49710_solr    ] o.a.s.s.HttpSolrCall [admin] webapp=null path=/admin/cores params={qt=/admin/cores&requestid=254cbecd-7455-4df3-9fd0-12bd57553464460862206951312&action=REQUESTSTATUS&wt=javabin&version=2} status=0 QTime=0
   [junit4]   2> 67599 INFO  (OverseerThreadFactory-119-thread-1-processing-n:127.0.0.1:49710_solr) [n:127.0.0.1:49710_solr    ] o.a.s.c.OverseerTaskQueue Response ZK path: /overseer/collection-queue-work/qnr-0000000000 doesn't exist.  Requestor may have disconnected from ZooKeeper
   [junit4]   2> 68167 INFO  (OverseerCollectionConfigSetProcessor-98483951340224517-127.0.0.1:49710_solr-n_0000000000) [n:127.0.0.1:49710_solr    ] o.a.s.c.OverseerTaskQueue Response ZK path: /overseer/collection-queue-work/qnr-0000000000 doesn't exist.  Requestor may have disconnected from ZooKeeper
   [junit4]   2> 68172 INFO  (qtp438818493-1234) [n:127.0.0.1:49707_solr    ] o.a.s.h.a.CollectionsHandler Invoked Collection Action :requeststatus with params requestid=254cbecd-7455-4df3-9fd0-12bd57553464&action=REQUESTSTATUS&wt=javabin&version=2 and sendToOCPQueue=true
   [junit4]   2> 68175 INFO  (qtp438818493-1234) [n:127.0.0.1:49707_solr    ] o.a.s.s.HttpSolrCall [admin] webapp=null path=/admin/collections params={requestid=254cbecd-7455-4df3-9fd0-12bd57553464&action=REQUESTSTATUS&wt=javabin&version=2} status=0 QTime=3
   [junit4]   2> 68178 INFO  (qtp438818493-1231) [n:127.0.0.1:49707_solr    ] o.a.s.h.a.CollectionsHandler Invoked Collection Action :deletestatus with params requestid=254cbecd-7455-4df3-9fd0-12bd57553464&action=DELETESTATUS&wt=javabin&version=2 and sendToOCPQueue=true
   [junit4]   2> 68179 INFO  (qtp438818493-1231) [n:127.0.0.1:49707_solr    ] o.a.s.s.HttpSolrCall [admin] webapp=null path=/admin/collections params={requestid=254cbecd-7455-4df3-9fd0-12bd57553464&action=DELETESTATUS&wt=javabin&version=2} status=0 QTime=1
   [junit4]   2> 68186 INFO  (TEST-TestAuthenticationFramework.testBasics-seed#[502470BC77FC2F8A]) [    ] o.a.s.c.AbstractDistribZkTestBase Wait for recoveries to finish - collection: testcollection failOnTimeout:true timeout (sec):330
   [junit4]   1> -
   [junit4]   1> replica:core_node3 rstate:active live:true
   [junit4]   1> replica:core_node6 rstate:active live:true
   [junit4]   1> replica:core_node7 rstate:active live:true
   [junit4]   1> replica:core_node8 rstate:active live:true
   [junit4]   1> no one is recoverying
   [junit4]   2> 68187 INFO  (TEST-TestAuthenticationFramework.testBasics-seed#[502470BC77FC2F8A]) [    ] o.a.s.c.AbstractDistribZkTestBase Recoveries finished - collection: testcollection
   [junit4]   2> 68234 INFO  (qtp1540063276-1225) [n:127.0.0.1:49710_solr c:testcollection s:shard2 r:core_node8 x:testcollection_shard2_replica_n5] o.a.s.c.S.Request [testcollection_shard2_replica_n5]  webapp=/solr path=/select params={df=text&distrib=false&_stateVer_=testcollection:6&fl=id&fl=score&shards.purpose=4&start=0&fsv=true&shard.url=http://127.0.0.1:49710/solr/testcollection_shard2_replica_n5/|http://127.0.0.1:49707/solr/testcollection_shard2_replica_n4/&rows=10&version=2&q=*:*&NOW=1502745845004&isShard=true&wt=javabin} hits=0 status=0 QTime=25
   [junit4]   2> 68234 INFO  (qtp438818493-1237) [n:127.0.0.1:49707_solr c:testcollection s:shard1 r:core_node3 x:testcollection_shard1_replica_n1] o.a.s.c.S.Request [testcollection_shard1_replica_n1]  webapp=/solr path=/select params={df=text&distrib=false&_stateVer_=testcollection:6&fl=id&fl=score&shards.purpose=4&start=0&fsv=true&shard.url=http://127.0.0.1:49707/solr/testcollection_shard1_replica_n1/|http://127.0.0.1:49710/solr/testcollection_shard1_replica_n2/&rows=10&version=2&q=*:*&NOW=1502745845004&isShard=true&wt=javabin} hits=0 status=0 QTime=24
   [junit4]   2> 68245 INFO  (qtp438818493-1229) [n:127.0.0.1:49707_solr c:testcollection s:shard2 r:core_node7 x:testcollection_shard2_replica_n4] o.a.s.c.S.Request [testcollection_shard2_replica_n4]  webapp=/solr path=/select params={q=*:*&_stateVer_=testcollection:6&wt=javabin&version=2} hits=0 status=0 QTime=50
   [junit4]   2> 68363 INFO  (qtp438818493-1227) [n:127.0.0.1:49707_solr c:testcollection s:shard1 r:core_node3 x:testcollection_shard1_replica_n1] o.a.s.u.p.LogUpdateProcessorFactory [testcollection_shard1_replica_n1]  webapp=/solr path=/update params={update.distrib=FROMLEADER&distrib.from=http://127.0.0.1:49710/solr/testcollection_shard1_replica_n2/&wt=javabin&version=2}{add=[1 (1575743227242217472)]} 0 20
   [junit4]   2> 68365 INFO  (qtp1540063276-1233) [n:127.0.0.1:49710_solr c:testcollection s:shard1 r:core_node6 x:testcollection_shard1_replica_n2] o.a.s.u.p.LogUpdateProcessorFactory [testcollection_shard1_replica_n2]  webapp=/solr path=/update params={_stateVer_=testcollection:6&wt=javabin&version=2}{add=[1 (1575743227242217472)]} 0 113
   [junit4]   2> 68386 INFO  (qtp438818493-1239) [n:127.0.0.1:49707_solr c:testcollection s:shard1 r:core_node3 x:testcollection_shard1_replica_n1] o.a.s.u.DirectUpdateHandler2 start commit{_version_=1575743227368046592,optimize=false,openSearcher=true,waitSearcher=true,expungeDeletes=false,softCommit=false,prepareCommit=false}
   [junit4]   2> 68386 INFO  (qtp438818493-1239) [n:127.0.0.1:49707_solr c:testcollection s:shard1 r:core_node3 x:testcollection_shard1_replica_n1] o.a.s.u.SolrIndexWriter Calling setCommitData with IW:org.apache.solr.update.SolrIndexWriter@326b6562 commitCommandVersion:1575743227368046592
   [junit4]   2> 68391 INFO  (qtp438818493-1235) [n:127.0.0.1:49707_solr c:testcollection s:shard2 r:core_node7 x:testcollection_shard2_replica_n4] o.a.s.u.DirectUpdateHandler2 start commit{_version_=1575743227373289472,optimize=false,openSearcher=true,waitSearcher=true,expungeDeletes=false,softCommit=false,prepareCommit=false}
   [junit4]   2> 68396 INFO  (qtp438818493-1235) [n:127.0.0.1:49707_solr c:testcollection s:shard2 r:core_node7 x:testcollection_shard2_replica_n4] o.a.s.u.DirectUpdateHandler2 No uncommitted changes. Skipping IW.commit.
   [junit4]   2> 68403 INFO  (qtp438818493-1235) [n:127.0.0.1:49707_solr c:testcollection s:shard2 r:core_node7 x:testcollection_shard2_replica_n4] o.a.s.u.DirectUpdateHandler2 end_commit_flush
   [junit4]   2> 68403 INFO  (qtp438818493-1235) [n:127.0.0.1:49707_solr c:testcollection s:shard2 r:core_node7 x:testcollection_shard2_replica_n4] o.a.s.u.p.LogUpdateProcessorFactory [testcollection_shard2_replica_n4]  webapp=/solr path=/update params={update.distrib=FROMLEADER&waitSearcher=true&openSearcher=true&commit=true&softCommit=false&distrib.from=http://127.0.0.1:49710/solr/testcollection_shard1_replica_n2/&commit_end_point=true&wt=javabin&version=2&expungeDeletes=false}{commit=} 0 12
   [junit4]   2> 68405 INFO  (qtp1540063276-1232) [n:127.0.0.1:49710_solr c:testcollection s:shard2 r:core_node8 x:testcollection_shard2_replica_n5] o.a.s.u.DirectUpdateHandler2 start commit{_version_=1575743227387969536,optimize=false,openSearcher=true,waitSearcher=true,expungeDeletes=false,softCommit=false,prepareCommit=false}
   [junit4]   2> 68408 INFO  (qtp1540063276-1232) [n:127.0.0.1:49710_solr c:testcollection s:shard2 r:core_node8 x:testcollection_shard2_replica_n5] o.a.s.u.DirectUpdateHandler2 No uncommitted changes. Skipping IW.commit.
   [junit4]   2> 68415 INFO  (qtp1540063276-1232) [n:127.0.0.1:49710_solr c:testcollection s:shard2 r:core_node8 x:testcollection_shard2_replica_n5] o.a.s.u.DirectUpdateHandler2 end_commit_flush
   [junit4]   2> 68417 INFO  (qtp1540063276-1230) [n:127.0.0.1:49710_solr c:testcollection s:shard1 r:core_node6 x:testcollection_shard1_replica_n2] o.a.s.u.DirectUpdateHandler2 start commit{_version_=1575743227400552448,optimize=false,openSearcher=true,waitSearcher=true,expungeDeletes=false,softCommit=false,prepareCommit=false}
   [junit4]   2> 68417 INFO  (qtp1540063276-1230) [n:127.0.0.1:49710_solr c:testcollection s:shard1 r:core_node6 x:testcollection_shard1_replica_n2] o.a.s.u.SolrIndexWriter Calling setCommitData with IW:org.apache.solr.update.SolrIndexWriter@6a8b6910 commitCommandVersion:1575743227400552448
   [junit4]   2> 68417 INFO  (qtp1540063276-1232) [n:127.0.0.1:49710_solr c:testcollection s:shard2 r:core_node8 x:testcollection_shard2_replica_n5] o.a.s.u.p.LogUpdateProcessorFactory [testcollection_shard2_replica_n5]  webapp=/solr path=/update params={update.distrib=FROMLEADER&waitSearcher=true&openSearcher=true&commit=true&softCommit=false&distrib.from=http://127.0.0.1:49710/solr/testcollection_shard1_replica_n2/&commit_end_point=true&wt=javabin&version=2&expungeDeletes=false}{commit=} 0 11
   [junit4]   2> 68472 INFO  (qtp438818493-1239) [n:127.0.0.1:49707_solr c:testcollection s:shard1 r:core_node3 x:testcollection_shard1_replica_n1] o.a.s.s.SolrIndexSearcher Opening [Searcher@6df8cc27[testcollection_shard1_replica_n1] main]
   [junit4]   2> 68475 INFO  (searcherExecutor-124-thread-1-processing-n:127.0.0.1:49707_solr x:testcollection_shard1_replica_n1 s:shard1 c:testcollection r:core_node3) [n:127.0.0.1:49707_solr c:testcollection s:shard1 r:core_node3 x:testcollection_shard1_replica_n1] o.a.s.c.SolrCore [testcollection_shard1_replica_n1] Registered new searcher Searcher@6df8cc27[testcollection_shard1_replica_n1] main{ExitableDirectoryReader(UninvertingDirectoryReader(Uninverting(_0(7.1.0):C1)))}
   [junit4]   2> 68480 INFO  (qtp438818493-1239) [n:127.0.0.1:49707_solr c:testcollection s:shard1 r:core_node3 x:testcollection_shard1_replica_n1] o.a.s.u.DirectUpdateHandler2 end_commit_flush
   [junit4]   2> 68480 INFO  (qtp438818493-1239) [n:127.0.0.1:49707_solr c:testcollection s:shard1 r:core_node3 x:testcollection_shard1_replica_n1] o.a.s.u.p.LogUpdateProcessorFactory [testcollection_shard1_replica_n1]  webapp=/solr path=/update params={update.distrib=FROMLEADER&waitSearcher=true&openSearcher=true&commit=true&softCommit=false&distrib.from=http://127.0.0.1:49710/solr/testcollection_shard1_replica_n2/&commit_end_point=true&wt=javabin&version=2&expungeDeletes=false}{commit=} 0 95
   [junit4]   2> 68482 INFO  (qtp1540063276-1230) [n:127.0.0.1:49710_solr c:testcollection s:shard1 r:core_node6 x:testcollection_shard1_replica_n2] o.a.s.s.SolrIndexSearcher Opening [Searcher@5db0bfdf[testcollection_shard1_replica_n2] main]
   [junit4]   2> 68490 INFO  (qtp1540063276-1230) [n:127.0.0.1:49710_solr c:testcollection s:shard1 r:core_node6 x:testcollection_shard1_replica_n2] o.a.s.u.DirectUpdateHandler2 end_commit_flush
   [junit4]   2> 68491 INFO  (searcherExecutor-126-thread-1-processing-n:127.0.0.1:49710_solr x:testcollection_shard1_replica_n2 s:shard1 c:testcollection r:core_node6) [n:127.0.0.1:49710_solr c:testcollection s:shard1 r:core_node6 x:testcollection_shard1_replica_n2] o.a.s.c.SolrCore [testcollection_shard1_replica_n2] Registered new searcher Searcher@5db0bfdf[testcollection_shard1_replica_n2] main{ExitableDirectoryReader(UninvertingDirectoryReader(Uninverting(_0(7.1.0):C1)))}
   [junit4]   2> 68491 INFO  (qtp1540063276-1230) [n:127.0.0.1:49710_solr c:testcollection s:shard1 r:core_node6 x:testcollection_shard1_replica_n2] o.a.s.u.p.LogUpdateProcessorFactory [testcollection_shard1_replica_n2]  webapp=/solr path=/update params={update.distrib=FROMLEADER&waitSearcher=true&openSearcher=true&commit=true&softCommit=false&distrib.from=http://127.0.0.1:49710/solr/testcollection_shard1_replica_n2/&commit_end_point=true&wt=javabin&version=2&expungeDeletes=false}{commit=} 0 75
   [junit4]   2> 68515 INFO  (qtp1540063276-1236) [n:127.0.0.1:49710_solr c:testcollection s:shard1 r:core_node6 x:testcollection_shard1_replica_n2] o.a.s.u.p.LogUpdateProcessorFactory [testcollection_shard1_replica_n2]  webapp=/solr path=/update params={_stateVer_=testcollection:6&commit=true&wt=javabin&version=2}{commit=} 0 146
   [junit4]   2> 68519 INFO  (qtp1540063276-1225) [n:127.0.0.1:49710_solr c:testcollection s:shard2 r:core_node8 x:testcollection_shard2_replica_n5] o.a.s.c.S.Request [testcollection_shard2_replica_n5]  webapp=/solr path=/select params={df=text&distrib=false&_stateVer_=testcollection:6&fl=id&fl=score&shards.purpose=4&start=0&fsv=true&shard.url=http://127.0.0.1:49710/solr/testcollection_shard2_replica_n5/|http://127.0.0.1:49707/solr/testcollection_shard2_replica_n4/&rows=10&version=2&q=*:*&NOW=1502745845322&isShard=true&wt=javabin} hits=0 status=0 QTime=0
   [junit4]   2> 68525 INFO  (qtp438818493-1234) [n:127.0.0.1:49707_solr c:testcollection s:shard1 r:core_node3 x:testcollection_shard1_replica_n1] o.a.s.c.S.Request [testcollection_shard1_replica_n1]  webapp=/solr path=/select params={df=text&distrib=false&_stateVer_=testcollection:6&fl=id&fl=score&shards.purpose=4&start=0&fsv=true&shard.url=http://127.0.0.1:49707/solr/testcollection_shard1_replica_n1/|http://127.0.0.1:49710/solr/testcollection_shard1_replica_n2/&rows=10&version=2&q=*:*&NOW=1502745845322&isShard=true&wt=javabin} hits=1 status=0 QTime=0
   [junit4]   2> 68539 INFO  (qtp438818493-1234) [n:127.0.0.1:49707_solr c:testcollection s:shard1 r:core_node3 x:testcollection_shard1_replica_n1] o.a.s.c.S.Request [testcollection_shard1_replica_n1]  webapp=/solr path=/select params={q=*:*&df=text&distrib=false&_stateVer_=testcollection:6&shards.purpose=64&NOW=1502745845322&ids=1&isShard=true&shard.url=http://127.0.0.1:49707/solr/testcollection_shard1_replica_n1/|http://127.0.0.1:49710/solr/testcollection_shard1_replica_n2/&wt=javabin&version=2} status=0 QTime=4
   [junit4]   2> 68541 INFO  (qtp1540063276-1236) [n:127.0.0.1:49710_solr c:testcollection s:shard1 r:core_node6 x:testcollection_shard1_replica_n2] o.a.s.c.S.Request [testcollection_shard1_replica_n2]  webapp=/solr path=/select params={q=*:*&_stateVer_=testcollection:6&wt=javabin&version=2} hits=1 status=0 QTime=24
   [junit4]   2> 68544 INFO  (qtp438818493-1234) [n:127.0.0.1:49707_solr    ] o.a.s.h.a.CollectionsHandler Invoked Collection Action :delete with params name=testcollection&action=DELETE&wt=javabin&version=2 and sendToOCPQueue=true
   [junit4]   2> 68565 INFO  (OverseerThreadFactory-119-thread-2-processing-n:127.0.0.1:49710_solr) [n:127.0.0.1:49710_solr    ] o.a.s.c.OverseerCollectionMessageHandler Executing Collection Cmd : action=UNLOAD&deleteInstanceDir=true&deleteDataDir=true
   [junit4]   2> 68568 INFO  (qtp438818493-1229) [n:127.0.0.1:49707_solr    ] o.a.s.m.SolrMetricManager Closing metric reporters for registry=solr.core.testcollection.shard1.replica_n1, tag=null
   [junit4]   2> 68568 INFO  (qtp438818493-1229) [n:127.0.0.1:49707_solr    ] o.a.s.m.r.SolrJmxReporter Closing reporter [org.apache.solr.metrics.reporters.SolrJmxReporter@cdb60df: rootName = solr_49707, domain = solr.core.testcollection.shard1.replica_n1, service url = null, agent id = null] for registry solr.core.testcollection.shard1.replica_n1 / com.codahale.metrics.MetricRegistry@3de4b595
   [junit4]   2> 68576 INFO  (qtp438818493-1229) [n:127.0.0.1:49707_solr    ] o.a.s.c.SolrCore [testcollection_shard1_replica_n1]  CLOSING SolrCore org.apache.solr.core.SolrCore@c066601
   [junit4]   2> 68589 INFO  (qtp1540063276-1225) [n:127.0.0.1:49710_solr    ] o.a.s.m.SolrMetricManager Closing metric reporters for registry=solr.core.testcollection.shard1.replica_n2, tag=null
   [junit4]   2> 68592 INFO  (qtp1540063276-1225) [n:127.0.0.1:49710_solr    ] o.a.s.m.r.SolrJmxReporter Closing reporter [org.apache.solr.metrics.reporters.SolrJmxReporter@67fef1e1: rootName = solr_49710, domain = solr.core.testcollection.shard1.replica_n2, service url = null, agent id = null] for registry solr.core.testcollection.shard1.replica_n2 / com.codahale.metrics.MetricRegistry@525d2296
   [junit4

[...truncated too long message...]

g=null
   [junit4]   2> 1172922 INFO  (coreCloseExecutor-4308-thread-1) [n:127.0.0.1:56618_ c:collection1 s:shard2 r:core_node46 x:collection1_shard2_replica_t45] o.a.s.c.SolrCore [collection1_shard2_replica_t45]  CLOSING SolrCore org.apache.solr.core.SolrCore@2503e116
   [junit4]   2> 1172922 INFO  (coreCloseExecutor-4308-thread-1) [n:127.0.0.1:56618_ c:collection1 s:shard2 r:core_node46 x:collection1_shard2_replica_t45] o.a.s.m.SolrMetricManager Closing metric reporters for registry=solr.core.collection1.shard2.replica_t45, tag=621011222
   [junit4]   2> 1172922 INFO  (coreCloseExecutor-4308-thread-1) [n:127.0.0.1:56618_ c:collection1 s:shard2 r:core_node46 x:collection1_shard2_replica_t45] o.a.s.m.r.SolrJmxReporter Closing reporter [org.apache.solr.metrics.reporters.SolrJmxReporter@1bfcf1b2: rootName = null, domain = solr.core.collection1.shard2.replica_t45, service url = null, agent id = null] for registry solr.core.collection1.shard2.replica_t45 / com.codahale.metrics.MetricRegistry@7c958d00
   [junit4]   2> 1172935 INFO  (coreCloseExecutor-4308-thread-1) [n:127.0.0.1:56618_ c:collection1 s:shard2 r:core_node46 x:collection1_shard2_replica_t45] o.a.s.m.SolrMetricManager Closing metric reporters for registry=solr.collection.collection1.shard2.leader, tag=621011222
   [junit4]   2> 1172935 INFO  (TEST-ForceLeaderTest.testReplicasInLIRNoLeader-seed#[502470BC77FC2F8A]) [    ] o.a.s.c.Overseer Overseer (id=98484021456732175-127.0.0.1:56618_-n_0000000003) closing
   [junit4]   2> 1172935 INFO  (OverseerStateUpdate-98484021456732175-127.0.0.1:56618_-n_0000000003) [n:127.0.0.1:56618_    ] o.a.s.c.Overseer Overseer Loop exiting : 127.0.0.1:56618_
   [junit4]   2> 1172935 WARN  (zkCallback-1518-thread-2-processing-n:127.0.0.1:56618_) [n:127.0.0.1:56618_    ] o.a.s.c.c.ZkStateReader ZooKeeper watch triggered, but Solr cannot talk to ZK: [KeeperErrorCode = Session expired for /live_nodes]
   [junit4]   2> 1172953 INFO  (TEST-ForceLeaderTest.testReplicasInLIRNoLeader-seed#[502470BC77FC2F8A]) [    ] o.e.j.s.AbstractConnector Stopped ServerConnector@57c5be48{HTTP/1.1,[http/1.1]}{127.0.0.1:0}
   [junit4]   2> 1172953 INFO  (TEST-ForceLeaderTest.testReplicasInLIRNoLeader-seed#[502470BC77FC2F8A]) [    ] o.e.j.s.h.ContextHandler Stopped o.e.j.s.ServletContextHandler@1a105608{/,null,UNAVAILABLE}
   [junit4]   2> 1172953 ERROR (TEST-ForceLeaderTest.testReplicasInLIRNoLeader-seed#[502470BC77FC2F8A]) [    ] o.a.z.s.ZooKeeperServer ZKShutdownHandler is not registered, so ZooKeeper server won't take any action on ERROR or SHUTDOWN server state changes
   [junit4]   2> 1172966 INFO  (TEST-ForceLeaderTest.testReplicasInLIRNoLeader-seed#[502470BC77FC2F8A]) [    ] o.a.s.c.ZkTestServer connecting to 127.0.0.1:56551 56551
   [junit4]   2> 1172966 INFO  (Thread-2101) [    ] o.a.s.c.ZkTestServer connecting to 127.0.0.1:56551 56551
   [junit4]   2> 1172966 WARN  (Thread-2101) [    ] o.a.s.c.ZkTestServer Watch limit violations: 
   [junit4]   2> Maximum concurrent create/delete watches above limit:
   [junit4]   2> 
   [junit4]   2> 	6	/solr/aliases.json
   [junit4]   2> 	4	/solr/security.json
   [junit4]   2> 	4	/solr/configs/conf1
   [junit4]   2> 	3	/solr/collections/forceleader_test_collection/state.json
   [junit4]   2> 	3	/solr/collections/collection1/state.json
   [junit4]   2> 
   [junit4]   2> Maximum concurrent data watches above limit:
   [junit4]   2> 
   [junit4]   2> 	6	/solr/clusterstate.json
   [junit4]   2> 	6	/solr/clusterprops.json
   [junit4]   2> 	2	/solr/overseer_elect/election/98484021456732164-127.0.0.1:56558_-n_0000000000
   [junit4]   2> 
   [junit4]   2> Maximum concurrent children watches above limit:
   [junit4]   2> 
   [junit4]   2> 	6	/solr/live_nodes
   [junit4]   2> 	6	/solr/collections
   [junit4]   2> 	3	/solr/overseer/queue
   [junit4]   2> 	3	/solr/overseer/collection-queue-work
   [junit4]   2> 
   [junit4]   2> 1172966 WARN  (TEST-ForceLeaderTest.testReplicasInLIRNoLeader-seed#[502470BC77FC2F8A]) [    ] o.a.s.c.SocketProxy Closing 0 connections to: http://127.0.0.1:56584/, target: http://127.0.0.1:56585/
   [junit4]   2> 1172966 WARN  (TEST-ForceLeaderTest.testReplicasInLIRNoLeader-seed#[502470BC77FC2F8A]) [    ] o.a.s.c.SocketProxy Closing 14 connections to: http://127.0.0.1:56558/, target: http://127.0.0.1:56559/
   [junit4]   2> 1172966 WARN  (TEST-ForceLeaderTest.testReplicasInLIRNoLeader-seed#[502470BC77FC2F8A]) [    ] o.a.s.c.SocketProxy Closing 2 connections to: http://127.0.0.1:56602/, target: http://127.0.0.1:56603/
   [junit4]   2> 1172966 WARN  (TEST-ForceLeaderTest.testReplicasInLIRNoLeader-seed#[502470BC77FC2F8A]) [    ] o.a.s.c.SocketProxy Closing 2 connections to: http://127.0.0.1:56618/, target: http://127.0.0.1:56619/
   [junit4]   2> NOTE: reproduce with: ant test  -Dtestcase=ForceLeaderTest -Dtests.method=testReplicasInLIRNoLeader -Dtests.seed=502470BC77FC2F8A -Dtests.slow=true -Dtests.locale=cs -Dtests.timezone=Asia/Barnaul -Dtests.asserts=true -Dtests.file.encoding=US-ASCII
   [junit4] FAILURE 40.2s J1 | ForceLeaderTest.testReplicasInLIRNoLeader <<<
   [junit4]    > Throwable #1: java.lang.AssertionError: Doc with id=1 not found in http://127.0.0.1:56558/forceleader_test_collection due to: Path not found: /id; rsp={doc=null}
   [junit4]    > 	at __randomizedtesting.SeedInfo.seed([502470BC77FC2F8A:B6B3447C4E7ED6EB]:0)
   [junit4]    > 	at org.apache.solr.cloud.HttpPartitionTest.assertDocExists(HttpPartitionTest.java:603)
   [junit4]    > 	at org.apache.solr.cloud.HttpPartitionTest.assertDocsExistInAllReplicas(HttpPartitionTest.java:556)
   [junit4]    > 	at org.apache.solr.cloud.ForceLeaderTest.testReplicasInLIRNoLeader(ForceLeaderTest.java:142)
   [junit4]    > 	at org.apache.solr.BaseDistributedSearchTestCase$ShardsRepeatRule$ShardsFixedStatement.callStatement(BaseDistributedSearchTestCase.java:993)
   [junit4]    > 	at org.apache.solr.BaseDistributedSearchTestCase$ShardsRepeatRule$ShardsStatement.evaluate(BaseDistributedSearchTestCase.java:968)
   [junit4]    > 	at java.lang.Thread.run(Thread.java:748)
   [junit4]   2> NOTE: leaving temporary files on disk at: C:\Users\jenkins\workspace\Lucene-Solr-7.x-Windows\solr\build\solr-core\test\J1\temp\solr.cloud.ForceLeaderTest_502470BC77FC2F8A-001
   [junit4]   2> Aug 14, 2017 9:42:29 PM com.carrotsearch.randomizedtesting.ThreadLeakControl checkThreadLeaks
   [junit4]   2> WARNING: Will linger awaiting termination of 2 leaked thread(s).
   [junit4]   2> NOTE: test params are: codec=CheapBastard, sim=RandomSimilarity(queryNorm=false): {}, locale=cs, timezone=Asia/Barnaul
   [junit4]   2> NOTE: Windows 10 10.0 amd64/Oracle Corporation 1.8.0_144 (64-bit)/cpus=3,threads=1,free=164520440,total=518979584
   [junit4]   2> NOTE: All tests run in this JVM: [TestPolicyCloud, MoreLikeThisHandlerTest, OverseerCollectionConfigSetProcessorTest, TestStressLucene, TestMergePolicyConfig, TestFastWriter, TestAnalyzedSuggestions, TestConfigOverlay, SolrGraphiteReporterTest, AutoCommitTest, DistribCursorPagingTest, UpdateRequestProcessorFactoryTest, TestGraphMLResponseWriter, CollectionTooManyReplicasTest, TestMultiValuedNumericRangeQuery, DistribJoinFromCollectionTest, TestRangeQuery, FullHLLTest, TestDynamicLoading, TestDynamicFieldResource, TestSchemaResource, CachingDirectoryFactoryTest, ShardRoutingCustomTest, HttpSolrCallGetCoreTest, EnumFieldTest, SOLR749Test, TestCollationFieldDocValues, TestSuggestSpellingConverter, CloneFieldUpdateProcessorFactoryTest, LeaderElectionIntegrationTest, CursorMarkTest, HdfsWriteToMultipleCollectionsTest, StatsComponentTest, TermVectorComponentDistributedTest, TestLRUStatsCache, TermsComponentTest, BasicDistributedZk2Test, AtomicUpdatesTest, TestConfigsApi, TestManagedSchema, UpdateParamsTest, SpellCheckComponentTest, TestReqParamsAPI, TestSchemaVersionResource, CdcrVersionReplicationTest, TestRandomCollapseQParserPlugin, MissingSegmentRecoveryTest, SolrPluginUtilsTest, DocumentBuilderTest, TestCollectionAPI, ExternalFileFieldSortTest, HdfsBasicDistributedZkTest, SynonymTokenizerTest, TestSlowCompositeReaderWrapper, CollectionsAPIDistributedZkTest, IndexSchemaRuntimeFieldTest, MBeansHandlerTest, BadComponentTest, DistributedTermsComponentTest, BlockJoinFacetSimpleTest, TestCloudSearcherWarming, PreAnalyzedUpdateProcessorTest, TestCollapseQParserPlugin, TermVectorComponentTest, TestSizeLimitedDistributedMap, TestBadConfig, SolrRequestParserTest, TestDelegationWithHadoopAuth, BlockDirectoryTest, TestHttpShardHandlerFactory, TestDistributedStatsComponentCardinality, PreAnalyzedFieldTest, CoreAdminRequestStatusTest, TestPushWriter, TestTrie, DateRangeFieldTest, TestCloudManagedSchema, ActionThrottleTest, TestLMJelinekMercerSimilarityFactory, TestIntervalFaceting, TestInitQParser, TestReloadDeadlock, TestXmlQParser, SolrCmdDistributorTest, ClassificationUpdateProcessorIntegrationTest, TestRuleBasedAuthorizationPlugin, HdfsRecoveryZkTest, BasicAuthStandaloneTest, TestLeaderElectionZkExpiry, TestSystemCollAutoCreate, UpdateLogTest, ConvertedLegacyTest, SolrCoreCheckLockOnStartupTest, OpenCloseCoreStressTest, TestDocumentBuilder, SegmentsInfoRequestHandlerTest, TestQueryTypes, TestApiFramework, AnalysisErrorHandlingTest, TestSolrCloudWithKerberosAlt, TestFieldResource, QueryEqualityTest, HdfsChaosMonkeySafeLeaderTest, HdfsTlogReplayBufferedWhileIndexingTest, HdfsSyncSliceTest, ShufflingReplicaListTransformerTest, DistributedSuggestComponentTest, PolyFieldTest, TestUseDocValuesAsStored, DebugComponentTest, TestMiniSolrCloudClusterSSL, DistributedQueryElevationComponentTest, TestValueSourceCache, DistributedDebugComponentTest, TestSimpleTrackingShardHandler, LeaderFailureAfterFreshStartTest, TestHdfsBackupRestoreCore, TestJsonFacetRefinement, TestFiltering, TestFieldCacheWithThreads, StatelessScriptUpdateProcessorFactoryTest, ForceLeaderTest]
   [junit4] Completed [197/729 (2!)] on J1 in 114.34s, 3 tests, 1 failure, 1 skipped <<< FAILURES!

[...truncated 45167 lines...]

Mime
View raw message