lucene-dev mailing list archives

Site index · List index
Message view « Date » · « Thread »
Top « Date » · « Thread »
From Policeman Jenkins Server <jenk...@thetaphi.de>
Subject [JENKINS] Lucene-Solr-7.x-Linux (64bit/jdk1.8.0_144) - Build # 303 - Still Unstable!
Date Tue, 22 Aug 2017 22:34:33 GMT
Build: https://jenkins.thetaphi.de/job/Lucene-Solr-7.x-Linux/303/
Java: 64bit/jdk1.8.0_144 -XX:+UseCompressedOops -XX:+UseConcMarkSweepGC

2 tests failed.
FAILED:  org.apache.solr.cloud.HttpPartitionTest.test

Error Message:
Doc with id=1 not found in http://127.0.0.1:41879/collMinRf_1x3 due to: Path not found: /id;
rsp={doc=null}

Stack Trace:
java.lang.AssertionError: Doc with id=1 not found in http://127.0.0.1:41879/collMinRf_1x3
due to: Path not found: /id; rsp={doc=null}
	at __randomizedtesting.SeedInfo.seed([1779746CC0633D81:9F2D4BB66E9F5079]:0)
	at org.junit.Assert.fail(Assert.java:93)
	at org.junit.Assert.assertTrue(Assert.java:43)
	at org.apache.solr.cloud.HttpPartitionTest.assertDocExists(HttpPartitionTest.java:603)
	at org.apache.solr.cloud.HttpPartitionTest.assertDocsExistInAllReplicas(HttpPartitionTest.java:558)
	at org.apache.solr.cloud.HttpPartitionTest.testMinRf(HttpPartitionTest.java:249)
	at org.apache.solr.cloud.HttpPartitionTest.test(HttpPartitionTest.java:127)
	at sun.reflect.NativeMethodAccessorImpl.invoke0(Native Method)
	at sun.reflect.NativeMethodAccessorImpl.invoke(NativeMethodAccessorImpl.java:62)
	at sun.reflect.DelegatingMethodAccessorImpl.invoke(DelegatingMethodAccessorImpl.java:43)
	at java.lang.reflect.Method.invoke(Method.java:498)
	at com.carrotsearch.randomizedtesting.RandomizedRunner.invoke(RandomizedRunner.java:1713)
	at com.carrotsearch.randomizedtesting.RandomizedRunner$8.evaluate(RandomizedRunner.java:907)
	at com.carrotsearch.randomizedtesting.RandomizedRunner$9.evaluate(RandomizedRunner.java:943)
	at com.carrotsearch.randomizedtesting.RandomizedRunner$10.evaluate(RandomizedRunner.java:957)
	at org.apache.solr.BaseDistributedSearchTestCase$ShardsRepeatRule$ShardsFixedStatement.callStatement(BaseDistributedSearchTestCase.java:993)
	at org.apache.solr.BaseDistributedSearchTestCase$ShardsRepeatRule$ShardsStatement.evaluate(BaseDistributedSearchTestCase.java:968)
	at com.carrotsearch.randomizedtesting.rules.SystemPropertiesRestoreRule$1.evaluate(SystemPropertiesRestoreRule.java:57)
	at org.apache.lucene.util.TestRuleSetupTeardownChained$1.evaluate(TestRuleSetupTeardownChained.java:49)
	at org.apache.lucene.util.AbstractBeforeAfterRule$1.evaluate(AbstractBeforeAfterRule.java:45)
	at org.apache.lucene.util.TestRuleThreadAndTestName$1.evaluate(TestRuleThreadAndTestName.java:48)
	at org.apache.lucene.util.TestRuleIgnoreAfterMaxFailures$1.evaluate(TestRuleIgnoreAfterMaxFailures.java:64)
	at org.apache.lucene.util.TestRuleMarkFailure$1.evaluate(TestRuleMarkFailure.java:47)
	at com.carrotsearch.randomizedtesting.rules.StatementAdapter.evaluate(StatementAdapter.java:36)
	at com.carrotsearch.randomizedtesting.ThreadLeakControl$StatementRunner.run(ThreadLeakControl.java:368)
	at com.carrotsearch.randomizedtesting.ThreadLeakControl.forkTimeoutingTask(ThreadLeakControl.java:817)
	at com.carrotsearch.randomizedtesting.ThreadLeakControl$3.evaluate(ThreadLeakControl.java:468)
	at com.carrotsearch.randomizedtesting.RandomizedRunner.runSingleTest(RandomizedRunner.java:916)
	at com.carrotsearch.randomizedtesting.RandomizedRunner$5.evaluate(RandomizedRunner.java:802)
	at com.carrotsearch.randomizedtesting.RandomizedRunner$6.evaluate(RandomizedRunner.java:852)
	at com.carrotsearch.randomizedtesting.RandomizedRunner$7.evaluate(RandomizedRunner.java:863)
	at com.carrotsearch.randomizedtesting.rules.StatementAdapter.evaluate(StatementAdapter.java:36)
	at com.carrotsearch.randomizedtesting.rules.SystemPropertiesRestoreRule$1.evaluate(SystemPropertiesRestoreRule.java:57)
	at org.apache.lucene.util.AbstractBeforeAfterRule$1.evaluate(AbstractBeforeAfterRule.java:45)
	at com.carrotsearch.randomizedtesting.rules.StatementAdapter.evaluate(StatementAdapter.java:36)
	at org.apache.lucene.util.TestRuleStoreClassName$1.evaluate(TestRuleStoreClassName.java:41)
	at com.carrotsearch.randomizedtesting.rules.NoShadowingOrOverridesOnMethodsRule$1.evaluate(NoShadowingOrOverridesOnMethodsRule.java:40)
	at com.carrotsearch.randomizedtesting.rules.NoShadowingOrOverridesOnMethodsRule$1.evaluate(NoShadowingOrOverridesOnMethodsRule.java:40)
	at com.carrotsearch.randomizedtesting.rules.StatementAdapter.evaluate(StatementAdapter.java:36)
	at com.carrotsearch.randomizedtesting.rules.StatementAdapter.evaluate(StatementAdapter.java:36)
	at com.carrotsearch.randomizedtesting.rules.StatementAdapter.evaluate(StatementAdapter.java:36)
	at org.apache.lucene.util.TestRuleAssertionsRequired$1.evaluate(TestRuleAssertionsRequired.java:53)
	at org.apache.lucene.util.TestRuleMarkFailure$1.evaluate(TestRuleMarkFailure.java:47)
	at org.apache.lucene.util.TestRuleIgnoreAfterMaxFailures$1.evaluate(TestRuleIgnoreAfterMaxFailures.java:64)
	at org.apache.lucene.util.TestRuleIgnoreTestSuites$1.evaluate(TestRuleIgnoreTestSuites.java:54)
	at com.carrotsearch.randomizedtesting.rules.StatementAdapter.evaluate(StatementAdapter.java:36)
	at com.carrotsearch.randomizedtesting.ThreadLeakControl$StatementRunner.run(ThreadLeakControl.java:368)
	at java.lang.Thread.run(Thread.java:748)


FAILED:  org.apache.solr.metrics.reporters.SolrSlf4jReporterTest.testReporter

Error Message:


Stack Trace:
java.lang.AssertionError
	at __randomizedtesting.SeedInfo.seed([1779746CC0633D81:489D595BAB6FAEC4]:0)
	at org.junit.Assert.fail(Assert.java:92)
	at org.junit.Assert.assertTrue(Assert.java:43)
	at org.junit.Assert.assertTrue(Assert.java:54)
	at org.apache.solr.metrics.reporters.SolrSlf4jReporterTest.testReporter(SolrSlf4jReporterTest.java:84)
	at sun.reflect.NativeMethodAccessorImpl.invoke0(Native Method)
	at sun.reflect.NativeMethodAccessorImpl.invoke(NativeMethodAccessorImpl.java:62)
	at sun.reflect.DelegatingMethodAccessorImpl.invoke(DelegatingMethodAccessorImpl.java:43)
	at java.lang.reflect.Method.invoke(Method.java:498)
	at com.carrotsearch.randomizedtesting.RandomizedRunner.invoke(RandomizedRunner.java:1713)
	at com.carrotsearch.randomizedtesting.RandomizedRunner$8.evaluate(RandomizedRunner.java:907)
	at com.carrotsearch.randomizedtesting.RandomizedRunner$9.evaluate(RandomizedRunner.java:943)
	at com.carrotsearch.randomizedtesting.RandomizedRunner$10.evaluate(RandomizedRunner.java:957)
	at com.carrotsearch.randomizedtesting.rules.SystemPropertiesRestoreRule$1.evaluate(SystemPropertiesRestoreRule.java:57)
	at org.apache.lucene.util.TestRuleSetupTeardownChained$1.evaluate(TestRuleSetupTeardownChained.java:49)
	at org.apache.lucene.util.AbstractBeforeAfterRule$1.evaluate(AbstractBeforeAfterRule.java:45)
	at org.apache.lucene.util.TestRuleThreadAndTestName$1.evaluate(TestRuleThreadAndTestName.java:48)
	at org.apache.lucene.util.TestRuleIgnoreAfterMaxFailures$1.evaluate(TestRuleIgnoreAfterMaxFailures.java:64)
	at org.apache.lucene.util.TestRuleMarkFailure$1.evaluate(TestRuleMarkFailure.java:47)
	at com.carrotsearch.randomizedtesting.rules.StatementAdapter.evaluate(StatementAdapter.java:36)
	at com.carrotsearch.randomizedtesting.ThreadLeakControl$StatementRunner.run(ThreadLeakControl.java:368)
	at com.carrotsearch.randomizedtesting.ThreadLeakControl.forkTimeoutingTask(ThreadLeakControl.java:817)
	at com.carrotsearch.randomizedtesting.ThreadLeakControl$3.evaluate(ThreadLeakControl.java:468)
	at com.carrotsearch.randomizedtesting.RandomizedRunner.runSingleTest(RandomizedRunner.java:916)
	at com.carrotsearch.randomizedtesting.RandomizedRunner$5.evaluate(RandomizedRunner.java:802)
	at com.carrotsearch.randomizedtesting.RandomizedRunner$6.evaluate(RandomizedRunner.java:852)
	at com.carrotsearch.randomizedtesting.RandomizedRunner$7.evaluate(RandomizedRunner.java:863)
	at com.carrotsearch.randomizedtesting.rules.StatementAdapter.evaluate(StatementAdapter.java:36)
	at com.carrotsearch.randomizedtesting.rules.SystemPropertiesRestoreRule$1.evaluate(SystemPropertiesRestoreRule.java:57)
	at org.apache.lucene.util.AbstractBeforeAfterRule$1.evaluate(AbstractBeforeAfterRule.java:45)
	at com.carrotsearch.randomizedtesting.rules.StatementAdapter.evaluate(StatementAdapter.java:36)
	at org.apache.lucene.util.TestRuleStoreClassName$1.evaluate(TestRuleStoreClassName.java:41)
	at com.carrotsearch.randomizedtesting.rules.NoShadowingOrOverridesOnMethodsRule$1.evaluate(NoShadowingOrOverridesOnMethodsRule.java:40)
	at com.carrotsearch.randomizedtesting.rules.NoShadowingOrOverridesOnMethodsRule$1.evaluate(NoShadowingOrOverridesOnMethodsRule.java:40)
	at com.carrotsearch.randomizedtesting.rules.StatementAdapter.evaluate(StatementAdapter.java:36)
	at com.carrotsearch.randomizedtesting.rules.StatementAdapter.evaluate(StatementAdapter.java:36)
	at com.carrotsearch.randomizedtesting.rules.StatementAdapter.evaluate(StatementAdapter.java:36)
	at org.apache.lucene.util.TestRuleAssertionsRequired$1.evaluate(TestRuleAssertionsRequired.java:53)
	at org.apache.lucene.util.TestRuleMarkFailure$1.evaluate(TestRuleMarkFailure.java:47)
	at org.apache.lucene.util.TestRuleIgnoreAfterMaxFailures$1.evaluate(TestRuleIgnoreAfterMaxFailures.java:64)
	at org.apache.lucene.util.TestRuleIgnoreTestSuites$1.evaluate(TestRuleIgnoreTestSuites.java:54)
	at com.carrotsearch.randomizedtesting.rules.StatementAdapter.evaluate(StatementAdapter.java:36)
	at com.carrotsearch.randomizedtesting.ThreadLeakControl$StatementRunner.run(ThreadLeakControl.java:368)
	at java.lang.Thread.run(Thread.java:748)




Build Log:
[...truncated 12427 lines...]
   [junit4] Suite: org.apache.solr.cloud.HttpPartitionTest
   [junit4]   2> Creating dataDir: /home/jenkins/workspace/Lucene-Solr-7.x-Linux/solr/build/solr-core/test/J2/temp/solr.cloud.HttpPartitionTest_1779746CC0633D81-001/init-core-data-001
   [junit4]   2> 1611478 WARN  (SUITE-HttpPartitionTest-seed#[1779746CC0633D81]-worker)
[    ] o.a.s.SolrTestCaseJ4 startTrackingSearchers: numOpens=43 numCloses=43
   [junit4]   2> 1611483 ERROR (Thread-3534) [    ] o.a.z.s.ZooKeeperServer ZKShutdownHandler
is not registered, so ZooKeeper server won't take any action on ERROR or SHUTDOWN server state
changes
   [junit4]   2> 1611648 ERROR (TEST-HttpPartitionTest.test-seed#[1779746CC0633D81]) [
   ] o.a.s.u.StartupLoggingUtils Missing Java Option solr.log.dir. Logging may be missing
or incomplete.
   [junit4]   2> 1612983 WARN  (qtp917836191-17309) [n:127.0.0.1:41879_ c:control_collection
s:shard1  x:control_collection_shard1_replica_n1] o.a.s.c.RequestHandlers INVALID paramSet
a in requestHandler {type = requestHandler,name = /dump,class = DumpRequestHandler,attributes
= {initParams=a, name=/dump, class=DumpRequestHandler},args = {defaults={a=A,b=B}}}
   [junit4]   2> 1614172 WARN  (OverseerThreadFactory-7508-thread-2-processing-n:127.0.0.1:41879_)
[n:127.0.0.1:41879_    ] o.a.s.c.CreateCollectionCmd It is unusual to create a collection
(collection1) without cores.
   [junit4]   2> 1614450 ERROR (TEST-HttpPartitionTest.test-seed#[1779746CC0633D81]) [
   ] o.a.s.u.StartupLoggingUtils Missing Java Option solr.log.dir. Logging may be missing
or incomplete.
   [junit4]   2> 1615610 WARN  (qtp902975537-17355) [n:127.0.0.1:45013_ c:collection1 s:shard2
 x:collection1_shard2_replica_t41] o.a.s.c.RequestHandlers INVALID paramSet a in requestHandler
{type = requestHandler,name = /dump,class = DumpRequestHandler,attributes = {initParams=a,
name=/dump, class=DumpRequestHandler},args = {defaults={a=A,b=B}}}
   [junit4]   2> 1615862 ERROR (TEST-HttpPartitionTest.test-seed#[1779746CC0633D81]) [
   ] o.a.s.u.StartupLoggingUtils Missing Java Option solr.log.dir. Logging may be missing
or incomplete.
   [junit4]   2> 1617035 WARN  (qtp1895577988-17387) [n:127.0.0.1:40281_ c:collection1
s:shard1  x:collection1_shard1_replica_t43] o.a.s.c.RequestHandlers INVALID paramSet a in
requestHandler {type = requestHandler,name = /dump,class = DumpRequestHandler,attributes =
{initParams=a, name=/dump, class=DumpRequestHandler},args = {defaults={a=A,b=B}}}
   [junit4]   2> 1617293 ERROR (TEST-HttpPartitionTest.test-seed#[1779746CC0633D81]) [
   ] o.a.s.u.StartupLoggingUtils Missing Java Option solr.log.dir. Logging may be missing
or incomplete.
   [junit4]   2> 1617299 WARN  (NIOServerCxn.Factory:0.0.0.0/0.0.0.0:0) [    ] o.a.z.s.NIOServerCnxn
caught end of stream exception
   [junit4]   2> EndOfStreamException: Unable to read additional data from client sessionid
0x15e0bf52692000e, likely client has closed socket
   [junit4]   2> 	at org.apache.zookeeper.server.NIOServerCnxn.doIO(NIOServerCnxn.java:239)
   [junit4]   2> 	at org.apache.zookeeper.server.NIOServerCnxnFactory.run(NIOServerCnxnFactory.java:203)
   [junit4]   2> 	at java.lang.Thread.run(Thread.java:748)
   [junit4]   2> 1618488 WARN  (qtp1506000898-17419) [n:127.0.0.1:40609_ c:collection1
s:shard2  x:collection1_shard2_replica_t45] o.a.s.c.RequestHandlers INVALID paramSet a in
requestHandler {type = requestHandler,name = /dump,class = DumpRequestHandler,attributes =
{initParams=a, name=/dump, class=DumpRequestHandler},args = {defaults={a=A,b=B}}}
   [junit4]   2> 1623789 WARN  (qtp1895577988-17388) [n:127.0.0.1:40281_ c:c8n_crud_1x2
s:shard1  x:c8n_crud_1x2_shard1_replica_t2] o.a.s.c.RequestHandlers INVALID paramSet a in
requestHandler {type = requestHandler,name = /dump,class = DumpRequestHandler,attributes =
{initParams=a, name=/dump, class=DumpRequestHandler},args = {defaults={a=A,b=B}}}
   [junit4]   2> 1623789 WARN  (qtp1506000898-17420) [n:127.0.0.1:40609_ c:c8n_crud_1x2
s:shard1  x:c8n_crud_1x2_shard1_replica_t1] o.a.s.c.RequestHandlers INVALID paramSet a in
requestHandler {type = requestHandler,name = /dump,class = DumpRequestHandler,attributes =
{initParams=a, name=/dump, class=DumpRequestHandler},args = {defaults={a=A,b=B}}}
   [junit4]   2> 1625874 WARN  (zkCallback-3862-thread-1-processing-n:127.0.0.1:40281_)
[n:127.0.0.1:40281_    ] o.a.s.c.LeaderElector Our node is no longer in line to be leader
   [junit4]   2> 1627947 WARN  (qtp902975537-17357) [n:127.0.0.1:45013_ c:collMinRf_1x3
s:shard1  x:collMinRf_1x3_shard1_replica_t3] o.a.s.c.RequestHandlers INVALID paramSet a in
requestHandler {type = requestHandler,name = /dump,class = DumpRequestHandler,attributes =
{initParams=a, name=/dump, class=DumpRequestHandler},args = {defaults={a=A,b=B}}}
   [junit4]   2> 1627947 WARN  (qtp917836191-17302) [n:127.0.0.1:41879_ c:collMinRf_1x3
s:shard1  x:collMinRf_1x3_shard1_replica_t2] o.a.s.c.RequestHandlers INVALID paramSet a in
requestHandler {type = requestHandler,name = /dump,class = DumpRequestHandler,attributes =
{initParams=a, name=/dump, class=DumpRequestHandler},args = {defaults={a=A,b=B}}}
   [junit4]   2> 1627948 WARN  (qtp1895577988-17385) [n:127.0.0.1:40281_ c:collMinRf_1x3
s:shard1  x:collMinRf_1x3_shard1_replica_t1] o.a.s.c.RequestHandlers INVALID paramSet a in
requestHandler {type = requestHandler,name = /dump,class = DumpRequestHandler,attributes =
{initParams=a, name=/dump, class=DumpRequestHandler},args = {defaults={a=A,b=B}}}
   [junit4]   2> 1630062 WARN  (TEST-HttpPartitionTest.test-seed#[1779746CC0633D81]) [
   ] o.a.s.c.SocketProxy Closing 12 connections to: http://127.0.0.1:45013/, target: http://127.0.0.1:35811/
   [junit4]   2> 1630071 ERROR (updateExecutor-3859-thread-2-processing-http:////127.0.0.1:45013//collMinRf_1x3_shard1_replica_t3
x:collMinRf_1x3_shard1_replica_t1 r:core_node4 n:127.0.0.1:40281_ s:shard1 c:collMinRf_1x3)
[n:127.0.0.1:40281_ c:collMinRf_1x3 s:shard1 r:core_node4 x:collMinRf_1x3_shard1_replica_t1]
o.a.s.u.ErrorReportingConcurrentUpdateSolrClient error
   [junit4]   2> java.net.SocketException: Broken pipe (Write failed)
   [junit4]   2> 	at java.net.SocketOutputStream.socketWrite0(Native Method)
   [junit4]   2> 	at java.net.SocketOutputStream.socketWrite(SocketOutputStream.java:111)
   [junit4]   2> 	at java.net.SocketOutputStream.write(SocketOutputStream.java:155)
   [junit4]   2> 	at org.apache.http.impl.io.SessionOutputBufferImpl.streamWrite(SessionOutputBufferImpl.java:126)
   [junit4]   2> 	at org.apache.http.impl.io.SessionOutputBufferImpl.flushBuffer(SessionOutputBufferImpl.java:138)
   [junit4]   2> 	at org.apache.http.impl.io.SessionOutputBufferImpl.flush(SessionOutputBufferImpl.java:146)
   [junit4]   2> 	at org.apache.http.impl.io.ChunkedOutputStream.close(ChunkedOutputStream.java:205)
   [junit4]   2> 	at org.apache.http.impl.DefaultBHttpClientConnection.sendRequestEntity(DefaultBHttpClientConnection.java:159)
   [junit4]   2> 	at org.apache.http.impl.conn.CPoolProxy.sendRequestEntity(CPoolProxy.java:162)
   [junit4]   2> 	at org.apache.http.protocol.HttpRequestExecutor.doSendRequest(HttpRequestExecutor.java:237)
   [junit4]   2> 	at org.apache.http.protocol.HttpRequestExecutor.execute(HttpRequestExecutor.java:122)
   [junit4]   2> 	at org.apache.solr.util.stats.InstrumentedHttpRequestExecutor.execute(InstrumentedHttpRequestExecutor.java:118)
   [junit4]   2> 	at org.apache.http.impl.execchain.MainClientExec.execute(MainClientExec.java:271)
   [junit4]   2> 	at org.apache.http.impl.execchain.ProtocolExec.execute(ProtocolExec.java:184)
   [junit4]   2> 	at org.apache.http.impl.execchain.RetryExec.execute(RetryExec.java:88)
   [junit4]   2> 	at org.apache.http.impl.execchain.RedirectExec.execute(RedirectExec.java:110)
   [junit4]   2> 	at org.apache.http.impl.client.InternalHttpClient.doExecute(InternalHttpClient.java:184)
   [junit4]   2> 	at org.apache.http.impl.client.CloseableHttpClient.execute(CloseableHttpClient.java:82)
   [junit4]   2> 	at org.apache.http.impl.client.CloseableHttpClient.execute(CloseableHttpClient.java:55)
   [junit4]   2> 	at org.apache.solr.client.solrj.impl.ConcurrentUpdateSolrClient$Runner.sendUpdateStream(ConcurrentUpdateSolrClient.java:347)
   [junit4]   2> 	at org.apache.solr.client.solrj.impl.ConcurrentUpdateSolrClient$Runner.run(ConcurrentUpdateSolrClient.java:182)
   [junit4]   2> 	at com.codahale.metrics.InstrumentedExecutorService$InstrumentedRunnable.run(InstrumentedExecutorService.java:176)
   [junit4]   2> 	at org.apache.solr.common.util.ExecutorUtil$MDCAwareThreadPoolExecutor.lambda$execute$0(ExecutorUtil.java:188)
   [junit4]   2> 	at java.util.concurrent.ThreadPoolExecutor.runWorker(ThreadPoolExecutor.java:1149)
   [junit4]   2> 	at java.util.concurrent.ThreadPoolExecutor$Worker.run(ThreadPoolExecutor.java:624)
   [junit4]   2> 	at java.lang.Thread.run(Thread.java:748)
   [junit4]   2> 1630110 WARN  (qtp1895577988-17388) [n:127.0.0.1:40281_ c:collMinRf_1x3
s:shard1 r:core_node4 x:collMinRf_1x3_shard1_replica_t1] o.a.s.u.p.DistributedUpdateProcessor
Error sending update to http://127.0.0.1:45013
   [junit4]   2> java.net.SocketException: Broken pipe (Write failed)
   [junit4]   2> 	at java.net.SocketOutputStream.socketWrite0(Native Method)
   [junit4]   2> 	at java.net.SocketOutputStream.socketWrite(SocketOutputStream.java:111)
   [junit4]   2> 	at java.net.SocketOutputStream.write(SocketOutputStream.java:155)
   [junit4]   2> 	at org.apache.http.impl.io.SessionOutputBufferImpl.streamWrite(SessionOutputBufferImpl.java:126)
   [junit4]   2> 	at org.apache.http.impl.io.SessionOutputBufferImpl.flushBuffer(SessionOutputBufferImpl.java:138)
   [junit4]   2> 	at org.apache.http.impl.io.SessionOutputBufferImpl.flush(SessionOutputBufferImpl.java:146)
   [junit4]   2> 	at org.apache.http.impl.io.ChunkedOutputStream.close(ChunkedOutputStream.java:205)
   [junit4]   2> 	at org.apache.http.impl.DefaultBHttpClientConnection.sendRequestEntity(DefaultBHttpClientConnection.java:159)
   [junit4]   2> 	at org.apache.http.impl.conn.CPoolProxy.sendRequestEntity(CPoolProxy.java:162)
   [junit4]   2> 	at org.apache.http.protocol.HttpRequestExecutor.doSendRequest(HttpRequestExecutor.java:237)
   [junit4]   2> 	at org.apache.http.protocol.HttpRequestExecutor.execute(HttpRequestExecutor.java:122)
   [junit4]   2> 	at org.apache.solr.util.stats.InstrumentedHttpRequestExecutor.execute(InstrumentedHttpRequestExecutor.java:118)
   [junit4]   2> 	at org.apache.http.impl.execchain.MainClientExec.execute(MainClientExec.java:271)
   [junit4]   2> 	at org.apache.http.impl.execchain.ProtocolExec.execute(ProtocolExec.java:184)
   [junit4]   2> 	at org.apache.http.impl.execchain.RetryExec.execute(RetryExec.java:88)
   [junit4]   2> 	at org.apache.http.impl.execchain.RedirectExec.execute(RedirectExec.java:110)
   [junit4]   2> 	at org.apache.http.impl.client.InternalHttpClient.doExecute(InternalHttpClient.java:184)
   [junit4]   2> 	at org.apache.http.impl.client.CloseableHttpClient.execute(CloseableHttpClient.java:82)
   [junit4]   2> 	at org.apache.http.impl.client.CloseableHttpClient.execute(CloseableHttpClient.java:55)
   [junit4]   2> 	at org.apache.solr.client.solrj.impl.ConcurrentUpdateSolrClient$Runner.sendUpdateStream(ConcurrentUpdateSolrClient.java:347)
   [junit4]   2> 	at org.apache.solr.client.solrj.impl.ConcurrentUpdateSolrClient$Runner.run(ConcurrentUpdateSolrClient.java:182)
   [junit4]   2> 	at com.codahale.metrics.InstrumentedExecutorService$InstrumentedRunnable.run(InstrumentedExecutorService.java:176)
   [junit4]   2> 	at org.apache.solr.common.util.ExecutorUtil$MDCAwareThreadPoolExecutor.lambda$execute$0(ExecutorUtil.java:188)
   [junit4]   2> 	at java.util.concurrent.ThreadPoolExecutor.runWorker(ThreadPoolExecutor.java:1149)
   [junit4]   2> 	at java.util.concurrent.ThreadPoolExecutor$Worker.run(ThreadPoolExecutor.java:624)
   [junit4]   2> 	at java.lang.Thread.run(Thread.java:748)
   [junit4]   2> 1630110 ERROR (qtp1895577988-17388) [n:127.0.0.1:40281_ c:collMinRf_1x3
s:shard1 r:core_node4 x:collMinRf_1x3_shard1_replica_t1] o.a.s.u.p.DistributedUpdateProcessor
Setting up to try to start recovery on replica http://127.0.0.1:45013/collMinRf_1x3_shard1_replica_t3/
   [junit4]   2> java.net.SocketException: Broken pipe (Write failed)
   [junit4]   2> 	at java.net.SocketOutputStream.socketWrite0(Native Method)
   [junit4]   2> 	at java.net.SocketOutputStream.socketWrite(SocketOutputStream.java:111)
   [junit4]   2> 	at java.net.SocketOutputStream.write(SocketOutputStream.java:155)
   [junit4]   2> 	at org.apache.http.impl.io.SessionOutputBufferImpl.streamWrite(SessionOutputBufferImpl.java:126)
   [junit4]   2> 	at org.apache.http.impl.io.SessionOutputBufferImpl.flushBuffer(SessionOutputBufferImpl.java:138)
   [junit4]   2> 	at org.apache.http.impl.io.SessionOutputBufferImpl.flush(SessionOutputBufferImpl.java:146)
   [junit4]   2> 	at org.apache.http.impl.io.ChunkedOutputStream.close(ChunkedOutputStream.java:205)
   [junit4]   2> 	at org.apache.http.impl.DefaultBHttpClientConnection.sendRequestEntity(DefaultBHttpClientConnection.java:159)
   [junit4]   2> 	at org.apache.http.impl.conn.CPoolProxy.sendRequestEntity(CPoolProxy.java:162)
   [junit4]   2> 	at org.apache.http.protocol.HttpRequestExecutor.doSendRequest(HttpRequestExecutor.java:237)
   [junit4]   2> 	at org.apache.http.protocol.HttpRequestExecutor.execute(HttpRequestExecutor.java:122)
   [junit4]   2> 	at org.apache.solr.util.stats.InstrumentedHttpRequestExecutor.execute(InstrumentedHttpRequestExecutor.java:118)
   [junit4]   2> 	at org.apache.http.impl.execchain.MainClientExec.execute(MainClientExec.java:271)
   [junit4]   2> 	at org.apache.http.impl.execchain.ProtocolExec.execute(ProtocolExec.java:184)
   [junit4]   2> 	at org.apache.http.impl.execchain.RetryExec.execute(RetryExec.java:88)
   [junit4]   2> 	at org.apache.http.impl.execchain.RedirectExec.execute(RedirectExec.java:110)
   [junit4]   2> 	at org.apache.http.impl.client.InternalHttpClient.doExecute(InternalHttpClient.java:184)
   [junit4]   2> 	at org.apache.http.impl.client.CloseableHttpClient.execute(CloseableHttpClient.java:82)
   [junit4]   2> 	at org.apache.http.impl.client.CloseableHttpClient.execute(CloseableHttpClient.java:55)
   [junit4]   2> 	at org.apache.solr.client.solrj.impl.ConcurrentUpdateSolrClient$Runner.sendUpdateStream(ConcurrentUpdateSolrClient.java:347)
   [junit4]   2> 	at org.apache.solr.client.solrj.impl.ConcurrentUpdateSolrClient$Runner.run(ConcurrentUpdateSolrClient.java:182)
   [junit4]   2> 	at com.codahale.metrics.InstrumentedExecutorService$InstrumentedRunnable.run(InstrumentedExecutorService.java:176)
   [junit4]   2> 	at org.apache.solr.common.util.ExecutorUtil$MDCAwareThreadPoolExecutor.lambda$execute$0(ExecutorUtil.java:188)
   [junit4]   2> 	at java.util.concurrent.ThreadPoolExecutor.runWorker(ThreadPoolExecutor.java:1149)
   [junit4]   2> 	at java.util.concurrent.ThreadPoolExecutor$Worker.run(ThreadPoolExecutor.java:624)
   [junit4]   2> 	at java.lang.Thread.run(Thread.java:748)
   [junit4]   2> 1630114 WARN  (updateExecutor-3859-thread-1-processing-x:collMinRf_1x3_shard1_replica_t1
r:core_node4 http:////127.0.0.1:45013//collMinRf_1x3_shard1_replica_t3// n:127.0.0.1:40281_
s:shard1 c:collMinRf_1x3) [n:127.0.0.1:40281_ c:collMinRf_1x3 s:shard1 r:core_node4 x:collMinRf_1x3_shard1_replica_t1]
o.a.s.c.LeaderInitiatedRecoveryThread Leader is publishing core=collMinRf_1x3_shard1_replica_t3
coreNodeName =core_node6 state=down on behalf of un-reachable replica http://127.0.0.1:45013/collMinRf_1x3_shard1_replica_t3/
   [junit4]   2> 1630118 ERROR (updateExecutor-3859-thread-1-processing-x:collMinRf_1x3_shard1_replica_t1
r:core_node4 http:////127.0.0.1:45013//collMinRf_1x3_shard1_replica_t3// n:127.0.0.1:40281_
s:shard1 c:collMinRf_1x3) [n:127.0.0.1:40281_ c:collMinRf_1x3 s:shard1 r:core_node4 x:collMinRf_1x3_shard1_replica_t1]
o.a.s.c.LeaderInitiatedRecoveryThread http://127.0.0.1:45013: Could not tell a replica to
recover:org.apache.solr.client.solrj.SolrServerException: Server refused connection at: http://127.0.0.1:45013
   [junit4]   2> 	at org.apache.solr.client.solrj.impl.HttpSolrClient.executeMethod(HttpSolrClient.java:634)
   [junit4]   2> 	at org.apache.solr.client.solrj.impl.HttpSolrClient.request(HttpSolrClient.java:253)
   [junit4]   2> 	at org.apache.solr.client.solrj.impl.HttpSolrClient.request(HttpSolrClient.java:242)
   [junit4]   2> 	at org.apache.solr.client.solrj.SolrClient.request(SolrClient.java:1219)
   [junit4]   2> 	at org.apache.solr.cloud.LeaderInitiatedRecoveryThread.sendRecoveryCommandWithRetry(LeaderInitiatedRecoveryThread.java:209)
   [junit4]   2> 	at org.apache.solr.cloud.LeaderInitiatedRecoveryThread.run(LeaderInitiatedRecoveryThread.java:95)
   [junit4]   2> 	at com.codahale.metrics.InstrumentedExecutorService$InstrumentedRunnable.run(InstrumentedExecutorService.java:176)
   [junit4]   2> 	at org.apache.solr.common.util.ExecutorUtil$MDCAwareThreadPoolExecutor.lambda$execute$0(ExecutorUtil.java:188)
   [junit4]   2> 	at java.util.concurrent.ThreadPoolExecutor.runWorker(ThreadPoolExecutor.java:1149)
   [junit4]   2> 	at java.util.concurrent.ThreadPoolExecutor$Worker.run(ThreadPoolExecutor.java:624)
   [junit4]   2> 	at java.lang.Thread.run(Thread.java:748)
   [junit4]   2> Caused by: org.apache.http.conn.HttpHostConnectException: Connect to 127.0.0.1:45013
[/127.0.0.1] failed: Connection refused (Connection refused)
   [junit4]   2> 	at org.apache.http.impl.conn.DefaultHttpClientConnectionOperator.connect(DefaultHttpClientConnectionOperator.java:151)
   [junit4]   2> 	at org.apache.http.impl.conn.PoolingHttpClientConnectionManager.connect(PoolingHttpClientConnectionManager.java:353)
   [junit4]   2> 	at org.apache.http.impl.execchain.MainClientExec.establishRoute(MainClientExec.java:380)
   [junit4]   2> 	at org.apache.http.impl.execchain.MainClientExec.execute(MainClientExec.java:236)
   [junit4]   2> 	at org.apache.http.impl.execchain.ProtocolExec.execute(ProtocolExec.java:184)
   [junit4]   2> 	at org.apache.http.impl.execchain.RetryExec.execute(RetryExec.java:88)
   [junit4]   2> 	at org.apache.http.impl.execchain.RedirectExec.execute(RedirectExec.java:110)
   [junit4]   2> 	at org.apache.http.impl.client.InternalHttpClient.doExecute(InternalHttpClient.java:184)
   [junit4]   2> 	at org.apache.http.impl.client.CloseableHttpClient.execute(CloseableHttpClient.java:82)
   [junit4]   2> 	at org.apache.http.impl.client.CloseableHttpClient.execute(CloseableHttpClient.java:55)
   [junit4]   2> 	at org.apache.solr.client.solrj.impl.HttpSolrClient.executeMethod(HttpSolrClient.java:526)
   [junit4]   2> 	... 10 more
   [junit4]   2> Caused by: java.net.ConnectException: Connection refused (Connection refused)
   [junit4]   2> 	at java.net.PlainSocketImpl.socketConnect(Native Method)
   [junit4]   2> 	at java.net.AbstractPlainSocketImpl.doConnect(AbstractPlainSocketImpl.java:350)
   [junit4]   2> 	at java.net.AbstractPlainSocketImpl.connectToAddress(AbstractPlainSocketImpl.java:206)
   [junit4]   2> 	at java.net.AbstractPlainSocketImpl.connect(AbstractPlainSocketImpl.java:188)
   [junit4]   2> 	at java.net.SocksSocketImpl.connect(SocksSocketImpl.java:392)
   [junit4]   2> 	at java.net.Socket.connect(Socket.java:589)
   [junit4]   2> 	at org.apache.http.conn.socket.PlainConnectionSocketFactory.connectSocket(PlainConnectionSocketFactory.java:74)
   [junit4]   2> 	at org.apache.http.impl.conn.DefaultHttpClientConnectionOperator.connect(DefaultHttpClientConnectionOperator.java:134)
   [junit4]   2> 	... 20 more
   [junit4]   2> 
   [junit4]   2> 1635119 WARN  (updateExecutor-3859-thread-1-processing-x:collMinRf_1x3_shard1_replica_t1
r:core_node4 http:////127.0.0.1:45013//collMinRf_1x3_shard1_replica_t3// n:127.0.0.1:40281_
s:shard1 c:collMinRf_1x3) [n:127.0.0.1:40281_ c:collMinRf_1x3 s:shard1 r:core_node4 x:collMinRf_1x3_shard1_replica_t1]
o.a.s.c.LeaderInitiatedRecoveryThread Asking core=collMinRf_1x3_shard1_replica_t3 coreNodeName=core_node6
on http://127.0.0.1:45013 to recover; unsuccessful after 2 of 120 attempts so far ...
   [junit4]   2> 1637975 WARN  (zkCallback-3844-thread-1-processing-n:127.0.0.1:41879_)
[n:127.0.0.1:41879_    ] o.a.s.c.c.ZkStateReader ZooKeeper watch triggered, but Solr cannot
talk to ZK: [KeeperErrorCode = Session expired for /live_nodes]
   [junit4]   2> 1638016 WARN  (zkCallback-3856-thread-2-processing-n:127.0.0.1:45013_)
[n:127.0.0.1:45013_    ] o.a.s.c.c.ZkStateReader ZooKeeper watch triggered, but Solr cannot
talk to ZK: [KeeperErrorCode = Session expired for /live_nodes]
   [junit4]   2> 1638016 WARN  (NIOServerCxn.Factory:0.0.0.0/0.0.0.0:0) [    ] o.a.z.s.NIOServerCnxn
caught end of stream exception
   [junit4]   2> EndOfStreamException: Unable to read additional data from client sessionid
0x15e0bf526920009, likely client has closed socket
   [junit4]   2> 	at org.apache.zookeeper.server.NIOServerCnxn.doIO(NIOServerCnxn.java:239)
   [junit4]   2> 	at org.apache.zookeeper.server.NIOServerCnxnFactory.run(NIOServerCnxnFactory.java:203)
   [junit4]   2> 	at java.lang.Thread.run(Thread.java:748)
   [junit4]   2> 1638035 WARN  (zkCallback-3862-thread-2-processing-n:127.0.0.1:40281_)
[n:127.0.0.1:40281_    ] o.a.s.c.c.ZkStateReader ZooKeeper watch triggered, but Solr cannot
talk to ZK: [KeeperErrorCode = Session expired for /live_nodes]
   [junit4]   2> 1638042 WARN  (zkCallback-3868-thread-2-processing-n:127.0.0.1:40609_)
[n:127.0.0.1:40609_    ] o.a.s.c.c.ZkStateReader ZooKeeper watch triggered, but Solr cannot
talk to ZK: [KeeperErrorCode = Session expired for /live_nodes]
   [junit4]   2> 1640517 WARN  (zkCallback-3868-thread-1-processing-n:127.0.0.1:40609_)
[n:127.0.0.1:40609_ c:collection1 s:shard2 r:core_node46 x:collection1_shard2_replica_t45]
o.a.s.c.SyncStrategy Closed, skipping sync up.
   [junit4]   2> 1640531 ERROR (TEST-HttpPartitionTest.test-seed#[1779746CC0633D81]) [
   ] o.a.z.s.ZooKeeperServer ZKShutdownHandler is not registered, so ZooKeeper server won't
take any action on ERROR or SHUTDOWN server state changes
   [junit4]   2> 1641670 WARN  (Thread-3534) [    ] o.a.s.c.ZkTestServer Watch limit violations:

   [junit4]   2> Maximum concurrent create/delete watches above limit:
   [junit4]   2> 
   [junit4]   2> 	6	/solr/aliases.json
   [junit4]   2> 	4	/solr/security.json
   [junit4]   2> 	4	/solr/configs/conf1
   [junit4]   2> 
   [junit4]   2> Maximum concurrent data watches above limit:
   [junit4]   2> 
   [junit4]   2> 	6	/solr/clusterprops.json
   [junit4]   2> 	6	/solr/clusterstate.json
   [junit4]   2> 	3	/solr/collections/collection1/state.json
   [junit4]   2> 	3	/solr/collections/collMinRf_1x3/state.json
   [junit4]   2> 	2	/solr/collections/collMinRf_1x3/leader_elect/shard1/election/98529389390725132-core_node4-n_0000000000
   [junit4]   2> 	2	/solr/collections/c8n_crud_1x2/state.json
   [junit4]   2> 
   [junit4]   2> Maximum concurrent children watches above limit:
   [junit4]   2> 
   [junit4]   2> 	6	/solr/live_nodes
   [junit4]   2> 	6	/solr/collections
   [junit4]   2> 	2	/solr/overseer/queue
   [junit4]   2> 	2	/solr/overseer/collection-queue-work
   [junit4]   2> 
   [junit4]   2> 1641670 WARN  (TEST-HttpPartitionTest.test-seed#[1779746CC0633D81]) [
   ] o.a.s.c.SocketProxy Closing 3 connections to: http://127.0.0.1:40609/, target: http://127.0.0.1:33459/
   [junit4]   2> 1641670 WARN  (TEST-HttpPartitionTest.test-seed#[1779746CC0633D81]) [
   ] o.a.s.c.SocketProxy Closing 3 connections to: http://127.0.0.1:45013/, target: http://127.0.0.1:35811/
   [junit4]   2> 1641670 WARN  (TEST-HttpPartitionTest.test-seed#[1779746CC0633D81]) [
   ] o.a.s.c.SocketProxy Closing 10 connections to: http://127.0.0.1:40281/, target: http://127.0.0.1:39689/
   [junit4]   2> 1641670 WARN  (TEST-HttpPartitionTest.test-seed#[1779746CC0633D81]) [
   ] o.a.s.c.SocketProxy Closing 6 connections to: http://127.0.0.1:41879/, target: http://127.0.0.1:43781/
   [junit4]   2> NOTE: reproduce with: ant test  -Dtestcase=HttpPartitionTest -Dtests.method=test
-Dtests.seed=1779746CC0633D81 -Dtests.multiplier=3 -Dtests.slow=true -Dtests.locale=ar-LB
-Dtests.timezone=NST -Dtests.asserts=true -Dtests.file.encoding=UTF-8
   [junit4] FAILURE 30.2s J2 | HttpPartitionTest.test <<<
   [junit4]    > Throwable #1: java.lang.AssertionError: Doc with id=1 not found in http://127.0.0.1:41879/collMinRf_1x3
due to: Path not found: /id; rsp={doc=null}
   [junit4]    > 	at __randomizedtesting.SeedInfo.seed([1779746CC0633D81:9F2D4BB66E9F5079]:0)
   [junit4]    > 	at org.apache.solr.cloud.HttpPartitionTest.assertDocExists(HttpPartitionTest.java:603)
   [junit4]    > 	at org.apache.solr.cloud.HttpPartitionTest.assertDocsExistInAllReplicas(HttpPartitionTest.java:558)
   [junit4]    > 	at org.apache.solr.cloud.HttpPartitionTest.testMinRf(HttpPartitionTest.java:249)
   [junit4]    > 	at org.apache.solr.cloud.HttpPartitionTest.test(HttpPartitionTest.java:127)
   [junit4]    > 	at org.apache.solr.BaseDistributedSearchTestCase$ShardsRepeatRule$ShardsFixedStatement.callStatement(BaseDistributedSearchTestCase.java:993)
   [junit4]    > 	at org.apache.solr.BaseDistributedSearchTestCase$ShardsRepeatRule$ShardsStatement.evaluate(BaseDistributedSearchTestCase.java:968)
   [junit4]    > 	at java.lang.Thread.run(Thread.java:748)
   [junit4]   2> NOTE: leaving temporary files on disk at: /home/jenkins/workspace/Lucene-Solr-7.x-Linux/solr/build/solr-core/test/J2/temp/solr.cloud.HttpPartitionTest_1779746CC0633D81-001
   [junit4]   2> NOTE: test params are: codec=Asserting(Lucene70): {multiDefault=BlockTreeOrds(blocksize=128),
a_t=BlockTreeOrds(blocksize=128), id=PostingsFormat(name=Memory), text=Lucene50(blocksize=128)},
docValues:{range_facet_l_dv=DocValuesFormat(name=Direct), _version_=DocValuesFormat(name=Memory),
range_facet_i_dv=DocValuesFormat(name=Lucene70), intDvoDefault=DocValuesFormat(name=Direct),
timestamp=DocValuesFormat(name=Lucene70)}, maxPointsInLeafNode=1223, maxMBSortInHeap=6.364015169404111,
sim=RandomSimilarity(queryNorm=false): {}, locale=ar-LB, timezone=NST
   [junit4]   2> NOTE: Linux 4.10.0-27-generic amd64/Oracle Corporation 1.8.0_144 (64-bit)/cpus=8,threads=1,free=177048576,total=518979584
   [junit4]   2> NOTE: All tests run in this JVM: [GraphQueryTest, LargeFieldTest, RestartWhileUpdatingTest,
CollectionReloadTest, TestReload, AliasIntegrationTest, TestTrackingShardHandlerFactory, TestTlogReplica,
HdfsLockFactoryTest, TestTolerantSearch, CollectionsAPIAsyncDistributedZkTest, TestUnifiedSolrHighlighter,
SimplePostToolTest, TestStressCloudBlindAtomicUpdates, TestSubQueryTransformerDistrib, TestAuthorizationFramework,
TestNoOpRegenerator, TestLFUCache, UnloadDistributedZkTest, TestSolrCLIRunExample, TestMaxScoreQueryParser,
TestMultiValuedNumericRangeQuery, TestLegacyFieldReuse, DirectUpdateHandlerOptimizeTest, XsltUpdateRequestHandlerTest,
TestSort, TolerantUpdateProcessorTest, TestExactSharedStatsCache, TestSchemaNameResource,
TestSQLHandler, AsyncCallRequestStatusResponseTest, TestReplicationHandlerBackup, TestPullReplica,
TestSolrCoreSnapshots, TestStressReorder, ExitableDirectoryReaderTest, TestDFISimilarityFactory,
MetricUtilsTest, DistributedFacetPivotLongTailTest, PingRequestHandlerTest, TestHdfsCloudBackupRestore,
BasicDistributedZk2Test, TestRawResponseWriter, ReplicaListTransformerTest, ClusterStateTest,
CircularListTest, SearchHandlerTest, BadCopyFieldTest, LeaderElectionTest, TestScoreJoinQPNoScore,
NotRequiredUniqueKeyTest, TestConfigSetsAPIZkFailure, HdfsUnloadDistributedZkTest, FullSolrCloudDistribCmdsTest,
TestLeaderInitiatedRecoveryThread, TestManagedStopFilterFactory, ConfigureRecoveryStrategyTest,
TestSolrConfigHandler, TestCustomDocTransformer, TestZkChroot, TestDistributedMissingSort,
TestCloudPivotFacet, DateMathParserTest, TestReloadDeadlock, SolrInfoBeanTest, ConfigSetsAPITest,
TestSolrCoreProperties, MultiTermTest, TestHalfAndHalfDocValues, CustomCollectionTest, TestSmileRequest,
TestClusterStateMutator, UniqFieldsUpdateProcessorFactoryTest, TestAnalyzeInfixSuggestions,
TermsComponentTest, MoveReplicaTest, HdfsChaosMonkeySafeLeaderTest, MinimalSchemaTest, AtomicUpdatesTest,
SolrCoreCheckLockOnStartupTest, StatsComponentTest, TestCustomStream, DeleteNodeTest, SortSpecParsingTest,
TestSha256AuthenticationProvider, TestSolrDeletionPolicy2, BitVectorTest, TestIndexSearcher,
TestMaxTokenLenTokenizer, TestPayloadScoreQParserPlugin, SortByFunctionTest, MissingSegmentRecoveryTest,
AutoCommitTest, TestCloudDeleteByQuery, TestRecovery, TestDynamicFieldCollectionResource,
TestSolrConfigHandlerConcurrent, IgnoreCommitOptimizeUpdateProcessorFactoryTest, TermVectorComponentDistributedTest,
URLClassifyProcessorTest, RecoveryZkTest, TestJmxIntegration, TestReloadAndDeleteDocs, SuggesterFSTTest,
TestRestManager, TestCloudSearcherWarming, CdcrVersionReplicationTest, DirectUpdateHandlerTest,
TestTrie, SaslZkACLProviderTest, TestExpandComponent, DocumentBuilderTest, DistributedExpandComponentTest,
TlogReplayBufferedWhileIndexingTest, SubstringBytesRefFilterTest, SolrCloudExampleTest, TestSolrCloudWithDelegationTokens,
TestCodecSupport, TestRandomFaceting, TestRandomDVFaceting, TestDistributedSearch, DistributedTermsComponentTest,
TestCoreContainer, SimpleFacetsTest, TestSolr4Spatial, TestGroupingSearch, SolrCmdDistributorTest,
BadIndexSchemaTest, TestFunctionQuery, TestBadConfig, HighlighterTest, ShowFileRequestHandlerTest,
SolrIndexSplitterTest, AnalysisAfterCoreReloadTest, SignatureUpdateProcessorFactoryTest, TestExtendedDismaxParser,
SpellCheckCollatorTest, CoreAdminHandlerTest, TestFoldingMultitermQuery, SuggesterTSTTest,
SuggesterTest, TestStressLucene, SuggesterWFSTTest, TestCSVLoader, PolyFieldTest, NoCacheHeaderTest,
WordBreakSolrSpellCheckerTest, SchemaVersionSpecificBehaviorTest, TestPseudoReturnFields,
StatelessScriptUpdateProcessorFactoryTest, IndexBasedSpellCheckerTest, LukeRequestHandlerTest,
DirectSolrSpellCheckerTest, TestReversedWildcardFilterFactory, PrimitiveFieldTypeTest, XmlUpdateRequestHandlerTest,
PathHierarchyTokenizerFactoryTest, MoreLikeThisHandlerTest, FieldAnalysisRequestHandlerTest,
IndexSchemaRuntimeFieldTest, TestCollationField, TestAnalyzedSuggestions, BinaryUpdateRequestHandlerTest,
CSVRequestHandlerTest, TestSolrIndexConfig, ResponseLogComponentTest, BadComponentTest, TestStressRecovery,
DistributedMLTComponentTest, SolrTestCaseJ4Test, TestCursorMarkWithoutUniqueKey, TestSimpleTrackingShardHandler,
TestJettySolrRunner, AssignBackwardCompatibilityTest, CdcrReplicationDistributedZkTest, CdcrRequestHandlerTest,
ChaosMonkeySafeLeaderWithPullReplicasTest, ConnectionManagerTest, CreateCollectionCleanupTest,
DeleteInactiveReplicaTest, DistribCursorPagingTest, DistribJoinFromCollectionTest, DocValuesNotIndexedTest,
HttpPartitionTest]
   [junit4] Completed [512/730 (1!)] on J2 in 30.21s, 1 test, 1 failure <<< FAILURES!

[...truncated 386 lines...]
   [junit4] Suite: org.apache.solr.metrics.reporters.SolrSlf4jReporterTest
   [junit4]   2> Creating dataDir: /home/jenkins/workspace/Lucene-Solr-7.x-Linux/solr/build/solr-core/test/J2/temp/solr.metrics.reporters.SolrSlf4jReporterTest_1779746CC0633D81-001/init-core-data-001
   [junit4]   2> 2519867 WARN  (SUITE-SolrSlf4jReporterTest-seed#[1779746CC0633D81]-worker)
[    ] o.a.s.SolrTestCaseJ4 startTrackingSearchers: numOpens=2 numCloses=2
   [junit4]   2> NOTE: reproduce with: ant test  -Dtestcase=SolrSlf4jReporterTest -Dtests.method=testReporter
-Dtests.seed=1779746CC0633D81 -Dtests.multiplier=3 -Dtests.slow=true -Dtests.locale=lt-LT
-Dtests.timezone=Etc/Universal -Dtests.asserts=true -Dtests.file.encoding=UTF-8
   [junit4] FAILURE 6.55s J2 | SolrSlf4jReporterTest.testReporter <<<
   [junit4]    > Throwable #1: java.lang.AssertionError
   [junit4]    > 	at __randomizedtesting.SeedInfo.seed([1779746CC0633D81:489D595BAB6FAEC4]:0)
   [junit4]    > 	at org.apache.solr.metrics.reporters.SolrSlf4jReporterTest.testReporter(SolrSlf4jReporterTest.java:84)
   [junit4]    > 	at java.lang.Thread.run(Thread.java:748)
   [junit4]   2> NOTE: leaving temporary files on disk at: /home/jenkins/workspace/Lucene-Solr-7.x-Linux/solr/build/solr-core/test/J2/temp/solr.metrics.reporters.SolrSlf4jReporterTest_1779746CC0633D81-001
   [junit4]   2> NOTE: test params are: codec=CheapBastard, sim=RandomSimilarity(queryNorm=true):
{}, locale=lt-LT, timezone=Etc/Universal
   [junit4]   2> NOTE: Linux 4.10.0-27-generic amd64/Oracle Corporation 1.8.0_144 (64-bit)/cpus=8,threads=1,free=259199592,total=518979584
   [junit4]   2> NOTE: All tests run in this JVM: [GraphQueryTest, LargeFieldTest, RestartWhileUpdatingTest,
CollectionReloadTest, TestReload, AliasIntegrationTest, TestTrackingShardHandlerFactory, TestTlogReplica,
HdfsLockFactoryTest, TestTolerantSearch, CollectionsAPIAsyncDistributedZkTest, TestUnifiedSolrHighlighter,
SimplePostToolTest, TestStressCloudBlindAtomicUpdates, TestSubQueryTransformerDistrib, TestAuthorizationFramework,
TestNoOpRegenerator, TestLFUCache, UnloadDistributedZkTest, TestSolrCLIRunExample, TestMaxScoreQueryParser,
TestMultiValuedNumericRangeQuery, TestLegacyFieldReuse, DirectUpdateHandlerOptimizeTest, XsltUpdateRequestHandlerTest,
TestSort, TolerantUpdateProcessorTest, TestExactSharedStatsCache, TestSchemaNameResource,
TestSQLHandler, AsyncCallRequestStatusResponseTest, TestReplicationHandlerBackup, TestPullReplica,
TestSolrCoreSnapshots, TestStressReorder, ExitableDirectoryReaderTest, TestDFISimilarityFactory,
MetricUtilsTest, DistributedFacetPivotLongTailTest, PingRequestHandlerTest, TestHdfsCloudBackupRestore,
BasicDistributedZk2Test, TestRawResponseWriter, ReplicaListTransformerTest, ClusterStateTest,
CircularListTest, SearchHandlerTest, BadCopyFieldTest, LeaderElectionTest, TestScoreJoinQPNoScore,
NotRequiredUniqueKeyTest, TestConfigSetsAPIZkFailure, HdfsUnloadDistributedZkTest, FullSolrCloudDistribCmdsTest,
TestLeaderInitiatedRecoveryThread, TestManagedStopFilterFactory, ConfigureRecoveryStrategyTest,
TestSolrConfigHandler, TestCustomDocTransformer, TestZkChroot, TestDistributedMissingSort,
TestCloudPivotFacet, DateMathParserTest, TestReloadDeadlock, SolrInfoBeanTest, ConfigSetsAPITest,
TestSolrCoreProperties, MultiTermTest, TestHalfAndHalfDocValues, CustomCollectionTest, TestSmileRequest,
TestClusterStateMutator, UniqFieldsUpdateProcessorFactoryTest, TestAnalyzeInfixSuggestions,
TermsComponentTest, MoveReplicaTest, HdfsChaosMonkeySafeLeaderTest, MinimalSchemaTest, AtomicUpdatesTest,
SolrCoreCheckLockOnStartupTest, StatsComponentTest, TestCustomStream, DeleteNodeTest, SortSpecParsingTest,
TestSha256AuthenticationProvider, TestSolrDeletionPolicy2, BitVectorTest, TestIndexSearcher,
TestMaxTokenLenTokenizer, TestPayloadScoreQParserPlugin, SortByFunctionTest, MissingSegmentRecoveryTest,
AutoCommitTest, TestCloudDeleteByQuery, TestRecovery, TestDynamicFieldCollectionResource,
TestSolrConfigHandlerConcurrent, IgnoreCommitOptimizeUpdateProcessorFactoryTest, TermVectorComponentDistributedTest,
URLClassifyProcessorTest, RecoveryZkTest, TestJmxIntegration, TestReloadAndDeleteDocs, SuggesterFSTTest,
TestRestManager, TestCloudSearcherWarming, CdcrVersionReplicationTest, DirectUpdateHandlerTest,
TestTrie, SaslZkACLProviderTest, TestExpandComponent, DocumentBuilderTest, DistributedExpandComponentTest,
TlogReplayBufferedWhileIndexingTest, SubstringBytesRefFilterTest, SolrCloudExampleTest, TestSolrCloudWithDelegationTokens,
TestCodecSupport, TestRandomFaceting, TestRandomDVFaceting, TestDistributedSearch, DistributedTermsComponentTest,
TestCoreContainer, SimpleFacetsTest, TestSolr4Spatial, TestGroupingSearch, SolrCmdDistributorTest,
BadIndexSchemaTest, TestFunctionQuery, TestBadConfig, HighlighterTest, ShowFileRequestHandlerTest,
SolrIndexSplitterTest, AnalysisAfterCoreReloadTest, SignatureUpdateProcessorFactoryTest, TestExtendedDismaxParser,
SpellCheckCollatorTest, CoreAdminHandlerTest, TestFoldingMultitermQuery, SuggesterTSTTest,
SuggesterTest, TestStressLucene, SuggesterWFSTTest, TestCSVLoader, PolyFieldTest, NoCacheHeaderTest,
WordBreakSolrSpellCheckerTest, SchemaVersionSpecificBehaviorTest, TestPseudoReturnFields,
StatelessScriptUpdateProcessorFactoryTest, IndexBasedSpellCheckerTest, LukeRequestHandlerTest,
DirectSolrSpellCheckerTest, TestReversedWildcardFilterFactory, PrimitiveFieldTypeTest, XmlUpdateRequestHandlerTest,
PathHierarchyTokenizerFactoryTest, MoreLikeThisHandlerTest, FieldAnalysisRequestHandlerTest,
IndexSchemaRuntimeFieldTest, TestCollationField, TestAnalyzedSuggestions, BinaryUpdateRequestHandlerTest,
CSVRequestHandlerTest, TestSolrIndexConfig, ResponseLogComponentTest, BadComponentTest, TestStressRecovery,
DistributedMLTComponentTest, SolrTestCaseJ4Test, TestCursorMarkWithoutUniqueKey, TestSimpleTrackingShardHandler,
TestJettySolrRunner, AssignBackwardCompatibilityTest, CdcrReplicationDistributedZkTest, CdcrRequestHandlerTest,
ChaosMonkeySafeLeaderWithPullReplicasTest, ConnectionManagerTest, CreateCollectionCleanupTest,
DeleteInactiveReplicaTest, DistribCursorPagingTest, DistribJoinFromCollectionTest, DocValuesNotIndexedTest,
HttpPartitionTest, LeaderElectionContextKeyTest, LeaderInitiatedRecoveryOnCommitTest, LeaderInitiatedRecoveryOnShardRestartTest,
MigrateRouteKeyTest, MoveReplicaHDFSTest, MoveReplicaHDFSUlogDirTest, NodeMutatorTest, OutOfBoxZkACLAndCredentialsProvidersTest,
OverriddenZkACLAndCredentialsProvidersTest, PeerSyncReplicationTest, SharedFSAutoReplicaFailoverTest,
SharedFSAutoReplicaFailoverUtilsTest, SolrCLIZkUtilsTest, TestCloudJSONFacetJoinDomain, TestCloudPseudoReturnFields,
TestCloudRecovery, TestCollectionsAPIViaSolrCloudCluster, TestConfigSetsAPI, TestConfigSetsAPIExclusivity,
TestDistribDocBasedVersion, TestLockTree, TestMiniSolrCloudClusterSSL, TestRandomRequestDistribution,
TestSegmentSorting, TestTolerantUpdateProcessorRandomCloud, HdfsBasicDistributedZk2Test, HdfsCollectionsAPIDistributedZkTest,
HdfsRecoverLeaseTest, HdfsRecoveryZkTest, ImplicitSnitchTest, TestBackupRepositoryFactory,
TestConfigOverlay, TestConfigSetImmutable, TestConfigSetProperties, TestCorePropertiesReload,
TestImplicitCoreProperties, TestNRTOpen, RequestLoggingTest, SearchHandlerTest, TestBlobHandler,
TestSystemCollAutoCreate, V2StandaloneTest, CoreMergeIndexesAdminHandlerTest, MetricsHandlerTest,
SegmentsInfoRequestHandlerTest, TestApiFramework, TestCollectionAPIs, TestConfigsApi, DistributedDebugComponentTest,
DistributedFacetPivotWhiteBoxTest, DistributedQueryComponentCustomSortTest, DistributedSuggestComponentTest,
TestNumericRangeQuery32, TestNumericTokenStream, JvmMetricsTest, SolrMetricsIntegrationTest,
SolrSlf4jReporterTest]
   [junit4] Completed [619/730 (2!)] on J2 in 6.57s, 1 test, 1 failure <<< FAILURES!

[...truncated 43771 lines...]

Mime
View raw message