lucene-dev mailing list archives

Site index · List index
Message view « Date » · « Thread »
Top « Date » · « Thread »
From Apache Jenkins Server <jenk...@builds.apache.org>
Subject [JENKINS] Lucene-Solr-Tests-6.6 - Build # 34 - Still Unstable
Date Mon, 21 Aug 2017 08:47:28 GMT
Build: https://builds.apache.org/job/Lucene-Solr-Tests-6.6/34/

1 tests failed.
FAILED:  org.apache.solr.common.cloud.TestCollectionStateWatchers.testWaitForStateWatcherIsRetainedOnPredicateFailure

Error Message:
Did not see a fully active cluster after 30 seconds

Stack Trace:
java.lang.AssertionError: Did not see a fully active cluster after 30 seconds
	at __randomizedtesting.SeedInfo.seed([ED764CE729C1E289:6540EEB4F16E0A9B]:0)
	at org.junit.Assert.fail(Assert.java:93)
	at org.junit.Assert.assertTrue(Assert.java:43)
	at org.apache.solr.common.cloud.TestCollectionStateWatchers.testWaitForStateWatcherIsRetainedOnPredicateFailure(TestCollectionStateWatchers.java:250)
	at sun.reflect.NativeMethodAccessorImpl.invoke0(Native Method)
	at sun.reflect.NativeMethodAccessorImpl.invoke(NativeMethodAccessorImpl.java:62)
	at sun.reflect.DelegatingMethodAccessorImpl.invoke(DelegatingMethodAccessorImpl.java:43)
	at java.lang.reflect.Method.invoke(Method.java:498)
	at com.carrotsearch.randomizedtesting.RandomizedRunner.invoke(RandomizedRunner.java:1713)
	at com.carrotsearch.randomizedtesting.RandomizedRunner$8.evaluate(RandomizedRunner.java:907)
	at com.carrotsearch.randomizedtesting.RandomizedRunner$9.evaluate(RandomizedRunner.java:943)
	at com.carrotsearch.randomizedtesting.RandomizedRunner$10.evaluate(RandomizedRunner.java:957)
	at com.carrotsearch.randomizedtesting.rules.SystemPropertiesRestoreRule$1.evaluate(SystemPropertiesRestoreRule.java:57)
	at org.apache.lucene.util.TestRuleSetupTeardownChained$1.evaluate(TestRuleSetupTeardownChained.java:49)
	at org.apache.lucene.util.AbstractBeforeAfterRule$1.evaluate(AbstractBeforeAfterRule.java:45)
	at org.apache.lucene.util.TestRuleThreadAndTestName$1.evaluate(TestRuleThreadAndTestName.java:48)
	at org.apache.lucene.util.TestRuleIgnoreAfterMaxFailures$1.evaluate(TestRuleIgnoreAfterMaxFailures.java:64)
	at org.apache.lucene.util.TestRuleMarkFailure$1.evaluate(TestRuleMarkFailure.java:47)
	at com.carrotsearch.randomizedtesting.rules.StatementAdapter.evaluate(StatementAdapter.java:36)
	at com.carrotsearch.randomizedtesting.ThreadLeakControl$StatementRunner.run(ThreadLeakControl.java:368)
	at com.carrotsearch.randomizedtesting.ThreadLeakControl.forkTimeoutingTask(ThreadLeakControl.java:817)
	at com.carrotsearch.randomizedtesting.ThreadLeakControl$3.evaluate(ThreadLeakControl.java:468)
	at com.carrotsearch.randomizedtesting.RandomizedRunner.runSingleTest(RandomizedRunner.java:916)
	at com.carrotsearch.randomizedtesting.RandomizedRunner$5.evaluate(RandomizedRunner.java:802)
	at com.carrotsearch.randomizedtesting.RandomizedRunner$6.evaluate(RandomizedRunner.java:852)
	at com.carrotsearch.randomizedtesting.RandomizedRunner$7.evaluate(RandomizedRunner.java:863)
	at com.carrotsearch.randomizedtesting.rules.StatementAdapter.evaluate(StatementAdapter.java:36)
	at com.carrotsearch.randomizedtesting.rules.SystemPropertiesRestoreRule$1.evaluate(SystemPropertiesRestoreRule.java:57)
	at org.apache.lucene.util.AbstractBeforeAfterRule$1.evaluate(AbstractBeforeAfterRule.java:45)
	at com.carrotsearch.randomizedtesting.rules.StatementAdapter.evaluate(StatementAdapter.java:36)
	at org.apache.lucene.util.TestRuleStoreClassName$1.evaluate(TestRuleStoreClassName.java:41)
	at com.carrotsearch.randomizedtesting.rules.NoShadowingOrOverridesOnMethodsRule$1.evaluate(NoShadowingOrOverridesOnMethodsRule.java:40)
	at com.carrotsearch.randomizedtesting.rules.NoShadowingOrOverridesOnMethodsRule$1.evaluate(NoShadowingOrOverridesOnMethodsRule.java:40)
	at com.carrotsearch.randomizedtesting.rules.StatementAdapter.evaluate(StatementAdapter.java:36)
	at com.carrotsearch.randomizedtesting.rules.StatementAdapter.evaluate(StatementAdapter.java:36)
	at com.carrotsearch.randomizedtesting.rules.StatementAdapter.evaluate(StatementAdapter.java:36)
	at org.apache.lucene.util.TestRuleAssertionsRequired$1.evaluate(TestRuleAssertionsRequired.java:53)
	at org.apache.lucene.util.TestRuleMarkFailure$1.evaluate(TestRuleMarkFailure.java:47)
	at org.apache.lucene.util.TestRuleIgnoreAfterMaxFailures$1.evaluate(TestRuleIgnoreAfterMaxFailures.java:64)
	at org.apache.lucene.util.TestRuleIgnoreTestSuites$1.evaluate(TestRuleIgnoreTestSuites.java:54)
	at com.carrotsearch.randomizedtesting.rules.StatementAdapter.evaluate(StatementAdapter.java:36)
	at com.carrotsearch.randomizedtesting.ThreadLeakControl$StatementRunner.run(ThreadLeakControl.java:368)
	at java.lang.Thread.run(Thread.java:748)




Build Log:
[...truncated 14091 lines...]
   [junit4] Suite: org.apache.solr.common.cloud.TestCollectionStateWatchers
   [junit4]   2> Creating dataDir: /x1/jenkins/jenkins-slave/workspace/Lucene-Solr-Tests-6.6/solr/build/solr-solrj/test/J0/temp/solr.common.cloud.TestCollectionStateWatchers_ED764CE729C1E289-001/init-core-data-001
   [junit4]   2> 181240 INFO  (SUITE-TestCollectionStateWatchers-seed#[ED764CE729C1E289]-worker) [    ] o.a.s.SolrTestCaseJ4 Using TrieFields
   [junit4]   2> 181240 INFO  (SUITE-TestCollectionStateWatchers-seed#[ED764CE729C1E289]-worker) [    ] o.a.s.SolrTestCaseJ4 Randomized ssl (true) and clientAuth (false) via: @org.apache.solr.util.RandomizeSSL(reason=, ssl=NaN, value=NaN, clientAuth=NaN)
   [junit4]   2> 181253 INFO  (SUITE-TestCollectionStateWatchers-seed#[ED764CE729C1E289]-worker) [    ] o.a.s.c.MiniSolrCloudCluster Starting cluster of 4 servers in /x1/jenkins/jenkins-slave/workspace/Lucene-Solr-Tests-6.6/solr/build/solr-solrj/test/J0/temp/solr.common.cloud.TestCollectionStateWatchers_ED764CE729C1E289-001/tempDir-001
   [junit4]   2> 181253 INFO  (SUITE-TestCollectionStateWatchers-seed#[ED764CE729C1E289]-worker) [    ] o.a.s.c.ZkTestServer STARTING ZK TEST SERVER
   [junit4]   2> 181265 INFO  (Thread-347) [    ] o.a.s.c.ZkTestServer client port:0.0.0.0/0.0.0.0:0
   [junit4]   2> 181265 INFO  (Thread-347) [    ] o.a.s.c.ZkTestServer Starting server
   [junit4]   2> 181317 ERROR (Thread-347) [    ] o.a.z.s.ZooKeeperServer ZKShutdownHandler is not registered, so ZooKeeper server won't take any action on ERROR or SHUTDOWN server state changes
   [junit4]   2> 181365 INFO  (SUITE-TestCollectionStateWatchers-seed#[ED764CE729C1E289]-worker) [    ] o.a.s.c.ZkTestServer start zk server on port:56893
   [junit4]   2> 181425 INFO  (jetty-launcher-549-thread-1) [    ] o.e.j.s.Server jetty-9.3.14.v20161028
   [junit4]   2> 181434 INFO  (jetty-launcher-549-thread-2) [    ] o.e.j.s.Server jetty-9.3.14.v20161028
   [junit4]   2> 181436 INFO  (jetty-launcher-549-thread-3) [    ] o.e.j.s.Server jetty-9.3.14.v20161028
   [junit4]   2> 181443 INFO  (jetty-launcher-549-thread-4) [    ] o.e.j.s.Server jetty-9.3.14.v20161028
   [junit4]   2> 181593 INFO  (jetty-launcher-549-thread-3) [    ] o.e.j.s.h.ContextHandler Started o.e.j.s.ServletContextHandler@49bbcbb8{/solr,null,AVAILABLE}
   [junit4]   2> 181595 INFO  (jetty-launcher-549-thread-3) [    ] o.e.j.s.AbstractConnector Started ServerConnector@6f988f36{SSL,[ssl, http/1.1]}{127.0.0.1:43452}
   [junit4]   2> 181595 INFO  (jetty-launcher-549-thread-3) [    ] o.e.j.s.Server Started @189267ms
   [junit4]   2> 181595 INFO  (jetty-launcher-549-thread-3) [    ] o.a.s.c.s.e.JettySolrRunner Jetty properties: {hostContext=/solr, hostPort=43452}
   [junit4]   2> 181595 ERROR (jetty-launcher-549-thread-3) [    ] o.a.s.s.StartupLoggingUtils Missing Java Option solr.log.dir. Logging may be missing or incomplete.
   [junit4]   2> 181595 INFO  (jetty-launcher-549-thread-3) [    ] o.a.s.s.SolrDispatchFilter  ___      _       Welcome to Apache Solr? version 6.6.1
   [junit4]   2> 181595 INFO  (jetty-launcher-549-thread-3) [    ] o.a.s.s.SolrDispatchFilter / __| ___| |_ _   Starting in cloud mode on port null
   [junit4]   2> 181595 INFO  (jetty-launcher-549-thread-3) [    ] o.a.s.s.SolrDispatchFilter \__ \/ _ \ | '_|  Install dir: null
   [junit4]   2> 181595 INFO  (jetty-launcher-549-thread-3) [    ] o.a.s.s.SolrDispatchFilter |___/\___/_|_|    Start time: 2017-08-21T08:30:44.697Z
   [junit4]   2> 181684 INFO  (jetty-launcher-549-thread-3) [    ] o.a.s.s.SolrDispatchFilter solr.xml found in ZooKeeper. Loading...
   [junit4]   2> 181729 INFO  (jetty-launcher-549-thread-4) [    ] o.e.j.s.h.ContextHandler Started o.e.j.s.ServletContextHandler@5cbc4652{/solr,null,AVAILABLE}
   [junit4]   2> 181730 INFO  (jetty-launcher-549-thread-4) [    ] o.e.j.s.AbstractConnector Started ServerConnector@3a8b8def{SSL,[ssl, http/1.1]}{127.0.0.1:52294}
   [junit4]   2> 181730 INFO  (jetty-launcher-549-thread-4) [    ] o.e.j.s.Server Started @189402ms
   [junit4]   2> 181730 INFO  (jetty-launcher-549-thread-4) [    ] o.a.s.c.s.e.JettySolrRunner Jetty properties: {hostContext=/solr, hostPort=52294}
   [junit4]   2> 181730 ERROR (jetty-launcher-549-thread-4) [    ] o.a.s.s.StartupLoggingUtils Missing Java Option solr.log.dir. Logging may be missing or incomplete.
   [junit4]   2> 181730 INFO  (jetty-launcher-549-thread-4) [    ] o.a.s.s.SolrDispatchFilter  ___      _       Welcome to Apache Solr? version 6.6.1
   [junit4]   2> 181730 INFO  (jetty-launcher-549-thread-4) [    ] o.a.s.s.SolrDispatchFilter / __| ___| |_ _   Starting in cloud mode on port null
   [junit4]   2> 181730 INFO  (jetty-launcher-549-thread-4) [    ] o.a.s.s.SolrDispatchFilter \__ \/ _ \ | '_|  Install dir: null
   [junit4]   2> 181730 INFO  (jetty-launcher-549-thread-4) [    ] o.a.s.s.SolrDispatchFilter |___/\___/_|_|    Start time: 2017-08-21T08:30:44.832Z
   [junit4]   2> 181750 INFO  (jetty-launcher-549-thread-1) [    ] o.e.j.s.h.ContextHandler Started o.e.j.s.ServletContextHandler@16b85cdb{/solr,null,AVAILABLE}
   [junit4]   2> 181751 INFO  (jetty-launcher-549-thread-1) [    ] o.e.j.s.AbstractConnector Started ServerConnector@2efe6212{SSL,[ssl, http/1.1]}{127.0.0.1:54513}
   [junit4]   2> 181751 INFO  (jetty-launcher-549-thread-1) [    ] o.e.j.s.Server Started @189423ms
   [junit4]   2> 181751 INFO  (jetty-launcher-549-thread-1) [    ] o.a.s.c.s.e.JettySolrRunner Jetty properties: {hostContext=/solr, hostPort=54513}
   [junit4]   2> 181751 ERROR (jetty-launcher-549-thread-1) [    ] o.a.s.s.StartupLoggingUtils Missing Java Option solr.log.dir. Logging may be missing or incomplete.
   [junit4]   2> 181751 INFO  (jetty-launcher-549-thread-1) [    ] o.a.s.s.SolrDispatchFilter  ___      _       Welcome to Apache Solr? version 6.6.1
   [junit4]   2> 181751 INFO  (jetty-launcher-549-thread-1) [    ] o.a.s.s.SolrDispatchFilter / __| ___| |_ _   Starting in cloud mode on port null
   [junit4]   2> 181751 INFO  (jetty-launcher-549-thread-1) [    ] o.a.s.s.SolrDispatchFilter \__ \/ _ \ | '_|  Install dir: null
   [junit4]   2> 181751 INFO  (jetty-launcher-549-thread-1) [    ] o.a.s.s.SolrDispatchFilter |___/\___/_|_|    Start time: 2017-08-21T08:30:44.853Z
   [junit4]   2> 181762 INFO  (jetty-launcher-549-thread-2) [    ] o.e.j.s.h.ContextHandler Started o.e.j.s.ServletContextHandler@570965cc{/solr,null,AVAILABLE}
   [junit4]   2> 181763 INFO  (jetty-launcher-549-thread-2) [    ] o.e.j.s.AbstractConnector Started ServerConnector@4c578abc{SSL,[ssl, http/1.1]}{127.0.0.1:53851}
   [junit4]   2> 181763 INFO  (jetty-launcher-549-thread-2) [    ] o.e.j.s.Server Started @189435ms
   [junit4]   2> 181763 INFO  (jetty-launcher-549-thread-2) [    ] o.a.s.c.s.e.JettySolrRunner Jetty properties: {hostContext=/solr, hostPort=53851}
   [junit4]   2> 181763 ERROR (jetty-launcher-549-thread-2) [    ] o.a.s.s.StartupLoggingUtils Missing Java Option solr.log.dir. Logging may be missing or incomplete.
   [junit4]   2> 181763 INFO  (jetty-launcher-549-thread-2) [    ] o.a.s.s.SolrDispatchFilter  ___      _       Welcome to Apache Solr? version 6.6.1
   [junit4]   2> 181763 INFO  (jetty-launcher-549-thread-2) [    ] o.a.s.s.SolrDispatchFilter / __| ___| |_ _   Starting in cloud mode on port null
   [junit4]   2> 181763 INFO  (jetty-launcher-549-thread-2) [    ] o.a.s.s.SolrDispatchFilter \__ \/ _ \ | '_|  Install dir: null
   [junit4]   2> 181763 INFO  (jetty-launcher-549-thread-2) [    ] o.a.s.s.SolrDispatchFilter |___/\___/_|_|    Start time: 2017-08-21T08:30:44.865Z
   [junit4]   2> 181764 INFO  (jetty-launcher-549-thread-3) [    ] o.a.s.u.UpdateShardHandler Creating UpdateShardHandler HTTP client with params: socketTimeout=340000&connTimeout=45000&retry=true
   [junit4]   2> 181765 INFO  (jetty-launcher-549-thread-3) [    ] o.a.s.c.ZkContainer Zookeeper client=127.0.0.1:56893/solr
   [junit4]   2> 181777 INFO  (jetty-launcher-549-thread-4) [    ] o.a.s.s.SolrDispatchFilter solr.xml found in ZooKeeper. Loading...
   [junit4]   2> 181791 INFO  (jetty-launcher-549-thread-1) [    ] o.a.s.s.SolrDispatchFilter solr.xml found in ZooKeeper. Loading...
   [junit4]   2> 181795 INFO  (jetty-launcher-549-thread-2) [    ] o.a.s.s.SolrDispatchFilter solr.xml found in ZooKeeper. Loading...
   [junit4]   2> 181798 INFO  (jetty-launcher-549-thread-1) [    ] o.a.s.u.UpdateShardHandler Creating UpdateShardHandler HTTP client with params: socketTimeout=340000&connTimeout=45000&retry=true
   [junit4]   2> 181798 INFO  (jetty-launcher-549-thread-1) [    ] o.a.s.c.ZkContainer Zookeeper client=127.0.0.1:56893/solr
   [junit4]   2> 181800 WARN  (NIOServerCxn.Factory:0.0.0.0/0.0.0.0:0) [    ] o.a.z.s.NIOServerCnxn caught end of stream exception
   [junit4]   2> EndOfStreamException: Unable to read additional data from client sessionid 0x15e03ea5c970002, likely client has closed socket
   [junit4]   2> 	at org.apache.zookeeper.server.NIOServerCnxn.doIO(NIOServerCnxn.java:239)
   [junit4]   2> 	at org.apache.zookeeper.server.NIOServerCnxnFactory.run(NIOServerCnxnFactory.java:203)
   [junit4]   2> 	at java.lang.Thread.run(Thread.java:748)
   [junit4]   2> 181809 INFO  (jetty-launcher-549-thread-4) [    ] o.a.s.u.UpdateShardHandler Creating UpdateShardHandler HTTP client with params: socketTimeout=340000&connTimeout=45000&retry=true
   [junit4]   2> 181822 INFO  (jetty-launcher-549-thread-4) [    ] o.a.s.c.ZkContainer Zookeeper client=127.0.0.1:56893/solr
   [junit4]   2> 181825 INFO  (jetty-launcher-549-thread-2) [    ] o.a.s.u.UpdateShardHandler Creating UpdateShardHandler HTTP client with params: socketTimeout=340000&connTimeout=45000&retry=true
   [junit4]   2> 181832 INFO  (jetty-launcher-549-thread-2) [    ] o.a.s.c.ZkContainer Zookeeper client=127.0.0.1:56893/solr
   [junit4]   2> 181911 INFO  (jetty-launcher-549-thread-3) [n:127.0.0.1:43452_solr    ] o.a.s.c.Overseer Overseer (id=null) closing
   [junit4]   2> 181925 INFO  (jetty-launcher-549-thread-1) [n:127.0.0.1:54513_solr    ] o.a.s.c.Overseer Overseer (id=null) closing
   [junit4]   2> 181936 INFO  (jetty-launcher-549-thread-3) [n:127.0.0.1:43452_solr    ] o.a.s.c.OverseerElectionContext I am going to be the leader 127.0.0.1:43452_solr
   [junit4]   2> 181939 INFO  (jetty-launcher-549-thread-1) [n:127.0.0.1:54513_solr    ] o.a.s.c.ZkController Register node as live in ZooKeeper:/live_nodes/127.0.0.1:54513_solr
   [junit4]   2> 181939 INFO  (jetty-launcher-549-thread-3) [n:127.0.0.1:43452_solr    ] o.a.s.c.Overseer Overseer (id=98520546959360006-127.0.0.1:43452_solr-n_0000000000) starting
   [junit4]   2> 182007 INFO  (jetty-launcher-549-thread-4) [n:127.0.0.1:52294_solr    ] o.a.s.c.c.ZkStateReader Updated live nodes from ZooKeeper... (0) -> (1)
   [junit4]   2> 182010 INFO  (jetty-launcher-549-thread-4) [n:127.0.0.1:52294_solr    ] o.a.s.c.Overseer Overseer (id=null) closing
   [junit4]   2> 182014 INFO  (jetty-launcher-549-thread-4) [n:127.0.0.1:52294_solr    ] o.a.s.c.ZkController Register node as live in ZooKeeper:/live_nodes/127.0.0.1:52294_solr
   [junit4]   2> 182023 INFO  (zkCallback-569-thread-1-processing-n:127.0.0.1:54513_solr) [n:127.0.0.1:54513_solr    ] o.a.s.c.c.ZkStateReader Updated live nodes from ZooKeeper... (0) -> (2)
   [junit4]   2> 182029 INFO  (jetty-launcher-549-thread-2) [n:127.0.0.1:53851_solr    ] o.a.s.c.c.ZkStateReader Updated live nodes from ZooKeeper... (0) -> (2)
   [junit4]   2> 182030 INFO  (jetty-launcher-549-thread-2) [n:127.0.0.1:53851_solr    ] o.a.s.c.Overseer Overseer (id=null) closing
   [junit4]   2> 182034 INFO  (jetty-launcher-549-thread-2) [n:127.0.0.1:53851_solr    ] o.a.s.c.ZkController Register node as live in ZooKeeper:/live_nodes/127.0.0.1:53851_solr
   [junit4]   2> 182036 INFO  (zkCallback-569-thread-1-processing-n:127.0.0.1:54513_solr) [n:127.0.0.1:54513_solr    ] o.a.s.c.c.ZkStateReader Updated live nodes from ZooKeeper... (2) -> (3)
   [junit4]   2> 182150 INFO  (jetty-launcher-549-thread-3) [n:127.0.0.1:43452_solr    ] o.a.s.c.ZkController Register node as live in ZooKeeper:/live_nodes/127.0.0.1:43452_solr
   [junit4]   2> 182151 INFO  (zkCallback-569-thread-1-processing-n:127.0.0.1:54513_solr) [n:127.0.0.1:54513_solr    ] o.a.s.c.c.ZkStateReader Updated live nodes from ZooKeeper... (3) -> (4)
   [junit4]   2> 182213 INFO  (zkCallback-571-thread-2-processing-n:127.0.0.1:52294_solr) [n:127.0.0.1:52294_solr    ] o.a.s.c.c.ZkStateReader Updated live nodes from ZooKeeper... (1) -> (4)
   [junit4]   2> 182226 INFO  (zkCallback-559-thread-1-processing-n:127.0.0.1:43452_solr) [n:127.0.0.1:43452_solr    ] o.a.s.c.c.ZkStateReader Updated live nodes from ZooKeeper... (0) -> (2)
   [junit4]   2> 182226 INFO  (OverseerStateUpdate-98520546959360006-127.0.0.1:43452_solr-n_0000000000) [n:127.0.0.1:43452_solr    ] o.a.s.c.c.ZkStateReader Updated live nodes from ZooKeeper... (2) -> (4)
   [junit4]   2> 182305 INFO  (zkCallback-572-thread-1-processing-n:127.0.0.1:53851_solr) [n:127.0.0.1:53851_solr    ] o.a.s.c.c.ZkStateReader Updated live nodes from ZooKeeper... (2) -> (4)
   [junit4]   2> 182496 INFO  (jetty-launcher-549-thread-3) [n:127.0.0.1:43452_solr    ] o.a.s.c.CorePropertiesLocator Found 0 core definitions underneath /x1/jenkins/jenkins-slave/workspace/Lucene-Solr-Tests-6.6/solr/build/solr-solrj/test/J0/temp/solr.common.cloud.TestCollectionStateWatchers_ED764CE729C1E289-001/tempDir-001/node3/.
   [junit4]   2> 182506 INFO  (jetty-launcher-549-thread-1) [n:127.0.0.1:54513_solr    ] o.a.s.c.CorePropertiesLocator Found 0 core definitions underneath /x1/jenkins/jenkins-slave/workspace/Lucene-Solr-Tests-6.6/solr/build/solr-solrj/test/J0/temp/solr.common.cloud.TestCollectionStateWatchers_ED764CE729C1E289-001/tempDir-001/node1/.
   [junit4]   2> 182525 INFO  (jetty-launcher-549-thread-2) [n:127.0.0.1:53851_solr    ] o.a.s.c.CorePropertiesLocator Found 0 core definitions underneath /x1/jenkins/jenkins-slave/workspace/Lucene-Solr-Tests-6.6/solr/build/solr-solrj/test/J0/temp/solr.common.cloud.TestCollectionStateWatchers_ED764CE729C1E289-001/tempDir-001/node2/.
   [junit4]   2> 182636 INFO  (jetty-launcher-549-thread-4) [n:127.0.0.1:52294_solr    ] o.a.s.c.CorePropertiesLocator Found 0 core definitions underneath /x1/jenkins/jenkins-slave/workspace/Lucene-Solr-Tests-6.6/solr/build/solr-solrj/test/J0/temp/solr.common.cloud.TestCollectionStateWatchers_ED764CE729C1E289-001/tempDir-001/node4/.
   [junit4]   2> 182739 INFO  (SUITE-TestCollectionStateWatchers-seed#[ED764CE729C1E289]-worker) [    ] o.a.s.c.c.ZkStateReader Updated live nodes from ZooKeeper... (0) -> (4)
   [junit4]   2> 182739 INFO  (SUITE-TestCollectionStateWatchers-seed#[ED764CE729C1E289]-worker) [    ] o.a.s.c.s.i.ZkClientClusterStateProvider Cluster at 127.0.0.1:56893/solr ready
   [junit4]   2> 182834 INFO  (TEST-TestCollectionStateWatchers.testCanWaitForNonexistantCollection-seed#[ED764CE729C1E289]) [    ] o.a.s.SolrTestCaseJ4 ###Starting testCanWaitForNonexistantCollection
   [junit4]   2> 183082 INFO  (qtp1924484925-1861) [n:127.0.0.1:53851_solr    ] o.a.s.h.a.CollectionsHandler Invoked Collection Action :create with params async=0bab450f-7976-42e7-a6a3-e2ad43ed03bb&replicationFactor=1&collection.configName=config&name=delayed&action=CREATE&numShards=1&wt=javabin&version=2 and sendToOCPQueue=true
   [junit4]   2> 183085 INFO  (qtp1924484925-1861) [n:127.0.0.1:53851_solr    ] o.a.s.s.HttpSolrCall [admin] webapp=null path=/admin/collections params={async=0bab450f-7976-42e7-a6a3-e2ad43ed03bb&replicationFactor=1&collection.configName=config&name=delayed&action=CREATE&numShards=1&wt=javabin&version=2} status=0 QTime=3
   [junit4]   2> 183091 INFO  (qtp1924484925-1861) [n:127.0.0.1:53851_solr    ] o.a.s.h.a.CollectionsHandler Invoked Collection Action :requeststatus with params requestid=0bab450f-7976-42e7-a6a3-e2ad43ed03bb&action=REQUESTSTATUS&wt=javabin&version=2 and sendToOCPQueue=true
   [junit4]   2> 183092 INFO  (qtp1924484925-1861) [n:127.0.0.1:53851_solr    ] o.a.s.s.HttpSolrCall [admin] webapp=null path=/admin/collections params={requestid=0bab450f-7976-42e7-a6a3-e2ad43ed03bb&action=REQUESTSTATUS&wt=javabin&version=2} status=0 QTime=0
   [junit4]   2> 183093 INFO  (OverseerThreadFactory-745-thread-1-processing-n:127.0.0.1:43452_solr) [n:127.0.0.1:43452_solr    ] o.a.s.c.CreateCollectionCmd Create collection delayed
   [junit4]   2> 183116 INFO  (zkCallback-579-thread-1) [    ] o.a.s.c.c.ZkStateReader A cluster state change: [WatchedEvent state:SyncConnected type:NodeCreated path:/collections/delayed/state.json] for collection [delayed] has occurred - updating... (live nodes size: [4])
   [junit4]   2> 183284 INFO  (qtp1019341583-1850) [n:127.0.0.1:43452_solr    ] o.a.s.s.HttpSolrCall [admin] webapp=null path=/admin/cores params={async=0bab450f-7976-42e7-a6a3-e2ad43ed03bb3556178158978719&qt=/admin/cores&collection.configName=config&newCollection=true&name=delayed_shard1_replica1&action=CREATE&numShards=1&collection=delayed&shard=shard1&wt=javabin&version=2} status=0 QTime=1
   [junit4]   2> 183285 INFO  (parallelCoreAdminExecutor-746-thread-1-processing-n:127.0.0.1:43452_solr 0bab450f-7976-42e7-a6a3-e2ad43ed03bb3556178158978719 CREATE) [n:127.0.0.1:43452_solr    ] o.a.s.h.a.CoreAdminOperation core create command async=0bab450f-7976-42e7-a6a3-e2ad43ed03bb3556178158978719&qt=/admin/cores&collection.configName=config&newCollection=true&name=delayed_shard1_replica1&action=CREATE&numShards=1&collection=delayed&shard=shard1&wt=javabin&version=2
   [junit4]   2> 183285 INFO  (parallelCoreAdminExecutor-746-thread-1-processing-n:127.0.0.1:43452_solr 0bab450f-7976-42e7-a6a3-e2ad43ed03bb3556178158978719 CREATE) [n:127.0.0.1:43452_solr    ] o.a.s.c.TransientSolrCoreCacheDefault Allocating transient cache for 2147483647 transient cores
   [junit4]   2> 183313 INFO  (qtp1019341583-1851) [n:127.0.0.1:43452_solr    ] o.a.s.h.a.CoreAdminOperation Checking request status for : 0bab450f-7976-42e7-a6a3-e2ad43ed03bb3556178158978719
   [junit4]   2> 183313 INFO  (qtp1019341583-1851) [n:127.0.0.1:43452_solr    ] o.a.s.s.HttpSolrCall [admin] webapp=null path=/admin/cores params={qt=/admin/cores&requestid=0bab450f-7976-42e7-a6a3-e2ad43ed03bb3556178158978719&action=REQUESTSTATUS&wt=javabin&version=2} status=0 QTime=0
   [junit4]   2> 183585 INFO  (zkCallback-559-thread-2-processing-n:127.0.0.1:43452_solr) [n:127.0.0.1:43452_solr    ] o.a.s.c.c.ZkStateReader A cluster state change: [WatchedEvent state:SyncConnected type:NodeDataChanged path:/collections/delayed/state.json] for collection [delayed] has occurred - updating... (live nodes size: [4])
   [junit4]   2> 183586 INFO  (zkCallback-579-thread-1) [    ] o.a.s.c.c.ZkStateReader A cluster state change: [WatchedEvent state:SyncConnected type:NodeDataChanged path:/collections/delayed/state.json] for collection [delayed] has occurred - updating... (live nodes size: [4])
   [junit4]   2> 184099 INFO  (qtp1924484925-1862) [n:127.0.0.1:53851_solr    ] o.a.s.h.a.CollectionsHandler Invoked Collection Action :requeststatus with params requestid=0bab450f-7976-42e7-a6a3-e2ad43ed03bb&action=REQUESTSTATUS&wt=javabin&version=2 and sendToOCPQueue=true
   [junit4]   2> 184101 INFO  (qtp1924484925-1862) [n:127.0.0.1:53851_solr    ] o.a.s.s.HttpSolrCall [admin] webapp=null path=/admin/collections params={requestid=0bab450f-7976-42e7-a6a3-e2ad43ed03bb&action=REQUESTSTATUS&wt=javabin&version=2} status=0 QTime=1
   [junit4]   2> 184314 INFO  (parallelCoreAdminExecutor-746-thread-1-processing-n:127.0.0.1:43452_solr 0bab450f-7976-42e7-a6a3-e2ad43ed03bb3556178158978719 CREATE) [n:127.0.0.1:43452_solr c:delayed s:shard1  x:delayed_shard1_replica1] o.a.s.c.SolrConfig Using Lucene MatchVersion: 6.6.1
   [junit4]   2> 184316 INFO  (qtp1019341583-1852) [n:127.0.0.1:43452_solr    ] o.a.s.h.a.CoreAdminOperation Checking request status for : 0bab450f-7976-42e7-a6a3-e2ad43ed03bb3556178158978719
   [junit4]   2> 184316 INFO  (qtp1019341583-1852) [n:127.0.0.1:43452_solr    ] o.a.s.s.HttpSolrCall [admin] webapp=null path=/admin/cores params={qt=/admin/cores&requestid=0bab450f-7976-42e7-a6a3-e2ad43ed03bb3556178158978719&action=REQUESTSTATUS&wt=javabin&version=2} status=0 QTime=0
   [junit4]   2> 184334 INFO  (parallelCoreAdminExecutor-746-thread-1-processing-n:127.0.0.1:43452_solr 0bab450f-7976-42e7-a6a3-e2ad43ed03bb3556178158978719 CREATE) [n:127.0.0.1:43452_solr c:delayed s:shard1  x:delayed_shard1_replica1] o.a.s.s.IndexSchema [delayed_shard1_replica1] Schema name=test
   [junit4]   2> 184417 WARN  (parallelCoreAdminExecutor-746-thread-1-processing-n:127.0.0.1:43452_solr 0bab450f-7976-42e7-a6a3-e2ad43ed03bb3556178158978719 CREATE) [n:127.0.0.1:43452_solr c:delayed s:shard1  x:delayed_shard1_replica1] o.a.s.s.IndexSchema Field lowerfilt1and2 is not multivalued and destination for multiple copyFields (2)
   [junit4]   2> 184418 WARN  (parallelCoreAdminExecutor-746-thread-1-processing-n:127.0.0.1:43452_solr 0bab450f-7976-42e7-a6a3-e2ad43ed03bb3556178158978719 CREATE) [n:127.0.0.1:43452_solr c:delayed s:shard1  x:delayed_shard1_replica1] o.a.s.s.IndexSchema Field text is not multivalued and destination for multiple copyFields (3)
   [junit4]   2> 184418 INFO  (parallelCoreAdminExecutor-746-thread-1-processing-n:127.0.0.1:43452_solr 0bab450f-7976-42e7-a6a3-e2ad43ed03bb3556178158978719 CREATE) [n:127.0.0.1:43452_solr c:delayed s:shard1  x:delayed_shard1_replica1] o.a.s.s.IndexSchema Loaded schema test/1.6 with uniqueid field id
   [junit4]   2> 184418 INFO  (parallelCoreAdminExecutor-746-thread-1-processing-n:127.0.0.1:43452_solr 0bab450f-7976-42e7-a6a3-e2ad43ed03bb3556178158978719 CREATE) [n:127.0.0.1:43452_solr c:delayed s:shard1  x:delayed_shard1_replica1] o.a.s.c.CoreContainer Creating SolrCore 'delayed_shard1_replica1' using configuration from collection delayed, trusted=true
   [junit4]   2> 184419 INFO  (parallelCoreAdminExecutor-746-thread-1-processing-n:127.0.0.1:43452_solr 0bab450f-7976-42e7-a6a3-e2ad43ed03bb3556178158978719 CREATE) [n:127.0.0.1:43452_solr c:delayed s:shard1  x:delayed_shard1_replica1] o.a.s.c.SolrCore solr.RecoveryStrategy.Builder
   [junit4]   2> 184419 INFO  (parallelCoreAdminExecutor-746-thread-1-processing-n:127.0.0.1:43452_solr 0bab450f-7976-42e7-a6a3-e2ad43ed03bb3556178158978719 CREATE) [n:127.0.0.1:43452_solr c:delayed s:shard1  x:delayed_shard1_replica1] o.a.s.c.SolrCore [[delayed_shard1_replica1] ] Opening new SolrCore at [/x1/jenkins/jenkins-slave/workspace/Lucene-Solr-Tests-6.6/solr/build/solr-solrj/test/J0/temp/solr.common.cloud.TestCollectionStateWatchers_ED764CE729C1E289-001/tempDir-001/node3/delayed_shard1_replica1], dataDir=[/x1/jenkins/jenkins-slave/workspace/Lucene-Solr-Tests-6.6/solr/build/solr-solrj/test/J0/temp/solr.common.cloud.TestCollectionStateWatchers_ED764CE729C1E289-001/tempDir-001/node3/./delayed_shard1_replica1/data/]
   [junit4]   2> 184446 INFO  (parallelCoreAdminExecutor-746-thread-1-processing-n:127.0.0.1:43452_solr 0bab450f-7976-42e7-a6a3-e2ad43ed03bb3556178158978719 CREATE) [n:127.0.0.1:43452_solr c:delayed s:shard1  x:delayed_shard1_replica1] o.a.s.u.UpdateHandler Using UpdateLog implementation: org.apache.solr.update.UpdateLog
   [junit4]   2> 184446 INFO  (parallelCoreAdminExecutor-746-thread-1-processing-n:127.0.0.1:43452_solr 0bab450f-7976-42e7-a6a3-e2ad43ed03bb3556178158978719 CREATE) [n:127.0.0.1:43452_solr c:delayed s:shard1  x:delayed_shard1_replica1] o.a.s.u.UpdateLog Initializing UpdateLog: dataDir= defaultSyncLevel=FLUSH numRecordsToKeep=100 maxNumLogsToKeep=10 numVersionBuckets=65536
   [junit4]   2> 184447 INFO  (parallelCoreAdminExecutor-746-thread-1-processing-n:127.0.0.1:43452_solr 0bab450f-7976-42e7-a6a3-e2ad43ed03bb3556178158978719 CREATE) [n:127.0.0.1:43452_solr c:delayed s:shard1  x:delayed_shard1_replica1] o.a.s.u.CommitTracker Hard AutoCommit: disabled
   [junit4]   2> 184447 INFO  (parallelCoreAdminExecutor-746-thread-1-processing-n:127.0.0.1:43452_solr 0bab450f-7976-42e7-a6a3-e2ad43ed03bb3556178158978719 CREATE) [n:127.0.0.1:43452_solr c:delayed s:shard1  x:delayed_shard1_replica1] o.a.s.u.CommitTracker Soft AutoCommit: disabled
   [junit4]   2> 184448 INFO  (parallelCoreAdminExecutor-746-thread-1-processing-n:127.0.0.1:43452_solr 0bab450f-7976-42e7-a6a3-e2ad43ed03bb3556178158978719 CREATE) [n:127.0.0.1:43452_solr c:delayed s:shard1  x:delayed_shard1_replica1] o.a.s.s.SolrIndexSearcher Opening [Searcher@323dc9b7[delayed_shard1_replica1] main]
   [junit4]   2> 184449 INFO  (parallelCoreAdminExecutor-746-thread-1-processing-n:127.0.0.1:43452_solr 0bab450f-7976-42e7-a6a3-e2ad43ed03bb3556178158978719 CREATE) [n:127.0.0.1:43452_solr c:delayed s:shard1  x:delayed_shard1_replica1] o.a.s.r.ManagedResourceStorage Configured ZooKeeperStorageIO with znodeBase: /configs/config
   [junit4]   2> 184449 INFO  (parallelCoreAdminExecutor-746-thread-1-processing-n:127.0.0.1:43452_solr 0bab450f-7976-42e7-a6a3-e2ad43ed03bb3556178158978719 CREATE) [n:127.0.0.1:43452_solr c:delayed s:shard1  x:delayed_shard1_replica1] o.a.s.r.ManagedResourceStorage Loaded null at path _rest_managed.json using ZooKeeperStorageIO:path=/configs/config
   [junit4]   2> 184449 INFO  (parallelCoreAdminExecutor-746-thread-1-processing-n:127.0.0.1:43452_solr 0bab450f-7976-42e7-a6a3-e2ad43ed03bb3556178158978719 CREATE) [n:127.0.0.1:43452_solr c:delayed s:shard1  x:delayed_shard1_replica1] o.a.s.h.ReplicationHandler Commits will be reserved for  10000
   [junit4]   2> 184449 INFO  (searcherExecutor-754-thread-1-processing-x:delayed_shard1_replica1 0bab450f-7976-42e7-a6a3-e2ad43ed03bb3556178158978719 CREATE n:127.0.0.1:43452_solr s:shard1 c:delayed) [n:127.0.0.1:43452_solr c:delayed s:shard1  x:delayed_shard1_replica1] o.a.s.c.SolrCore [delayed_shard1_replica1] Registered new searcher Searcher@323dc9b7[delayed_shard1_replica1] main{ExitableDirectoryReader(UninvertingDirectoryReader())}
   [junit4]   2> 184449 INFO  (parallelCoreAdminExecutor-746-thread-1-processing-n:127.0.0.1:43452_solr 0bab450f-7976-42e7-a6a3-e2ad43ed03bb3556178158978719 CREATE) [n:127.0.0.1:43452_solr c:delayed s:shard1  x:delayed_shard1_replica1] o.a.s.u.UpdateLog Could not find max version in index or recent updates, using new clock 1576328754680037376
   [junit4]   2> 184456 INFO  (parallelCoreAdminExecutor-746-thread-1-processing-n:127.0.0.1:43452_solr 0bab450f-7976-42e7-a6a3-e2ad43ed03bb3556178158978719 CREATE) [n:127.0.0.1:43452_solr c:delayed s:shard1  x:delayed_shard1_replica1] o.a.s.c.ShardLeaderElectionContext Enough replicas found to continue.
   [junit4]   2> 184456 INFO  (parallelCoreAdminExecutor-746-thread-1-processing-n:127.0.0.1:43452_solr 0bab450f-7976-42e7-a6a3-e2ad43ed03bb3556178158978719 CREATE) [n:127.0.0.1:43452_solr c:delayed s:shard1  x:delayed_shard1_replica1] o.a.s.c.ShardLeaderElectionContext I may be the new leader - try and sync
   [junit4]   2> 184456 INFO  (parallelCoreAdminExecutor-746-thread-1-processing-n:127.0.0.1:43452_solr 0bab450f-7976-42e7-a6a3-e2ad43ed03bb3556178158978719 CREATE) [n:127.0.0.1:43452_solr c:delayed s:shard1  x:delayed_shard1_replica1] o.a.s.c.SyncStrategy Sync replicas to https://127.0.0.1:43452/solr/delayed_shard1_replica1/
   [junit4]   2> 184456 INFO  (parallelCoreAdminExecutor-746-thread-1-processing-n:127.0.0.1:43452_solr 0bab450f-7976-42e7-a6a3-e2ad43ed03bb3556178158978719 CREATE) [n:127.0.0.1:43452_solr c:delayed s:shard1  x:delayed_shard1_replica1] o.a.s.c.SyncStrategy Sync Success - now sync replicas to me
   [junit4]   2> 184456 INFO  (parallelCoreAdminExecutor-746-thread-1-processing-n:127.0.0.1:43452_solr 0bab450f-7976-42e7-a6a3-e2ad43ed03bb3556178158978719 CREATE) [n:127.0.0.1:43452_solr c:delayed s:shard1  x:delayed_shard1_replica1] o.a.s.c.SyncStrategy https://127.0.0.1:43452/solr/delayed_shard1_replica1/ has no replicas
   [junit4]   2> 184456 INFO  (parallelCoreAdminExecutor-746-thread-1-processing-n:127.0.0.1:43452_solr 0bab450f-7976-42e7-a6a3-e2ad43ed03bb3556178158978719 CREATE) [n:127.0.0.1:43452_solr c:delayed s:shard1  x:delayed_shard1_replica1] o.a.s.c.ShardLeaderElectionContext Found all replicas participating in election, clear LIR
   [junit4]   2> 184460 INFO  (parallelCoreAdminExecutor-746-thread-1-processing-n:127.0.0.1:43452_solr 0bab450f-7976-42e7-a6a3-e2ad43ed03bb3556178158978719 CREATE) [n:127.0.0.1:43452_solr c:delayed s:shard1  x:delayed_shard1_replica1] o.a.s.c.ShardLeaderElectionContext I am the new leader: https://127.0.0.1:43452/solr/delayed_shard1_replica1/ shard1
   [junit4]   2> 184564 INFO  (zkCallback-579-thread-1) [    ] o.a.s.c.c.ZkStateReader A cluster state change: [WatchedEvent state:SyncConnected type:NodeDataChanged path:/collections/delayed/state.json] for collection [delayed] has occurred - updating... (live nodes size: [4])
   [junit4]   2> 184564 INFO  (zkCallback-559-thread-2-processing-n:127.0.0.1:43452_solr) [n:127.0.0.1:43452_solr    ] o.a.s.c.c.ZkStateReader A cluster state change: [WatchedEvent state:SyncConnected type:NodeDataChanged path:/collections/delayed/state.json] for collection [delayed] has occurred - updating... (live nodes size: [4])
   [junit4]   2> 184611 INFO  (parallelCoreAdminExecutor-746-thread-1-processing-n:127.0.0.1:43452_solr 0bab450f-7976-42e7-a6a3-e2ad43ed03bb3556178158978719 CREATE) [n:127.0.0.1:43452_solr c:delayed s:shard1  x:delayed_shard1_replica1] o.a.s.c.ZkController I am the leader, no recovery necessary
   [junit4]   2> 184715 INFO  (zkCallback-579-thread-1) [    ] o.a.s.c.c.ZkStateReader A cluster state change: [WatchedEvent state:SyncConnected type:NodeDataChanged path:/collections/delayed/state.json] for collection [delayed] has occurred - updating... (live nodes size: [4])
   [junit4]   2> 184718 INFO  (zkCallback-559-thread-2-processing-n:127.0.0.1:43452_solr) [n:127.0.0.1:43452_solr    ] o.a.s.c.c.ZkStateReader A cluster state change: [WatchedEvent state:SyncConnected type:NodeDataChanged path:/collections/delayed/state.json] for collection [delayed] has occurred - updating... (live nodes size: [4])
   [junit4]   2> 185104 INFO  (qtp1924484925-1863) [n:127.0.0.1:53851_solr    ] o.a.s.h.a.CollectionsHandler Invoked Collection Action :requeststatus with params requestid=0bab450f-7976-42e7-a6a3-e2ad43ed03bb&action=REQUESTSTATUS&wt=javabin&version=2 and sendToOCPQueue=true
   [junit4]   2> 185110 INFO  (qtp1924484925-1863) [n:127.0.0.1:53851_solr    ] o.a.s.s.HttpSolrCall [admin] webapp=null path=/admin/collections params={requestid=0bab450f-7976-42e7-a6a3-e2ad43ed03bb&action=REQUESTSTATUS&wt=javabin&version=2} status=0 QTime=5
   [junit4]   2> 185331 INFO  (qtp1019341583-1845) [n:127.0.0.1:43452_solr    ] o.a.s.h.a.CoreAdminOperation Checking request status for : 0bab450f-7976-42e7-a6a3-e2ad43ed03bb3556178158978719
   [junit4]   2> 185331 INFO  (qtp1019341583-1845) [n:127.0.0.1:43452_solr    ] o.a.s.s.HttpSolrCall [admin] webapp=null path=/admin/cores params={qt=/admin/cores&requestid=0bab450f-7976-42e7-a6a3-e2ad43ed03bb3556178158978719&action=REQUESTSTATUS&wt=javabin&version=2} status=0 QTime=0
   [junit4]   2> 185339 INFO  (OverseerThreadFactory-745-thread-1-processing-n:127.0.0.1:43452_solr) [n:127.0.0.1:43452_solr    ] o.a.s.c.OverseerTaskQueue Response ZK path: /overseer/collection-queue-work/qnr-0000000000 doesn't exist.  Requestor may have disconnected from ZooKeeper
   [junit4]   2> 186113 INFO  (qtp1924484925-1879) [n:127.0.0.1:53851_solr    ] o.a.s.h.a.CollectionsHandler Invoked Collection Action :requeststatus with params requestid=0bab450f-7976-42e7-a6a3-e2ad43ed03bb&action=REQUESTSTATUS&wt=javabin&version=2 and sendToOCPQueue=true
   [junit4]   2> 186116 INFO  (qtp1924484925-1879) [n:127.0.0.1:53851_solr    ] o.a.s.s.HttpSolrCall [admin] webapp=null path=/admin/collections params={requestid=0bab450f-7976-42e7-a6a3-e2ad43ed03bb&action=REQUESTSTATUS&wt=javabin&version=2} status=0 QTime=2
   [junit4]   2> 186120 INFO  (qtp1924484925-1857) [n:127.0.0.1:53851_solr    ] o.a.s.h.a.CollectionsHandler Invoked Collection Action :deletestatus with params requestid=0bab450f-7976-42e7-a6a3-e2ad43ed03bb&action=DELETESTATUS&wt=javabin&version=2 and sendToOCPQueue=true
   [junit4]   2> 186121 INFO  (qtp1924484925-1857) [n:127.0.0.1:53851_solr    ] o.a.s.s.HttpSolrCall [admin] webapp=null path=/admin/collections params={requestid=0bab450f-7976-42e7-a6a3-e2ad43ed03bb&action=DELETESTATUS&wt=javabin&version=2} status=0 QTime=0
   [junit4]   2> 186122 INFO  (TEST-TestCollectionStateWatchers.testCanWaitForNonexistantCollection-seed#[ED764CE729C1E289]) [    ] o.a.s.SolrTestCaseJ4 ###Ending testCanWaitForNonexistantCollection
   [junit4]   2> 186151 INFO  (TEST-TestCollectionStateWatchers.testStateWatcherChecksCurrentStateOnRegister-seed#[ED764CE729C1E289]) [    ] o.a.s.SolrTestCaseJ4 ###Starting testStateWatcherChecksCurrentStateOnRegister
   [junit4]   2> 186157 INFO  (qtp1924484925-1860) [n:127.0.0.1:53851_solr    ] o.a.s.h.a.CollectionsHandler Invoked Collection Action :create with params async=3a37a039-c087-4bbd-8e00-1f39a66c0f54&replicationFactor=1&collection.configName=config&name=currentstate&action=CREATE&numShards=1&wt=javabin&version=2 and sendToOCPQueue=true
   [junit4]   2> 186159 INFO  (qtp1924484925-1860) [n:127.0.0.1:53851_solr    ] o.a.s.s.HttpSolrCall [admin] webapp=null path=/admin/collections params={async=3a37a039-c087-4bbd-8e00-1f39a66c0f54&replicationFactor=1&collection.configName=config&name=currentstate&action=CREATE&numShards=1&wt=javabin&version=2} status=0 QTime=1
   [junit4]   2> 186160 INFO  (OverseerThreadFactory-745-thread-2-processing-n:127.0.0.1:43452_solr) [n:127.0.0.1:43452_solr    ] o.a.s.c.CreateCollectionCmd Create collection currentstate
   [junit4]   2> 186161 INFO  (qtp1924484925-1861) [n:127.0.0.1:53851_solr    ] o.a.s.h.a.CollectionsHandler Invoked Collection Action :requeststatus with params requestid=3a37a039-c087-4bbd-8e00-1f39a66c0f54&action=REQUESTSTATUS&wt=javabin&version=2 and sendToOCPQueue=true
   [junit4]   2> 186161 INFO  (OverseerCollectionConfigSetProcessor-98520546959360006-127.0.0.1:43452_solr-n_0000000000) [n:127.0.0.1:43452_solr    ] o.a.s.c.OverseerTaskQueue Response ZK path: /overseer/collection-queue-work/qnr-0000000000 doesn't exist.  Requestor may have disconnected from ZooKeeper
   [junit4]   2> 186164 INFO  (qtp1924484925-1861) [n:127.0.0.1:53851_solr    ] o.a.s.s.HttpSolrCall [admin] webapp=null path=/admin/collections params={requestid=3a37a039-c087-4bbd-8e00-1f39a66c0f54&action=REQUESTSTATUS&wt=javabin&version=2} status=0 QTime=2
   [junit4]   2> 186376 INFO  (qtp1924484925-1858) [n:127.0.0.1:53851_solr    ] o.a.s.s.HttpSolrCall [admin] webapp=null path=/admin/cores params={async=3a37a039-c087-4bbd-8e00-1f39a66c0f543556181317324737&qt=/admin/cores&collection.configName=config&newCollection=true&name=currentstate_shard1_replica1&action=CREATE&numShards=1&collection=currentstate&shard=shard1&wt=javabin&version=2} status=0 QTime=0
   [junit4]   2> 186377 INFO  (parallelCoreAdminExecutor-750-thread-1-processing-n:127.0.0.1:53851_solr 3a37a039-c087-4bbd-8e00-1f39a66c0f543556181317324737 CREATE) [n:127.0.0.1:53851_solr    ] o.a.s.h.a.CoreAdminOperation core create command async=3a37a039-c087-4bbd-8e00-1f39a66c0f543556181317324737&qt=/admin/cores&collection.configName=config&newCollection=true&name=currentstate_shard1_replica1&action=CREATE&numShards=1&collection=currentstate&shard=shard1&wt=javabin&version=2
   [junit4]   2> 186378 INFO  (parallelCoreAdminExecutor-750-thread-1-processing-n:127.0.0.1:53851_solr 3a37a039-c087-4bbd-8e00-1f39a66c0f543556181317324737 CREATE) [n:127.0.0.1:53851_solr    ] o.a.s.c.TransientSolrCoreCacheDefault Allocating transient cache for 2147483647 transient cores
   [junit4]   2> 186379 INFO  (qtp1924484925-1879) [n:127.0.0.1:53851_solr    ] o.a.s.h.a.CoreAdminOperation Checking request status for : 3a37a039-c087-4bbd-8e00-1f39a66c0f543556181317324737
   [junit4]   2> 186379 INFO  (qtp1924484925-1879) [n:127.0.0.1:53851_solr    ] o.a.s.s.HttpSolrCall [admin] webapp=null path=/admin/cores params={qt=/admin/cores&requestid=3a37a039-c087-4bbd-8e00-1f39a66c0f543556181317324737&action=REQUESTSTATUS&wt=javabin&version=2} status=0 QTime=0
   [junit4]   2> 186485 INFO  (zkCallback-572-thread-1-processing-n:127.0.0.1:53851_solr) [n:127.0.0.1:53851_solr    ] o.a.s.c.c.ZkStateReader A cluster state change: [WatchedEvent state:SyncConnected type:NodeDataChanged path:/collections/currentstate/state.json] for collection [currentstate] has occurred - updating... (live nodes size: [4])
   [junit4]   2> 187167 INFO  (qtp1924484925-1862) [n:127.0.0.1:53851_solr    ] o.a.s.h.a.CollectionsHandler Invoked Collection Action :requeststatus with params requestid=3a37a039-c087-4bbd-8e00-1f39a66c0f54&action=REQUESTSTATUS&wt=javabin&version=2 and sendToOCPQueue=true
   [junit4]   2> 187168 INFO  (qtp1924484925-1862) [n:127.0.0.1:53851_solr    ] o.a.s.s.HttpSolrCall [admin] webapp=null path=/admin/collections params={requestid=3a37a039-c087-4bbd-8e00-1f39a66c0f54&action=REQUESTSTATUS&wt=javabin&version=2} status=0 QTime=1
   [junit4]   2> 187382 INFO  (qtp1924484925-1857) [n:127.0.0.1:53851_solr    ] o.a.s.h.a.CoreAdminOperation Checking request status for : 3a37a039-c087-4bbd-8e00-1f39a66c0f543556181317324737
   [junit4]   2> 187382 INFO  (qtp1924484925-1857) [n:127.0.0.1:53851_solr    ] o.a.s.s.HttpSolrCall [admin] webapp=null path=/admin/cores params={qt=/admin/cores&requestid=3a37a039-c087-4bbd-8e00-1f39a66c0f543556181317324737&action=REQUESTSTATUS&wt=javabin&version=2} status=0 QTime=0
   [junit4]   2> 187395 INFO  (parallelCoreAdminExecutor-750-thread-1-processing-n:127.0.0.1:53851_solr 3a37a039-c087-4bbd-8e00-1f39a66c0f543556181317324737 CREATE) [n:127.0.0.1:53851_solr c:currentstate s:shard1  x:currentstate_shard1_replica1] o.a.s.c.SolrConfig Using Lucene MatchVersion: 6.6.1
   [junit4]   2> 187403 INFO  (parallelCoreAdminExecutor-750-thread-1-processing-n:127.0.0.1:53851_solr 3a37a039-c087-4bbd-8e00-1f39a66c0f543556181317324737 CREATE) [n:127.0.0.1:53851_solr c:currentstate s:shard1  x:currentstate_shard1_replica1] o.a.s.s.IndexSchema [currentstate_shard1_replica1] Schema name=test
   [junit4]   2> 187470 WARN  (parallelCoreAdminExecutor-750-thread-1-processing-n:127.0.0.1:53851_solr 3a37a039-c087-4bbd-8e00-1f39a66c0f543556181317324737 CREATE) [n:127.0.0.1:53851_solr c:currentstate s:shard1  x:currentstate_shard1_replica1] o.a.s.s.IndexSchema Field lowerfilt1and2 is not multivalued and destination for multiple copyFields (2)
   [junit4]   2> 187470 WARN  (parallelCoreAdminExecutor-750-thread-1-processing-n:127.0.0.1:53851_solr 3a37a039-c087-4bbd-8e00-1f39a66c0f543556181317324737 CREATE) [n:127.0.0.1:53851_solr c:currentstate s:shard1  x:currentstate_shard1_replica1] o.a.s.s.IndexSchema Field text is not multivalued and destination for multiple copyFields (3)
   [junit4]   2> 187471 INFO  (parallelCoreAdminExecutor-750-thread-1-processing-n:127.0.0.1:53851_solr 3a37a039-c087-4bbd-8e00-1f39a66c0f543556181317324737 CREATE) [n:127.0.0.1:53851_solr c:currentstate s:shard1  x:currentstate_shard1_replica1] o.a.s.s.IndexSchema Loaded schema test/1.6 with uniqueid field id
   [junit4]   2> 187471 INFO  (parallelCoreAdminExecutor-750-thread-1-processing-n:127.0.0.1:53851_solr 3a37a039-c087-4bbd-8e00-1f39a66c0f543556181317324737 CREATE) [n:127.0.0.1:53851_solr c:currentstate s:shard1  x:currentstate_shard1_replica1] o.a.s.c.CoreContainer Creating SolrCore 'currentstate_shard1_replica1' using configuration from collection currentstate, trusted=true
   [junit4]   2> 187471 INFO  (parallelCoreAdminExecutor-750-thread-1-processing-n:127.0.0.1:53851_solr 3a37a039-c087-4bbd-8e00-1f39a66c0f543556181317324737 CREATE) [n:127.0.0.1:53851_solr c:currentstate s:shard1  x:currentstate_shard1_replica1] o.a.s.c.SolrCore solr.RecoveryStrategy.Builder
   [junit4]   2> 187471 INFO  (parallelCoreAdminExecutor-750-thread-1-processing-n:127.0.0.1:53851_solr 3a37a039-c087-4bbd-8e00-1f39a66c0f543556181317324737 CREATE) [n:127.0.0.1:53851_solr c:currentstate s:shard1  x:currentstate_shard1_replica1] o.a.s.c.SolrCore [[currentstate_shard1_replica1] ] Opening new SolrCore at [/x1/jenkins/jenkins-slave/workspace/Lucene-Solr-Tests-6.6/solr/build/solr-solrj/test/J0/temp/solr.common.cloud.TestCollectionStateWatchers_ED764CE729C1E289-001/tempDir-001/node2/currentstate_shard1_replica1], dataDir=[/x1/jenkins/jenkins-slave/workspace/Lucene-Solr-Tests-6.6/solr/build/solr-solrj/test/J0/temp/solr.common.cloud.TestCollectionStateWatchers_ED764CE729C1E289-001/tempDir-001/node2/./currentstate_shard1_replica1/data/]
   [junit4]   2> 187503 INFO  (parallelCoreAdminExecutor-750-thread-1-processing-n:127.0.0.1:53851_solr 3a37a039-c087-4bbd-8e00-1f39a66c0f543556181317324737 CREATE) [n:127.0.0.1:53851_solr c:currentstate s:shard1  x:currentstate_shard1_replica1] o.a.s.u.UpdateHandler Using UpdateLog implementation: org.apache.solr.update.UpdateLog
   [junit4]   2> 187503 INFO  (parallelCoreAdminExecutor-750-thread-1-processing-n:127.0.0.1:53851_solr 3a37a039-c087-4bbd-8e00-1f39a66c0f543556181317324737 CREATE) [n:127.0.0.1:53851_solr c:currentstate s:shard1  x:currentstate_shard1_replica1] o.a.s.u.UpdateLog Initializing UpdateLog: dataDir= defaultSyncLevel=FLUSH numRecordsToKeep=100 maxNumLogsToKeep=10 numVersionBuckets=65536
   [junit4]   2> 187504 INFO  (parallelCoreAdminExecutor-750-thread-1-processing-n:127.0.0.1:53851_solr 3a37a039-c087-4bbd-8e00-1f39a66c0f543556181317324737 CREATE) [n:127.0.0.1:53851_solr c:currentstate s:shard1  x:currentstate_shard1_replica1] o.a.s.u.CommitTracker Hard AutoCommit: disabled
   [junit4]   2> 187504 INFO  (parallelCoreAdminExecutor-750-thread-1-processing-n:127.0.0.1:53851_solr 3a37a039-c087-4bbd-8e00-1f39a66c0f543556181317324737 CREATE) [n:127.0.0.1:53851_solr c:currentstate s:shard1  x:currentstate_shard1_replica1] o.a.s.u.CommitTracker Soft AutoCommit: disabled
   [junit4]   2> 187505 INFO  (parallelCoreAdminExecutor-750-thread-1-processing-n:127.0.0.1:53851_solr 3a37a039-c087-4bbd-8e00-1f39a66c0f543556181317324737 CREATE) [n:127.0.0.1:53851_solr c:currentstate s:shard1  x:currentstate_shard1_replica1] o.a.s.s.SolrIndexSearcher Opening [Searcher@3fe5f64b[currentstate_shard1_replica1] main]
   [junit4]   2> 187507 INFO  (parallelCoreAdminExecutor-750-thread-1-processing-n:127.0.0.1:53851_solr 3a37a039-c087-4bbd-8e00-1f39a66c0f543556181317324737 CREATE) [n:127.0.0.1:53851_solr c:currentstate s:shard1  x:currentstate_shard1_replica1] o.a.s.r.ManagedResourceStorage Configured ZooKeeperStorageIO with znodeBase: /configs/config
   [junit4]   2> 187508 INFO  (parallelCoreAdminExecutor-750-thread-1-processing-n:127.0.0.1:53851_solr 3a37a039-c087-4bbd-8e00-1f39a66c0f543556181317324737 CREATE) [n:127.0.0.1:53851_solr c:currentstate s:shard1  x:currentstate_shard1_replica1] o.a.s.r.ManagedResourceStorage Loaded null at path _rest_managed.json using ZooKeeperStorageIO:path=/configs/config
   [junit4]   2> 187508 INFO  (parallelCoreAdminExecutor-750-thread-1-processing-n:127.0.0.1:53851_solr 3a37a039-c087-4bbd-8e00-1f39a66c0f543556181317324737 CREATE) [n:127.0.0.1:53851_solr c:currentstate s:shard1  x:currentstate_shard1_replica1] o.a.s.h.ReplicationHandler Commits will be reserved for  10000
   [junit4]   2> 187509 INFO  (searcherExecutor-759-thread-1-processing-x:currentstate_shard1_replica1 3a37a039-c087-4bbd-8e00-1f39a66c0f543556181317324737 CREATE n:127.0.0.1:53851_solr s:shard1 c:currentstate) [n:127.0.0.1:53851_solr c:currentstate s:shard1  x:currentstate_shard1_replica1] o.a.s.c.SolrCore [currentstate_shard1_replica1] Registered new searcher Searcher@3fe5f64b[currentstate_shard1_replica1] main{ExitableDirectoryReader(UninvertingDirectoryReader())}
   [junit4]   2> 187509 INFO  (parallelCoreAdminExecutor-750-thread-1-processing-n:127.0.0.1:53851_solr 3a37a039-c087-4bbd-8e00-1f39a66c0f543556181317324737 CREATE) [n:127.0.0.1:53851_solr c:currentstate s:shard1  x:currentstate_shard1_replica1] o.a.s.u.UpdateLog Could not find max version in index or recent updates, using new clock 1576328757888679936
   [junit4]   2> 187518 INFO  (parallelCoreAdminExecutor-750-thread-1-processing-n:127.0.0.1:53851_solr 3a37a039-c087-4bbd-8e00-1f39a66c0f543556181317324737 CREATE) [n:127.0.0.1:53851_solr c:currentstate s:shard1  x:currentstate_shard1_replica1] o.a.s.c.ShardLeaderElectionContext Enough replicas found to continue.
   [junit4]   2> 187518 INFO  (parallelCoreAdminExecutor-750-thread-1-processing-n:127.0.0.1:53851_solr 3a37a039-c087-4bbd-8e00-1f39a66c0f543556181317324737 CREATE) [n:127.0.0.1:53851_solr c:currentstate s:shard1  x:currentstate_shard1_replica1] o.a.s.c.ShardLeaderElectionContext I may be the new leader - try and sync
   [junit4]   2> 187518 INFO  (parallelCoreAdminExecutor-750-thread-1-processing-n:127.0.0.1:53851_solr 3a37a039-c087-4bbd-8e00-1f39a66c0f543556181317324737 CREATE) [n:127.0.0.1:53851_solr c:currentstate s:shard1  x:currentstate_shard1_replica1] o.a.s.c.SyncStrategy Sync replicas to https://127.0.0.1:53851/solr/currentstate_shard1_replica1/
   [junit4]   2> 187518 INFO  (parallelCoreAdminExecutor-750-thread-1-processing-n:127.0.0.1:53851_solr 3a37a039-c087-4bbd-8e00-1f39a66c0f543556181317324737 CREATE) [n:127.0.0.1:53851_solr c:currentstate s:shard1  x:currentstate_shard1_replica1] o.a.s.c.SyncStrategy Sync Success - now sync replicas to me
   [junit4]   2> 187518 INFO  (parallelCoreAdminExecutor-750-thread-1-processing-n:127.0.0.1:53851_solr 3a37a039-c087-4bbd-8e00-1f39a66c0f543556181317324737 CREATE) [n:127.0.0.1:53851_solr c:currentstate s:shard1  x:currentstate_shard1_replica1] o.a.s.c.SyncStrategy https://127.0.0.1:53851/solr/currentstate_shard1_replica1/ has no replicas
   [junit4]   2> 187518 INFO  (parallelCoreAdminExecutor-750-thread-1-processing-n:127.0.0.1:53851_solr 3a37a039-c087-4bbd-8e00-1f39a66c0f543556181317324737 CREATE) [n:127.0.0.1:53851_solr c:currentstate s:shard1  x:currentstate_shard1_replica1] o.a.s.c.ShardLeaderElectionContext Found all replicas participating in election, clear LIR
   [junit4]   2> 187522 INFO  (parallelCoreAdminExecutor-750-thread-1-processing-n:127.0.0.1:53851_solr 3a37a039-c087-4bbd-8e00-1f39a66c0f543556181317324737 CREATE) [n:127.0.0.1:53851_solr c:currentstate s:shard1  x:currentstate_shard1_replica1] o.a.s.c.ShardLeaderElectionContext I am the new leader: https://127.0.0.1:53851/solr/currentstate_shard1_replica1/ shard1
   [junit4]   2> 187625 INFO  (zkCallback-572-thread-1-processing-n:127.0.0.1:53851_solr) [n:127.0.0.1:53851_solr    ] o.a.s.c.c.ZkStateReader A cluster state change: [WatchedEvent state:SyncConnected type:NodeDataChanged path:/collections/currentstate/state.json] for collection [currentstate] has occurred - updating... (live nodes size: [4])
   [junit4]   2> 187675 INFO  (parallelCoreAdminExecutor-750-thread-1-processing-n:127.0.0.1:53851_solr 3a37a039-c087-4bbd-8e00-1f39a66c0f543556181317324737 CREATE) [n:127.0.0.1:53851_solr c:currentstate s:shard1  x:currentstate_shard1_replica1] o.a.s.c.ZkController I am the leader, no recovery necessary
   [junit4]   2> 187779 INFO  (zkCallback-572-thread-1-processing-n:127.0.0.1:53851_solr) [n:127.0.0.1:53851_solr    ] o.a.s.c.c.ZkStateReader A cluster state change: [WatchedEvent state:SyncConnected type:NodeDataChanged path:/collections/currentstate/state.json] for collection [currentstate] has occurred - updating... (live nodes size: [4])
   [junit4]   2> 188171 INFO  (qtp1924484925-1862) [n:127.0.0.1:53851_solr    ] o.a.s.h.a.CollectionsHandler Invoked Collection Action :requeststatus with params requestid=3a37a039-c087-4bbd-8e00-1f39a66c0f54&action=REQUESTSTATUS&wt=javabin&version=2 and sendToOCPQueue=true
   [junit4]   2> 188172 INFO  (qtp1924484925-1862) [n:127.0.0.1:53851_solr    ] o.a.s.s.HttpSolrCall [admin] webapp=null path=/admin/collections params={requestid=3a37a039-c087-4bbd-8e00-1f39a66c0f54&action=REQUESTSTATUS&wt=javabin&version=2} status=0 QTime=0
   [junit4]   2> 188386 INFO  (qtp1924484925-1857) [n:127.0.0.1:53851_solr    ] o.a.s.h.a.CoreAdminOperation Checking request status for : 3a37a039-c087-4bbd-8e00-1f39a66c0f543556181317324737
   [junit4]   2> 188386 INFO  (qtp1924484925-1857) [n:127.0.0.1:53851_solr    ] o.a.s.s.HttpSolrCall [admin] webapp=null path=/admin/cores params={qt=/admin/cores&requestid=3a37a039-c087-4bbd-8e00-1f39a66c0f543556181317324737&action=REQUESTSTATUS&wt=javabin&version=2} status=0 QTime=0
   [junit4]   2> 188390 INFO  (OverseerThreadFactory-745-thread-2-processing-n:127.0.0.1:43452_solr) [n:127.0.0.1:43452_solr    ] o.a.s.c.OverseerTaskQueue Response ZK path: /overseer/collection-queue-work/qnr-0000000001 doesn't exist.  Requestor may have disconnected from ZooKeeper
   [junit4]   2> 189175 INFO  (qtp1924484925-1863) [n:127.0.0.1:53851_solr    ] o.a.s.h.a.CollectionsHandler Invoked Collection Action :requeststatus with params requestid=3a37a039-c087-4bbd-8e00-1f39a66c0f54&action=REQUESTSTATUS&wt=javabin&version=2 and sendToOCPQueue=true
   [junit4]   2> 189177 INFO  (qtp1924484925-1863) [n:127.0.0.1:53851_solr    ] o.a.s.s.HttpSolrCall [admin] webapp=null path=/admin/collections params={requestid=3a37a039-c087-4bbd-8e00-1f39a66c0f54&action=REQUESTSTATUS&wt=javabin&version=2} status=0 QTime=2
   [junit4]   2> 189180 INFO  (qtp1924484925-1879) [n:127.0.0.1:53851_solr    ] o.a.s.h.a.CollectionsHandler Invoked Collection Action :deletestatus with params requestid=3a37a039-c087-4bbd-8e00-1f39a66c0f54&action=DELETESTATUS&wt=javabin&version=2 and sendToOCPQueue=true
   [junit4]   2> 189180 INFO  (qtp1924484925-1879) [n:127.0.0.1:53851_solr    ] o.a.s.s.HttpSolrCall [admin] webapp=null path=/admin/collections params={requestid=3a37a039-c087-4bbd-8e00-1f39a66c0f54&action=DELETESTATUS&wt=javabin&version=2} status=0 QTime=0
   [junit4]   2> 189186 INFO  (TEST-TestCollectionStateWatchers.testStateWatcherChecksCurrentStateOnRegister-seed#[ED764CE729C1E289]) [    ] o.a.s.SolrTestCaseJ4 ###Ending testStateWatcherChecksCurrentStateOnRegister
   [junit4]   2> 189211 INFO  (TEST-TestCollectionStateWatchers.testWaitForStateChecksCurrentState-seed#[ED764CE729C1E289]) [    ] o.a.s.SolrTestCaseJ4 ###Starting testWaitForStateChecksCurrentState
   [junit4]   2> 189216 INFO  (qtp1924484925-1860) [n:127.0.0.1:53851_solr    ] o.a.s.h.a.CollectionsHandler Invoked Collection Action :create with params async=b9e1bc96-cfda-40f6-8c19-3263fd8da3d5&replicationFactor=1&collection.configName=config&name=waitforstate&action=CREATE&numShards=1&wt=javabin&version=2 and sendToOCPQueue=true
   [junit4]   2> 189218 INFO  (qtp1924484925-1860) [n:127.0.0.1:53851_solr    ] o.a.s.s.HttpSolrCall [admin] webapp=null path=/admin/collections params={async=b9e1bc96-cfda-40f6-8c19-3263fd8da3d5&replicationFactor=1&collection.configName=config&name=waitforstate&action=CREATE&numShards=1&wt=javabin&version=2} status=0 QTime=1
   [junit4]   2> 189222 INFO  (qtp1924484925-1861) [n:127.0.0.1:53851_solr    ] o.a.s.h.a.CollectionsHandler Invoked Collection Action :requeststatus with params requestid=b9e1bc96-cfda-40f6-8c19-3263fd8da3d5&action=REQUESTSTATUS&wt=javabin&version=2 and sendToOCPQueue=true
   [junit4]   2> 189234 INFO  (qtp1924484925-1861) [n:127.0.0.1:53851_solr    ] o.a.s.s.HttpSolrCall [admin] webapp=null path=/admin/collections params={requestid=b9e1bc96-cfda-40f6-8c19-3263fd8da3d5&action=REQUESTSTATUS&wt=javabin&version=2} status=0 QTime=11
   [junit4]   2> 189235 INFO  (OverseerThreadFactory-745-thread-3-processing-n:127.0.0.1:43452_solr) [n:127.0.0.1:43452_solr    ] o.a.s.c.CreateCollectionCmd Create collection waitforstate
   [junit4]   2> 189236 INFO  (OverseerCollectionConfigSetProcessor-98520546959360006-127.0.0.1:43452_solr-n_0000000000) [n:127.0.0.1:43452_solr    ] o.a.s.c.OverseerTaskQueue Response ZK path: /overseer/collection-queue-work/qnr-0000000001 doesn't exist.  Requestor may have disconnected from ZooKeeper
   [junit4]   2> 189547 INFO  (qtp1911332881-1883) [n:127.0.0.1:54513_solr    ] o.a.s.s.HttpSolrCall [admin] webapp=null path=/admin/cores params={async=b9e1bc96-cfda-40f6-8c19-3263fd8da3d53556184418123797&qt=/admin/cores&collection.configName=config&newCollection=true&name=waitforstate_shard1_replica1&action=CREATE&numShards=1&collection=waitforstate&shard=shard1&wt=javabin&version=2} status=0 QTime=5
   [junit4]   2> 189547 INFO  (parallelCoreAdminExecutor-748-thread-1-processing-n:127.0.0.1:54513_solr b9e1bc96-cfda-40f6-8c19-3263fd8da3d53556184418123797 CREATE) [n:127.0.0.1:54513_solr    ] o.a.s.h.a.CoreAdminOperation core create command async=b9e1bc96-cfda-40f6-8c19-3263fd8da3d53556184418123797&qt=/admin/cores&collection.configName=config&newCollection=true&name=waitforstate_shard1_replica1&action=CREATE&numShards=1&collection=waitforstate&shard=shard1&wt=javabin&version=2
   [junit4]   2> 189547 INFO  (parallelCoreAdminExecutor-748-thread-1-processing-n:127.0.0.1:54513_solr b9e1bc96-cfda-40f6-8c19-3263fd8da3d53556184418123797 CREATE) [n:127.0.0.1:54513_solr    ] o.a.s.c.TransientSolrCoreCacheDefault Allocating transient cache for 2147483647 transient cores
   [junit4]   2> 189550 INFO  (qtp1911332881-1884) [n:127.0.0.1:54513_solr    ] o.a.s.h.a.CoreAdminOperation Checking request status for : b9e1bc96-cfda-40f6-8c19-3263fd8da3d53556184418123797
   [junit4]   2> 189550 INFO  (qtp1911332881-1884) [n:127.0.0.1:54513_solr    ] o.a.s.s.HttpSolrCall [admin] webapp=null path=/admin/cores params={qt=/admin/cores&requestid=b9e1bc96-cfda-40f6-8c19-3263fd8da3d53556184418123797&action=REQUESTSTATUS&wt=javabin&version=2} status=0 QTime=0
   [junit4]   2> 189654 INFO  (zkCallback-569-thread-1-processing-n:127.0.0.1:54513_solr) [n:127.0.0.1:54513_solr    ] o.a.s.c.c.ZkStateReader A cluster state change: [WatchedEvent state:SyncConnected type:NodeDataChanged path:/collections/waitforstate/state.json] for collection [waitforstate] has occurred - updating... (live nodes size: [4])
   [junit4]   2> 190236 INFO  (qtp1924484925-1862) [n:127.0.0.1:53851_solr    ] o.a.s.h.a.CollectionsHandler Invoked Collection Action :requeststatus with params requestid=b9e1bc96-cfda-40f6-8c19-3263fd8da3d5&action=REQUESTSTATUS&wt=javabin&version=2 and sendToOCPQueue=true
   [junit4]   2> 190237 INFO  (qtp1924484925-1862) [n:127.0.0.1:53851_solr    ] o.a.s.s.HttpSolrCall [admin] webapp=null path=/admin/collections params={requestid=b9e1bc96-cfda-40f6-8c19-3263fd8da3d5&action=REQUESTSTATUS&wt=javabin&version=2} status=0 QTime=0
   [junit4]   2> 190556 INFO  (qtp1911332881-1885) [n:127.0.0.1:54513_solr    ] o.a.s.h.a.CoreAdminOperation Checking request status for : b9e1bc96-cfda-40f6-8c19-3263fd8da3d53556184418123797
   [junit4]   2> 190556 INFO  (qtp1911332881-1885) [n:127.0.0.1:54513_solr    ] o.a.s.s.HttpSolrCall [admin] webapp=null path=/admin/cores params={qt=/admin/cores&requestid=b9e1bc96-cfda-40f6-8c19-3263fd8da3d53556184418123797&action=REQUESTSTATUS&wt=javabin&version=2} status=0 QTime=0
   [junit4]   2> 190569 INFO  (parallelCoreAdminExecutor-748-thread-1-processing-n:127.0.0.1:54513_solr b9e1bc96-cfda-40f6-8c19-3263fd8da3d53556184418123797 CREATE) [n:127.0.0.1:54513_solr c:waitforstate s:shard1  x:waitforstate_shard1_replica1] o.a.s.c.SolrConfig Using Lucene MatchVersion: 6.6.1
   [junit4]   2> 190583 INFO  (parallelCoreAdminExecutor-748-thread-1-processing-n:127.0.0.1:54513_solr b9e1bc96-cfda-40f6-8c19-3263fd8da3d53556184418123797 CREATE) [n:127.0.0.1:54513_solr c:waitforstate s:shard1  x:waitforstate_shard1_replica1] o.a.s.s.IndexSchema [waitforstate_shard1_replica1] Schema name=test
   [junit4]   2> 190727 WARN  (parallelCoreAdminExecutor-748-thread-1-processing-n:127.0.0.1:54513_solr b9e1bc96-cfda-40f6-8c19-3263fd8da3d53556184418123797 CREATE) [n:127.0.0.1:54513_solr c:waitforstate s:shard1  x:waitforstate_shard1_replica1] o.a.s.s.IndexSchema Field lowerfilt1and2 is not multivalued and destination for multiple copyFields (2)
   [junit4]   2> 190727 WARN  (parallelCoreAdminExecutor-748-thread-1-processing-n:127.0.0.1:54513_solr b9e1bc96-cfda-40f6-8c19-3263fd8da3d53556184418123797 CREATE) [n:127.0.0.1:54513_solr c:waitforstate s:shard1  x:waitforstate_shard1_replica1] o.a.s.s.IndexSchema Field text is not multivalued and destination for multiple copyFields (3)
   [junit4]   2> 190732 INFO  (parallelCoreAdminExecutor-748-thread-1-processing-n:127.0.0.1:54513_solr b9e1bc96-cfda-40f6-8c19-3263fd8da3d53556184418123797 CREATE) [n:127.0.0.1:54513_solr c:waitforstate s:shard1  x:waitforstate_shard1_replica1] o.a.s.s.IndexSchema Loaded schema test/1.6 with uniqueid field id
   [junit4]   2> 190732 INFO  (parallelCoreAdminExecutor-748-thread-1-processing-n:127.0.0.1:54513_solr b9e1bc96-cfda-40f6-8c19-3263fd8da3d53556184418123797 CREATE) [n:127.0.0.1:54513_solr c:waitforstate s:shard1  x:waitforstate_shard1_replica1] o.a.s.c.CoreContainer Creating SolrCore 'waitforstate_shard1_replica1' using configuration from collection waitforstate, trusted=true
   [junit4]   2> 190732 INFO  (parallelCoreAdminExecutor-748-thread-1-processing-n:127.0.0.1:54513_solr b9e1bc96-cfda-40f6-8c19-3263fd8da3d53556184418123797 CREATE) [n:127.0.0.1:54513_solr c:waitforstate s:shard1  x:waitforstate_shard1_replica1] o.a.s.c.SolrCore solr.RecoveryStrategy.Builder
   [junit4]   2> 190732 INFO  (parallelCoreAdminExecutor-748-thread-1-processing-n:127.0.0.1:54513_solr b9e1bc96-cfda-40f6-8c19-3263fd8da3d53556184418123797 CREATE) [n:127.0.0.1:54513_solr c:waitforstate s:shard1  x:waitforstate_shard1_replica1] o.a.s.c.SolrCore [[waitforstate_shard1_replica1] ] Opening new SolrCore at [/x1/jenkins/jenkins-slave/workspace/Lucene-Solr-Tests-6.6/solr/build/solr-solrj/test/J0/temp/solr.common.cloud.TestCollectionStateWatchers_ED764CE729C1E289-001/tempDir-001/node1/waitforstate_shard1_replica1], dataDir=[/x1/jenkins/jenkins-slave/workspace/Lucene-Solr-Tests-6.6/solr/build/solr-solrj/test/J0/temp/solr.common.cloud.TestCollectionStateWatchers_ED764CE729C1E289-001/tempDir-001/node1/./waitforstate_shard1_replica1/data/]
   [junit4]   2> 190770 INFO  (parallelCoreAdminExecutor-748-thread-1-processing-n:127.0.0.1:54513_solr b9e1bc96-cfda-40f6-8c19-3263fd8da3d53556184418123797 CREATE) [n:127.0.0.1:54513_solr c:waitforstate s:shard1  x:waitforstate_shard1_replica1] o.a.s.u.UpdateHandler Using UpdateLog implementation: org.apache.solr.update.UpdateLog
   [junit4]   2> 190770 INFO  (parallelCoreAdminExecutor-748-thread-1-processing-n:127.0.0.1:54513_solr b9e1bc96-cfda-40f6-8c19-3263fd8da3d53556184418123797 CREATE) [n:127.0.0.1:54513_solr c:waitforstate s:shard1  x:waitforstate_shard1_replica1] o.a.s.u.UpdateLog Initializing UpdateLog: dataDir= defaultSyncLevel=FLUSH numRecordsToKeep=100 maxNumLogsToKeep=10 numVersionBuckets=65536
   [junit4]   2> 190770 INFO  (parallelCoreAdminExecutor-748-thread-1-processing-n:127.0.0.1:54513_solr b9e1bc96-cfda-40f6-8c19-3263fd8da3d53556184418123797 CREATE) [n:127.0.0.1:54513_solr c:waitforstate s:shard1  x:waitforstate_shard1_replica1] o.a.s.u.CommitTracker Hard AutoCommit: disabled
   [junit4]   2> 190770 INFO  (parallelCoreAdminExecutor-748-thread-1-processing-n:127.0.0.1:54513_solr b9e1bc96-cfda-40f6-8c19-3263fd8da3d53556184418123797 CREATE) [n:127.0.0.1:54513_solr c:waitforstate s:shard1  x:waitforstate_shard1_replica1] o.a.s.u.CommitTracker Soft AutoCommit: disabled
   [junit4]   2> 190772 INFO  (parallelCoreAdminExecutor-748-thread-1-processing-n:127.0.0.1:54513_solr b9e1bc96-cfda-40f6-8c19-3263fd8da3d53556184418123797 CREATE) [n:127.0.0.1:54513_solr c:waitforstate s:shard1  x:waitforstate_shard1_replica1] o.a.s.s.SolrIndexSearcher Opening [Searcher@47af90e5[waitforstate_shard1_replica1] main]
   [junit4]   2> 190785 INFO  (parallelCoreAdminExecutor-748-thread-1-processing-n:127.0.0.1:54513_solr b9e1bc96-cfda-40f6-8c19-3263fd8da3d53556184418123797 CREATE) [n:127.0.0.1:54513_solr c:waitforstate s:shard1  x:waitforstate_shard1_replica1] o.a.s.r.ManagedResourceStorage Configured ZooKeeperStorageIO with znodeBase: /configs/config
   [junit4]   2> 190785 INFO  (parallelCoreAdminExecutor-748-thread-1-processing-n:127.0.0.1:54513_solr b9e1bc96-cfda-40f6-8c19-3263fd8da3d53556184418123797 CREATE) [n:127.0.0.1:54513_solr c:waitforstate s:shard1  x:waitforstate_shard1_replica1] o.a.s.r.ManagedResourceStorage Loaded null at path _rest_managed.json using ZooKeeperStorageIO:path=/configs/config
   [junit4]   2> 190785 INFO  (parallelCoreAdminExecutor-748-thread-1-processing-n:127.0.0.1:54513_solr b9e1bc96-cfda-40f6-8c19-3263fd8da3d53556184418123797 CREATE) [n:127.0.0.1:54513_solr c:waitforstate s:shard1  x:waitforstate_shard1_replica1] o.a.s.h.ReplicationHandler Commits will be reserved for  10000
   [junit4]   2> 190786 INFO  (parallelCoreAdminExecutor-748-thread-1-processing-n:127.0.0.1:54513_solr b9e1bc96-cfda-40f6-8c19-3263fd8da3d53556184418123797 CREATE) [n:127.0.0.1:54513_solr c:waitforstate s:shard1  x:waitforstate_shard1_replica1] o.a.s.u.UpdateLog Could not find max version in index or recent updates, using new clock 1576328761324863488
   [junit4]   2> 190792 INFO  (parallelCoreAdminExecutor-748-thread-1-processing-n:127.0.0.1:54513_solr b9e1bc96-cfda-40f6-8c19-3263fd8da3d53556184418123797 CREATE) [n:127.0.0.1:54513_solr c:waitforstate s:shard1  x:waitforstate_shard1_replica1] o.a.s.c.ShardLeaderElectionContext Enough replicas found to continue.
   [junit4]   2> 190792 INFO  (parallelCoreAdminExecutor-748-thread-1-processing-n:127.0.0.1:54513_solr b9e1bc96-cfda-40f6-8c19-3263fd8da3d53556184418123797 CREATE) [n:127.0.0.1:54513_solr c:waitforstate s:shard1  x:waitforstate_shard1_replica1] o.a.s.c.ShardLeaderElectionContext I may be the new leader - try and sync
   [junit4]   2> 190792 INFO  (parallelCoreAdminExecutor-748-thread-1-processing-n:127.0.0.1:54513_solr b9e1bc96-cfda-40f6-8c19-3263fd8da3d53556184418123797 CREATE) [n:127.0.0.1:54513_solr c:waitforstate s:shard1  x:waitforstate_shard1_replica1] o.a.s.c.SyncStrategy Sync replicas to https://127.0.0.1:54513/solr/waitforstate_shard1_replica1/
   [junit4]   2> 190792 INFO  (parallelCoreAdminExecutor-748-thread-1-processing-n:127.0.0.1:54513_solr b9e1bc96-cfda-40f6-8c19-3263fd8da3d53556184418123797 CREATE) [n:127.0.0.1:54513_solr c:waitforstate s:shard1  x:waitforstate_shard1_replica1] o.a.s.c.SyncStrategy Sync Success - now sync replicas to me
   [junit4]   2> 190792 INFO  (parallelCoreAdminExecutor-748-thread-1-processing-n:127.0.0.1:54513_solr b9e1bc96-cfda-40f6-8c19-3263fd8da3d53556184418123797 CREATE) [n:127.0.0.1:54513_solr c:waitforstate s:shard1  x:waitforstate_shard1_replica1] o.a.s.c.SyncStrategy https://127.0.0.1:54513/solr/waitforstate_shard1_replica1/ has no replicas
   [junit4]   2> 190792 INFO  (parallelCoreAdminExecutor-748-thread-1-processing-n:127.0.0.1:54513_solr b9e1bc96-cfda-40f6-8c19-3263fd8da3d53556184418123797 CREATE) [n:127.0.0.1:54513_solr c:waitforstate s:shard1  x:waitforstate_shard1_replica1] o.a.s.c.ShardLeaderElectionContext Found all replicas participating in election, clear LIR
   [junit4]   2> 190808 INFO  (parallelCoreAdminExecutor-748-thread-1-processing-n:127.0.0.1:54513_solr b9e1bc96-cfda-40f6-8c19-3263fd8da3d53556184418123797 CREATE) [n:127.0.0.1:54513_solr c:waitforstate s:shard1  x:waitforstate_shard1_replica1] o.a.s.c.ShardLeaderElectionContext I am the new leader: https://127.0.0.1:54513/solr/waitforstate_shard1_replica1/ shard1
   [junit4]   2> 190808 INFO  (searcherExecutor-764-thread-1-processing-x:waitforstate_shard1_replica1 b9e1bc96-cfda-40f6-8c19-3263fd8da3d53556184418123797 CREATE n:127.0.0.1:54513_solr s:shard1 c:waitforstate) [n:127.0.0.1:54513_solr c:waitforstate s:shard1  x:waitforstate_shard1_replica1] o.a.s.c.SolrCore [waitforstate_shard1_replica1] Registered new searcher Searcher@47af90e5[waitforstate_shard1_replica1] main{ExitableDirectoryReader(UninvertingDirectoryReader())}
   [junit4]   2> 190900 INFO  (zkCallback-569-thread-1-processing-n:127.0.0.1:54513_solr) [n:127.0.0.1:54513_solr    ] o.a.s.c.c.ZkStateReader A cluster state change: [WatchedEvent state:SyncConnected type:NodeDataChanged path:/collections/waitforstate/state.json] for collection [waitforstate] has occurred - updating... (live nodes size: [4])
   [junit4]   2> 190909 INFO  (parallelCoreAdminExecutor-748-thread-1-processing-n:127.0.0.1:54513_solr b9e1bc96-cfda-40f6-8c19-3263fd8da3d53556184418123797 CREATE) [n:127.0.0.1:54513_solr c:waitforstate s:shard1  x:waitforstate_shard1_replica1] o.a.s.c.ZkController I am the leader, no recovery necessary
   [junit4]   2> 191019 INFO  (zkCallback-569-thread-1-processing-n:127.0.0.1:54513_solr) [n:127.0.0.1:54513_solr    ] o.a.s.c.c.ZkStateReader A cluster state change: [WatchedEvent state:SyncConnected type:NodeDataChanged path:/collections/waitforstate/state.json] for collection [waitforstate] has occurred - updating... (live nodes size: [4])
   [junit4]   2> 191239 INFO  (qtp1924484925-1858) [n:127.0.0.1:53851_solr    ] o.a.s.h.a.CollectionsHandler Invoked Collection Action :requeststatus with params requestid=b9e1bc96-cfda-40f6-8c19-3263fd8da3d5&action=REQUESTSTATUS&wt=javabin&version=2 and sendToOCPQueue=true
   [junit4]   2> 191240 INFO  (qtp1924484925-1858) [n:127.0.0.1:53851_solr    ] o.a.s.s.HttpSolrCall [admin] webapp=null path=/admin/collections params={requestid=b9e1bc96-cfda-40f6-8c19-3263fd8da3d5&action=REQUESTSTATUS&wt=javabin&version=2} status=0 QTime=1
   [junit4]   2> 191559 INFO  (qtp1911332881-1864) [n:127.0.0.1:54513_solr    ] o.a.s.h.a.CoreAdminOperation Checking request status for : b9e1bc96-cfda-40f6-8c19-3263fd8da3d53556184418123797
   [junit4]   2> 191559 INFO  (qtp1911332881-1864) [n:127.0.0.1:54513_solr    ] o.a.s.s.HttpSolrCall [admin] webapp=null path=/admin/cores params={qt=/admin/cores&requestid=b9e1bc96-cfda-40f6-8c19-3263fd8da3d53556184418123797&action=REQUESTSTATUS&wt=javabin&version=2} status=0 QTime=0
   [junit4]   2> 191562 INFO  (OverseerThreadFactory-745-thread-3-processing-n:127.0.0.1:43452_solr) [n:127.0.0.1:43452_solr    ] o.a.s.c.OverseerTaskQueue Response ZK path: /overseer/collection-queue-work/qnr-0000000002 doesn't exist.  Requestor may have disconnected from ZooKeeper
   [junit4]   2> 192243 INFO  (qtp1924484925-1863) [n:127.0.0.1:53851_solr    ] o.a.s.h.a.CollectionsHandler Invoked Collection Action :requeststatus with params requestid=b9e1bc96-cfda-40f6-8c19-3263fd8da3d5&action=REQUESTSTATUS&wt=javabin&version=2 and sendToOCPQueue=true
   [junit4]   2> 192245 INFO  (qtp1924484925-1863) [n:127.0.0.1:53851_solr    ] o.a.s.s.HttpSolrCall [admin] webapp=null path=/admin/collections params={requestid=b9e1bc96-cfda-40f6-8c19-3263fd8da3d5&action=REQUESTSTATUS&wt=javabin&version=2} status=0 QTime=1
   [junit4]   2> 192252 INFO  (qtp1924484925-1863) [n:127.0.0.1:53851_solr    ] o.a.s.h.a.CollectionsHandler Invoked Collection Action :deletestatus with params requestid=b9e1bc96-cfda-40f6-8c19-3263fd8da3d5&action=DELETESTATUS&wt=javabin&version=2 and sendToOCPQueue=true
   [junit4]   2> 192252 INFO  (qtp1924484925-1863) [n:127.0.0.1:53851_solr    ] o.a.s.s.HttpSolrCall [admin] webapp=null path=/admin/collections params={requestid=b9e1bc96-cfda-40f6-8c19-3263fd8da3d5&action=DELETESTATUS&wt=javabin&version=2} status=0 QTime=0
   [junit4]   2> 192258 INFO  (TEST-TestCollectionStateWatchers.testWaitForStateChecksCurrentState-seed#[ED764CE729C1E289]) [    ] o.a.s.SolrTestCaseJ4 ###Ending testWaitForStateChecksCurrentState
   [junit4]   2> 192283 INFO  (TEST-TestCollectionStateWatchers.testWaitForStateWatcherIsRetainedOnPredicateFailure-seed#[ED764CE729C1E289]) [    ] o.a.s.SolrTestCaseJ4 ###Starting testWaitForStateWatcherIsRetainedOnPredicateFailure
   [junit4]   2> 192287 INFO  (qtp1924484925-1879) [n:127.0.0.1:53851_solr    ] o.a.s.h.a.CollectionsHandler Invoked Collection Action :create with params async=de92a76c-2d50-4fc5-a512-a12b1e47a50b&replicationFactor=1&collection.configName=config&name=falsepredicate&action=CREATE&numShards=4&wt=javabin&version=2 and sendToOCPQueue=true
   [junit4]   2> 192288 INFO  (qtp1924484925-1879) [n:127.0.0.1:53851_solr    ] o.a.s.s.HttpSolrCall [admin] webapp=null path=/admin/collections params={async=de92a76c-2d50-4fc5-a512-a12b1e47a50b&replicationFactor=1&collection.configName=config&name=falsepredicate&action=CREATE&numShards=4&wt=javabin&version=2} status=0 QTime=1
   [junit4]   2> 192292 INFO  (qtp1924484925-1860) [n:127.0.0.1:53851_solr    ] o.a.s.h.a.CollectionsHandler Invoked Collection Action :requeststatus with params requestid=de92a76c-2d50-4fc5-a512-a12b1e47a50b&action=REQUESTSTATUS&wt=javabin&version=2 and sendToOCPQueue=true
   [junit4]   2> 192295 INFO  (qtp1924484925-1860) [n:127.0.0.1:53851_solr    ] o.a.s.s.HttpSolrCall [admin] webapp=null path=/admin/collections params={requestid=de92a76c-2d50-4fc5-a512-a12b1e47a50b&action=REQUESTSTATUS&wt=javabin&version=2} status=0 QTime=2
   [junit4]   2> 192301 INFO  (OverseerCollectionConfigSetProcessor-98520546959360006-127.0.0.1:43452_solr-n_0000000000) [n:127.0.0.1:43452_solr    ] o.a.s.c.OverseerTaskQueue Response ZK path: /overseer/collection-queue-work/qnr-0000000002 doesn't exist.  Requestor may have disconnected from ZooKeeper
   [junit4]   2> 192302 INFO  (OverseerThreadFactory-745-thread-4-processing-n:127.0.0.1:43452_solr) [n:127.0.0.1:43452_solr    ] o.a.s.c.CreateCollectionCmd Create collection falsepredicate
   [junit4]   2> 192642 INFO  (qtp1924484925-1857) [n:127.0.0.1:53851_solr    ] o.a.s.s.HttpSolrCall [admin] webapp=null path=/admin/cores params={async=de92a76c-2d50-4fc5-a512-a12b1e47a50b3556187581985338&qt=/admin/cores&collection.configName=config&newCollection=true&name=falsepredicate_shard3_replica1&action=CREATE&numShards=4&collection=falsepredicate&shard=shard3&wt=javabin&version=2} status=0 QTime=2
   [junit4]   2> 192644 INFO  (parallelCoreAdminExecutor-750-thread-2-processing-n:127.0.0.1:53851_solr de92a76c-2d50-4fc5-a512-a12b1e47a50b3556187581985338 CREATE) [n:127.0.0.1:53851_solr    ] o.a.s.h.a.CoreAdminOperation core create command async=de92a76c-2d50-4fc5-a512-a12b1e47a50b3556187581985338&qt=/admin/cores&collection.configName=config&newCollection=true&name=falsepredicate_shard3_replica1&action=CREATE&numShards=4&collection=falsepredicate&shard=shard3&wt=javabin&version=2
   [junit4]   2> 192646 INFO  (qtp1019341583-1845) [n:127.0.0.1:43452_solr    ] o.a.s.s.HttpSolrCall [admin] webapp=null path=/admin/cores params={async=de92a76c-2d50-4fc5-a512-a12b1e47a50b3556187588045940&qt=/admin/cores&collection.configName=config&newCollection=true&name=falsepredicate_shard4_replica1&action=CREATE&numShards=4&collection=falsepredicate&shard=shard4&wt=javabin&version=2} status=0 QTime=0
   [junit4]   2> 192647 INFO  (parallelCoreAdminExecutor-746-thread-2-processing-n:127.0.0.1:43452_solr de92a76c-2d50-4fc5-a512-a12b1e47a50b3556187588045940 CREATE) [n:127.0.0.1:43452_solr    ] o.a.s.h.a.CoreAdminOperation core create command async=de92a76c-2d50-4fc5-a512-a12b1e47a50b3556187588045940&qt=/admin/cores&collection.configName=config&newCollection=true&name=falsepredicate_shard4_replica1&action=CREATE&numShards=4&collection=falsepredicate&shard=shard4&wt=javabin&version=2
   [junit4]   2> 192665 INFO  (qtp1911332881-1864) [n:127.0.0.1:54513_solr    ] o.a.s.s.HttpSolrCall [admin] webapp=null path=/admin/cores params={async=de92a76c-2d50-4fc5-a512-a12b1e47a50b3556187582113299&qt=/admin/cores&collection.configName=config&newCollection=true&name=falsepredicate_shard2_replica1&action=CREATE&numShards=4&collection=falsepredicate&shard=shard2&wt=javabin&version=2} status=0 QTime=21
   [junit4]   2> 192677 INFO  (parallelCoreAdminExecutor-748-thread-2-processing-n:127.0.0.1:54513_solr de92a76c-2d50-4fc5-a512-a12b1e47a50b3556187582113299 CREATE) [n:127.0.0.1:54513_solr    ] o.a.s.h.a.CoreAdminOperation core create command async=de92a76c-2d50-4fc5-a512-a12b1e47a50b3556187582113299&qt=/admin/cores&collection.configName=config&newCollection=true&name=falsepredicate_shard2_replica1&action=CREATE&numShards=4&collection=falsepredicate&shard=shard2&wt=javabin&version=2
   [junit4]   2> 192757 INFO  (qtp640153030-1871) [n:127.0.0.1:52294_solr    ] o.a.s.s.HttpSolrCall [admin] webapp=null path=/admin/cores params={async=de92a76c-2d50-4fc5-a512-a12b1e47a50b3556187588872924&qt=/admin/cores&collection.configName=config&newCollection=true&name=falsepredicate_shard1_replica1&action=CREATE&numShards=4&collection=falsepredicate&shard=shard1&wt=javabin&version=2} status=0 QTime=26
   [junit4]   2> 192758 INFO  (parallelCoreAdminExecutor-752-thread-1-processing-n:127.0.0.1:52294_solr de92a76c-2d50-4fc5-a512-a12b1e47a50b3556187588872924 CREATE) [n:127.0.0.1:52294_solr    ] o.a.s.h.a.CoreAdminOperation core create command async=de92a76c-2d50-4fc5-a512-a12b1e47a50b3556187588872924&qt=/admin/cores&collection.configName=config&newCollection=true&name=falsepredicate_shard1_replica1&action=CREATE&numShards=4&collection=falsepredicate&shard=shard1&wt=javabin&version=2
   [junit4]   2> 192758 INFO  (parallelCoreAdminExecutor-752-thread-1-processing-n:127.0.0.1:52294_solr de92a76c-2d50-4fc5-a512-a12b1e47a50b3556187588872924 CREATE) [n:127.0.0.1:52294_solr    ] o.a.s.c.TransientSolrCoreCacheDefault Allocating transient cache for 2147483647 transient cores
   [junit4]   2> 192762 INFO  (qtp1924484925-1862) [n:127.0.0.1:53851_solr    ] o.a.s.h.a.CoreAdminOperation Checking request status for : de92a76c-2d50-4fc5-a512-a12b1e47a50b3556187581985338
   [junit4]   2> 192763 INFO  (qtp1924484925-1862) [n:127.0.0.1:53851_solr    ] o.a.s.s.HttpSolrCall [admin] webapp=null path=/admin/cores params={qt=/admin/cores&requestid=de92a76c-2d50-4fc5-a512-a12b1e47a50b3556187581985338&action=REQUESTSTATUS&wt=javabin&version=2} status=0 QTime=0
   [junit4]   2> 192939 INFO  (zkCallback-569-thread-1-processing-n:127.0.0.1:54513_solr) [n:127.0.0.1:54513_solr    ] o.a.s.c.c.ZkStateReader A cluster state change: [WatchedEvent state:SyncConnected type:NodeDataChanged path:/collections/falsepredicate/state.json] for collection [falsepredicate] has occurred - updating... (live nodes size: [4])
   [junit4]   2> 192939 INFO  (zkCallback-572-thread-1-processing-n:127.0.0.1:53851_solr) [n:127.0.0.1:53851_solr    ] o.a.s.c.c.ZkStateReader A cluster state change: [WatchedEvent state:SyncConnected type:NodeDataChanged path:/collections/falsepredicate/state.json] for collection [falsepredicate] has occurred - updating... (live nodes size: [4])
   [junit4]   2> 192939 INFO  (zkCallback-571-thread-1-processing-n:127.0.0.1:52294_solr) [n:127.0.0.1:52294_solr    ] o.a.s.c.c.ZkStateReader A cluster state change: [WatchedEvent state:SyncConnected type:NodeDataChanged path:/collections/falsepredicate/state.json] for collection [falsepredicate] has occurred - updating... (live nodes size: [4])
   [junit4]   2> 192940 INFO  (zkCallback-559-thread-2-processing-n:127.0.0.1:43452_solr) [n:127.0.0.1:43452_solr    ] o.a.s.c.c.ZkStateReader A cluster state change: [WatchedEvent state:SyncConnected type:NodeDataChanged path:/collections/falsepredicate/state.json] for collection [falsepredicate] has occurred - updating... (live nodes size: [4])
   [junit4]   2> 193297 INFO  (qtp1924484925-1861) [n:127.0.0.1:53851_solr    ] o.a.s.h.a.CollectionsHandler Invoked Collection Action :requeststatus with params requestid=de92a76c-2d50-4fc5-a512-a12b1e47a50b&action=REQUESTSTATUS&wt=javabin&version=2 and sendToOCPQueue=true
   [junit4]   2> 193298 INFO  (qtp1924484925-1861) [n:127.0.0.1:53851_solr    ] o.a.s.s.HttpSolrCall [admin] webapp=null path=/admin/collections params={requestid=de92a76c-2d50-4fc5-a512-a12b1e47a50b&action=REQUESTSTATUS&wt=javabin&version=2} status=0 QTime=1
   [junit4]   2> 193673 INFO  (parallelCoreAdminExecutor-750-thread-2-processing-n:127.0.0.1:53851_solr de92a76c-2d50-4fc5-a512-a12b1e47a50b3556187581985338 CREATE) [n:127.0.0.1:53851_solr c:falsepredicate s:shard3  x:falsepredicate_shard3_replica1] o.a.s.c.SolrConfig Using Lucene MatchVersion: 6.6.1
   [junit4]   2> 193673 INFO  (parallelCoreAdminExecutor-746-thread-2-processing-n:127.0.0.1:43452_solr de92a76c-2d50-4fc5-a512-a12b1e47a50b3556187588045940 CREATE) [n:127.0.0.1:43452_solr c:falsepredicate s:shard4  x:falsepredicate_shard4_replica1] o.a.s.c.SolrConfig Using Lucene MatchVersion: 6.6.1
   [junit4]   2> 193683 INFO  (parallelCoreAdminExecutor-746-thread-2-processing-n:127.0.0.1:43452_solr de92a76c-2d50-4fc5-a512-a12b1e47a50b3556187588045940 CREATE) [n:127.0.0.1:43452_solr c:falsepredicate s:shard4  x:falsepredicate_shard4_replica1] o.a.s.s.IndexSchema [falsepredicate_shard4_replica1] Schema name=test
   [junit4]   2> 193695 INFO  (parallelCoreAdminExecutor-748-thread-2-processing-n:127.0.0.1:54513_solr de92a76c-2d50-4fc5-a512-a12b1e47a50b3556187582113299 CREATE) [n:127.0.0.1:54513_solr c:falsepredicate s:shard2  x:falsepredicate_shard2_replica1] o.a.s.c.SolrConfig Using Lucene MatchVersion: 6.6.1
   [junit4]   2> 193744 INFO  (parallelCoreAdminExecutor-748-thread-2-processing-n:127.0.0.1:54513_solr de92a76c-2d50-4fc5-a512-a12b1e47a50b3556187582113299 CREATE) [n:127.0.0.1:54513_solr c:falsepredicate s:shard2  x:falsepredicate_shard2_replica1] o.a.s.s.IndexSchema [falsepredicate_shard2_replica1] Schema name=test
   [junit4]   2> 193750 INFO  (parallelCoreAdminExecutor-750-thread-2-processing-n:127.0.0.1:53851_solr de92a76c-2d50-4fc5-a512-a12b1e47a50b3556187581985338 CREATE) [n:127.0.0.1:53851_solr c:falsepredicate s:shard3  x:falsepredicate_shard3_replica1] o.a.s.s.IndexSchema [falsepredicate_shard3_replica1] Schema name=test
   [junit4]   2> 193765 INFO  (qtp1924484925-1862) [n:127.0.0.1:53851_solr    ] o.a.s.h.a.CoreAdminOperation Checking request status for : de92a76c-2d50-4fc5-a512-a12b1e47a50b3556187581985338
   [junit4]   2> 193766 INFO  (qtp1924484925-1862) [n:127.0.0.1:53851_solr    ] o.a.s.s.HttpSolrCall [admin] webapp=null path=/admin/cores params={qt=/admin/cores&requestid=de92a76c-2d50-4fc5-a512-a12b1e47a50b3556187581985338&action=REQUESTSTATUS&wt=javabin&version=2} status=0 QTime=0
   [junit4]   2> 193842 INFO  (parallelCoreAdminExecutor-752-thread-1-processing-n:127.0.0.1:52294_solr de92a76c-2d50-4fc5-a512-a12b1e47a50b3556187588872924 CREATE) [n:127.0.0.1:52294_solr c:falsepredicate s:shard1  x:falsepredicate_shard1_replica1] o.a.s.c.SolrConfig Using Lucene MatchVersion: 6.6.1
   [junit4]   2> 193843 WARN  (parallelCoreAdminExecutor-746-thread-2-processing-n:127.0.0.1:43452_solr de92a76c-2d50-4fc5-a512-a12b1e47a50b3556187588045940 CREATE) [n:127.0.0.1:43452_solr c:falsepredicate s:shard4  x:falsepredicate_shard4_replica1] o.a.s.s.IndexSchema Field lowerfilt1and2 is not multivalued and destination for multiple copyFields (2)
   [junit4]   2> 193843 WARN  (parallelCoreAdminExecutor-746-thread-2-processing-n:127.0.0.1:43452_solr de92a76c-2d50-4fc5-a512-a12b1e47a50b3556187588045940 CREATE) [n:127.0.0.1:43452_solr c:falsepredicate s:shard4  x:falsepredicate_shard4_replica1] o.a.s.s.IndexSchema Field text is not multivalued and destination for multiple copyFields (3)
   [junit4]   2> 193843 INFO  (parallelCoreAdminExecutor-746-thread-2-processing-n:127.0.0.1:43452_solr de92a76c-2d50-4fc5-a512-a12b1e47a50b3556187588045940 CREATE) [n:127.0.0.1:43452_solr c:falsepredicate s:shard4  x:falsepredicate_shard4_replica1] o.a.s.s.IndexSchema Loaded schema test/1.6 with uniqueid field id
   [junit4]   2> 193843 INFO  (parallelCoreAdminExecutor-746-thread-2-processing-n:127.0.0.1:43452_solr de92a76c-2d50-4fc5-a512-a12b1e47a50b3556187588045940 CREATE) [n:127.0.0.1:43452_solr c:falsepredicate s:shard4  x:falsepredicate_shard4_replica1] o.a.s.c.CoreContainer Creating SolrCore 'falsepredicate_shard4_replica1' using configuration from collection falsepredicate, trusted=true
   [junit4]   2> 193844 INFO  (parallelCoreAdminExecutor-746-thread-2-processing-n:127.0.0.1:43452_solr de92a76c-2d50-4fc5-a512-a12b1e47a50b3556187588045940 CREATE) [n:127.0.0.1:43452_solr c:falsepredicate s:shard4  x:falsepredicate_shard4_replica1] o.a.s.c.SolrCore solr.RecoveryStrategy.Builder
   [junit4]   2> 193844 INFO  (parallelCoreAdminExecutor-746-thread-2-processing-n:127.0.0.1:43452_solr de92a76c-2d50-4fc5-a512-a12b1e47a50b3556187588045940 CREATE) [n:127.0.0.1:43452_solr c:falsepredicate s:shard4  x:falsepredicate_shard4_replica1] o.a.s.c.SolrCore [[falsepredicate_shard4_replica1] ] Opening new SolrCore at [/x1/jenkins/jenkins-slave/workspace/Lucene-Solr-Tests-6.6/solr/build/solr-solrj/test/J0/temp/solr.common.cloud.TestCollectionStateWatchers_ED764CE729C1E289-001/tempDir-001/node3/falsepredicate_shard4_replica1], dataDir=[/x1/jenkins/jenkins-slave/workspace/Lucene-Solr-Tests-6.6/solr/build/solr-solrj/test/J0/temp/solr.common.cloud.TestCollectionStateWatchers_ED764CE729C1E289-001/tempDir-001/node3/./falsepredicate_shard4_replica1/data/]
   [junit4]   2> 193859 INFO  (parallelCoreAdminExecutor-752-thread-1-processing-n:127.0.0.1:52294_solr de92a76c-2d50-4fc5-a512-a12b1e47a50b3556187588872924 CREATE) [n:127.0.0.1:52294_solr c:falsepredicate s:shard1  x:falsepredicate_shard1_replica1] o.a.s.s.IndexSchema [falsepredicate_shard1_replica1] Schema name=test
   [junit4]   2> 193980 WARN  (parallelCoreAdminExecutor-748-thread-2-processing-n:127.0.0.1:54513_solr de92a76c-2d50-4fc5-a512-a12b1e47a50b3556187582113299 CREATE) [n:127.0.0.1:54513_solr c:falsepredicate s:shard2  x:falsepredicate_shard2_replica1] o.a.s.s.IndexSchema Field lowerfilt1and2 is not multivalued and destination for multiple copyFields (2)
   [junit4]   2> 193981 WARN  (parallelCoreAdminExecutor-748-thread-2-processing-n:127.0.0.1:54513_solr de92a76c-2d50-4fc5-a512-a12b1e47a50b3556187582113299 CREATE) [n:127.0.0.1:54513_solr c:falsepredicate s:shard2  x:falsepredicate_shard2_replica1] o.a.s.s.IndexSchema Field text is not multivalued and destination for multiple copyFields (3)
   [junit4]   2> 193984 INFO  (parallelCoreAdminExecutor-748-thread-2-processing-n:127.0.0.1:54513_solr de92a76c-2d50-4fc5-a512-a12b1e47a50b3556187582113299 CREATE) [n:127.0.0.1:54513_solr c:falsepredicate s:shard2  x:falsepredicate_shard2_replica1] o.a.s.s.IndexSchema Loaded schema test/1.6 with uniqueid field id
   [junit4]   2> 193984 INFO  (parallelCoreAdminExecutor-748-thread-2-processing-n:127.0.0.1:54513_solr de92a76c-2d50-4fc5-a512-a12b1e47a50b3556187582113299 CREATE) [n:127.0.0.1:54513_solr c:falsepredicate s:shard2  x:falsepredicate_shard2_replica1] o.a.s.c.CoreContainer Creating SolrCore 'falsepredicate_shard2_replica1' using configuration from collection falsepredicate, trusted=true
   [junit4]   2> 193988 INFO  (parallelCoreAdminExecutor-748-thread-2-processing-n:127.0.0.1:54513_solr de92a76c-2d50-4fc5-a512-a12b1e47a50b3556187582113299 CREATE) [n:127.0.0.1:54513_solr c:falsepredicate s:shard2  x:falsepredicate_shard2_replica1] o.a.s.c.SolrCore solr.RecoveryStrategy.Builder
   [junit4]   2> 193988 INFO  (parallelCoreAdminExecutor-748-thread-2-processing-n:127.0.0.1:54513_solr de92a76c-2d50-4fc5-a512-a12b1e47a50b3556187582113299 CREATE) [n:127.0.0.1:54513_solr c:falsepredicate s:shard2  x:falsepredicate_shard2_replica1] o.a.s.c.SolrCore [[falsepredicate_shard2_replica1] ] Opening new SolrCore at [/x1/jenkins/jenkins-slave/workspace/Lucene-Solr-Tests-6.6/solr/build/solr-solrj/test/J0/temp/solr.common.cloud.TestCollectionStateWatchers_ED764CE729C1E289-001/tempDir-001/node1/falsepredicate_shard2_replica1], dataDir=[/x1/jenkins/jenkins-slave/workspace/Lucene-Solr-Tests-6.6/solr/build/solr-solrj/test/J0/temp/solr.common.cloud.TestCollectionStateWatchers_ED764CE729C1E289-001/tempDir-001/node1/./falsepredicate_shard2_replica1/data/]
   [junit4]   2> 194010 INFO  (parallelCoreAdminExecutor-746-thread-2-processing-n:127.0.0.1:43452_solr de92a76c-2d50-4fc5-a512-a12b1e47a50b3556187588045940 CREATE) [n:127.0.0.1:43452_solr c:falsepredicate s:shard4  x:falsepredicate_shard4_replica1] o.a.s.u.UpdateHandler Using UpdateLog implementation: org.apache.solr.update.UpdateLog
   [junit4]   2> 194010 INFO  (parallelCoreAdminExecutor-746-thread-2-processing-n:127.0.0.1:43452_solr de92a76c-2d50-4fc5-a512-a12b1e47a50b3556187588045940 CREATE) [n:127.0.0.1:43452_solr c:falsepredicate s:shard4  x:falsepredicate_shard4_replica1] o.a.s.u.UpdateLog Initializing UpdateLog: dataDir= defaultSyncLevel=FLUSH numRecordsToKeep=100 maxNumLogsToKeep=10 numVersionBuckets=65536
   [junit4]   2> 194011 INFO  (parallelCoreAdminExecutor-746-thread-2-processing-n:127.0.0.1:43452_solr de92a76c-2d50-4fc5-a512-a12b1e47a50b3556187588045940 CREATE) [n:127.0.0.1:43452_solr c:falsepredicate s:shard4  x:falsepredicate_shard4_replica1] o.a.s.u.CommitTracker Hard AutoCommit: disabled
   [junit4]   2> 194011 INFO  (parallelCoreAdminExecutor-746-thread-2-processing-n:127.0.0.1:43452_solr de92a76c-2d50-4fc5-a512-a12b1e47a50b3556187588045940 CREATE) [n:127.0.0.1:43452_solr c:falsepredicate s:shard4  x:falsepredicate_shard4_replica1] o.a.s.u.CommitTracker Soft AutoCommit: disabled
   [junit4]   2> 194012 INFO  (parallelCoreAdminExecutor-746-thread-2-processing-n:127.0.0.1:43452_solr de92a76c-2d50-4fc5-a512-a12b1e47a50b3556187588045940 CREATE) [n:127.0.0.1:43452_solr c:falsepredicate s:shard4  x:falsepredicate_shard4_replica1] o.a.s.s.SolrIndexSearcher Opening [Searcher@1ffe694a[falsepredicate_shard4_replica1] main]
   [junit4]   2> 194014 INFO  (parallelCoreAdminExecutor-746-thread-2-processing-n:127.0.0.1:43452_solr de92a76c-2d50-4fc5-a512-a12b1e47a50b3556187588045940 CREATE) [n:127.0.0.1:43452_solr c:falsepredicate s:shard4  x:falsepredicate_shard4_replica1] o.a.s.r.ManagedResourceStorage Configured ZooKeeperStorageIO with znodeBase: /configs/config
   [junit4]   2> 194016 INFO  (parallelCoreAdminExecutor-746-thread-2-processing-n:127.0.0.1:43452_solr de92a76c-2d50-4fc5-a512-a12b1e47a50b3556187588045940 CREATE) [n:127.0.0.1:43452_solr c:falsepredicate s:shard4  x:falsepredicate_shard4_replica1] o.a.

[...truncated too long message...]

r... (4) -> (3)
   [junit4]   2> 238681 INFO  (zkCallback-602-thread-1-processing-n:127.0.0.1:52786_solr) [n:127.0.0.1:52786_solr    ] o.a.s.c.c.ZkStateReader Updated live nodes from ZooKeeper... (4) -> (3)
   [junit4]   2> 238681 INFO  (zkCallback-594-thread-2-processing-n:127.0.0.1:41606_solr) [n:127.0.0.1:41606_solr    ] o.a.s.c.c.ZkStateReader Updated live nodes from ZooKeeper... (4) -> (3)
   [junit4]   2> 238682 INFO  (jetty-closer-550-thread-4) [    ] o.a.s.c.TransientSolrCoreCacheDefault Allocating transient cache for 2147483647 transient cores
   [junit4]   2> 238690 INFO  (coreCloseExecutor-861-thread-1) [n:127.0.0.1:41606_solr c:falsepredicate s:shard1 r:core_node6 x:falsepredicate_shard1_replica1] o.a.s.c.SolrCore [falsepredicate_shard1_replica1]  CLOSING SolrCore org.apache.solr.core.SolrCore@76fd5f2c
   [junit4]   2> 238690 INFO  (coreCloseExecutor-861-thread-2) [n:127.0.0.1:41606_solr c:stateformat1 s:shard1 r:core_node1 x:stateformat1_shard1_replica1] o.a.s.c.SolrCore [stateformat1_shard1_replica1]  CLOSING SolrCore org.apache.solr.core.SolrCore@56e2d927
   [junit4]   2> 238693 INFO  (coreCloseExecutor-862-thread-1) [n:127.0.0.1:43452_solr c:delayed s:shard1 r:core_node1 x:delayed_shard1_replica1] o.a.s.c.SolrCore [delayed_shard1_replica1]  CLOSING SolrCore org.apache.solr.core.SolrCore@526a09a7
   [junit4]   2> 238694 INFO  (zkCallback-594-thread-1-processing-n:127.0.0.1:41606_solr) [n:127.0.0.1:41606_solr    ] o.a.s.c.c.ZkStateReader Updated live nodes from ZooKeeper... (3) -> (2)
   [junit4]   2> 238694 INFO  (zkCallback-559-thread-2-processing-n:127.0.0.1:43452_solr) [n:127.0.0.1:43452_solr    ] o.a.s.c.c.ZkStateReader Updated live nodes from ZooKeeper... (3) -> (2)
   [junit4]   2> 238695 INFO  (coreCloseExecutor-861-thread-3) [n:127.0.0.1:41606_solr c:testcollection s:shard2 r:core_node1 x:testcollection_shard2_replica1] o.a.s.c.SolrCore [testcollection_shard2_replica1]  CLOSING SolrCore org.apache.solr.core.SolrCore@14d19a19
   [junit4]   2> 238701 INFO  (coreCloseExecutor-862-thread-2) [n:127.0.0.1:43452_solr c:falsepredicate s:shard4 r:core_node1 x:falsepredicate_shard4_replica1] o.a.s.c.SolrCore [falsepredicate_shard4_replica1]  CLOSING SolrCore org.apache.solr.core.SolrCore@718cdf01
   [junit4]   2> 238702 INFO  (coreCloseExecutor-861-thread-1) [n:127.0.0.1:41606_solr c:falsepredicate s:shard1 r:core_node6 x:falsepredicate_shard1_replica1] o.a.s.m.SolrMetricManager Closing metric reporters for: solr.core.falsepredicate.shard1.replica1
   [junit4]   2> 238709 INFO  (coreCloseExecutor-861-thread-2) [n:127.0.0.1:41606_solr c:stateformat1 s:shard1 r:core_node1 x:stateformat1_shard1_replica1] o.a.s.m.SolrMetricManager Closing metric reporters for: solr.core.stateformat1.shard1.replica1
   [junit4]   2> 238709 INFO  (coreCloseExecutor-862-thread-3) [n:127.0.0.1:43452_solr c:testcollection s:shard3 r:core_node3 x:testcollection_shard3_replica1] o.a.s.c.SolrCore [testcollection_shard3_replica1]  CLOSING SolrCore org.apache.solr.core.SolrCore@42e70be4
   [junit4]   2> 238709 INFO  (coreCloseExecutor-862-thread-2) [n:127.0.0.1:43452_solr c:falsepredicate s:shard4 r:core_node1 x:falsepredicate_shard4_replica1] o.a.s.m.SolrMetricManager Closing metric reporters for: solr.core.falsepredicate.shard4.replica1
   [junit4]   2> 238710 INFO  (coreCloseExecutor-862-thread-1) [n:127.0.0.1:43452_solr c:delayed s:shard1 r:core_node1 x:delayed_shard1_replica1] o.a.s.m.SolrMetricManager Closing metric reporters for: solr.core.delayed.shard1.replica1
   [junit4]   2> 238713 INFO  (coreCloseExecutor-861-thread-3) [n:127.0.0.1:41606_solr c:testcollection s:shard2 r:core_node1 x:testcollection_shard2_replica1] o.a.s.m.SolrMetricManager Closing metric reporters for: solr.core.testcollection.shard2.replica1
   [junit4]   2> 238720 INFO  (coreCloseExecutor-862-thread-3) [n:127.0.0.1:43452_solr c:testcollection s:shard3 r:core_node3 x:testcollection_shard3_replica1] o.a.s.m.SolrMetricManager Closing metric reporters for: solr.core.testcollection.shard3.replica1
   [junit4]   2> 238722 INFO  (zkCallback-559-thread-2-processing-n:127.0.0.1:43452_solr) [n:127.0.0.1:43452_solr    ] o.a.s.c.c.ZkStateReader Updated live nodes from ZooKeeper... (2) -> (1)
   [junit4]   2> 238724 INFO  (jetty-closer-550-thread-2) [    ] o.a.s.c.Overseer Overseer (id=98520546959360006-127.0.0.1:43452_solr-n_0000000000) closing
   [junit4]   2> 238725 INFO  (OverseerStateUpdate-98520546959360006-127.0.0.1:43452_solr-n_0000000000) [n:127.0.0.1:43452_solr    ] o.a.s.c.Overseer Overseer Loop exiting : 127.0.0.1:43452_solr
   [junit4]   2> 240181 WARN  (zkCallback-572-thread-2-processing-n:127.0.0.1:53851_solr) [n:127.0.0.1:53851_solr    ] o.a.s.c.c.ZkStateReader ZooKeeper watch triggered, but Solr cannot talk to ZK: [KeeperErrorCode = Session expired for /live_nodes]
   [junit4]   2> 240181 INFO  (jetty-closer-550-thread-1) [    ] o.e.j.s.h.ContextHandler Stopped o.e.j.s.ServletContextHandler@570965cc{/solr,null,UNAVAILABLE}
   [junit4]   2> 240196 WARN  (zkCallback-602-thread-1-processing-n:127.0.0.1:52786_solr) [n:127.0.0.1:52786_solr    ] o.a.s.c.c.ZkStateReader ZooKeeper watch triggered, but Solr cannot talk to ZK: [KeeperErrorCode = Session expired for /live_nodes]
   [junit4]   2> 240196 INFO  (jetty-closer-550-thread-4) [    ] o.e.j.s.h.ContextHandler Stopped o.e.j.s.ServletContextHandler@34586f96{/solr,null,UNAVAILABLE}
   [junit4]   2> 240223 WARN  (zkCallback-594-thread-1-processing-n:127.0.0.1:41606_solr) [n:127.0.0.1:41606_solr    ] o.a.s.c.c.ZkStateReader ZooKeeper watch triggered, but Solr cannot talk to ZK: [KeeperErrorCode = Session expired for /live_nodes]
   [junit4]   2> 240223 INFO  (jetty-closer-550-thread-3) [    ] o.e.j.s.h.ContextHandler Stopped o.e.j.s.ServletContextHandler@93f9931{/solr,null,UNAVAILABLE}
   [junit4]   2> 240229 WARN  (zkCallback-559-thread-2-processing-n:127.0.0.1:43452_solr) [n:127.0.0.1:43452_solr    ] o.a.s.c.c.ZkStateReader ZooKeeper watch triggered, but Solr cannot talk to ZK: [KeeperErrorCode = Session expired for /live_nodes]
   [junit4]   2> 240230 INFO  (jetty-closer-550-thread-2) [    ] o.e.j.s.h.ContextHandler Stopped o.e.j.s.ServletContextHandler@49bbcbb8{/solr,null,UNAVAILABLE}
   [junit4]   2> 240237 ERROR (SUITE-TestCollectionStateWatchers-seed#[ED764CE729C1E289]-worker) [    ] o.a.z.s.ZooKeeperServer ZKShutdownHandler is not registered, so ZooKeeper server won't take any action on ERROR or SHUTDOWN server state changes
   [junit4]   2> 240238 INFO  (SUITE-TestCollectionStateWatchers-seed#[ED764CE729C1E289]-worker) [    ] o.a.s.c.ZkTestServer connecting to 127.0.0.1:56893 56893
   [junit4]   2> 240329 INFO  (Thread-347) [    ] o.a.s.c.ZkTestServer connecting to 127.0.0.1:56893 56893
   [junit4]   2> 240330 WARN  (Thread-347) [    ] o.a.s.c.ZkTestServer Watch limit violations: 
   [junit4]   2> Maximum concurrent create/delete watches above limit:
   [junit4]   2> 
   [junit4]   2> 	8	/solr/aliases.json
   [junit4]   2> 	7	/solr/security.json
   [junit4]   2> 	6	/solr/configs/config
   [junit4]   2> 	3	/solr/collections/stateformat1/state.json
   [junit4]   2> 
   [junit4]   2> Maximum concurrent data watches above limit:
   [junit4]   2> 
   [junit4]   2> 	18	/solr/collections/falsepredicate/state.json
   [junit4]   2> 	12	/solr/collections/waitforstate/state.json
   [junit4]   2> 	8	/solr/clusterprops.json
   [junit4]   2> 	8	/solr/clusterstate.json
   [junit4]   2> 	7	/solr/collections/testcollection/state.json
   [junit4]   2> 	4	/solr/overseer_elect/election/98520546959360006-127.0.0.1:43452_solr-n_0000000000
   [junit4]   2> 	3	/solr/collections/stateformat1/state.json
   [junit4]   2> 	2	/solr/collections/currentstate/state.json
   [junit4]   2> 	2	/solr/collections/delayed/state.json
   [junit4]   2> 	2	/solr/collections/tobedeleted/state.json
   [junit4]   2> 	2	/solr/overseer_elect/election/98520546959360012-127.0.0.1:53851_solr-n_0000000003
   [junit4]   2> 
   [junit4]   2> Maximum concurrent children watches above limit:
   [junit4]   2> 
   [junit4]   2> 	8	/solr/collections
   [junit4]   2> 	5	/solr/live_nodes
   [junit4]   2> 
   [junit4]   2> 240330 INFO  (SUITE-TestCollectionStateWatchers-seed#[ED764CE729C1E289]-worker) [    ] o.a.s.SolrTestCaseJ4 ###deleteCore
   [junit4]   2> NOTE: leaving temporary files on disk at: /x1/jenkins/jenkins-slave/workspace/Lucene-Solr-Tests-6.6/solr/build/solr-solrj/test/J0/temp/solr.common.cloud.TestCollectionStateWatchers_ED764CE729C1E289-001
   [junit4]   2> Aug 21, 2017 8:31:43 AM com.carrotsearch.randomizedtesting.ThreadLeakControl checkThreadLeaks
   [junit4]   2> WARNING: Will linger awaiting termination of 1 leaked thread(s).
   [junit4]   2> NOTE: test params are: codec=Asserting(Lucene62): {}, docValues:{}, maxPointsInLeafNode=1631, maxMBSortInHeap=7.391862111056997, sim=RandomSimilarity(queryNorm=false,coord=yes): {}, locale=he-IL, timezone=Africa/Bangui
   [junit4]   2> NOTE: Linux 3.13.0-88-generic amd64/Oracle Corporation 1.8.0_144 (64-bit)/cpus=4,threads=1,free=93937520,total=432013312
   [junit4]   2> NOTE: All tests run in this JVM: [CeilingEvaluatorTest, TestToleratedUpdateError, JDBCStreamTest, GreaterThanEvaluatorTest, LargeVolumeBinaryJettyTest, NotEvaluatorTest, SolrPingTest, ShardParamsTest, SolrExampleStreamingTest, HyperbolicTangentEvaluatorTest, FieldEvaluatorTest, TermsResponseTest, ExternalHttpClientTest, TestUpdateRequestCodec, ConcatOperationTest, FieldAnalysisResponseTest, CloudSolrClientBuilderTest, TestEmbeddedSolrServer, TestZkConfigManager, DivideEvaluatorTest, TestDelegationTokenRequest, SolrExampleEmbeddedTest, LargeVolumeJettyTest, QueryResponseTest, TestCoreAdmin, TestLBHttpSolrClient, LBHttpSolrClientBuilderTest, TestCloudSolrClientConnections, GraphExpressionTest, SelectWithEvaluatorsTest, StreamExpressionToExpessionTest, StreamingTest, SolrZkClientTest, TestCollectionStateWatchers]
   [junit4] Completed [129/130 (1!)] on J0 in 59.89s, 9 tests, 1 failure <<< FAILURES!

[...truncated 42647 lines...]

Mime
View raw message