lucene-dev mailing list archives

Site index · List index
Message view « Date » · « Thread »
Top « Date » · « Thread »
From Policeman Jenkins Server <jenk...@thetaphi.de>
Subject [JENKINS-EA] Lucene-Solr-7.0-Linux (32bit/jdk-9-ea+178) - Build # 139 - Still Unstable!
Date Thu, 03 Aug 2017 22:21:44 GMT
Build: https://jenkins.thetaphi.de/job/Lucene-Solr-7.0-Linux/139/
Java: 32bit/jdk-9-ea+178 -client -XX:+UseParallelGC --illegal-access=deny

3 tests failed.
FAILED:  junit.framework.TestSuite.org.apache.solr.cloud.ChaosMonkeyNothingIsSafeTest

Error Message:
9 threads leaked from SUITE scope at org.apache.solr.cloud.ChaosMonkeyNothingIsSafeTest:     1) Thread[id=4760, name=zkCallback-724-thread-1, state=TIMED_WAITING, group=TGRP-ChaosMonkeyNothingIsSafeTest]         at java.base@9/jdk.internal.misc.Unsafe.park(Native Method)         at java.base@9/java.util.concurrent.locks.LockSupport.parkNanos(LockSupport.java:234)         at java.base@9/java.util.concurrent.SynchronousQueue$TransferStack.awaitFulfill(SynchronousQueue.java:462)         at java.base@9/java.util.concurrent.SynchronousQueue$TransferStack.transfer(SynchronousQueue.java:361)         at java.base@9/java.util.concurrent.SynchronousQueue.poll(SynchronousQueue.java:937)         at java.base@9/java.util.concurrent.ThreadPoolExecutor.getTask(ThreadPoolExecutor.java:1085)         at java.base@9/java.util.concurrent.ThreadPoolExecutor.runWorker(ThreadPoolExecutor.java:1146)         at java.base@9/java.util.concurrent.ThreadPoolExecutor$Worker.run(ThreadPoolExecutor.java:635)         at java.base@9/java.lang.Thread.run(Thread.java:844)    2) Thread[id=4964, name=zkCallback-724-thread-4, state=TIMED_WAITING, group=TGRP-ChaosMonkeyNothingIsSafeTest]         at java.base@9/jdk.internal.misc.Unsafe.park(Native Method)         at java.base@9/java.util.concurrent.locks.LockSupport.parkNanos(LockSupport.java:234)         at java.base@9/java.util.concurrent.SynchronousQueue$TransferStack.awaitFulfill(SynchronousQueue.java:462)         at java.base@9/java.util.concurrent.SynchronousQueue$TransferStack.transfer(SynchronousQueue.java:361)         at java.base@9/java.util.concurrent.SynchronousQueue.poll(SynchronousQueue.java:937)         at java.base@9/java.util.concurrent.ThreadPoolExecutor.getTask(ThreadPoolExecutor.java:1085)         at java.base@9/java.util.concurrent.ThreadPoolExecutor.runWorker(ThreadPoolExecutor.java:1146)         at java.base@9/java.util.concurrent.ThreadPoolExecutor$Worker.run(ThreadPoolExecutor.java:635)         at java.base@9/java.lang.Thread.run(Thread.java:844)    3) Thread[id=4757, name=Connection evictor, state=TIMED_WAITING, group=TGRP-ChaosMonkeyNothingIsSafeTest]         at java.base@9/java.lang.Thread.sleep(Native Method)         at app//org.apache.http.impl.client.IdleConnectionEvictor$1.run(IdleConnectionEvictor.java:66)         at java.base@9/java.lang.Thread.run(Thread.java:844)    4) Thread[id=4962, name=zkCallback-724-thread-2, state=TIMED_WAITING, group=TGRP-ChaosMonkeyNothingIsSafeTest]         at java.base@9/jdk.internal.misc.Unsafe.park(Native Method)         at java.base@9/java.util.concurrent.locks.LockSupport.parkNanos(LockSupport.java:234)         at java.base@9/java.util.concurrent.SynchronousQueue$TransferStack.awaitFulfill(SynchronousQueue.java:462)         at java.base@9/java.util.concurrent.SynchronousQueue$TransferStack.transfer(SynchronousQueue.java:361)         at java.base@9/java.util.concurrent.SynchronousQueue.poll(SynchronousQueue.java:937)         at java.base@9/java.util.concurrent.ThreadPoolExecutor.getTask(ThreadPoolExecutor.java:1085)         at java.base@9/java.util.concurrent.ThreadPoolExecutor.runWorker(ThreadPoolExecutor.java:1146)         at java.base@9/java.util.concurrent.ThreadPoolExecutor$Worker.run(ThreadPoolExecutor.java:635)         at java.base@9/java.lang.Thread.run(Thread.java:844)    5) Thread[id=4963, name=zkCallback-724-thread-3, state=TIMED_WAITING, group=TGRP-ChaosMonkeyNothingIsSafeTest]         at java.base@9/jdk.internal.misc.Unsafe.park(Native Method)         at java.base@9/java.util.concurrent.locks.LockSupport.parkNanos(LockSupport.java:234)         at java.base@9/java.util.concurrent.SynchronousQueue$TransferStack.awaitFulfill(SynchronousQueue.java:462)         at java.base@9/java.util.concurrent.SynchronousQueue$TransferStack.transfer(SynchronousQueue.java:361)         at java.base@9/java.util.concurrent.SynchronousQueue.poll(SynchronousQueue.java:937)         at java.base@9/java.util.concurrent.ThreadPoolExecutor.getTask(ThreadPoolExecutor.java:1085)         at java.base@9/java.util.concurrent.ThreadPoolExecutor.runWorker(ThreadPoolExecutor.java:1146)         at java.base@9/java.util.concurrent.ThreadPoolExecutor$Worker.run(ThreadPoolExecutor.java:635)         at java.base@9/java.lang.Thread.run(Thread.java:844)    6) Thread[id=4980, name=zkCallback-724-thread-5, state=TIMED_WAITING, group=TGRP-ChaosMonkeyNothingIsSafeTest]         at java.base@9/jdk.internal.misc.Unsafe.park(Native Method)         at java.base@9/java.util.concurrent.locks.LockSupport.parkNanos(LockSupport.java:234)         at java.base@9/java.util.concurrent.SynchronousQueue$TransferStack.awaitFulfill(SynchronousQueue.java:462)         at java.base@9/java.util.concurrent.SynchronousQueue$TransferStack.transfer(SynchronousQueue.java:361)         at java.base@9/java.util.concurrent.SynchronousQueue.poll(SynchronousQueue.java:937)         at java.base@9/java.util.concurrent.ThreadPoolExecutor.getTask(ThreadPoolExecutor.java:1085)         at java.base@9/java.util.concurrent.ThreadPoolExecutor.runWorker(ThreadPoolExecutor.java:1146)         at java.base@9/java.util.concurrent.ThreadPoolExecutor$Worker.run(ThreadPoolExecutor.java:635)         at java.base@9/java.lang.Thread.run(Thread.java:844)    7) Thread[id=4758, name=TEST-ChaosMonkeyNothingIsSafeTest.test-seed#[238068C853D28BA5]-SendThread(127.0.0.1:36547), state=TIMED_WAITING, group=TGRP-ChaosMonkeyNothingIsSafeTest]         at java.base@9/java.lang.Thread.sleep(Native Method)         at app//org.apache.zookeeper.client.StaticHostProvider.next(StaticHostProvider.java:101)         at app//org.apache.zookeeper.ClientCnxn$SendThread.startConnect(ClientCnxn.java:997)         at app//org.apache.zookeeper.ClientCnxn$SendThread.run(ClientCnxn.java:1060)    8) Thread[id=4759, name=TEST-ChaosMonkeyNothingIsSafeTest.test-seed#[238068C853D28BA5]-EventThread, state=WAITING, group=TGRP-ChaosMonkeyNothingIsSafeTest]         at java.base@9/jdk.internal.misc.Unsafe.park(Native Method)         at java.base@9/java.util.concurrent.locks.LockSupport.park(LockSupport.java:194)         at java.base@9/java.util.concurrent.locks.AbstractQueuedSynchronizer$ConditionObject.await(AbstractQueuedSynchronizer.java:2062)         at java.base@9/java.util.concurrent.LinkedBlockingQueue.take(LinkedBlockingQueue.java:435)         at app//org.apache.zookeeper.ClientCnxn$EventThread.run(ClientCnxn.java:501)    9) Thread[id=5097, name=zkCallback-724-thread-6, state=TIMED_WAITING, group=TGRP-ChaosMonkeyNothingIsSafeTest]         at java.base@9/jdk.internal.misc.Unsafe.park(Native Method)         at java.base@9/java.util.concurrent.locks.LockSupport.parkNanos(LockSupport.java:234)         at java.base@9/java.util.concurrent.SynchronousQueue$TransferStack.awaitFulfill(SynchronousQueue.java:462)         at java.base@9/java.util.concurrent.SynchronousQueue$TransferStack.transfer(SynchronousQueue.java:361)         at java.base@9/java.util.concurrent.SynchronousQueue.poll(SynchronousQueue.java:937)         at java.base@9/java.util.concurrent.ThreadPoolExecutor.getTask(ThreadPoolExecutor.java:1085)         at java.base@9/java.util.concurrent.ThreadPoolExecutor.runWorker(ThreadPoolExecutor.java:1146)         at java.base@9/java.util.concurrent.ThreadPoolExecutor$Worker.run(ThreadPoolExecutor.java:635)         at java.base@9/java.lang.Thread.run(Thread.java:844)

Stack Trace:
com.carrotsearch.randomizedtesting.ThreadLeakError: 9 threads leaked from SUITE scope at org.apache.solr.cloud.ChaosMonkeyNothingIsSafeTest: 
   1) Thread[id=4760, name=zkCallback-724-thread-1, state=TIMED_WAITING, group=TGRP-ChaosMonkeyNothingIsSafeTest]
        at java.base@9/jdk.internal.misc.Unsafe.park(Native Method)
        at java.base@9/java.util.concurrent.locks.LockSupport.parkNanos(LockSupport.java:234)
        at java.base@9/java.util.concurrent.SynchronousQueue$TransferStack.awaitFulfill(SynchronousQueue.java:462)
        at java.base@9/java.util.concurrent.SynchronousQueue$TransferStack.transfer(SynchronousQueue.java:361)
        at java.base@9/java.util.concurrent.SynchronousQueue.poll(SynchronousQueue.java:937)
        at java.base@9/java.util.concurrent.ThreadPoolExecutor.getTask(ThreadPoolExecutor.java:1085)
        at java.base@9/java.util.concurrent.ThreadPoolExecutor.runWorker(ThreadPoolExecutor.java:1146)
        at java.base@9/java.util.concurrent.ThreadPoolExecutor$Worker.run(ThreadPoolExecutor.java:635)
        at java.base@9/java.lang.Thread.run(Thread.java:844)
   2) Thread[id=4964, name=zkCallback-724-thread-4, state=TIMED_WAITING, group=TGRP-ChaosMonkeyNothingIsSafeTest]
        at java.base@9/jdk.internal.misc.Unsafe.park(Native Method)
        at java.base@9/java.util.concurrent.locks.LockSupport.parkNanos(LockSupport.java:234)
        at java.base@9/java.util.concurrent.SynchronousQueue$TransferStack.awaitFulfill(SynchronousQueue.java:462)
        at java.base@9/java.util.concurrent.SynchronousQueue$TransferStack.transfer(SynchronousQueue.java:361)
        at java.base@9/java.util.concurrent.SynchronousQueue.poll(SynchronousQueue.java:937)
        at java.base@9/java.util.concurrent.ThreadPoolExecutor.getTask(ThreadPoolExecutor.java:1085)
        at java.base@9/java.util.concurrent.ThreadPoolExecutor.runWorker(ThreadPoolExecutor.java:1146)
        at java.base@9/java.util.concurrent.ThreadPoolExecutor$Worker.run(ThreadPoolExecutor.java:635)
        at java.base@9/java.lang.Thread.run(Thread.java:844)
   3) Thread[id=4757, name=Connection evictor, state=TIMED_WAITING, group=TGRP-ChaosMonkeyNothingIsSafeTest]
        at java.base@9/java.lang.Thread.sleep(Native Method)
        at app//org.apache.http.impl.client.IdleConnectionEvictor$1.run(IdleConnectionEvictor.java:66)
        at java.base@9/java.lang.Thread.run(Thread.java:844)
   4) Thread[id=4962, name=zkCallback-724-thread-2, state=TIMED_WAITING, group=TGRP-ChaosMonkeyNothingIsSafeTest]
        at java.base@9/jdk.internal.misc.Unsafe.park(Native Method)
        at java.base@9/java.util.concurrent.locks.LockSupport.parkNanos(LockSupport.java:234)
        at java.base@9/java.util.concurrent.SynchronousQueue$TransferStack.awaitFulfill(SynchronousQueue.java:462)
        at java.base@9/java.util.concurrent.SynchronousQueue$TransferStack.transfer(SynchronousQueue.java:361)
        at java.base@9/java.util.concurrent.SynchronousQueue.poll(SynchronousQueue.java:937)
        at java.base@9/java.util.concurrent.ThreadPoolExecutor.getTask(ThreadPoolExecutor.java:1085)
        at java.base@9/java.util.concurrent.ThreadPoolExecutor.runWorker(ThreadPoolExecutor.java:1146)
        at java.base@9/java.util.concurrent.ThreadPoolExecutor$Worker.run(ThreadPoolExecutor.java:635)
        at java.base@9/java.lang.Thread.run(Thread.java:844)
   5) Thread[id=4963, name=zkCallback-724-thread-3, state=TIMED_WAITING, group=TGRP-ChaosMonkeyNothingIsSafeTest]
        at java.base@9/jdk.internal.misc.Unsafe.park(Native Method)
        at java.base@9/java.util.concurrent.locks.LockSupport.parkNanos(LockSupport.java:234)
        at java.base@9/java.util.concurrent.SynchronousQueue$TransferStack.awaitFulfill(SynchronousQueue.java:462)
        at java.base@9/java.util.concurrent.SynchronousQueue$TransferStack.transfer(SynchronousQueue.java:361)
        at java.base@9/java.util.concurrent.SynchronousQueue.poll(SynchronousQueue.java:937)
        at java.base@9/java.util.concurrent.ThreadPoolExecutor.getTask(ThreadPoolExecutor.java:1085)
        at java.base@9/java.util.concurrent.ThreadPoolExecutor.runWorker(ThreadPoolExecutor.java:1146)
        at java.base@9/java.util.concurrent.ThreadPoolExecutor$Worker.run(ThreadPoolExecutor.java:635)
        at java.base@9/java.lang.Thread.run(Thread.java:844)
   6) Thread[id=4980, name=zkCallback-724-thread-5, state=TIMED_WAITING, group=TGRP-ChaosMonkeyNothingIsSafeTest]
        at java.base@9/jdk.internal.misc.Unsafe.park(Native Method)
        at java.base@9/java.util.concurrent.locks.LockSupport.parkNanos(LockSupport.java:234)
        at java.base@9/java.util.concurrent.SynchronousQueue$TransferStack.awaitFulfill(SynchronousQueue.java:462)
        at java.base@9/java.util.concurrent.SynchronousQueue$TransferStack.transfer(SynchronousQueue.java:361)
        at java.base@9/java.util.concurrent.SynchronousQueue.poll(SynchronousQueue.java:937)
        at java.base@9/java.util.concurrent.ThreadPoolExecutor.getTask(ThreadPoolExecutor.java:1085)
        at java.base@9/java.util.concurrent.ThreadPoolExecutor.runWorker(ThreadPoolExecutor.java:1146)
        at java.base@9/java.util.concurrent.ThreadPoolExecutor$Worker.run(ThreadPoolExecutor.java:635)
        at java.base@9/java.lang.Thread.run(Thread.java:844)
   7) Thread[id=4758, name=TEST-ChaosMonkeyNothingIsSafeTest.test-seed#[238068C853D28BA5]-SendThread(127.0.0.1:36547), state=TIMED_WAITING, group=TGRP-ChaosMonkeyNothingIsSafeTest]
        at java.base@9/java.lang.Thread.sleep(Native Method)
        at app//org.apache.zookeeper.client.StaticHostProvider.next(StaticHostProvider.java:101)
        at app//org.apache.zookeeper.ClientCnxn$SendThread.startConnect(ClientCnxn.java:997)
        at app//org.apache.zookeeper.ClientCnxn$SendThread.run(ClientCnxn.java:1060)
   8) Thread[id=4759, name=TEST-ChaosMonkeyNothingIsSafeTest.test-seed#[238068C853D28BA5]-EventThread, state=WAITING, group=TGRP-ChaosMonkeyNothingIsSafeTest]
        at java.base@9/jdk.internal.misc.Unsafe.park(Native Method)
        at java.base@9/java.util.concurrent.locks.LockSupport.park(LockSupport.java:194)
        at java.base@9/java.util.concurrent.locks.AbstractQueuedSynchronizer$ConditionObject.await(AbstractQueuedSynchronizer.java:2062)
        at java.base@9/java.util.concurrent.LinkedBlockingQueue.take(LinkedBlockingQueue.java:435)
        at app//org.apache.zookeeper.ClientCnxn$EventThread.run(ClientCnxn.java:501)
   9) Thread[id=5097, name=zkCallback-724-thread-6, state=TIMED_WAITING, group=TGRP-ChaosMonkeyNothingIsSafeTest]
        at java.base@9/jdk.internal.misc.Unsafe.park(Native Method)
        at java.base@9/java.util.concurrent.locks.LockSupport.parkNanos(LockSupport.java:234)
        at java.base@9/java.util.concurrent.SynchronousQueue$TransferStack.awaitFulfill(SynchronousQueue.java:462)
        at java.base@9/java.util.concurrent.SynchronousQueue$TransferStack.transfer(SynchronousQueue.java:361)
        at java.base@9/java.util.concurrent.SynchronousQueue.poll(SynchronousQueue.java:937)
        at java.base@9/java.util.concurrent.ThreadPoolExecutor.getTask(ThreadPoolExecutor.java:1085)
        at java.base@9/java.util.concurrent.ThreadPoolExecutor.runWorker(ThreadPoolExecutor.java:1146)
        at java.base@9/java.util.concurrent.ThreadPoolExecutor$Worker.run(ThreadPoolExecutor.java:635)
        at java.base@9/java.lang.Thread.run(Thread.java:844)
	at __randomizedtesting.SeedInfo.seed([238068C853D28BA5]:0)


FAILED:  junit.framework.TestSuite.org.apache.solr.cloud.ChaosMonkeyNothingIsSafeTest

Error Message:
There are still zombie threads that couldn't be terminated:    1) Thread[id=4760, name=zkCallback-724-thread-1, state=TIMED_WAITING, group=TGRP-ChaosMonkeyNothingIsSafeTest]         at java.base@9/jdk.internal.misc.Unsafe.park(Native Method)         at java.base@9/java.util.concurrent.locks.LockSupport.parkNanos(LockSupport.java:234)         at java.base@9/java.util.concurrent.SynchronousQueue$TransferStack.awaitFulfill(SynchronousQueue.java:462)         at java.base@9/java.util.concurrent.SynchronousQueue$TransferStack.transfer(SynchronousQueue.java:361)         at java.base@9/java.util.concurrent.SynchronousQueue.poll(SynchronousQueue.java:937)         at java.base@9/java.util.concurrent.ThreadPoolExecutor.getTask(ThreadPoolExecutor.java:1085)         at java.base@9/java.util.concurrent.ThreadPoolExecutor.runWorker(ThreadPoolExecutor.java:1146)         at java.base@9/java.util.concurrent.ThreadPoolExecutor$Worker.run(ThreadPoolExecutor.java:635)         at java.base@9/java.lang.Thread.run(Thread.java:844)    2) Thread[id=4964, name=zkCallback-724-thread-4, state=TIMED_WAITING, group=TGRP-ChaosMonkeyNothingIsSafeTest]         at java.base@9/jdk.internal.misc.Unsafe.park(Native Method)         at java.base@9/java.util.concurrent.locks.LockSupport.parkNanos(LockSupport.java:234)         at java.base@9/java.util.concurrent.SynchronousQueue$TransferStack.awaitFulfill(SynchronousQueue.java:462)         at java.base@9/java.util.concurrent.SynchronousQueue$TransferStack.transfer(SynchronousQueue.java:361)         at java.base@9/java.util.concurrent.SynchronousQueue.poll(SynchronousQueue.java:937)         at java.base@9/java.util.concurrent.ThreadPoolExecutor.getTask(ThreadPoolExecutor.java:1085)         at java.base@9/java.util.concurrent.ThreadPoolExecutor.runWorker(ThreadPoolExecutor.java:1146)         at java.base@9/java.util.concurrent.ThreadPoolExecutor$Worker.run(ThreadPoolExecutor.java:635)         at java.base@9/java.lang.Thread.run(Thread.java:844)    3) Thread[id=4962, name=zkCallback-724-thread-2, state=TIMED_WAITING, group=TGRP-ChaosMonkeyNothingIsSafeTest]         at java.base@9/jdk.internal.misc.Unsafe.park(Native Method)         at java.base@9/java.util.concurrent.locks.LockSupport.parkNanos(LockSupport.java:234)         at java.base@9/java.util.concurrent.SynchronousQueue$TransferStack.awaitFulfill(SynchronousQueue.java:462)         at java.base@9/java.util.concurrent.SynchronousQueue$TransferStack.transfer(SynchronousQueue.java:361)         at java.base@9/java.util.concurrent.SynchronousQueue.poll(SynchronousQueue.java:937)         at java.base@9/java.util.concurrent.ThreadPoolExecutor.getTask(ThreadPoolExecutor.java:1085)         at java.base@9/java.util.concurrent.ThreadPoolExecutor.runWorker(ThreadPoolExecutor.java:1146)         at java.base@9/java.util.concurrent.ThreadPoolExecutor$Worker.run(ThreadPoolExecutor.java:635)         at java.base@9/java.lang.Thread.run(Thread.java:844)    4) Thread[id=4963, name=zkCallback-724-thread-3, state=TIMED_WAITING, group=TGRP-ChaosMonkeyNothingIsSafeTest]         at java.base@9/jdk.internal.misc.Unsafe.park(Native Method)         at java.base@9/java.util.concurrent.locks.LockSupport.parkNanos(LockSupport.java:234)         at java.base@9/java.util.concurrent.SynchronousQueue$TransferStack.awaitFulfill(SynchronousQueue.java:462)         at java.base@9/java.util.concurrent.SynchronousQueue$TransferStack.transfer(SynchronousQueue.java:361)         at java.base@9/java.util.concurrent.SynchronousQueue.poll(SynchronousQueue.java:937)         at java.base@9/java.util.concurrent.ThreadPoolExecutor.getTask(ThreadPoolExecutor.java:1085)         at java.base@9/java.util.concurrent.ThreadPoolExecutor.runWorker(ThreadPoolExecutor.java:1146)         at java.base@9/java.util.concurrent.ThreadPoolExecutor$Worker.run(ThreadPoolExecutor.java:635)         at java.base@9/java.lang.Thread.run(Thread.java:844)    5) Thread[id=4980, name=zkCallback-724-thread-5, state=TIMED_WAITING, group=TGRP-ChaosMonkeyNothingIsSafeTest]         at java.base@9/jdk.internal.misc.Unsafe.park(Native Method)         at java.base@9/java.util.concurrent.locks.LockSupport.parkNanos(LockSupport.java:234)         at java.base@9/java.util.concurrent.SynchronousQueue$TransferStack.awaitFulfill(SynchronousQueue.java:462)         at java.base@9/java.util.concurrent.SynchronousQueue$TransferStack.transfer(SynchronousQueue.java:361)         at java.base@9/java.util.concurrent.SynchronousQueue.poll(SynchronousQueue.java:937)         at java.base@9/java.util.concurrent.ThreadPoolExecutor.getTask(ThreadPoolExecutor.java:1085)         at java.base@9/java.util.concurrent.ThreadPoolExecutor.runWorker(ThreadPoolExecutor.java:1146)         at java.base@9/java.util.concurrent.ThreadPoolExecutor$Worker.run(ThreadPoolExecutor.java:635)         at java.base@9/java.lang.Thread.run(Thread.java:844)    6) Thread[id=4758, name=TEST-ChaosMonkeyNothingIsSafeTest.test-seed#[238068C853D28BA5]-SendThread(127.0.0.1:36547), state=TIMED_WAITING, group=TGRP-ChaosMonkeyNothingIsSafeTest]         at java.base@9/java.lang.Thread.sleep(Native Method)         at app//org.apache.zookeeper.client.StaticHostProvider.next(StaticHostProvider.java:101)         at app//org.apache.zookeeper.ClientCnxn$SendThread.startConnect(ClientCnxn.java:997)         at app//org.apache.zookeeper.ClientCnxn$SendThread.run(ClientCnxn.java:1060)    7) Thread[id=5097, name=zkCallback-724-thread-6, state=TIMED_WAITING, group=TGRP-ChaosMonkeyNothingIsSafeTest]         at java.base@9/jdk.internal.misc.Unsafe.park(Native Method)         at java.base@9/java.util.concurrent.locks.LockSupport.parkNanos(LockSupport.java:234)         at java.base@9/java.util.concurrent.SynchronousQueue$TransferStack.awaitFulfill(SynchronousQueue.java:462)         at java.base@9/java.util.concurrent.SynchronousQueue$TransferStack.transfer(SynchronousQueue.java:361)         at java.base@9/java.util.concurrent.SynchronousQueue.poll(SynchronousQueue.java:937)         at java.base@9/java.util.concurrent.ThreadPoolExecutor.getTask(ThreadPoolExecutor.java:1085)         at java.base@9/java.util.concurrent.ThreadPoolExecutor.runWorker(ThreadPoolExecutor.java:1146)         at java.base@9/java.util.concurrent.ThreadPoolExecutor$Worker.run(ThreadPoolExecutor.java:635)         at java.base@9/java.lang.Thread.run(Thread.java:844)

Stack Trace:
com.carrotsearch.randomizedtesting.ThreadLeakError: There are still zombie threads that couldn't be terminated:
   1) Thread[id=4760, name=zkCallback-724-thread-1, state=TIMED_WAITING, group=TGRP-ChaosMonkeyNothingIsSafeTest]
        at java.base@9/jdk.internal.misc.Unsafe.park(Native Method)
        at java.base@9/java.util.concurrent.locks.LockSupport.parkNanos(LockSupport.java:234)
        at java.base@9/java.util.concurrent.SynchronousQueue$TransferStack.awaitFulfill(SynchronousQueue.java:462)
        at java.base@9/java.util.concurrent.SynchronousQueue$TransferStack.transfer(SynchronousQueue.java:361)
        at java.base@9/java.util.concurrent.SynchronousQueue.poll(SynchronousQueue.java:937)
        at java.base@9/java.util.concurrent.ThreadPoolExecutor.getTask(ThreadPoolExecutor.java:1085)
        at java.base@9/java.util.concurrent.ThreadPoolExecutor.runWorker(ThreadPoolExecutor.java:1146)
        at java.base@9/java.util.concurrent.ThreadPoolExecutor$Worker.run(ThreadPoolExecutor.java:635)
        at java.base@9/java.lang.Thread.run(Thread.java:844)
   2) Thread[id=4964, name=zkCallback-724-thread-4, state=TIMED_WAITING, group=TGRP-ChaosMonkeyNothingIsSafeTest]
        at java.base@9/jdk.internal.misc.Unsafe.park(Native Method)
        at java.base@9/java.util.concurrent.locks.LockSupport.parkNanos(LockSupport.java:234)
        at java.base@9/java.util.concurrent.SynchronousQueue$TransferStack.awaitFulfill(SynchronousQueue.java:462)
        at java.base@9/java.util.concurrent.SynchronousQueue$TransferStack.transfer(SynchronousQueue.java:361)
        at java.base@9/java.util.concurrent.SynchronousQueue.poll(SynchronousQueue.java:937)
        at java.base@9/java.util.concurrent.ThreadPoolExecutor.getTask(ThreadPoolExecutor.java:1085)
        at java.base@9/java.util.concurrent.ThreadPoolExecutor.runWorker(ThreadPoolExecutor.java:1146)
        at java.base@9/java.util.concurrent.ThreadPoolExecutor$Worker.run(ThreadPoolExecutor.java:635)
        at java.base@9/java.lang.Thread.run(Thread.java:844)
   3) Thread[id=4962, name=zkCallback-724-thread-2, state=TIMED_WAITING, group=TGRP-ChaosMonkeyNothingIsSafeTest]
        at java.base@9/jdk.internal.misc.Unsafe.park(Native Method)
        at java.base@9/java.util.concurrent.locks.LockSupport.parkNanos(LockSupport.java:234)
        at java.base@9/java.util.concurrent.SynchronousQueue$TransferStack.awaitFulfill(SynchronousQueue.java:462)
        at java.base@9/java.util.concurrent.SynchronousQueue$TransferStack.transfer(SynchronousQueue.java:361)
        at java.base@9/java.util.concurrent.SynchronousQueue.poll(SynchronousQueue.java:937)
        at java.base@9/java.util.concurrent.ThreadPoolExecutor.getTask(ThreadPoolExecutor.java:1085)
        at java.base@9/java.util.concurrent.ThreadPoolExecutor.runWorker(ThreadPoolExecutor.java:1146)
        at java.base@9/java.util.concurrent.ThreadPoolExecutor$Worker.run(ThreadPoolExecutor.java:635)
        at java.base@9/java.lang.Thread.run(Thread.java:844)
   4) Thread[id=4963, name=zkCallback-724-thread-3, state=TIMED_WAITING, group=TGRP-ChaosMonkeyNothingIsSafeTest]
        at java.base@9/jdk.internal.misc.Unsafe.park(Native Method)
        at java.base@9/java.util.concurrent.locks.LockSupport.parkNanos(LockSupport.java:234)
        at java.base@9/java.util.concurrent.SynchronousQueue$TransferStack.awaitFulfill(SynchronousQueue.java:462)
        at java.base@9/java.util.concurrent.SynchronousQueue$TransferStack.transfer(SynchronousQueue.java:361)
        at java.base@9/java.util.concurrent.SynchronousQueue.poll(SynchronousQueue.java:937)
        at java.base@9/java.util.concurrent.ThreadPoolExecutor.getTask(ThreadPoolExecutor.java:1085)
        at java.base@9/java.util.concurrent.ThreadPoolExecutor.runWorker(ThreadPoolExecutor.java:1146)
        at java.base@9/java.util.concurrent.ThreadPoolExecutor$Worker.run(ThreadPoolExecutor.java:635)
        at java.base@9/java.lang.Thread.run(Thread.java:844)
   5) Thread[id=4980, name=zkCallback-724-thread-5, state=TIMED_WAITING, group=TGRP-ChaosMonkeyNothingIsSafeTest]
        at java.base@9/jdk.internal.misc.Unsafe.park(Native Method)
        at java.base@9/java.util.concurrent.locks.LockSupport.parkNanos(LockSupport.java:234)
        at java.base@9/java.util.concurrent.SynchronousQueue$TransferStack.awaitFulfill(SynchronousQueue.java:462)
        at java.base@9/java.util.concurrent.SynchronousQueue$TransferStack.transfer(SynchronousQueue.java:361)
        at java.base@9/java.util.concurrent.SynchronousQueue.poll(SynchronousQueue.java:937)
        at java.base@9/java.util.concurrent.ThreadPoolExecutor.getTask(ThreadPoolExecutor.java:1085)
        at java.base@9/java.util.concurrent.ThreadPoolExecutor.runWorker(ThreadPoolExecutor.java:1146)
        at java.base@9/java.util.concurrent.ThreadPoolExecutor$Worker.run(ThreadPoolExecutor.java:635)
        at java.base@9/java.lang.Thread.run(Thread.java:844)
   6) Thread[id=4758, name=TEST-ChaosMonkeyNothingIsSafeTest.test-seed#[238068C853D28BA5]-SendThread(127.0.0.1:36547), state=TIMED_WAITING, group=TGRP-ChaosMonkeyNothingIsSafeTest]
        at java.base@9/java.lang.Thread.sleep(Native Method)
        at app//org.apache.zookeeper.client.StaticHostProvider.next(StaticHostProvider.java:101)
        at app//org.apache.zookeeper.ClientCnxn$SendThread.startConnect(ClientCnxn.java:997)
        at app//org.apache.zookeeper.ClientCnxn$SendThread.run(ClientCnxn.java:1060)
   7) Thread[id=5097, name=zkCallback-724-thread-6, state=TIMED_WAITING, group=TGRP-ChaosMonkeyNothingIsSafeTest]
        at java.base@9/jdk.internal.misc.Unsafe.park(Native Method)
        at java.base@9/java.util.concurrent.locks.LockSupport.parkNanos(LockSupport.java:234)
        at java.base@9/java.util.concurrent.SynchronousQueue$TransferStack.awaitFulfill(SynchronousQueue.java:462)
        at java.base@9/java.util.concurrent.SynchronousQueue$TransferStack.transfer(SynchronousQueue.java:361)
        at java.base@9/java.util.concurrent.SynchronousQueue.poll(SynchronousQueue.java:937)
        at java.base@9/java.util.concurrent.ThreadPoolExecutor.getTask(ThreadPoolExecutor.java:1085)
        at java.base@9/java.util.concurrent.ThreadPoolExecutor.runWorker(ThreadPoolExecutor.java:1146)
        at java.base@9/java.util.concurrent.ThreadPoolExecutor$Worker.run(ThreadPoolExecutor.java:635)
        at java.base@9/java.lang.Thread.run(Thread.java:844)
	at __randomizedtesting.SeedInfo.seed([238068C853D28BA5]:0)


FAILED:  org.apache.solr.cloud.ChaosMonkeyNothingIsSafeTest.test

Error Message:
Timeout occured while waiting response from server at: http://127.0.0.1:36861/vy/qr/collection1

Stack Trace:
org.apache.solr.client.solrj.SolrServerException: Timeout occured while waiting response from server at: http://127.0.0.1:36861/vy/qr/collection1
	at __randomizedtesting.SeedInfo.seed([238068C853D28BA5:ABD45712FD2EE65D]:0)
	at org.apache.solr.client.solrj.impl.HttpSolrClient.executeMethod(HttpSolrClient.java:637)
	at org.apache.solr.client.solrj.impl.HttpSolrClient.request(HttpSolrClient.java:252)
	at org.apache.solr.client.solrj.impl.HttpSolrClient.request(HttpSolrClient.java:241)
	at org.apache.solr.client.solrj.impl.LBHttpSolrClient.doRequest(LBHttpSolrClient.java:483)
	at org.apache.solr.client.solrj.impl.LBHttpSolrClient.request(LBHttpSolrClient.java:413)
	at org.apache.solr.client.solrj.impl.CloudSolrClient.sendRequest(CloudSolrClient.java:1121)
	at org.apache.solr.client.solrj.impl.CloudSolrClient.requestWithRetryOnStaleState(CloudSolrClient.java:862)
	at org.apache.solr.client.solrj.impl.CloudSolrClient.request(CloudSolrClient.java:793)
	at org.apache.solr.client.solrj.SolrRequest.process(SolrRequest.java:178)
	at org.apache.solr.client.solrj.SolrClient.commit(SolrClient.java:484)
	at org.apache.solr.client.solrj.SolrClient.commit(SolrClient.java:463)
	at org.apache.solr.cloud.AbstractFullDistribZkTestBase.commit(AbstractFullDistribZkTestBase.java:1583)
	at org.apache.solr.cloud.ChaosMonkeyNothingIsSafeTest.test(ChaosMonkeyNothingIsSafeTest.java:213)
	at java.base/jdk.internal.reflect.NativeMethodAccessorImpl.invoke0(Native Method)
	at java.base/jdk.internal.reflect.NativeMethodAccessorImpl.invoke(NativeMethodAccessorImpl.java:62)
	at java.base/jdk.internal.reflect.DelegatingMethodAccessorImpl.invoke(DelegatingMethodAccessorImpl.java:43)
	at java.base/java.lang.reflect.Method.invoke(Method.java:564)
	at com.carrotsearch.randomizedtesting.RandomizedRunner.invoke(RandomizedRunner.java:1713)
	at com.carrotsearch.randomizedtesting.RandomizedRunner$8.evaluate(RandomizedRunner.java:907)
	at com.carrotsearch.randomizedtesting.RandomizedRunner$9.evaluate(RandomizedRunner.java:943)
	at com.carrotsearch.randomizedtesting.RandomizedRunner$10.evaluate(RandomizedRunner.java:957)
	at org.apache.solr.BaseDistributedSearchTestCase$ShardsRepeatRule$ShardsFixedStatement.callStatement(BaseDistributedSearchTestCase.java:993)
	at org.apache.solr.BaseDistributedSearchTestCase$ShardsRepeatRule$ShardsStatement.evaluate(BaseDistributedSearchTestCase.java:968)
	at com.carrotsearch.randomizedtesting.rules.SystemPropertiesRestoreRule$1.evaluate(SystemPropertiesRestoreRule.java:57)
	at org.apache.lucene.util.TestRuleSetupTeardownChained$1.evaluate(TestRuleSetupTeardownChained.java:49)
	at org.apache.lucene.util.AbstractBeforeAfterRule$1.evaluate(AbstractBeforeAfterRule.java:45)
	at org.apache.lucene.util.TestRuleThreadAndTestName$1.evaluate(TestRuleThreadAndTestName.java:48)
	at org.apache.lucene.util.TestRuleIgnoreAfterMaxFailures$1.evaluate(TestRuleIgnoreAfterMaxFailures.java:64)
	at org.apache.lucene.util.TestRuleMarkFailure$1.evaluate(TestRuleMarkFailure.java:47)
	at com.carrotsearch.randomizedtesting.rules.StatementAdapter.evaluate(StatementAdapter.java:36)
	at com.carrotsearch.randomizedtesting.ThreadLeakControl$StatementRunner.run(ThreadLeakControl.java:368)
	at com.carrotsearch.randomizedtesting.ThreadLeakControl.forkTimeoutingTask(ThreadLeakControl.java:817)
	at com.carrotsearch.randomizedtesting.ThreadLeakControl$3.evaluate(ThreadLeakControl.java:468)
	at com.carrotsearch.randomizedtesting.RandomizedRunner.runSingleTest(RandomizedRunner.java:916)
	at com.carrotsearch.randomizedtesting.RandomizedRunner$5.evaluate(RandomizedRunner.java:802)
	at com.carrotsearch.randomizedtesting.RandomizedRunner$6.evaluate(RandomizedRunner.java:852)
	at com.carrotsearch.randomizedtesting.RandomizedRunner$7.evaluate(RandomizedRunner.java:863)
	at com.carrotsearch.randomizedtesting.rules.StatementAdapter.evaluate(StatementAdapter.java:36)
	at com.carrotsearch.randomizedtesting.rules.SystemPropertiesRestoreRule$1.evaluate(SystemPropertiesRestoreRule.java:57)
	at org.apache.lucene.util.AbstractBeforeAfterRule$1.evaluate(AbstractBeforeAfterRule.java:45)
	at com.carrotsearch.randomizedtesting.rules.StatementAdapter.evaluate(StatementAdapter.java:36)
	at org.apache.lucene.util.TestRuleStoreClassName$1.evaluate(TestRuleStoreClassName.java:41)
	at com.carrotsearch.randomizedtesting.rules.NoShadowingOrOverridesOnMethodsRule$1.evaluate(NoShadowingOrOverridesOnMethodsRule.java:40)
	at com.carrotsearch.randomizedtesting.rules.NoShadowingOrOverridesOnMethodsRule$1.evaluate(NoShadowingOrOverridesOnMethodsRule.java:40)
	at com.carrotsearch.randomizedtesting.rules.StatementAdapter.evaluate(StatementAdapter.java:36)
	at com.carrotsearch.randomizedtesting.rules.StatementAdapter.evaluate(StatementAdapter.java:36)
	at org.apache.lucene.util.TestRuleAssertionsRequired$1.evaluate(TestRuleAssertionsRequired.java:53)
	at org.apache.lucene.util.TestRuleMarkFailure$1.evaluate(TestRuleMarkFailure.java:47)
	at org.apache.lucene.util.TestRuleIgnoreAfterMaxFailures$1.evaluate(TestRuleIgnoreAfterMaxFailures.java:64)
	at org.apache.lucene.util.TestRuleIgnoreTestSuites$1.evaluate(TestRuleIgnoreTestSuites.java:54)
	at com.carrotsearch.randomizedtesting.rules.StatementAdapter.evaluate(StatementAdapter.java:36)
	at com.carrotsearch.randomizedtesting.ThreadLeakControl$StatementRunner.run(ThreadLeakControl.java:368)
	at java.base/java.lang.Thread.run(Thread.java:844)
Caused by: java.net.SocketTimeoutException: Read timed out
	at java.base/java.net.SocketInputStream.socketRead0(Native Method)
	at java.base/java.net.SocketInputStream.socketRead(SocketInputStream.java:116)
	at java.base/java.net.SocketInputStream.read(SocketInputStream.java:171)
	at java.base/java.net.SocketInputStream.read(SocketInputStream.java:141)
	at org.apache.http.impl.io.SessionInputBufferImpl.streamRead(SessionInputBufferImpl.java:139)
	at org.apache.http.impl.io.SessionInputBufferImpl.fillBuffer(SessionInputBufferImpl.java:155)
	at org.apache.http.impl.io.SessionInputBufferImpl.readLine(SessionInputBufferImpl.java:284)
	at org.apache.http.impl.conn.DefaultHttpResponseParser.parseHead(DefaultHttpResponseParser.java:140)
	at org.apache.http.impl.conn.DefaultHttpResponseParser.parseHead(DefaultHttpResponseParser.java:57)
	at org.apache.http.impl.io.AbstractMessageParser.parse(AbstractMessageParser.java:261)
	at org.apache.http.impl.DefaultBHttpClientConnection.receiveResponseHeader(DefaultBHttpClientConnection.java:165)
	at org.apache.http.impl.conn.CPoolProxy.receiveResponseHeader(CPoolProxy.java:167)
	at org.apache.http.protocol.HttpRequestExecutor.doReceiveResponse(HttpRequestExecutor.java:272)
	at org.apache.http.protocol.HttpRequestExecutor.execute(HttpRequestExecutor.java:124)
	at org.apache.http.impl.execchain.MainClientExec.execute(MainClientExec.java:271)
	at org.apache.http.impl.execchain.ProtocolExec.execute(ProtocolExec.java:184)
	at org.apache.http.impl.execchain.RetryExec.execute(RetryExec.java:88)
	at org.apache.http.impl.execchain.RedirectExec.execute(RedirectExec.java:110)
	at org.apache.http.impl.client.InternalHttpClient.doExecute(InternalHttpClient.java:184)
	at org.apache.http.impl.client.CloseableHttpClient.execute(CloseableHttpClient.java:82)
	at org.apache.http.impl.client.CloseableHttpClient.execute(CloseableHttpClient.java:55)
	at org.apache.solr.client.solrj.impl.HttpSolrClient.executeMethod(HttpSolrClient.java:523)
	... 52 more




Build Log:
[...truncated 11548 lines...]
   [junit4] Suite: org.apache.solr.cloud.ChaosMonkeyNothingIsSafeTest
   [junit4]   2> Creating dataDir: /home/jenkins/workspace/Lucene-Solr-7.0-Linux/solr/build/solr-core/test/J0/temp/solr.cloud.ChaosMonkeyNothingIsSafeTest_238068C853D28BA5-001/init-core-data-001
   [junit4]   2> 667997 WARN  (SUITE-ChaosMonkeyNothingIsSafeTest-seed#[238068C853D28BA5]-worker) [    ] o.a.s.SolrTestCaseJ4 startTrackingSearchers: numOpens=1 numCloses=1
   [junit4]   2> 667997 INFO  (SUITE-ChaosMonkeyNothingIsSafeTest-seed#[238068C853D28BA5]-worker) [    ] o.a.s.SolrTestCaseJ4 Using PointFields (NUMERIC_POINTS_SYSPROP=true) w/NUMERIC_DOCVALUES_SYSPROP=true
   [junit4]   2> 667998 INFO  (SUITE-ChaosMonkeyNothingIsSafeTest-seed#[238068C853D28BA5]-worker) [    ] o.a.s.SolrTestCaseJ4 Randomized ssl (false) and clientAuth (false) via: @org.apache.solr.SolrTestCaseJ4$SuppressSSL(bugUrl="https://issues.apache.org/jira/browse/SOLR-5776")
   [junit4]   2> 667998 INFO  (SUITE-ChaosMonkeyNothingIsSafeTest-seed#[238068C853D28BA5]-worker) [    ] o.a.s.BaseDistributedSearchTestCase Setting hostContext system property: /vy/qr
   [junit4]   2> 668000 INFO  (TEST-ChaosMonkeyNothingIsSafeTest.test-seed#[238068C853D28BA5]) [    ] o.a.s.c.ZkTestServer STARTING ZK TEST SERVER
   [junit4]   2> 668000 INFO  (Thread-1104) [    ] o.a.s.c.ZkTestServer client port:0.0.0.0/0.0.0.0:0
   [junit4]   2> 668000 INFO  (Thread-1104) [    ] o.a.s.c.ZkTestServer Starting server
   [junit4]   2> 668011 ERROR (Thread-1104) [    ] o.a.z.s.ZooKeeperServer ZKShutdownHandler is not registered, so ZooKeeper server won't take any action on ERROR or SHUTDOWN server state changes
   [junit4]   2> 668100 INFO  (TEST-ChaosMonkeyNothingIsSafeTest.test-seed#[238068C853D28BA5]) [    ] o.a.s.c.ZkTestServer start zk server on port:36547
   [junit4]   2> 668130 INFO  (TEST-ChaosMonkeyNothingIsSafeTest.test-seed#[238068C853D28BA5]) [    ] o.a.s.c.AbstractZkTestCase put /home/jenkins/workspace/Lucene-Solr-7.0-Linux/solr/core/src/test-files/solr/collection1/conf/solrconfig-tlog.xml to /configs/conf1/solrconfig.xml
   [junit4]   2> 668131 INFO  (TEST-ChaosMonkeyNothingIsSafeTest.test-seed#[238068C853D28BA5]) [    ] o.a.s.c.AbstractZkTestCase put /home/jenkins/workspace/Lucene-Solr-7.0-Linux/solr/core/src/test-files/solr/collection1/conf/schema15.xml to /configs/conf1/schema.xml
   [junit4]   2> 668131 INFO  (TEST-ChaosMonkeyNothingIsSafeTest.test-seed#[238068C853D28BA5]) [    ] o.a.s.c.AbstractZkTestCase put /home/jenkins/workspace/Lucene-Solr-7.0-Linux/solr/core/src/test-files/solr/collection1/conf/solrconfig.snippet.randomindexconfig.xml to /configs/conf1/solrconfig.snippet.randomindexconfig.xml
   [junit4]   2> 668132 INFO  (TEST-ChaosMonkeyNothingIsSafeTest.test-seed#[238068C853D28BA5]) [    ] o.a.s.c.AbstractZkTestCase put /home/jenkins/workspace/Lucene-Solr-7.0-Linux/solr/core/src/test-files/solr/collection1/conf/stopwords.txt to /configs/conf1/stopwords.txt
   [junit4]   2> 668132 INFO  (TEST-ChaosMonkeyNothingIsSafeTest.test-seed#[238068C853D28BA5]) [    ] o.a.s.c.AbstractZkTestCase put /home/jenkins/workspace/Lucene-Solr-7.0-Linux/solr/core/src/test-files/solr/collection1/conf/protwords.txt to /configs/conf1/protwords.txt
   [junit4]   2> 668133 INFO  (TEST-ChaosMonkeyNothingIsSafeTest.test-seed#[238068C853D28BA5]) [    ] o.a.s.c.AbstractZkTestCase put /home/jenkins/workspace/Lucene-Solr-7.0-Linux/solr/core/src/test-files/solr/collection1/conf/currency.xml to /configs/conf1/currency.xml
   [junit4]   2> 668133 INFO  (TEST-ChaosMonkeyNothingIsSafeTest.test-seed#[238068C853D28BA5]) [    ] o.a.s.c.AbstractZkTestCase put /home/jenkins/workspace/Lucene-Solr-7.0-Linux/solr/core/src/test-files/solr/collection1/conf/enumsConfig.xml to /configs/conf1/enumsConfig.xml
   [junit4]   2> 668134 INFO  (TEST-ChaosMonkeyNothingIsSafeTest.test-seed#[238068C853D28BA5]) [    ] o.a.s.c.AbstractZkTestCase put /home/jenkins/workspace/Lucene-Solr-7.0-Linux/solr/core/src/test-files/solr/collection1/conf/open-exchange-rates.json to /configs/conf1/open-exchange-rates.json
   [junit4]   2> 668135 INFO  (TEST-ChaosMonkeyNothingIsSafeTest.test-seed#[238068C853D28BA5]) [    ] o.a.s.c.AbstractZkTestCase put /home/jenkins/workspace/Lucene-Solr-7.0-Linux/solr/core/src/test-files/solr/collection1/conf/mapping-ISOLatin1Accent.txt to /configs/conf1/mapping-ISOLatin1Accent.txt
   [junit4]   2> 668135 INFO  (TEST-ChaosMonkeyNothingIsSafeTest.test-seed#[238068C853D28BA5]) [    ] o.a.s.c.AbstractZkTestCase put /home/jenkins/workspace/Lucene-Solr-7.0-Linux/solr/core/src/test-files/solr/collection1/conf/old_synonyms.txt to /configs/conf1/old_synonyms.txt
   [junit4]   2> 668136 INFO  (TEST-ChaosMonkeyNothingIsSafeTest.test-seed#[238068C853D28BA5]) [    ] o.a.s.c.AbstractZkTestCase put /home/jenkins/workspace/Lucene-Solr-7.0-Linux/solr/core/src/test-files/solr/collection1/conf/synonyms.txt to /configs/conf1/synonyms.txt
   [junit4]   2> 668136 INFO  (TEST-ChaosMonkeyNothingIsSafeTest.test-seed#[238068C853D28BA5]) [    ] o.a.s.c.AbstractFullDistribZkTestBase Will use TLOG replicas unless explicitly asked otherwise
   [junit4]   2> 668228 INFO  (TEST-ChaosMonkeyNothingIsSafeTest.test-seed#[238068C853D28BA5]) [    ] o.e.j.s.Server jetty-9.3.14.v20161028
   [junit4]   2> 668251 INFO  (TEST-ChaosMonkeyNothingIsSafeTest.test-seed#[238068C853D28BA5]) [    ] o.e.j.s.h.ContextHandler Started o.e.j.s.ServletContextHandler@ea9e14{/vy/qr,null,AVAILABLE}
   [junit4]   2> 668253 INFO  (TEST-ChaosMonkeyNothingIsSafeTest.test-seed#[238068C853D28BA5]) [    ] o.e.j.s.AbstractConnector Started ServerConnector@36dd39{HTTP/1.1,[http/1.1]}{127.0.0.1:46163}
   [junit4]   2> 668253 INFO  (TEST-ChaosMonkeyNothingIsSafeTest.test-seed#[238068C853D28BA5]) [    ] o.e.j.s.Server Started @669171ms
   [junit4]   2> 668254 INFO  (TEST-ChaosMonkeyNothingIsSafeTest.test-seed#[238068C853D28BA5]) [    ] o.a.s.c.s.e.JettySolrRunner Jetty properties: {hostContext=/vy/qr, solr.data.dir=/home/jenkins/workspace/Lucene-Solr-7.0-Linux/solr/build/solr-core/test/J0/temp/solr.cloud.ChaosMonkeyNothingIsSafeTest_238068C853D28BA5-001/tempDir-001/control/data, hostPort=46163, coreRootDirectory=/home/jenkins/workspace/Lucene-Solr-7.0-Linux/solr/build/solr-core/test/J0/../../../../../../../../../home/jenkins/workspace/Lucene-Solr-7.0-Linux/solr/build/solr-core/test/J0/temp/solr.cloud.ChaosMonkeyNothingIsSafeTest_238068C853D28BA5-001/control-001/cores, replicaType=NRT}
   [junit4]   2> 668254 ERROR (TEST-ChaosMonkeyNothingIsSafeTest.test-seed#[238068C853D28BA5]) [    ] o.a.s.s.StartupLoggingUtils Missing Java Option solr.log.dir. Logging may be missing or incomplete.
   [junit4]   2> 668254 INFO  (TEST-ChaosMonkeyNothingIsSafeTest.test-seed#[238068C853D28BA5]) [    ] o.a.s.s.SolrDispatchFilter  ___      _       Welcome to Apache Solr™ version 7.0.0
   [junit4]   2> 668254 INFO  (TEST-ChaosMonkeyNothingIsSafeTest.test-seed#[238068C853D28BA5]) [    ] o.a.s.s.SolrDispatchFilter / __| ___| |_ _   Starting in cloud mode on port null
   [junit4]   2> 668254 INFO  (TEST-ChaosMonkeyNothingIsSafeTest.test-seed#[238068C853D28BA5]) [    ] o.a.s.s.SolrDispatchFilter \__ \/ _ \ | '_|  Install dir: null, Default config dir: null
   [junit4]   2> 668254 INFO  (TEST-ChaosMonkeyNothingIsSafeTest.test-seed#[238068C853D28BA5]) [    ] o.a.s.s.SolrDispatchFilter |___/\___/_|_|    Start time: 2017-08-03T22:03:45.650645Z
   [junit4]   2> 668257 INFO  (TEST-ChaosMonkeyNothingIsSafeTest.test-seed#[238068C853D28BA5]) [    ] o.a.s.s.SolrDispatchFilter Loading solr.xml from SolrHome (not found in ZooKeeper)
   [junit4]   2> 668257 INFO  (TEST-ChaosMonkeyNothingIsSafeTest.test-seed#[238068C853D28BA5]) [    ] o.a.s.c.SolrXmlConfig Loading container configuration from /home/jenkins/workspace/Lucene-Solr-7.0-Linux/solr/build/solr-core/test/J0/temp/solr.cloud.ChaosMonkeyNothingIsSafeTest_238068C853D28BA5-001/control-001/solr.xml
   [junit4]   2> 668266 INFO  (TEST-ChaosMonkeyNothingIsSafeTest.test-seed#[238068C853D28BA5]) [    ] o.a.s.c.SolrXmlConfig MBean server found: com.sun.jmx.mbeanserver.JmxMBeanServer@79148e, but no JMX reporters were configured - adding default JMX reporter.
   [junit4]   2> 668269 INFO  (TEST-ChaosMonkeyNothingIsSafeTest.test-seed#[238068C853D28BA5]) [    ] o.a.s.c.ZkContainer Zookeeper client=127.0.0.1:36547/solr
   [junit4]   2> 668308 INFO  (TEST-ChaosMonkeyNothingIsSafeTest.test-seed#[238068C853D28BA5]) [    ] o.a.s.c.Overseer Overseer (id=null) closing
   [junit4]   2> 668308 INFO  (TEST-ChaosMonkeyNothingIsSafeTest.test-seed#[238068C853D28BA5]) [    ] o.a.s.c.OverseerElectionContext I am going to be the leader 127.0.0.1:46163_vy%2Fqr
   [junit4]   2> 668309 INFO  (TEST-ChaosMonkeyNothingIsSafeTest.test-seed#[238068C853D28BA5]) [    ] o.a.s.c.Overseer Overseer (id=98421822285414404-127.0.0.1:46163_vy%2Fqr-n_0000000000) starting
   [junit4]   2> 668311 INFO  (TEST-ChaosMonkeyNothingIsSafeTest.test-seed#[238068C853D28BA5]) [    ] o.a.s.c.ZkController Register node as live in ZooKeeper:/live_nodes/127.0.0.1:46163_vy%2Fqr
   [junit4]   2> 668312 INFO  (zkCallback-717-thread-1) [    ] o.a.s.c.c.ZkStateReader Updated live nodes from ZooKeeper... (0) -> (1)
   [junit4]   2> 668389 INFO  (TEST-ChaosMonkeyNothingIsSafeTest.test-seed#[238068C853D28BA5]) [    ] o.a.s.m.r.SolrJmxReporter JMX monitoring for 'solr.node' (registry 'solr.node') enabled at server: com.sun.jmx.mbeanserver.JmxMBeanServer@79148e
   [junit4]   2> 668392 INFO  (TEST-ChaosMonkeyNothingIsSafeTest.test-seed#[238068C853D28BA5]) [    ] o.a.s.m.r.SolrJmxReporter JMX monitoring for 'solr.jvm' (registry 'solr.jvm') enabled at server: com.sun.jmx.mbeanserver.JmxMBeanServer@79148e
   [junit4]   2> 668392 INFO  (TEST-ChaosMonkeyNothingIsSafeTest.test-seed#[238068C853D28BA5]) [    ] o.a.s.m.r.SolrJmxReporter JMX monitoring for 'solr.jetty' (registry 'solr.jetty') enabled at server: com.sun.jmx.mbeanserver.JmxMBeanServer@79148e
   [junit4]   2> 668393 INFO  (TEST-ChaosMonkeyNothingIsSafeTest.test-seed#[238068C853D28BA5]) [    ] o.a.s.c.CorePropertiesLocator Found 0 core definitions underneath /home/jenkins/workspace/Lucene-Solr-7.0-Linux/solr/build/solr-core/test/J0/../../../../../../../../../home/jenkins/workspace/Lucene-Solr-7.0-Linux/solr/build/solr-core/test/J0/temp/solr.cloud.ChaosMonkeyNothingIsSafeTest_238068C853D28BA5-001/control-001/cores
   [junit4]   2> 668402 INFO  (TEST-ChaosMonkeyNothingIsSafeTest.test-seed#[238068C853D28BA5]) [    ] o.a.s.c.c.ZkStateReader Updated live nodes from ZooKeeper... (0) -> (1)
   [junit4]   2> 668402 INFO  (TEST-ChaosMonkeyNothingIsSafeTest.test-seed#[238068C853D28BA5]) [    ] o.a.s.c.s.i.ZkClientClusterStateProvider Cluster at 127.0.0.1:36547/solr ready
   [junit4]   2> 668403 INFO  (qtp28713218-4727) [    ] o.a.s.h.a.CollectionsHandler Invoked Collection Action :create with params replicationFactor=1&collection.configName=conf1&name=control_collection&nrtReplicas=1&action=CREATE&numShards=1&createNodeSet=127.0.0.1:46163_vy%252Fqr&wt=javabin&version=2 and sendToOCPQueue=true
   [junit4]   2> 668404 INFO  (OverseerThreadFactory-1676-thread-1) [    ] o.a.s.c.CreateCollectionCmd Create collection control_collection
   [junit4]   2> 668507 INFO  (qtp28713218-4728) [    ] o.a.s.h.a.CoreAdminOperation core create command qt=/admin/cores&collection.configName=conf1&newCollection=true&name=control_collection_shard1_replica_n1&action=CREATE&numShards=1&collection=control_collection&shard=shard1&wt=javabin&version=2&replicaType=NRT
   [junit4]   2> 668507 INFO  (qtp28713218-4728) [    ] o.a.s.c.TransientSolrCoreCacheDefault Allocating transient cache for 4 transient cores
   [junit4]   2> 668608 INFO  (zkCallback-717-thread-1) [    ] o.a.s.c.c.ZkStateReader A cluster state change: [WatchedEvent state:SyncConnected type:NodeDataChanged path:/collections/control_collection/state.json] for collection [control_collection] has occurred - updating... (live nodes size: [1])
   [junit4]   2> 669514 INFO  (qtp28713218-4728) [    ] o.a.s.c.SolrConfig Using Lucene MatchVersion: 7.0.0
   [junit4]   2> 669522 INFO  (qtp28713218-4728) [    ] o.a.s.s.IndexSchema [control_collection_shard1_replica_n1] Schema name=test
   [junit4]   2> 669569 INFO  (qtp28713218-4728) [    ] o.a.s.s.IndexSchema Loaded schema test/1.6 with uniqueid field id
   [junit4]   2> 669575 INFO  (qtp28713218-4728) [    ] o.a.s.c.CoreContainer Creating SolrCore 'control_collection_shard1_replica_n1' using configuration from collection control_collection, trusted=true
   [junit4]   2> 669576 INFO  (qtp28713218-4728) [    ] o.a.s.m.r.SolrJmxReporter JMX monitoring for 'solr.core.control_collection.shard1.replica_n1' (registry 'solr.core.control_collection.shard1.replica_n1') enabled at server: com.sun.jmx.mbeanserver.JmxMBeanServer@79148e
   [junit4]   2> 669576 INFO  (qtp28713218-4728) [    ] o.a.s.c.SolrCore solr.RecoveryStrategy.Builder
   [junit4]   2> 669576 INFO  (qtp28713218-4728) [    ] o.a.s.c.SolrCore [[control_collection_shard1_replica_n1] ] Opening new SolrCore at [/home/jenkins/workspace/Lucene-Solr-7.0-Linux/solr/build/solr-core/test/J0/temp/solr.cloud.ChaosMonkeyNothingIsSafeTest_238068C853D28BA5-001/control-001/cores/control_collection_shard1_replica_n1], dataDir=[/home/jenkins/workspace/Lucene-Solr-7.0-Linux/solr/build/solr-core/test/J0/../../../../../../../../../home/jenkins/workspace/Lucene-Solr-7.0-Linux/solr/build/solr-core/test/J0/temp/solr.cloud.ChaosMonkeyNothingIsSafeTest_238068C853D28BA5-001/control-001/cores/control_collection_shard1_replica_n1/data/]
   [junit4]   2> 669579 INFO  (qtp28713218-4728) [    ] o.a.s.u.RandomMergePolicy RandomMergePolicy wrapping class org.apache.lucene.index.TieredMergePolicy: [TieredMergePolicy: maxMergeAtOnce=25, maxMergeAtOnceExplicit=29, maxMergedSegmentMB=85.689453125, floorSegmentMB=0.5048828125, forceMergeDeletesPctAllowed=24.820334415966023, segmentsPerTier=24.0, maxCFSSegmentSizeMB=8.796093022207999E12, noCFSRatio=1.0
   [junit4]   2> 669640 WARN  (qtp28713218-4728) [    ] o.a.s.c.RequestHandlers INVALID paramSet a in requestHandler {type = requestHandler,name = /dump,class = DumpRequestHandler,attributes = {initParams=a, name=/dump, class=DumpRequestHandler},args = {defaults={a=A,b=B}}}
   [junit4]   2> 669688 INFO  (qtp28713218-4728) [    ] o.a.s.u.UpdateHandler Using UpdateLog implementation: org.apache.solr.update.UpdateLog
   [junit4]   2> 669688 INFO  (qtp28713218-4728) [    ] o.a.s.u.UpdateLog Initializing UpdateLog: dataDir= defaultSyncLevel=FLUSH numRecordsToKeep=100 maxNumLogsToKeep=10 numVersionBuckets=65536
   [junit4]   2> 669689 INFO  (qtp28713218-4728) [    ] o.a.s.u.CommitTracker Hard AutoCommit: if uncommited for 15000ms; 
   [junit4]   2> 669689 INFO  (qtp28713218-4728) [    ] o.a.s.u.CommitTracker Soft AutoCommit: disabled
   [junit4]   2> 669691 INFO  (qtp28713218-4728) [    ] o.a.s.u.RandomMergePolicy RandomMergePolicy wrapping class org.apache.lucene.index.TieredMergePolicy: [TieredMergePolicy: maxMergeAtOnce=41, maxMergeAtOnceExplicit=10, maxMergedSegmentMB=19.4287109375, floorSegmentMB=2.17578125, forceMergeDeletesPctAllowed=10.860144471534452, segmentsPerTier=13.0, maxCFSSegmentSizeMB=8.796093022207999E12, noCFSRatio=0.3762927445485478
   [junit4]   2> 669692 INFO  (qtp28713218-4728) [    ] o.a.s.s.SolrIndexSearcher Opening [Searcher@12e697c[control_collection_shard1_replica_n1] main]
   [junit4]   2> 669708 INFO  (qtp28713218-4728) [    ] o.a.s.r.ManagedResourceStorage Configured ZooKeeperStorageIO with znodeBase: /configs/conf1
   [junit4]   2> 669708 INFO  (qtp28713218-4728) [    ] o.a.s.r.ManagedResourceStorage Loaded null at path _rest_managed.json using ZooKeeperStorageIO:path=/configs/conf1
   [junit4]   2> 669709 INFO  (qtp28713218-4728) [    ] o.a.s.h.ReplicationHandler Commits will be reserved for  10000
   [junit4]   2> 669710 INFO  (searcherExecutor-1679-thread-1) [    ] o.a.s.c.SolrCore [control_collection_shard1_replica_n1] Registered new searcher Searcher@12e697c[control_collection_shard1_replica_n1] main{ExitableDirectoryReader(UninvertingDirectoryReader())}
   [junit4]   2> 669710 INFO  (qtp28713218-4728) [    ] o.a.s.u.UpdateLog Could not find max version in index or recent updates, using new clock 1574749158355501056
   [junit4]   2> 669713 INFO  (qtp28713218-4728) [    ] o.a.s.c.ShardLeaderElectionContext Enough replicas found to continue.
   [junit4]   2> 669713 INFO  (qtp28713218-4728) [    ] o.a.s.c.ShardLeaderElectionContext I may be the new leader - try and sync
   [junit4]   2> 669713 INFO  (qtp28713218-4728) [    ] o.a.s.c.SyncStrategy Sync replicas to http://127.0.0.1:46163/vy/qr/control_collection_shard1_replica_n1/
   [junit4]   2> 669713 INFO  (qtp28713218-4728) [    ] o.a.s.c.SyncStrategy Sync Success - now sync replicas to me
   [junit4]   2> 669713 INFO  (qtp28713218-4728) [    ] o.a.s.c.SyncStrategy http://127.0.0.1:46163/vy/qr/control_collection_shard1_replica_n1/ has no replicas
   [junit4]   2> 669713 INFO  (qtp28713218-4728) [    ] o.a.s.c.ShardLeaderElectionContext Found all replicas participating in election, clear LIR
   [junit4]   2> 669714 INFO  (qtp28713218-4728) [    ] o.a.s.c.ShardLeaderElectionContext I am the new leader: http://127.0.0.1:46163/vy/qr/control_collection_shard1_replica_n1/ shard1
   [junit4]   2> 669815 INFO  (zkCallback-717-thread-1) [    ] o.a.s.c.c.ZkStateReader A cluster state change: [WatchedEvent state:SyncConnected type:NodeDataChanged path:/collections/control_collection/state.json] for collection [control_collection] has occurred - updating... (live nodes size: [1])
   [junit4]   2> 669864 INFO  (qtp28713218-4728) [    ] o.a.s.c.ZkController I am the leader, no recovery necessary
   [junit4]   2> 669865 INFO  (qtp28713218-4728) [    ] o.a.s.s.HttpSolrCall [admin] webapp=null path=/admin/cores params={qt=/admin/cores&collection.configName=conf1&newCollection=true&name=control_collection_shard1_replica_n1&action=CREATE&numShards=1&collection=control_collection&shard=shard1&wt=javabin&version=2&replicaType=NRT} status=0 QTime=1359
   [junit4]   2> 669869 INFO  (qtp28713218-4727) [    ] o.a.s.h.a.CollectionsHandler Wait for new collection to be active for at most 30 seconds. Check all shard replicas
   [junit4]   2> 669971 INFO  (zkCallback-717-thread-1) [    ] o.a.s.c.c.ZkStateReader A cluster state change: [WatchedEvent state:SyncConnected type:NodeDataChanged path:/collections/control_collection/state.json] for collection [control_collection] has occurred - updating... (live nodes size: [1])
   [junit4]   2> 670408 INFO  (OverseerCollectionConfigSetProcessor-98421822285414404-127.0.0.1:46163_vy%2Fqr-n_0000000000) [    ] o.a.s.c.OverseerTaskQueue Response ZK path: /overseer/collection-queue-work/qnr-0000000000 doesn't exist.  Requestor may have disconnected from ZooKeeper
   [junit4]   2> 670869 INFO  (qtp28713218-4727) [    ] o.a.s.s.HttpSolrCall [admin] webapp=null path=/admin/collections params={replicationFactor=1&collection.configName=conf1&name=control_collection&nrtReplicas=1&action=CREATE&numShards=1&createNodeSet=127.0.0.1:46163_vy%252Fqr&wt=javabin&version=2} status=0 QTime=2465
   [junit4]   2> 670885 INFO  (TEST-ChaosMonkeyNothingIsSafeTest.test-seed#[238068C853D28BA5]) [    ] o.a.s.c.c.ZkStateReader Updated live nodes from ZooKeeper... (0) -> (1)
   [junit4]   2> 670886 INFO  (TEST-ChaosMonkeyNothingIsSafeTest.test-seed#[238068C853D28BA5]) [    ] o.a.s.c.s.i.ZkClientClusterStateProvider Cluster at 127.0.0.1:36547/solr ready
   [junit4]   2> 670886 INFO  (TEST-ChaosMonkeyNothingIsSafeTest.test-seed#[238068C853D28BA5]) [    ] o.a.s.c.ChaosMonkey monkey: init - expire sessions:false cause connection loss:false
   [junit4]   2> 670887 INFO  (qtp28713218-4728) [    ] o.a.s.h.a.CollectionsHandler Invoked Collection Action :create with params replicationFactor=1&collection.configName=conf1&name=collection1&nrtReplicas=1&action=CREATE&numShards=3&createNodeSet=&stateFormat=2&wt=javabin&version=2 and sendToOCPQueue=true
   [junit4]   2> 670893 INFO  (OverseerThreadFactory-1676-thread-2) [    ] o.a.s.c.CreateCollectionCmd Create collection collection1
   [junit4]   2> 670894 WARN  (OverseerThreadFactory-1676-thread-2) [    ] o.a.s.c.CreateCollectionCmd It is unusual to create a collection (collection1) without cores.
   [junit4]   2> 671096 INFO  (qtp28713218-4728) [    ] o.a.s.h.a.CollectionsHandler Wait for new collection to be active for at most 30 seconds. Check all shard replicas
   [junit4]   2> 671097 INFO  (qtp28713218-4728) [    ] o.a.s.s.HttpSolrCall [admin] webapp=null path=/admin/collections params={replicationFactor=1&collection.configName=conf1&name=collection1&nrtReplicas=1&action=CREATE&numShards=3&createNodeSet=&stateFormat=2&wt=javabin&version=2} status=0 QTime=210
   [junit4]   2> 671217 INFO  (TEST-ChaosMonkeyNothingIsSafeTest.test-seed#[238068C853D28BA5]) [    ] o.a.s.c.AbstractFullDistribZkTestBase create jetty 1 in directory /home/jenkins/workspace/Lucene-Solr-7.0-Linux/solr/build/solr-core/test/J0/temp/solr.cloud.ChaosMonkeyNothingIsSafeTest_238068C853D28BA5-001/shard-1-001 of type TLOG
   [junit4]   2> 671221 INFO  (TEST-ChaosMonkeyNothingIsSafeTest.test-seed#[238068C853D28BA5]) [    ] o.e.j.s.Server jetty-9.3.14.v20161028
   [junit4]   2> 671222 INFO  (TEST-ChaosMonkeyNothingIsSafeTest.test-seed#[238068C853D28BA5]) [    ] o.e.j.s.h.ContextHandler Started o.e.j.s.ServletContextHandler@a3fefc{/vy/qr,null,AVAILABLE}
   [junit4]   2> 671223 INFO  (TEST-ChaosMonkeyNothingIsSafeTest.test-seed#[238068C853D28BA5]) [    ] o.e.j.s.AbstractConnector Started ServerConnector@2c534a{HTTP/1.1,[http/1.1]}{127.0.0.1:41575}
   [junit4]   2> 671223 INFO  (TEST-ChaosMonkeyNothingIsSafeTest.test-seed#[238068C853D28BA5]) [    ] o.e.j.s.Server Started @672141ms
   [junit4]   2> 671223 INFO  (TEST-ChaosMonkeyNothingIsSafeTest.test-seed#[238068C853D28BA5]) [    ] o.a.s.c.s.e.JettySolrRunner Jetty properties: {hostContext=/vy/qr, solrconfig=solrconfig.xml, solr.data.dir=/home/jenkins/workspace/Lucene-Solr-7.0-Linux/solr/build/solr-core/test/J0/temp/solr.cloud.ChaosMonkeyNothingIsSafeTest_238068C853D28BA5-001/tempDir-001/jetty1, hostPort=41575, coreRootDirectory=/home/jenkins/workspace/Lucene-Solr-7.0-Linux/solr/build/solr-core/test/J0/../../../../../../../../../home/jenkins/workspace/Lucene-Solr-7.0-Linux/solr/build/solr-core/test/J0/temp/solr.cloud.ChaosMonkeyNothingIsSafeTest_238068C853D28BA5-001/shard-1-001/cores, replicaType=TLOG}
   [junit4]   2> 671223 ERROR (TEST-ChaosMonkeyNothingIsSafeTest.test-seed#[238068C853D28BA5]) [    ] o.a.s.s.StartupLoggingUtils Missing Java Option solr.log.dir. Logging may be missing or incomplete.
   [junit4]   2> 671223 INFO  (TEST-ChaosMonkeyNothingIsSafeTest.test-seed#[238068C853D28BA5]) [    ] o.a.s.s.SolrDispatchFilter  ___      _       Welcome to Apache Solr™ version 7.0.0
   [junit4]   2> 671223 INFO  (TEST-ChaosMonkeyNothingIsSafeTest.test-seed#[238068C853D28BA5]) [    ] o.a.s.s.SolrDispatchFilter / __| ___| |_ _   Starting in cloud mode on port null
   [junit4]   2> 671224 INFO  (TEST-ChaosMonkeyNothingIsSafeTest.test-seed#[238068C853D28BA5]) [    ] o.a.s.s.SolrDispatchFilter \__ \/ _ \ | '_|  Install dir: null, Default config dir: null
   [junit4]   2> 671224 INFO  (TEST-ChaosMonkeyNothingIsSafeTest.test-seed#[238068C853D28BA5]) [    ] o.a.s.s.SolrDispatchFilter |___/\___/_|_|    Start time: 2017-08-03T22:03:48.620589Z
   [junit4]   2> 671226 INFO  (TEST-ChaosMonkeyNothingIsSafeTest.test-seed#[238068C853D28BA5]) [    ] o.a.s.s.SolrDispatchFilter Loading solr.xml from SolrHome (not found in ZooKeeper)
   [junit4]   2> 671226 INFO  (TEST-ChaosMonkeyNothingIsSafeTest.test-seed#[238068C853D28BA5]) [    ] o.a.s.c.SolrXmlConfig Loading container configuration from /home/jenkins/workspace/Lucene-Solr-7.0-Linux/solr/build/solr-core/test/J0/temp/solr.cloud.ChaosMonkeyNothingIsSafeTest_238068C853D28BA5-001/shard-1-001/solr.xml
   [junit4]   2> 671230 INFO  (TEST-ChaosMonkeyNothingIsSafeTest.test-seed#[238068C853D28BA5]) [    ] o.a.s.c.SolrXmlConfig MBean server found: com.sun.jmx.mbeanserver.JmxMBeanServer@79148e, but no JMX reporters were configured - adding default JMX reporter.
   [junit4]   2> 671234 INFO  (TEST-ChaosMonkeyNothingIsSafeTest.test-seed#[238068C853D28BA5]) [    ] o.a.s.c.ZkContainer Zookeeper client=127.0.0.1:36547/solr
   [junit4]   2> 671274 INFO  (TEST-ChaosMonkeyNothingIsSafeTest.test-seed#[238068C853D28BA5]) [    ] o.a.s.c.c.ZkStateReader Updated live nodes from ZooKeeper... (0) -> (1)
   [junit4]   2> 671275 INFO  (TEST-ChaosMonkeyNothingIsSafeTest.test-seed#[238068C853D28BA5]) [    ] o.a.s.c.Overseer Overseer (id=null) closing
   [junit4]   2> 671276 INFO  (TEST-ChaosMonkeyNothingIsSafeTest.test-seed#[238068C853D28BA5]) [    ] o.a.s.c.ZkController Register node as live in ZooKeeper:/live_nodes/127.0.0.1:41575_vy%2Fqr
   [junit4]   2> 671276 INFO  (zkCallback-717-thread-1) [    ] o.a.s.c.c.ZkStateReader Updated live nodes from ZooKeeper... (1) -> (2)
   [junit4]   2> 671277 INFO  (zkCallback-729-thread-1) [    ] o.a.s.c.c.ZkStateReader Updated live nodes from ZooKeeper... (1) -> (2)
   [junit4]   2> 671277 INFO  (zkCallback-724-thread-1) [    ] o.a.s.c.c.ZkStateReader Updated live nodes from ZooKeeper... (1) -> (2)
   [junit4]   2> 671320 INFO  (TEST-ChaosMonkeyNothingIsSafeTest.test-seed#[238068C853D28BA5]) [    ] o.a.s.m.r.SolrJmxReporter JMX monitoring for 'solr.node' (registry 'solr.node') enabled at server: com.sun.jmx.mbeanserver.JmxMBeanServer@79148e
   [junit4]   2> 671324 INFO  (TEST-ChaosMonkeyNothingIsSafeTest.test-seed#[238068C853D28BA5]) [    ] o.a.s.m.r.SolrJmxReporter JMX monitoring for 'solr.jvm' (registry 'solr.jvm') enabled at server: com.sun.jmx.mbeanserver.JmxMBeanServer@79148e
   [junit4]   2> 671324 INFO  (TEST-ChaosMonkeyNothingIsSafeTest.test-seed#[238068C853D28BA5]) [    ] o.a.s.m.r.SolrJmxReporter JMX monitoring for 'solr.jetty' (registry 'solr.jetty') enabled at server: com.sun.jmx.mbeanserver.JmxMBeanServer@79148e
   [junit4]   2> 671325 INFO  (TEST-ChaosMonkeyNothingIsSafeTest.test-seed#[238068C853D28BA5]) [    ] o.a.s.c.CorePropertiesLocator Found 0 core definitions underneath /home/jenkins/workspace/Lucene-Solr-7.0-Linux/solr/build/solr-core/test/J0/../../../../../../../../../home/jenkins/workspace/Lucene-Solr-7.0-Linux/solr/build/solr-core/test/J0/temp/solr.cloud.ChaosMonkeyNothingIsSafeTest_238068C853D28BA5-001/shard-1-001/cores
   [junit4]   2> 671356 INFO  (qtp8083759-4767) [    ] o.a.s.h.a.CollectionsHandler Invoked Collection Action :addreplica with params node=127.0.0.1:41575_vy%252Fqr&action=ADDREPLICA&collection=collection1&shard=shard2&type=TLOG&wt=javabin&version=2 and sendToOCPQueue=true
   [junit4]   2> 671368 INFO  (OverseerCollectionConfigSetProcessor-98421822285414404-127.0.0.1:46163_vy%2Fqr-n_0000000000) [    ] o.a.s.c.OverseerTaskQueue Response ZK path: /overseer/collection-queue-work/qnr-0000000002 doesn't exist.  Requestor may have disconnected from ZooKeeper
   [junit4]   2> 671372 INFO  (OverseerThreadFactory-1676-thread-3) [    ] o.a.s.c.AddReplicaCmd Node Identified 127.0.0.1:41575_vy%2Fqr for creating new replica
   [junit4]   2> 671373 INFO  (qtp8083759-4769) [    ] o.a.s.h.a.CoreAdminOperation core create command qt=/admin/cores&collection.configName=conf1&name=collection1_shard2_replica_t0&action=CREATE&collection=collection1&shard=shard2&wt=javabin&version=2&replicaType=TLOG
   [junit4]   2> 671374 INFO  (qtp8083759-4769) [    ] o.a.s.c.TransientSolrCoreCacheDefault Allocating transient cache for 4 transient cores
   [junit4]   2> 671476 INFO  (zkCallback-729-thread-1) [    ] o.a.s.c.c.ZkStateReader A cluster state change: [WatchedEvent state:SyncConnected type:NodeDataChanged path:/collections/collection1/state.json] for collection [collection1] has occurred - updating... (live nodes size: [2])
   [junit4]   2> 672387 INFO  (qtp8083759-4769) [    ] o.a.s.c.SolrConfig Using Lucene MatchVersion: 7.0.0
   [junit4]   2> 672396 INFO  (qtp8083759-4769) [    ] o.a.s.s.IndexSchema [collection1_shard2_replica_t0] Schema name=test
   [junit4]   2> 672440 INFO  (qtp8083759-4769) [    ] o.a.s.s.IndexSchema Loaded schema test/1.6 with uniqueid field id
   [junit4]   2> 672447 INFO  (qtp8083759-4769) [    ] o.a.s.c.CoreContainer Creating SolrCore 'collection1_shard2_replica_t0' using configuration from collection collection1, trusted=true
   [junit4]   2> 672448 INFO  (qtp8083759-4769) [    ] o.a.s.m.r.SolrJmxReporter JMX monitoring for 'solr.core.collection1.shard2.replica_t0' (registry 'solr.core.collection1.shard2.replica_t0') enabled at server: com.sun.jmx.mbeanserver.JmxMBeanServer@79148e
   [junit4]   2> 672448 INFO  (qtp8083759-4769) [    ] o.a.s.c.SolrCore solr.RecoveryStrategy.Builder
   [junit4]   2> 672448 INFO  (qtp8083759-4769) [    ] o.a.s.c.SolrCore [[collection1_shard2_replica_t0] ] Opening new SolrCore at [/home/jenkins/workspace/Lucene-Solr-7.0-Linux/solr/build/solr-core/test/J0/temp/solr.cloud.ChaosMonkeyNothingIsSafeTest_238068C853D28BA5-001/shard-1-001/cores/collection1_shard2_replica_t0], dataDir=[/home/jenkins/workspace/Lucene-Solr-7.0-Linux/solr/build/solr-core/test/J0/../../../../../../../../../home/jenkins/workspace/Lucene-Solr-7.0-Linux/solr/build/solr-core/test/J0/temp/solr.cloud.ChaosMonkeyNothingIsSafeTest_238068C853D28BA5-001/shard-1-001/cores/collection1_shard2_replica_t0/data/]
   [junit4]   2> 672451 INFO  (qtp8083759-4769) [    ] o.a.s.u.RandomMergePolicy RandomMergePolicy wrapping class org.apache.lucene.index.TieredMergePolicy: [TieredMergePolicy: maxMergeAtOnce=25, maxMergeAtOnceExplicit=29, maxMergedSegmentMB=85.689453125, floorSegmentMB=0.5048828125, forceMergeDeletesPctAllowed=24.820334415966023, segmentsPerTier=24.0, maxCFSSegmentSizeMB=8.796093022207999E12, noCFSRatio=1.0
   [junit4]   2> 672555 WARN  (qtp8083759-4769) [    ] o.a.s.c.RequestHandlers INVALID paramSet a in requestHandler {type = requestHandler,name = /dump,class = DumpRequestHandler,attributes = {initParams=a, name=/dump, class=DumpRequestHandler},args = {defaults={a=A,b=B}}}
   [junit4]   2> 672593 INFO  (qtp8083759-4769) [    ] o.a.s.u.UpdateHandler Using UpdateLog implementation: org.apache.solr.update.UpdateLog
   [junit4]   2> 672593 INFO  (qtp8083759-4769) [    ] o.a.s.u.UpdateLog Initializing UpdateLog: dataDir= defaultSyncLevel=FLUSH numRecordsToKeep=100 maxNumLogsToKeep=10 numVersionBuckets=65536
   [junit4]   2> 672594 INFO  (qtp8083759-4769) [    ] o.a.s.u.CommitTracker Hard AutoCommit: if uncommited for 15000ms; 
   [junit4]   2> 672594 INFO  (qtp8083759-4769) [    ] o.a.s.u.CommitTracker Soft AutoCommit: disabled
   [junit4]   2> 672595 INFO  (qtp8083759-4769) [    ] o.a.s.u.RandomMergePolicy RandomMergePolicy wrapping class org.apache.lucene.index.TieredMergePolicy: [TieredMergePolicy: maxMergeAtOnce=41, maxMergeAtOnceExplicit=10, maxMergedSegmentMB=19.4287109375, floorSegmentMB=2.17578125, forceMergeDeletesPctAllowed=10.860144471534452, segmentsPerTier=13.0, maxCFSSegmentSizeMB=8.796093022207999E12, noCFSRatio=0.3762927445485478
   [junit4]   2> 672595 INFO  (qtp8083759-4769) [    ] o.a.s.s.SolrIndexSearcher Opening [Searcher@1b54849[collection1_shard2_replica_t0] main]
   [junit4]   2> 672596 INFO  (qtp8083759-4769) [    ] o.a.s.r.ManagedResourceStorage Configured ZooKeeperStorageIO with znodeBase: /configs/conf1
   [junit4]   2> 672596 INFO  (qtp8083759-4769) [    ] o.a.s.r.ManagedResourceStorage Loaded null at path _rest_managed.json using ZooKeeperStorageIO:path=/configs/conf1
   [junit4]   2> 672597 INFO  (qtp8083759-4769) [    ] o.a.s.h.ReplicationHandler Commits will be reserved for  10000
   [junit4]   2> 672598 INFO  (searcherExecutor-1690-thread-1) [    ] o.a.s.c.SolrCore [collection1_shard2_replica_t0] Registered new searcher Searcher@1b54849[collection1_shard2_replica_t0] main{ExitableDirectoryReader(UninvertingDirectoryReader())}
   [junit4]   2> 672598 INFO  (qtp8083759-4769) [    ] o.a.s.u.UpdateLog Could not find max version in index or recent updates, using new clock 1574749161383788544
   [junit4]   2> 672601 INFO  (qtp8083759-4769) [    ] o.a.s.c.ShardLeaderElectionContext Enough replicas found to continue.
   [junit4]   2> 672601 INFO  (qtp8083759-4769) [    ] o.a.s.c.ShardLeaderElectionContext I may be the new leader - try and sync
   [junit4]   2> 672601 INFO  (qtp8083759-4769) [    ] o.a.s.c.SyncStrategy Sync replicas to http://127.0.0.1:41575/vy/qr/collection1_shard2_replica_t0/
   [junit4]   2> 672601 INFO  (qtp8083759-4769) [    ] o.a.s.c.SyncStrategy Sync Success - now sync replicas to me
   [junit4]   2> 672601 INFO  (qtp8083759-4769) [    ] o.a.s.c.SyncStrategy http://127.0.0.1:41575/vy/qr/collection1_shard2_replica_t0/ has no replicas
   [junit4]   2> 672601 INFO  (qtp8083759-4769) [    ] o.a.s.c.ShardLeaderElectionContext Found all replicas participating in election, clear LIR
   [junit4]   2> 672601 INFO  (qtp8083759-4769) [    ] o.a.s.c.ZkController collection1_shard2_replica_t0 stopping background replication from leader
   [junit4]   2> 672603 INFO  (qtp8083759-4769) [    ] o.a.s.c.ShardLeaderElectionContext I am the new leader: http://127.0.0.1:41575/vy/qr/collection1_shard2_replica_t0/ shard2
   [junit4]   2> 672704 INFO  (zkCallback-729-thread-1) [    ] o.a.s.c.c.ZkStateReader A cluster state change: [WatchedEvent state:SyncConnected type:NodeDataChanged path:/collections/collection1/state.json] for collection [collection1] has occurred - updating... (live nodes size: [2])
   [junit4]   2> 672753 INFO  (qtp8083759-4769) [    ] o.a.s.c.ZkController I am the leader, no recovery necessary
   [junit4]   2> 672754 INFO  (qtp8083759-4769) [    ] o.a.s.s.HttpSolrCall [admin] webapp=null path=/admin/cores params={qt=/admin/cores&collection.configName=conf1&name=collection1_shard2_replica_t0&action=CREATE&collection=collection1&shard=shard2&wt=javabin&version=2&replicaType=TLOG} status=0 QTime=1380
   [junit4]   2> 672755 INFO  (qtp8083759-4767) [    ] o.a.s.s.HttpSolrCall [admin] webapp=null path=/admin/collections params={node=127.0.0.1:41575_vy%252Fqr&action=ADDREPLICA&collection=collection1&shard=shard2&type=TLOG&wt=javabin&version=2} status=0 QTime=1399
   [junit4]   2> 672855 INFO  (zkCallback-729-thread-1) [    ] o.a.s.c.c.ZkStateReader A cluster state change: [WatchedEvent state:SyncConnected type:NodeDataChanged path:/collections/collection1/state.json] for collection [collection1] has occurred - updating... (live nodes size: [2])
   [junit4]   2> 672874 INFO  (TEST-ChaosMonkeyNothingIsSafeTest.test-seed#[238068C853D28BA5]) [    ] o.a.s.c.AbstractFullDistribZkTestBase create jetty 2 in directory /home/jenkins/workspace/Lucene-Solr-7.0-Linux/solr/build/solr-core/test/J0/temp/solr.cloud.ChaosMonkeyNothingIsSafeTest_238068C853D28BA5-001/shard-2-001 of type TLOG
   [junit4]   2> 672874 INFO  (TEST-ChaosMonkeyNothingIsSafeTest.test-seed#[238068C853D28BA5]) [    ] o.e.j.s.Server jetty-9.3.14.v20161028
   [junit4]   2> 672879 INFO  (TEST-ChaosMonkeyNothingIsSafeTest.test-seed#[238068C853D28BA5]) [    ] o.e.j.s.h.ContextHandler Started o.e.j.s.ServletContextHandler@3b5730{/vy/qr,null,AVAILABLE}
   [junit4]   2> 672880 INFO  (TEST-ChaosMonkeyNothingIsSafeTest.test-seed#[238068C853D28BA5]) [    ] o.e.j.s.AbstractConnector Started ServerConnector@507cbd{HTTP/1.1,[http/1.1]}{127.0.0.1:36861}
   [junit4]   2> 672880 INFO  (TEST-ChaosMonkeyNothingIsSafeTest.test-seed#[238068C853D28BA5]) [    ] o.e.j.s.Server Started @673798ms
   [junit4]   2> 672880 INFO  (TEST-ChaosMonkeyNothingIsSafeTest.test-seed#[238068C853D28BA5]) [    ] o.a.s.c.s.e.JettySolrRunner Jetty properties: {hostContext=/vy/qr, solrconfig=solrconfig.xml, solr.data.dir=/home/jenkins/workspace/Lucene-Solr-7.0-Linux/solr/build/solr-core/test/J0/temp/solr.cloud.ChaosMonkeyNothingIsSafeTest_238068C853D28BA5-001/tempDir-001/jetty2, hostPort=36861, coreRootDirectory=/home/jenkins/workspace/Lucene-Solr-7.0-Linux/solr/build/solr-core/test/J0/../../../../../../../../../home/jenkins/workspace/Lucene-Solr-7.0-Linux/solr/build/solr-core/test/J0/temp/solr.cloud.ChaosMonkeyNothingIsSafeTest_238068C853D28BA5-001/shard-2-001/cores, replicaType=TLOG}
   [junit4]   2> 672880 ERROR (TEST-ChaosMonkeyNothingIsSafeTest.test-seed#[238068C853D28BA5]) [    ] o.a.s.s.StartupLoggingUtils Missing Java Option solr.log.dir. Logging may be missing or incomplete.
   [junit4]   2> 672880 INFO  (TEST-ChaosMonkeyNothingIsSafeTest.test-seed#[238068C853D28BA5]) [    ] o.a.s.s.SolrDispatchFilter  ___      _       Welcome to Apache Solr™ version 7.0.0
   [junit4]   2> 672880 INFO  (TEST-ChaosMonkeyNothingIsSafeTest.test-seed#[238068C853D28BA5]) [    ] o.a.s.s.SolrDispatchFilter / __| ___| |_ _   Starting in cloud mode on port null
   [junit4]   2> 672880 INFO  (TEST-ChaosMonkeyNothingIsSafeTest.test-seed#[238068C853D28BA5]) [    ] o.a.s.s.SolrDispatchFilter \__ \/ _ \ | '_|  Install dir: null, Default config dir: null
   [junit4]   2> 672880 INFO  (TEST-ChaosMonkeyNothingIsSafeTest.test-seed#[238068C853D28BA5]) [    ] o.a.s.s.SolrDispatchFilter |___/\___/_|_|    Start time: 2017-08-03T22:03:50.276876Z
   [junit4]   2> 672882 INFO  (TEST-ChaosMonkeyNothingIsSafeTest.test-seed#[238068C853D28BA5]) [    ] o.a.s.s.SolrDispatchFilter Loading solr.xml from SolrHome (not found in ZooKeeper)
   [junit4]   2> 672882 INFO  (TEST-ChaosMonkeyNothingIsSafeTest.test-seed#[238068C853D28BA5]) [    ] o.a.s.c.SolrXmlConfig Loading container configuration from /home/jenkins/workspace/Lucene-Solr-7.0-Linux/solr/build/solr-core/test/J0/temp/solr.cloud.ChaosMonkeyNothingIsSafeTest_238068C853D28BA5-001/shard-2-001/solr.xml
   [junit4]   2> 672885 INFO  (TEST-ChaosMonkeyNothingIsSafeTest.test-seed#[238068C853D28BA5]) [    ] o.a.s.c.SolrXmlConfig MBean server found: com.sun.jmx.mbeanserver.JmxMBeanServer@79148e, but no JMX reporters were configured - adding default JMX reporter.
   [junit4]   2> 672887 INFO  (TEST-ChaosMonkeyNothingIsSafeTest.test-seed#[238068C853D28BA5]) [    ] o.a.s.c.ZkContainer Zookeeper client=127.0.0.1:36547/solr
   [junit4]   2> 672892 INFO  (TEST-ChaosMonkeyNothingIsSafeTest.test-seed#[238068C853D28BA5]) [    ] o.a.s.c.c.ZkStateReader Updated live nodes from ZooKeeper... (0) -> (2)
   [junit4]   2> 672892 INFO  (TEST-ChaosMonkeyNothingIsSafeTest.test-seed#[238068C853D28BA5]) [    ] o.a.s.c.Overseer Overseer (id=null) closing
   [junit4]   2> 672894 INFO  (TEST-ChaosMonkeyNothingIsSafeTest.test-seed#[238068C853D28BA5]) [    ] o.a.s.c.ZkController Register node as live in ZooKeeper:/live_nodes/127.0.0.1:36861_vy%2Fqr
   [junit4]   2> 672895 INFO  (zkCallback-729-thread-1) [    ] o.a.s.c.c.ZkStateReader Updated live nodes from ZooKeeper... (2) -> (3)
   [junit4]   2> 672895 INFO  (zkCallback-717-thread-2) [    ] o.a.s.c.c.ZkStateReader Updated live nodes from ZooKeeper... (2) -> (3)
   [junit4]   2> 672895 INFO  (zkCallback-724-thread-1) [    ] o.a.s.c.c.ZkStateReader Updated live nodes from ZooKeeper... (2) -> (3)
   [junit4]   2> 672899 INFO  (zkCallback-735-thread-1) [    ] o.a.s.c.c.ZkStateReader Updated live nodes from ZooKeeper... (2) -> (3)
   [junit4]   2> 673040 INFO  (TEST-ChaosMonkeyNothingIsSafeTest.test-seed#[238068C853D28BA5]) [    ] o.a.s.m.r.SolrJmxReporter JMX monitoring for 'solr.node' (registry 'solr.node') enabled at server: com.sun.jmx.mbeanserver.JmxMBeanServer@79148e
   [junit4]   2> 673044 INFO  (TEST-ChaosMonkeyNothingIsSafeTest.test-seed#[238068C853D28BA5]) [    ] o.a.s.m.r.SolrJmxReporter JMX monitoring for 'solr.jvm' (registry 'solr.jvm') enabled at server: com.sun.jmx.mbeanserver.JmxMBeanServer@79148e
   [junit4]   2> 673044 INFO  (TEST-ChaosMonkeyNothingIsSafeTest.test-seed#[238068C853D28BA5]) [    ] o.a.s.m.r.SolrJmxReporter JMX monitoring for 'solr.jetty' (registry 'solr.jetty') enabled at server: com.sun.jmx.mbeanserver.JmxMBeanServer@79148e
   [junit4]   2> 673045 INFO  (TEST-ChaosMonkeyNothingIsSafeTest.test-seed#[238068C853D28BA5]) [    ] o.a.s.c.CorePropertiesLocator Found 0 core definitions underneath /home/jenkins/workspace/Lucene-Solr-7.0-Linux/solr/build/solr-core/test/J0/../../../../../../../../../home/jenkins/workspace/Lucene-Solr-7.0-Linux/solr/build/solr-core/test/J0/temp/solr.cloud.ChaosMonkeyNothingIsSafeTest_238068C853D28BA5-001/shard-2-001/cores
   [junit4]   2> 673064 INFO  (qtp8083759-4768) [    ] o.a.s.h.a.CollectionsHandler Invoked Collection Action :addreplica with params node=127.0.0.1:36861_vy%252Fqr&action=ADDREPLICA&collection=collection1&shard=shard3&type=TLOG&wt=javabin&version=2 and sendToOCPQueue=true
   [junit4]   2> 673068 INFO  (OverseerCollectionConfigSetProcessor-98421822285414404-127.0.0.1:46163_vy%2Fqr-n_0000000000) [    ] o.a.s.c.OverseerTaskQueue Response ZK path: /overseer/collection-queue-work/qnr-0000000004 doesn't exist.  Requestor may have disconnected from ZooKeeper
   [junit4]   2> 673068 INFO  (OverseerThreadFactory-1676-thread-4) [    ] o.a.s.c.AddReplicaCmd Node Identified 127.0.0.1:36861_vy%2Fqr for creating new replica
   [junit4]   2> 673071 INFO  (qtp31281070-4797) [    ] o.a.s.h.a.CoreAdminOperation core create command qt=/admin/cores&collection.configName=conf1&name=collection1_shard3_replica_t0&action=CREATE&collection=collection1&shard=shard3&wt=javabin&version=2&replicaType=TLOG
   [junit4]   2> 673072 INFO  (qtp31281070-4797) [    ] o.a.s.c.TransientSolrCoreCacheDefault Allocating transient cache for 4 transient cores
   [junit4]   2> 673175 INFO  (zkCallback-729-thread-1) [    ] o.a.s.c.c.ZkStateReader A cluster state change: [WatchedEvent state:SyncConnected type:NodeDataChanged path:/collections/collection1/state.json] for collection [collection1] has occurred - updating... (live nodes size: [3])
   [junit4]   2> 673175 INFO  (zkCallback-735-thread-1) [    ] o.a.s.c.c.ZkStateReader A cluster state change: [WatchedEvent state:SyncConnected type:NodeDataChanged path:/collections/collection1/state.json] for collection [collection1] has occurred - updating... (live nodes size: [3])
   [junit4]   2> 674081 INFO  (qtp31281070-4797) [    ] o.a.s.c.SolrConfig Using Lucene MatchVersion: 7.0.0
   [junit4]   2> 674087 INFO  (qtp31281070-4797) [    ] o.a.s.s.IndexSchema [collection1_shard3_replica_t0] Schema name=test
   [junit4]   2> 674131 INFO  (qtp31281070-4797) [    ] o.a.s.s.IndexSchema Loaded schema test/1.6 with uniqueid field id
   [junit4]   2> 674136 INFO  (qtp31281070-4797) [    ] o.a.s.c.CoreContainer Creating SolrCore 'collection1_shard3_replica_t0' using configuration from collection collection1, trusted=true
   [junit4]   2> 674137 INFO  (qtp31281070-4797) [    ] o.a.s.m.r.SolrJmxReporter JMX monitoring for 'solr.core.collection1.shard3.replica_t0' (registry 'solr.core.collection1.shard3.replica_t0') enabled at server: com.sun.jmx.mbeanserver.JmxMBeanServer@79148e
   [junit4]   2> 674137 INFO  (qtp31281070-4797) [    ] o.a.s.c.SolrCore solr.RecoveryStrategy.Builder
   [junit4]   2> 674137 INFO  (qtp31281070-4797) [    ] o.a.s.c.SolrCore [[collection1_shard3_replica_t0] ] Opening new SolrCore at [/home/jenkins/workspace/Lucene-Solr-7.0-Linux/solr/build/solr-core/test/J0/temp/solr.cloud.ChaosMonkeyNothingIsSafeTest_238068C853D28BA5-001/shard-2-001/cores/collection1_shard3_replica_t0], dataDir=[/home/jenkins/workspace/Lucene-Solr-7.0-Linux/solr/build/solr-core/test/J0/../../../../../../../../../home/jenkins/workspace/Lucene-Solr-7.0-Linux/solr/build/solr-core/test/J0/temp/solr.cloud.ChaosMonkeyNothingIsSafeTest_238068C853D28BA5-001/shard-2-001/cores/collection1_shard3_replica_t0/data/]
   [junit4]   2> 674141 INFO  (qtp31281070-4797) [    ] o.a.s.u.RandomMergePolicy RandomMergePolicy wrapping class org.apache.lucene.index.TieredMergePolicy: [TieredMergePolicy: maxMergeAtOnce=25, maxMergeAtOnceExplicit=29, maxMergedSegmentMB=85.689453125, floorSegmentMB=0.5048828125, forceMergeDeletesPctAllowed=24.820334415966023, segmentsPerTier=24.0, maxCFSSegmentSizeMB=8.796093022207999E12, noCFSRatio=1.0
   [junit4]   2> 674162 WARN  (qtp31281070-4797) [    ] o.a.s.c.RequestHandlers INVALID paramSet a in requestHandler {type = requestHandler,name = /dump,class = DumpRequestHandler,attributes = {initParams=a, name=/dump, class=DumpRequestHandler},args = {defaults={a=A,b=B}}}
   [junit4]   2> 674191 INFO  (qtp31281070-4797) [    ] o.a.s.u.UpdateHandler Using UpdateLog implementation: org.apache.solr.update.UpdateLog
   [junit4]   2> 674191 INFO  (qtp31281070-4797) [    ] o.a.s.u.UpdateLog Initializing UpdateLog: dataDir= defaultSyncLevel=FLUSH numRecordsToKeep=100 maxNumLogsToKeep=10 numVersionBuckets=65536
   [junit4]   2> 674192 INFO  (qtp31281070-4797) [    ] o.a.s.u.CommitTracker Hard AutoCommit: if uncommited for 15000ms; 
   [junit4]   2> 674192 INFO  (qtp31281070-4797) [    ] o.a.s.u.CommitTracker Soft AutoCommit: disabled
   [junit4]   2> 674193 INFO  (qtp31281070-4797) [    ] o.a.s.u.RandomMergePolicy RandomMergePolicy wrapping class org.apache.lucene.index.TieredMergePolicy: [TieredMergePolicy: maxMergeAtOnce=41, maxMergeAtOnceExplicit=10, maxMergedSegmentMB=19.4287109375, floorSegmentMB=2.17578125, forceMergeDeletesPctAllowed=10.860144471534452, segmentsPerTier=13.0, maxCFSSegmentSizeMB=8.796093022207999E12, noCFSRatio=0.3762927445485478
   [junit4]   2> 674193 INFO  (qtp31281070-4797) [    ] o.a.s.s.SolrIndexSearcher Opening [Searcher@b2e3f0[collection1_shard3_replica_t0] main]
   [junit4]   2> 674194 INFO  (qtp31281070-4797) [    ] o.a.s.r.ManagedResourceStorage Configured ZooKeeperStorageIO with znodeBase: /configs/conf1
   [junit4]   2> 674194 INFO  (qtp31281070-4797) [    ] o.a.s.r.ManagedResourceStorage Loaded null at path _rest_managed.json using ZooKeeperStorageIO:path=/configs/conf1
   [junit4]   2> 674194 INFO  (qtp31281070-4797) [    ] o.a.s.h.ReplicationHandler Commits will be reserved for  10000
   [junit4]   2> 674195 INFO  (searcherExecutor-1701-thread-1) [    ] o.a.s.c.SolrCore [collection1_shard3_replica_t0] Registered new searcher Searcher@b2e3f0[collection1_shard3_replica_t0] main{ExitableDirectoryReader(UninvertingDirectoryReader())}
   [junit4]   2> 674195 INFO  (qtp31281070-4797) [    ] o.a.s.u.UpdateLog Could not find max version in index or recent updates, using new clock 1574749163058364416
   [junit4]   2> 674198 INFO  (qtp31281070-4797) [    ] o.a.s.c.ShardLeaderElectionContext Enough replicas found to continue.
   [junit4]   2> 674198 INFO  (qtp31281070-4797) [    ] o.a.s.c.ShardLeaderElectionContext I may be the new leader - try and sync
   [junit4]   2> 674198 INFO  (qtp31281070-4797) [    ] o.a.s.c.SyncStrategy Sync replicas to http://127.0.0.1:36861/vy/qr/collection1_shard3_replica_t0/
   [junit4]   2> 674198 INFO  (qtp31281070-4797) [    ] o.a.s.c.SyncStrategy Sync Success - now sync replicas to me
   [junit4]   2> 674198 INFO  (qtp31281070-4797) [    ] o.a.s.c.SyncStrategy http://127.0.0.1:36861/vy/qr/collection1_shard3_replica_t0/ has no replicas
   [junit4]   2> 674198 INFO  (qtp31281070-4797) [    ] o.a.s.c.ShardLeaderElectionContext Found all replicas participating in election, clear LIR
   [junit4]   2> 674198 INFO  (qtp31281070-4797) [    ] o.a.s.c.ZkController collection1_shard3_replica_t0 stopping background replication from leader
   [junit4]   2> 674199 INFO  (qtp31281070-4797) [    ] o.a.s.c.ShardLeaderElectionContext I am the new leader: http://127.0.0.1:36861/vy/qr/collection1_shard3_replica_t0/ shard3
   [junit4]   2> 674301 INFO  (zkCallback-735-thread-1) [    ] o.a.s.c.c.ZkStateReader A cluster state change: [WatchedEvent state:SyncConnected type:NodeDataChanged path:/collections/collection1/state.json] for collection [collection1] has occurred - updating... (live nodes size: [3])
   [junit4]   2> 674301 INFO  (zkCallback-729-thread-1) [    ] o.a.s.c.c.ZkStateReader A cluster state change: [WatchedEvent state:SyncConnected type:NodeDataChanged path:/collections/collection1/state.json] for collection [collection1] has occurred - updating... (live nodes size: [3])
   [junit4]   2> 674350 INFO  (qtp31281070-4797) [    ] o.a.s.c.ZkController I am the leader, no recovery necessary
   [junit4]   2> 674351 INFO  (qtp31281070-4797) [    ] o.a.s.s.HttpSolrCall [admin] webapp=null path=/admin/cores params={qt=/admin/cores&collection.configName=conf1&name=collection1_shard3_replica_t0&action=CREATE&collection=collection1&shard=shard3&wt=javabin&version=2&replicaType=TLOG} status=0 QTime=1279
   [junit4]   2> 674352 INFO  (qtp8083759-4768) [    ] o.a.s.s.HttpSolrCall [admin] webapp=null path=/admin/collections params={node=127.0.0.1:36861_vy%252Fqr&action=ADDREPLICA&collection=collection1&shard=shard3&type=TLOG&wt=javabin&version=2} status=0 QTime=1288
   [junit4]   2> 674452 INFO  (zkCallback-735-thread-1) [    ] o.a.s.c.c.ZkStateReader A cluster state change: [WatchedEvent state:SyncConnected type:NodeDataChanged path:/collections/collection1/state.json] for collection [collection1] has occurred - updating... (live nodes size: [3])
   [junit4]   2> 674452 INFO  (zkCallback-729-thread-1) [    ] o.a.s.c.c.ZkStateReader A cluster state change: [WatchedEvent state:SyncConnected type:NodeDataChanged path:/collections/collection1/state.json] for collection [collection1] has occurred - updating... (live nodes size: [3])
   [junit4]   2> 674463 INFO  (TEST-ChaosMonkeyNothingIsSafeTest.test-seed#[238068C853D28BA5]) [    ] o.a.s.c.AbstractFullDistribZkTestBase create jetty 3 in directory /home/jenkins/workspace/Lucene-Solr-7.0-Linux/solr/build/solr-core/test/J0/temp/solr.cloud.ChaosMonkeyNothingIsSafeTest_238068C853D28BA5-001/shard-3-001 of type TLOG
   [junit4]   2> 674463 INFO  (TEST-ChaosMonkeyNothingIsSafeTest.test-seed#[238068C853D28BA5]) [    ] o.e.j.s.Server jetty-9.3.14.v20161028
   [junit4]   2> 674464 INFO  (TEST-ChaosMonkeyNothingIsSafeTest.test-seed#[238068C853D28BA5]) [    ] o.e.j.s.h.ContextHandler Started o.e.j.s.ServletContextHandler@144b771{/vy/qr,null,AVAILABLE}
   [junit4]   2> 674464 INFO  (TEST-ChaosMonkeyNothingIsSafeTest.test-seed#[238068C853D28BA5]) [    ] o.e.j.s.AbstractConnector Started ServerConnector@7943a9{HTTP/1.1,[http/1.1]}{127.0.0.1:39817}
   [junit4]   2> 674464 INFO  (TEST-ChaosMonkeyNothingIsSafeTest.test-seed#[238068C853D28BA5]) [    ] o.e.j.s.Server Started @675382ms
   [junit4]   2> 674464 INFO  (TEST-ChaosMonkeyNothingIsSafeTest.test-seed#[238068C853D28BA5]) [    ] o.a.s.c.s.e.JettySolrRunner Jetty properties: {hostContext=/vy/qr, solrconfig=solrconfig.xml, solr.data.dir=/home/jenkins/workspace/Lucene-Solr-7.0-Linux/solr/build/solr-core/test/J0/temp/solr.cloud.ChaosMonkeyNothingIsSafeTest_238068C853D28BA5-001/tempDir-001/jetty3, hostPort=39817, coreRootDirectory=/home/jenkins/workspace/Lucene-Solr-7.0-Linux/solr/build/solr-core/test/J0/../../../../../../../../../home/jenkins/workspace/Lucene-Solr-7.0-Linux/solr/build/solr-core/test/J0/temp/solr.cloud.ChaosMonkeyNothingIsSafeTest_238068C853D28BA5-001/shard-3-001/cores, replicaType=TLOG}
   [junit4]   2> 674465 ERROR (TEST-ChaosMonkeyNothingIsSafeTest.test-seed#[238068C853D28BA5]) [    ] o.a.s.s.StartupLoggingUtils Missing Java Option solr.log.dir. Logging may be missing or incomplete.
   [junit4]   2> 674465 INFO  (TEST-ChaosMonkeyNothingIsSafeTest.test-seed#[238068C853D28BA5]) [    ] o.a.s.s.SolrDispatchFilter  ___      _       Welcome to Apache Solr™ version 7.0.0
   [junit4]   2> 674465 INFO  (TEST-ChaosMonkeyNothingIsSafeTest.test-seed#[238068C853D28BA5]) [    ] o.a.s.s.SolrDispatchFilter / __| ___| |_ _   Starting in cloud mode on port null
   [junit4]   2> 674465 INFO  (TEST-ChaosMonkeyNothingIsSafeTest.test-seed#[238068C853D28BA5]) [    ] o.a.s.s.SolrDispatchFilter \__ \/ _ \ | '_|  Install dir: null, Default config dir: null
   [junit4]   2> 674465 INFO  (TEST-ChaosMonkeyNothingIsSafeTest.test-seed#[238068C853D28BA5]) [    ] o.a.s.s.SolrDispatchFilter |___/\___/_|_|    Start time: 2017-08-03T22:03:51.861576Z
   [junit4]   2> 674467 INFO  (TEST-ChaosMonkeyNothingIsSafeTest.test-seed#[238068C853D28BA5]) [    ] o.a.s.s.SolrDispatchFilter Loading solr.xml from SolrHome (not found in ZooKeeper)
   [junit4]   2> 674467 INFO  (TEST-ChaosMonkeyNothingIsSafeTest.test-seed#[238068C853D28BA5]) [    ] o.a.s.c.SolrXmlConfig Loading container configuration from /home/jenkins/workspace/Lucene-Solr-7.0-Linux/solr/build/solr-core/test/J0/temp/solr.cloud.ChaosMonkeyNothingIsSafeTest_238068C853D28BA5-001/shard-3-001/solr.xml
   [junit4]   2> 674469 INFO  (TEST-ChaosMonkeyNothingIsSafeTest.test-seed#[238068C853D28BA5]) [    ] o.a.s.c.SolrXmlConfig MBean server found: com.sun.jmx.mbeanserver.JmxMBeanServer@79148e, but no JMX reporters were configured - adding default JMX reporter.
   [junit4]   2> 674471 INFO  (TEST-ChaosMonkeyNothingIsSafeTest.test-seed#[238068C853D28BA5]) [    ] o.a.s.c.ZkContainer Zookeeper client=127.0.0.1:36547/solr
   [junit4]   2> 674475 INFO  (TEST-ChaosMonkeyNothingIsSafeTest.test-seed#[238068C853D28BA5]) [    ] o.a.s.c.c.ZkStateReader Updated live nodes from ZooKeeper... (0) -> (3)
   [junit4]   2> 674475 INFO  (TEST-ChaosMonkeyNothingIsSafeTest.test-seed#[238068C853D28BA5]) [    ] o.a.s.c.Overseer Overseer (id=null) closing
   [junit4]   2> 674476 INFO  (TEST-ChaosMonkeyNothingIsSafeTest.test-seed#[238068C853D28BA5]) [    ] o.a.s.c.ZkController Register node as live in ZooKeeper:/live_nodes/127.0.0.1:39817_vy%2Fqr
   [junit4]   2> 674477 INFO  (zkCallback-741-thread-1) [    ] o.a.s.c.c.ZkStateReader Updated live nodes from ZooKeeper... (3) -> (4)
   [junit4]   2> 674477 INFO  (zkCallback-724-thread-1) [    ] o.a.s.c.c.ZkStateReader Updated live nodes from ZooKeeper... (3) -> (4)
   [junit4]   2> 674477 INFO  (zkCallback-717-thread-2) [    ] o.a.s.c.c.ZkStateReader Updated live nodes from ZooKeeper... (3) -> (4)
   [junit4]   2> 674477 INFO  (zkCallback-735-thread-1) [    ] o.a.s.c.c.ZkStateReader Updated live nodes from ZooKeeper... (3) -> (4)
   [junit4]   2> 674477 INFO  (zkCallback-729-thread-1) [    ] o.a.s.c.c.ZkStateReader Updated live nodes from ZooKeeper... (3) -> (4)
   [junit4]   2> 674672 INFO  (TEST-ChaosMonkeyNothingIsSafeTest.test-seed#[238068C853D28BA5]) [    ] o.a.s.m.r.SolrJmxReporter JMX monitoring for 'solr.node' (registry 'solr.node') enabled at server: com.sun.jmx.mbeanserver.JmxMBeanServer@79148e
   [junit4]   2> 674676 INFO  (TEST-ChaosMonkeyNothingIsSafeTest.test-seed#[238068C853D28BA5]) [    ] o.a.s.m.r.SolrJmxReporter JMX monitoring for 'solr.jvm' (registry 'solr.jvm') enabled at server: com.sun.jmx.mbeanserver.Jm

[...truncated too long message...]

Method)
   [junit4]    >         at app//org.apache.zookeeper.client.StaticHostProvider.next(StaticHostProvider.java:101)
   [junit4]    >         at app//org.apache.zookeeper.ClientCnxn$SendThread.startConnect(ClientCnxn.java:997)
   [junit4]    >         at app//org.apache.zookeeper.ClientCnxn$SendThread.run(ClientCnxn.java:1060)
   [junit4]    >    8) Thread[id=4759, name=TEST-ChaosMonkeyNothingIsSafeTest.test-seed#[238068C853D28BA5]-EventThread, state=WAITING, group=TGRP-ChaosMonkeyNothingIsSafeTest]
   [junit4]    >         at java.base@9/jdk.internal.misc.Unsafe.park(Native Method)
   [junit4]    >         at java.base@9/java.util.concurrent.locks.LockSupport.park(LockSupport.java:194)
   [junit4]    >         at java.base@9/java.util.concurrent.locks.AbstractQueuedSynchronizer$ConditionObject.await(AbstractQueuedSynchronizer.java:2062)
   [junit4]    >         at java.base@9/java.util.concurrent.LinkedBlockingQueue.take(LinkedBlockingQueue.java:435)
   [junit4]    >         at app//org.apache.zookeeper.ClientCnxn$EventThread.run(ClientCnxn.java:501)
   [junit4]    >    9) Thread[id=5097, name=zkCallback-724-thread-6, state=TIMED_WAITING, group=TGRP-ChaosMonkeyNothingIsSafeTest]
   [junit4]    >         at java.base@9/jdk.internal.misc.Unsafe.park(Native Method)
   [junit4]    >         at java.base@9/java.util.concurrent.locks.LockSupport.parkNanos(LockSupport.java:234)
   [junit4]    >         at java.base@9/java.util.concurrent.SynchronousQueue$TransferStack.awaitFulfill(SynchronousQueue.java:462)
   [junit4]    >         at java.base@9/java.util.concurrent.SynchronousQueue$TransferStack.transfer(SynchronousQueue.java:361)
   [junit4]    >         at java.base@9/java.util.concurrent.SynchronousQueue.poll(SynchronousQueue.java:937)
   [junit4]    >         at java.base@9/java.util.concurrent.ThreadPoolExecutor.getTask(ThreadPoolExecutor.java:1085)
   [junit4]    >         at java.base@9/java.util.concurrent.ThreadPoolExecutor.runWorker(ThreadPoolExecutor.java:1146)
   [junit4]    >         at java.base@9/java.util.concurrent.ThreadPoolExecutor$Worker.run(ThreadPoolExecutor.java:635)
   [junit4]    >         at java.base@9/java.lang.Thread.run(Thread.java:844)
   [junit4]    > 	at __randomizedtesting.SeedInfo.seed([238068C853D28BA5]:0)Throwable #2: com.carrotsearch.randomizedtesting.ThreadLeakError: There are still zombie threads that couldn't be terminated:
   [junit4]    >    1) Thread[id=4760, name=zkCallback-724-thread-1, state=TIMED_WAITING, group=TGRP-ChaosMonkeyNothingIsSafeTest]
   [junit4]    >         at java.base@9/jdk.internal.misc.Unsafe.park(Native Method)
   [junit4]    >         at java.base@9/java.util.concurrent.locks.LockSupport.parkNanos(LockSupport.java:234)
   [junit4]    >         at java.base@9/java.util.concurrent.SynchronousQueue$TransferStack.awaitFulfill(SynchronousQueue.java:462)
   [junit4]    >         at java.base@9/java.util.concurrent.SynchronousQueue$TransferStack.transfer(SynchronousQueue.java:361)
   [junit4]    >         at java.base@9/java.util.concurrent.SynchronousQueue.poll(SynchronousQueue.java:937)
   [junit4]    >         at java.base@9/java.util.concurrent.ThreadPoolExecutor.getTask(ThreadPoolExecutor.java:1085)
   [junit4]    >         at java.base@9/java.util.concurrent.ThreadPoolExecutor.runWorker(ThreadPoolExecutor.java:1146)
   [junit4]    >         at java.base@9/java.util.concurrent.ThreadPoolExecutor$Worker.run(ThreadPoolExecutor.java:635)
   [junit4]    >         at java.base@9/java.lang.Thread.run(Thread.java:844)
   [junit4]    >    2) Thread[id=4964, name=zkCallback-724-thread-4, state=TIMED_WAITING, group=TGRP-ChaosMonkeyNothingIsSafeTest]
   [junit4]    >         at java.base@9/jdk.internal.misc.Unsafe.park(Native Method)
   [junit4]    >         at java.base@9/java.util.concurrent.locks.LockSupport.parkNanos(LockSupport.java:234)
   [junit4]    >         at java.base@9/java.util.concurrent.SynchronousQueue$TransferStack.awaitFulfill(SynchronousQueue.java:462)
   [junit4]    >         at java.base@9/java.util.concurrent.SynchronousQueue$TransferStack.transfer(SynchronousQueue.java:361)
   [junit4]    >         at java.base@9/java.util.concurrent.SynchronousQueue.poll(SynchronousQueue.java:937)
   [junit4]    >         at java.base@9/java.util.concurrent.ThreadPoolExecutor.getTask(ThreadPoolExecutor.java:1085)
   [junit4]    >         at java.base@9/java.util.concurrent.ThreadPoolExecutor.runWorker(ThreadPoolExecutor.java:1146)
   [junit4]    >         at java.base@9/java.util.concurrent.ThreadPoolExecutor$Worker.run(ThreadPoolExecutor.java:635)
   [junit4]    >         at java.base@9/java.lang.Thread.run(Thread.java:844)
   [junit4]    >    3) Thread[id=4962, name=zkCallback-724-thread-2, state=TIMED_WAITING, group=TGRP-ChaosMonkeyNothingIsSafeTest]
   [junit4]    >         at java.base@9/jdk.internal.misc.Unsafe.park(Native Method)
   [junit4]    >         at java.base@9/java.util.concurrent.locks.LockSupport.parkNanos(LockSupport.java:234)
   [junit4]    >         at java.base@9/java.util.concurrent.SynchronousQueue$TransferStack.awaitFulfill(SynchronousQueue.java:462)
   [junit4]    >         at java.base@9/java.util.concurrent.SynchronousQueue$TransferStack.transfer(SynchronousQueue.java:361)
   [junit4]    >         at java.base@9/java.util.concurrent.SynchronousQueue.poll(SynchronousQueue.java:937)
   [junit4]    >         at java.base@9/java.util.concurrent.ThreadPoolExecutor.getTask(ThreadPoolExecutor.java:1085)
   [junit4]    >         at java.base@9/java.util.concurrent.ThreadPoolExecutor.runWorker(ThreadPoolExecutor.java:1146)
   [junit4]    >         at java.base@9/java.util.concurrent.ThreadPoolExecutor$Worker.run(ThreadPoolExecutor.java:635)
   [junit4]    >         at java.base@9/java.lang.Thread.run(Thread.java:844)
   [junit4]    >    4) Thread[id=4963, name=zkCallback-724-thread-3, state=TIMED_WAITING, group=TGRP-ChaosMonkeyNothingIsSafeTest]
   [junit4]    >         at java.base@9/jdk.internal.misc.Unsafe.park(Native Method)
   [junit4]    >         at java.base@9/java.util.concurrent.locks.LockSupport.parkNanos(LockSupport.java:234)
   [junit4]    >         at java.base@9/java.util.concurrent.SynchronousQueue$TransferStack.awaitFulfill(SynchronousQueue.java:462)
   [junit4]    >         at java.base@9/java.util.concurrent.SynchronousQueue$TransferStack.transfer(SynchronousQueue.java:361)
   [junit4]    >         at java.base@9/java.util.concurrent.SynchronousQueue.poll(SynchronousQueue.java:937)
   [junit4]    >         at java.base@9/java.util.concurrent.ThreadPoolExecutor.getTask(ThreadPoolExecutor.java:1085)
   [junit4]    >         at java.base@9/java.util.concurrent.ThreadPoolExecutor.runWorker(ThreadPoolExecutor.java:1146)
   [junit4]    >         at java.base@9/java.util.concurrent.ThreadPoolExecutor$Worker.run(ThreadPoolExecutor.java:635)
   [junit4]    >         at java.base@9/java.lang.Thread.run(Thread.java:844)
   [junit4]    >    5) Thread[id=4980, name=zkCallback-724-thread-5, state=TIMED_WAITING, group=TGRP-ChaosMonkeyNothingIsSafeTest]
   [junit4]    >         at java.base@9/jdk.internal.misc.Unsafe.park(Native Method)
   [junit4]    >         at java.base@9/java.util.concurrent.locks.LockSupport.parkNanos(LockSupport.java:234)
   [junit4]    >         at java.base@9/java.util.concurrent.SynchronousQueue$TransferStack.awaitFulfill(SynchronousQueue.java:462)
   [junit4]    >         at java.base@9/java.util.concurrent.SynchronousQueue$TransferStack.transfer(SynchronousQueue.java:361)
   [junit4]    >         at java.base@9/java.util.concurrent.SynchronousQueue.poll(SynchronousQueue.java:937)
   [junit4]    >         at java.base@9/java.util.concurrent.ThreadPoolExecutor.getTask(ThreadPoolExecutor.java:1085)
   [junit4]    >         at java.base@9/java.util.concurrent.ThreadPoolExecutor.runWorker(ThreadPoolExecutor.java:1146)
   [junit4]    >         at java.base@9/java.util.concurrent.ThreadPoolExecutor$Worker.run(ThreadPoolExecutor.java:635)
   [junit4]    >         at java.base@9/java.lang.Thread.run(Thread.java:844)
   [junit4]    >    6) Thread[id=4758, name=TEST-ChaosMonkeyNothingIsSafeTest.test-seed#[238068C853D28BA5]-SendThread(127.0.0.1:36547), state=TIMED_WAITING, group=TGRP-ChaosMonkeyNothingIsSafeTest]
   [junit4]    >         at java.base@9/java.lang.Thread.sleep(Native Method)
   [junit4]    >         at app//org.apache.zookeeper.client.StaticHostProvider.next(StaticHostProvider.java:101)
   [junit4]    >         at app//org.apache.zookeeper.ClientCnxn$SendThread.startConnect(ClientCnxn.java:997)
   [junit4]    >         at app//org.apache.zookeeper.ClientCnxn$SendThread.run(ClientCnxn.java:1060)
   [junit4]    >    7) Thread[id=5097, name=zkCallback-724-thread-6, state=TIMED_WAITING, group=TGRP-ChaosMonkeyNothingIsSafeTest]
   [junit4]    >         at java.base@9/jdk.internal.misc.Unsafe.park(Native Method)
   [junit4]    >         at java.base@9/java.util.concurrent.locks.LockSupport.parkNanos(LockSupport.java:234)
   [junit4]    >         at java.base@9/java.util.concurrent.SynchronousQueue$TransferStack.awaitFulfill(SynchronousQueue.java:462)
   [junit4]    >         at java.base@9/java.util.concurrent.SynchronousQueue$TransferStack.transfer(SynchronousQueue.java:361)
   [junit4]    >         at java.base@9/java.util.concurrent.SynchronousQueue.poll(SynchronousQueue.java:937)
   [junit4]    >         at java.base@9/java.util.concurrent.ThreadPoolExecutor.getTask(ThreadPoolExecutor.java:1085)
   [junit4]    >         at java.base@9/java.util.concurrent.ThreadPoolExecutor.runWorker(ThreadPoolExecutor.java:1146)
   [junit4]    >         at java.base@9/java.util.concurrent.ThreadPoolExecutor$Worker.run(ThreadPoolExecutor.java:635)
   [junit4]    >         at java.base@9/java.lang.Thread.run(Thread.java:844)
   [junit4]    > 	at __randomizedtesting.SeedInfo.seed([238068C853D28BA5]:0)
   [junit4] Completed [230/727 (1!)] on J0 in 79.40s, 1 test, 3 errors <<< FAILURES!

[...truncated 38126 lines...]

Mime
View raw message