lucene-dev mailing list archives

Site index · List index
Message view « Date » · « Thread »
Top « Date » · « Thread »
From Policeman Jenkins Server <jenk...@thetaphi.de>
Subject [JENKINS] Lucene-Solr-7.x-MacOSX (64bit/jdk1.8.0) - Build # 104 - Still unstable!
Date Thu, 10 Aug 2017 21:55:39 GMT
Build: https://jenkins.thetaphi.de/job/Lucene-Solr-7.x-MacOSX/104/
Java: 64bit/jdk1.8.0 -XX:-UseCompressedOops -XX:+UseParallelGC

4 tests failed.
FAILED:  org.apache.solr.cloud.CdcrVersionReplicationTest.testCdcrDocVersions

Error Message:
Failed to list contents of /Users/jenkins/workspace/Lucene-Solr-7.x-MacOSX/solr/core/src/test-files/solr

Stack Trace:
java.io.IOException: Failed to list contents of /Users/jenkins/workspace/Lucene-Solr-7.x-MacOSX/solr/core/src/test-files/solr
	at __randomizedtesting.SeedInfo.seed([BC69857AD64601BD:44FF8ED82420EEA1]:0)
	at org.apache.commons.io.FileUtils.doCopyDirectory(FileUtils.java:1426)
	at org.apache.commons.io.FileUtils.copyDirectory(FileUtils.java:1388)
	at org.apache.commons.io.FileUtils.copyDirectory(FileUtils.java:1268)
	at org.apache.commons.io.FileUtils.copyDirectory(FileUtils.java:1237)
	at org.apache.solr.BaseDistributedSearchTestCase.seedSolrHome(BaseDistributedSearchTestCase.java:1100)
	at org.apache.solr.BaseDistributedSearchTestCase.setupJettySolrHome(BaseDistributedSearchTestCase.java:1125)
	at org.apache.solr.cloud.BaseCdcrDistributedZkTest.startServers(BaseCdcrDistributedZkTest.java:584)
	at org.apache.solr.cloud.BaseCdcrDistributedZkTest.createSourceCollection(BaseCdcrDistributedZkTest.java:357)
	at org.apache.solr.cloud.BaseCdcrDistributedZkTest.baseBefore(BaseCdcrDistributedZkTest.java:176)
	at sun.reflect.NativeMethodAccessorImpl.invoke0(Native Method)
	at sun.reflect.NativeMethodAccessorImpl.invoke(NativeMethodAccessorImpl.java:62)
	at sun.reflect.DelegatingMethodAccessorImpl.invoke(DelegatingMethodAccessorImpl.java:43)
	at java.lang.reflect.Method.invoke(Method.java:498)
	at com.carrotsearch.randomizedtesting.RandomizedRunner.invoke(RandomizedRunner.java:1713)
	at com.carrotsearch.randomizedtesting.RandomizedRunner$9.evaluate(RandomizedRunner.java:941)
	at com.carrotsearch.randomizedtesting.RandomizedRunner$10.evaluate(RandomizedRunner.java:957)
	at org.apache.solr.BaseDistributedSearchTestCase$ShardsRepeatRule$ShardsFixedStatement.callStatement(BaseDistributedSearchTestCase.java:993)
	at org.apache.solr.BaseDistributedSearchTestCase$ShardsRepeatRule$ShardsStatement.evaluate(BaseDistributedSearchTestCase.java:968)
	at com.carrotsearch.randomizedtesting.rules.SystemPropertiesRestoreRule$1.evaluate(SystemPropertiesRestoreRule.java:57)
	at org.apache.lucene.util.TestRuleSetupTeardownChained$1.evaluate(TestRuleSetupTeardownChained.java:49)
	at org.apache.lucene.util.AbstractBeforeAfterRule$1.evaluate(AbstractBeforeAfterRule.java:45)
	at org.apache.lucene.util.TestRuleThreadAndTestName$1.evaluate(TestRuleThreadAndTestName.java:48)
	at org.apache.lucene.util.TestRuleIgnoreAfterMaxFailures$1.evaluate(TestRuleIgnoreAfterMaxFailures.java:64)
	at org.apache.lucene.util.TestRuleMarkFailure$1.evaluate(TestRuleMarkFailure.java:47)
	at com.carrotsearch.randomizedtesting.rules.StatementAdapter.evaluate(StatementAdapter.java:36)
	at com.carrotsearch.randomizedtesting.ThreadLeakControl$StatementRunner.run(ThreadLeakControl.java:368)
	at com.carrotsearch.randomizedtesting.ThreadLeakControl.forkTimeoutingTask(ThreadLeakControl.java:817)
	at com.carrotsearch.randomizedtesting.ThreadLeakControl$3.evaluate(ThreadLeakControl.java:468)
	at com.carrotsearch.randomizedtesting.RandomizedRunner.runSingleTest(RandomizedRunner.java:916)
	at com.carrotsearch.randomizedtesting.RandomizedRunner$5.evaluate(RandomizedRunner.java:802)
	at com.carrotsearch.randomizedtesting.RandomizedRunner$6.evaluate(RandomizedRunner.java:852)
	at com.carrotsearch.randomizedtesting.RandomizedRunner$7.evaluate(RandomizedRunner.java:863)
	at com.carrotsearch.randomizedtesting.rules.StatementAdapter.evaluate(StatementAdapter.java:36)
	at com.carrotsearch.randomizedtesting.rules.SystemPropertiesRestoreRule$1.evaluate(SystemPropertiesRestoreRule.java:57)
	at org.apache.lucene.util.AbstractBeforeAfterRule$1.evaluate(AbstractBeforeAfterRule.java:45)
	at com.carrotsearch.randomizedtesting.rules.StatementAdapter.evaluate(StatementAdapter.java:36)
	at org.apache.lucene.util.TestRuleStoreClassName$1.evaluate(TestRuleStoreClassName.java:41)
	at com.carrotsearch.randomizedtesting.rules.NoShadowingOrOverridesOnMethodsRule$1.evaluate(NoShadowingOrOverridesOnMethodsRule.java:40)
	at com.carrotsearch.randomizedtesting.rules.NoShadowingOrOverridesOnMethodsRule$1.evaluate(NoShadowingOrOverridesOnMethodsRule.java:40)
	at com.carrotsearch.randomizedtesting.rules.StatementAdapter.evaluate(StatementAdapter.java:36)
	at com.carrotsearch.randomizedtesting.rules.StatementAdapter.evaluate(StatementAdapter.java:36)
	at com.carrotsearch.randomizedtesting.rules.StatementAdapter.evaluate(StatementAdapter.java:36)
	at org.apache.lucene.util.TestRuleAssertionsRequired$1.evaluate(TestRuleAssertionsRequired.java:53)
	at org.apache.lucene.util.TestRuleMarkFailure$1.evaluate(TestRuleMarkFailure.java:47)
	at org.apache.lucene.util.TestRuleIgnoreAfterMaxFailures$1.evaluate(TestRuleIgnoreAfterMaxFailures.java:64)
	at org.apache.lucene.util.TestRuleIgnoreTestSuites$1.evaluate(TestRuleIgnoreTestSuites.java:54)
	at com.carrotsearch.randomizedtesting.rules.StatementAdapter.evaluate(StatementAdapter.java:36)
	at com.carrotsearch.randomizedtesting.ThreadLeakControl$StatementRunner.run(ThreadLeakControl.java:368)
	at java.lang.Thread.run(Thread.java:748)


FAILED:  junit.framework.TestSuite.org.apache.solr.cloud.CdcrVersionReplicationTest

Error Message:
9 threads leaked from SUITE scope at org.apache.solr.cloud.CdcrVersionReplicationTest:     1) Thread[id=17442, name=Connection evictor, state=TIMED_WAITING, group=TGRP-CdcrVersionReplicationTest]         at java.lang.Thread.sleep(Native Method)         at org.apache.http.impl.client.IdleConnectionEvictor$1.run(IdleConnectionEvictor.java:66)         at java.lang.Thread.run(Thread.java:748)    2) Thread[id=17455, name=zkCallback-3316-thread-4, state=TIMED_WAITING, group=TGRP-CdcrVersionReplicationTest]         at sun.misc.Unsafe.park(Native Method)         at java.util.concurrent.locks.LockSupport.parkNanos(LockSupport.java:215)         at java.util.concurrent.SynchronousQueue$TransferStack.awaitFulfill(SynchronousQueue.java:460)         at java.util.concurrent.SynchronousQueue$TransferStack.transfer(SynchronousQueue.java:362)         at java.util.concurrent.SynchronousQueue.poll(SynchronousQueue.java:941)         at java.util.concurrent.ThreadPoolExecutor.getTask(ThreadPoolExecutor.java:1073)         at java.util.concurrent.ThreadPoolExecutor.runWorker(ThreadPoolExecutor.java:1134)         at java.util.concurrent.ThreadPoolExecutor$Worker.run(ThreadPoolExecutor.java:624)         at java.lang.Thread.run(Thread.java:748)    3) Thread[id=17441, name=Connection evictor, state=TIMED_WAITING, group=TGRP-CdcrVersionReplicationTest]         at java.lang.Thread.sleep(Native Method)         at org.apache.http.impl.client.IdleConnectionEvictor$1.run(IdleConnectionEvictor.java:66)         at java.lang.Thread.run(Thread.java:748)    4) Thread[id=17446, name=TEST-CdcrVersionReplicationTest.testCdcrDocVersions-seed#[BC69857AD64601BD]-SendThread(127.0.0.1:50641), state=TIMED_WAITING, group=TGRP-CdcrVersionReplicationTest]         at java.lang.Thread.sleep(Native Method)         at org.apache.zookeeper.client.StaticHostProvider.next(StaticHostProvider.java:101)         at org.apache.zookeeper.ClientCnxn$SendThread.startConnect(ClientCnxn.java:997)         at org.apache.zookeeper.ClientCnxn$SendThread.run(ClientCnxn.java:1060)    5) Thread[id=17448, name=zkCallback-3316-thread-1, state=TIMED_WAITING, group=TGRP-CdcrVersionReplicationTest]         at sun.misc.Unsafe.park(Native Method)         at java.util.concurrent.locks.LockSupport.parkNanos(LockSupport.java:215)         at java.util.concurrent.SynchronousQueue$TransferStack.awaitFulfill(SynchronousQueue.java:460)         at java.util.concurrent.SynchronousQueue$TransferStack.transfer(SynchronousQueue.java:362)         at java.util.concurrent.SynchronousQueue.poll(SynchronousQueue.java:941)         at java.util.concurrent.ThreadPoolExecutor.getTask(ThreadPoolExecutor.java:1073)         at java.util.concurrent.ThreadPoolExecutor.runWorker(ThreadPoolExecutor.java:1134)         at java.util.concurrent.ThreadPoolExecutor$Worker.run(ThreadPoolExecutor.java:624)         at java.lang.Thread.run(Thread.java:748)    6) Thread[id=17454, name=zkCallback-3316-thread-3, state=TIMED_WAITING, group=TGRP-CdcrVersionReplicationTest]         at sun.misc.Unsafe.park(Native Method)         at java.util.concurrent.locks.LockSupport.parkNanos(LockSupport.java:215)         at java.util.concurrent.SynchronousQueue$TransferStack.awaitFulfill(SynchronousQueue.java:460)         at java.util.concurrent.SynchronousQueue$TransferStack.transfer(SynchronousQueue.java:362)         at java.util.concurrent.SynchronousQueue.poll(SynchronousQueue.java:941)         at java.util.concurrent.ThreadPoolExecutor.getTask(ThreadPoolExecutor.java:1073)         at java.util.concurrent.ThreadPoolExecutor.runWorker(ThreadPoolExecutor.java:1134)         at java.util.concurrent.ThreadPoolExecutor$Worker.run(ThreadPoolExecutor.java:624)         at java.lang.Thread.run(Thread.java:748)    7) Thread[id=17456, name=zkCallback-3316-thread-5, state=TIMED_WAITING, group=TGRP-CdcrVersionReplicationTest]         at sun.misc.Unsafe.park(Native Method)         at java.util.concurrent.locks.LockSupport.parkNanos(LockSupport.java:215)         at java.util.concurrent.SynchronousQueue$TransferStack.awaitFulfill(SynchronousQueue.java:460)         at java.util.concurrent.SynchronousQueue$TransferStack.transfer(SynchronousQueue.java:362)         at java.util.concurrent.SynchronousQueue.poll(SynchronousQueue.java:941)         at java.util.concurrent.ThreadPoolExecutor.getTask(ThreadPoolExecutor.java:1073)         at java.util.concurrent.ThreadPoolExecutor.runWorker(ThreadPoolExecutor.java:1134)         at java.util.concurrent.ThreadPoolExecutor$Worker.run(ThreadPoolExecutor.java:624)         at java.lang.Thread.run(Thread.java:748)    8) Thread[id=17452, name=zkCallback-3316-thread-2-processing-n:127.0.0.1:50652_, state=TIMED_WAITING, group=TGRP-CdcrVersionReplicationTest]         at java.lang.Thread.sleep(Native Method)         at org.apache.solr.common.cloud.ZkCmdExecutor.retryDelay(ZkCmdExecutor.java:111)         at org.apache.solr.common.cloud.ZkCmdExecutor.retryOperation(ZkCmdExecutor.java:70)         at org.apache.solr.common.cloud.SolrZkClient.exists(SolrZkClient.java:320)         at org.apache.solr.common.cloud.ZkCmdExecutor.ensureExists(ZkCmdExecutor.java:93)         at org.apache.solr.common.cloud.ZkCmdExecutor.ensureExists(ZkCmdExecutor.java:78)         at org.apache.solr.cloud.DistributedQueue.<init>(DistributedQueue.java:104)         at org.apache.solr.cloud.Overseer.getStateUpdateQueue(Overseer.java:632)         at org.apache.solr.cloud.Overseer$ClusterStateUpdater.<init>(Overseer.java:101)         at org.apache.solr.cloud.Overseer.start(Overseer.java:515)         at org.apache.solr.cloud.OverseerElectionContext.runLeaderProcess(ElectionContext.java:784)         at org.apache.solr.cloud.LeaderElector.runIamLeaderProcess(LeaderElector.java:170)         at org.apache.solr.cloud.LeaderElector.checkIfIamLeader(LeaderElector.java:135)         at org.apache.solr.cloud.LeaderElector.access$200(LeaderElector.java:56)         at org.apache.solr.cloud.LeaderElector$ElectionWatcher.process(LeaderElector.java:348)         at org.apache.solr.common.cloud.SolrZkClient$3.lambda$process$0(SolrZkClient.java:269)         at org.apache.solr.common.cloud.SolrZkClient$3$$Lambda$182/1793901903.run(Unknown Source)         at java.util.concurrent.Executors$RunnableAdapter.call(Executors.java:511)         at java.util.concurrent.FutureTask.run(FutureTask.java:266)         at org.apache.solr.common.util.ExecutorUtil$MDCAwareThreadPoolExecutor.lambda$execute$0(ExecutorUtil.java:188)         at org.apache.solr.common.util.ExecutorUtil$MDCAwareThreadPoolExecutor$$Lambda$111/1376189292.run(Unknown Source)         at java.util.concurrent.ThreadPoolExecutor.runWorker(ThreadPoolExecutor.java:1149)         at java.util.concurrent.ThreadPoolExecutor$Worker.run(ThreadPoolExecutor.java:624)         at java.lang.Thread.run(Thread.java:748)    9) Thread[id=17447, name=TEST-CdcrVersionReplicationTest.testCdcrDocVersions-seed#[BC69857AD64601BD]-EventThread, state=WAITING, group=TGRP-CdcrVersionReplicationTest]         at sun.misc.Unsafe.park(Native Method)         at java.util.concurrent.locks.LockSupport.park(LockSupport.java:175)         at java.util.concurrent.locks.AbstractQueuedSynchronizer$ConditionObject.await(AbstractQueuedSynchronizer.java:2039)         at java.util.concurrent.LinkedBlockingQueue.take(LinkedBlockingQueue.java:442)         at org.apache.zookeeper.ClientCnxn$EventThread.run(ClientCnxn.java:501)

Stack Trace:
com.carrotsearch.randomizedtesting.ThreadLeakError: 9 threads leaked from SUITE scope at org.apache.solr.cloud.CdcrVersionReplicationTest: 
   1) Thread[id=17442, name=Connection evictor, state=TIMED_WAITING, group=TGRP-CdcrVersionReplicationTest]
        at java.lang.Thread.sleep(Native Method)
        at org.apache.http.impl.client.IdleConnectionEvictor$1.run(IdleConnectionEvictor.java:66)
        at java.lang.Thread.run(Thread.java:748)
   2) Thread[id=17455, name=zkCallback-3316-thread-4, state=TIMED_WAITING, group=TGRP-CdcrVersionReplicationTest]
        at sun.misc.Unsafe.park(Native Method)
        at java.util.concurrent.locks.LockSupport.parkNanos(LockSupport.java:215)
        at java.util.concurrent.SynchronousQueue$TransferStack.awaitFulfill(SynchronousQueue.java:460)
        at java.util.concurrent.SynchronousQueue$TransferStack.transfer(SynchronousQueue.java:362)
        at java.util.concurrent.SynchronousQueue.poll(SynchronousQueue.java:941)
        at java.util.concurrent.ThreadPoolExecutor.getTask(ThreadPoolExecutor.java:1073)
        at java.util.concurrent.ThreadPoolExecutor.runWorker(ThreadPoolExecutor.java:1134)
        at java.util.concurrent.ThreadPoolExecutor$Worker.run(ThreadPoolExecutor.java:624)
        at java.lang.Thread.run(Thread.java:748)
   3) Thread[id=17441, name=Connection evictor, state=TIMED_WAITING, group=TGRP-CdcrVersionReplicationTest]
        at java.lang.Thread.sleep(Native Method)
        at org.apache.http.impl.client.IdleConnectionEvictor$1.run(IdleConnectionEvictor.java:66)
        at java.lang.Thread.run(Thread.java:748)
   4) Thread[id=17446, name=TEST-CdcrVersionReplicationTest.testCdcrDocVersions-seed#[BC69857AD64601BD]-SendThread(127.0.0.1:50641), state=TIMED_WAITING, group=TGRP-CdcrVersionReplicationTest]
        at java.lang.Thread.sleep(Native Method)
        at org.apache.zookeeper.client.StaticHostProvider.next(StaticHostProvider.java:101)
        at org.apache.zookeeper.ClientCnxn$SendThread.startConnect(ClientCnxn.java:997)
        at org.apache.zookeeper.ClientCnxn$SendThread.run(ClientCnxn.java:1060)
   5) Thread[id=17448, name=zkCallback-3316-thread-1, state=TIMED_WAITING, group=TGRP-CdcrVersionReplicationTest]
        at sun.misc.Unsafe.park(Native Method)
        at java.util.concurrent.locks.LockSupport.parkNanos(LockSupport.java:215)
        at java.util.concurrent.SynchronousQueue$TransferStack.awaitFulfill(SynchronousQueue.java:460)
        at java.util.concurrent.SynchronousQueue$TransferStack.transfer(SynchronousQueue.java:362)
        at java.util.concurrent.SynchronousQueue.poll(SynchronousQueue.java:941)
        at java.util.concurrent.ThreadPoolExecutor.getTask(ThreadPoolExecutor.java:1073)
        at java.util.concurrent.ThreadPoolExecutor.runWorker(ThreadPoolExecutor.java:1134)
        at java.util.concurrent.ThreadPoolExecutor$Worker.run(ThreadPoolExecutor.java:624)
        at java.lang.Thread.run(Thread.java:748)
   6) Thread[id=17454, name=zkCallback-3316-thread-3, state=TIMED_WAITING, group=TGRP-CdcrVersionReplicationTest]
        at sun.misc.Unsafe.park(Native Method)
        at java.util.concurrent.locks.LockSupport.parkNanos(LockSupport.java:215)
        at java.util.concurrent.SynchronousQueue$TransferStack.awaitFulfill(SynchronousQueue.java:460)
        at java.util.concurrent.SynchronousQueue$TransferStack.transfer(SynchronousQueue.java:362)
        at java.util.concurrent.SynchronousQueue.poll(SynchronousQueue.java:941)
        at java.util.concurrent.ThreadPoolExecutor.getTask(ThreadPoolExecutor.java:1073)
        at java.util.concurrent.ThreadPoolExecutor.runWorker(ThreadPoolExecutor.java:1134)
        at java.util.concurrent.ThreadPoolExecutor$Worker.run(ThreadPoolExecutor.java:624)
        at java.lang.Thread.run(Thread.java:748)
   7) Thread[id=17456, name=zkCallback-3316-thread-5, state=TIMED_WAITING, group=TGRP-CdcrVersionReplicationTest]
        at sun.misc.Unsafe.park(Native Method)
        at java.util.concurrent.locks.LockSupport.parkNanos(LockSupport.java:215)
        at java.util.concurrent.SynchronousQueue$TransferStack.awaitFulfill(SynchronousQueue.java:460)
        at java.util.concurrent.SynchronousQueue$TransferStack.transfer(SynchronousQueue.java:362)
        at java.util.concurrent.SynchronousQueue.poll(SynchronousQueue.java:941)
        at java.util.concurrent.ThreadPoolExecutor.getTask(ThreadPoolExecutor.java:1073)
        at java.util.concurrent.ThreadPoolExecutor.runWorker(ThreadPoolExecutor.java:1134)
        at java.util.concurrent.ThreadPoolExecutor$Worker.run(ThreadPoolExecutor.java:624)
        at java.lang.Thread.run(Thread.java:748)
   8) Thread[id=17452, name=zkCallback-3316-thread-2-processing-n:127.0.0.1:50652_, state=TIMED_WAITING, group=TGRP-CdcrVersionReplicationTest]
        at java.lang.Thread.sleep(Native Method)
        at org.apache.solr.common.cloud.ZkCmdExecutor.retryDelay(ZkCmdExecutor.java:111)
        at org.apache.solr.common.cloud.ZkCmdExecutor.retryOperation(ZkCmdExecutor.java:70)
        at org.apache.solr.common.cloud.SolrZkClient.exists(SolrZkClient.java:320)
        at org.apache.solr.common.cloud.ZkCmdExecutor.ensureExists(ZkCmdExecutor.java:93)
        at org.apache.solr.common.cloud.ZkCmdExecutor.ensureExists(ZkCmdExecutor.java:78)
        at org.apache.solr.cloud.DistributedQueue.<init>(DistributedQueue.java:104)
        at org.apache.solr.cloud.Overseer.getStateUpdateQueue(Overseer.java:632)
        at org.apache.solr.cloud.Overseer$ClusterStateUpdater.<init>(Overseer.java:101)
        at org.apache.solr.cloud.Overseer.start(Overseer.java:515)
        at org.apache.solr.cloud.OverseerElectionContext.runLeaderProcess(ElectionContext.java:784)
        at org.apache.solr.cloud.LeaderElector.runIamLeaderProcess(LeaderElector.java:170)
        at org.apache.solr.cloud.LeaderElector.checkIfIamLeader(LeaderElector.java:135)
        at org.apache.solr.cloud.LeaderElector.access$200(LeaderElector.java:56)
        at org.apache.solr.cloud.LeaderElector$ElectionWatcher.process(LeaderElector.java:348)
        at org.apache.solr.common.cloud.SolrZkClient$3.lambda$process$0(SolrZkClient.java:269)
        at org.apache.solr.common.cloud.SolrZkClient$3$$Lambda$182/1793901903.run(Unknown Source)
        at java.util.concurrent.Executors$RunnableAdapter.call(Executors.java:511)
        at java.util.concurrent.FutureTask.run(FutureTask.java:266)
        at org.apache.solr.common.util.ExecutorUtil$MDCAwareThreadPoolExecutor.lambda$execute$0(ExecutorUtil.java:188)
        at org.apache.solr.common.util.ExecutorUtil$MDCAwareThreadPoolExecutor$$Lambda$111/1376189292.run(Unknown Source)
        at java.util.concurrent.ThreadPoolExecutor.runWorker(ThreadPoolExecutor.java:1149)
        at java.util.concurrent.ThreadPoolExecutor$Worker.run(ThreadPoolExecutor.java:624)
        at java.lang.Thread.run(Thread.java:748)
   9) Thread[id=17447, name=TEST-CdcrVersionReplicationTest.testCdcrDocVersions-seed#[BC69857AD64601BD]-EventThread, state=WAITING, group=TGRP-CdcrVersionReplicationTest]
        at sun.misc.Unsafe.park(Native Method)
        at java.util.concurrent.locks.LockSupport.park(LockSupport.java:175)
        at java.util.concurrent.locks.AbstractQueuedSynchronizer$ConditionObject.await(AbstractQueuedSynchronizer.java:2039)
        at java.util.concurrent.LinkedBlockingQueue.take(LinkedBlockingQueue.java:442)
        at org.apache.zookeeper.ClientCnxn$EventThread.run(ClientCnxn.java:501)
	at __randomizedtesting.SeedInfo.seed([BC69857AD64601BD]:0)


FAILED:  junit.framework.TestSuite.org.apache.solr.cloud.CdcrVersionReplicationTest

Error Message:
There are still zombie threads that couldn't be terminated:    1) Thread[id=17455, name=zkCallback-3316-thread-4, state=TIMED_WAITING, group=TGRP-CdcrVersionReplicationTest]         at sun.misc.Unsafe.park(Native Method)         at java.util.concurrent.locks.LockSupport.parkNanos(LockSupport.java:215)         at java.util.concurrent.SynchronousQueue$TransferStack.awaitFulfill(SynchronousQueue.java:460)         at java.util.concurrent.SynchronousQueue$TransferStack.transfer(SynchronousQueue.java:362)         at java.util.concurrent.SynchronousQueue.poll(SynchronousQueue.java:941)         at java.util.concurrent.ThreadPoolExecutor.getTask(ThreadPoolExecutor.java:1073)         at java.util.concurrent.ThreadPoolExecutor.runWorker(ThreadPoolExecutor.java:1134)         at java.util.concurrent.ThreadPoolExecutor$Worker.run(ThreadPoolExecutor.java:624)         at java.lang.Thread.run(Thread.java:748)    2) Thread[id=17446, name=TEST-CdcrVersionReplicationTest.testCdcrDocVersions-seed#[BC69857AD64601BD]-SendThread(127.0.0.1:50641), state=TIMED_WAITING, group=TGRP-CdcrVersionReplicationTest]         at java.lang.Thread.sleep(Native Method)         at org.apache.zookeeper.ClientCnxn$SendThread.run(ClientCnxn.java:1051)    3) Thread[id=17448, name=zkCallback-3316-thread-1, state=TIMED_WAITING, group=TGRP-CdcrVersionReplicationTest]         at sun.misc.Unsafe.park(Native Method)         at java.util.concurrent.locks.LockSupport.parkNanos(LockSupport.java:215)         at java.util.concurrent.SynchronousQueue$TransferStack.awaitFulfill(SynchronousQueue.java:460)         at java.util.concurrent.SynchronousQueue$TransferStack.transfer(SynchronousQueue.java:362)         at java.util.concurrent.SynchronousQueue.poll(SynchronousQueue.java:941)         at java.util.concurrent.ThreadPoolExecutor.getTask(ThreadPoolExecutor.java:1073)         at java.util.concurrent.ThreadPoolExecutor.runWorker(ThreadPoolExecutor.java:1134)         at java.util.concurrent.ThreadPoolExecutor$Worker.run(ThreadPoolExecutor.java:624)         at java.lang.Thread.run(Thread.java:748)    4) Thread[id=17454, name=zkCallback-3316-thread-3, state=TIMED_WAITING, group=TGRP-CdcrVersionReplicationTest]         at sun.misc.Unsafe.park(Native Method)         at java.util.concurrent.locks.LockSupport.parkNanos(LockSupport.java:215)         at java.util.concurrent.SynchronousQueue$TransferStack.awaitFulfill(SynchronousQueue.java:460)         at java.util.concurrent.SynchronousQueue$TransferStack.transfer(SynchronousQueue.java:362)         at java.util.concurrent.SynchronousQueue.poll(SynchronousQueue.java:941)         at java.util.concurrent.ThreadPoolExecutor.getTask(ThreadPoolExecutor.java:1073)         at java.util.concurrent.ThreadPoolExecutor.runWorker(ThreadPoolExecutor.java:1134)         at java.util.concurrent.ThreadPoolExecutor$Worker.run(ThreadPoolExecutor.java:624)         at java.lang.Thread.run(Thread.java:748)    5) Thread[id=17456, name=zkCallback-3316-thread-5, state=TIMED_WAITING, group=TGRP-CdcrVersionReplicationTest]         at sun.misc.Unsafe.park(Native Method)         at java.util.concurrent.locks.LockSupport.parkNanos(LockSupport.java:215)         at java.util.concurrent.SynchronousQueue$TransferStack.awaitFulfill(SynchronousQueue.java:460)         at java.util.concurrent.SynchronousQueue$TransferStack.transfer(SynchronousQueue.java:362)         at java.util.concurrent.SynchronousQueue.poll(SynchronousQueue.java:941)         at java.util.concurrent.ThreadPoolExecutor.getTask(ThreadPoolExecutor.java:1073)         at java.util.concurrent.ThreadPoolExecutor.runWorker(ThreadPoolExecutor.java:1134)         at java.util.concurrent.ThreadPoolExecutor$Worker.run(ThreadPoolExecutor.java:624)         at java.lang.Thread.run(Thread.java:748)    6) Thread[id=17452, name=zkCallback-3316-thread-2, state=TIMED_WAITING, group=TGRP-CdcrVersionReplicationTest]         at sun.misc.Unsafe.park(Native Method)         at java.util.concurrent.locks.LockSupport.parkNanos(LockSupport.java:215)         at java.util.concurrent.SynchronousQueue$TransferStack.awaitFulfill(SynchronousQueue.java:460)         at java.util.concurrent.SynchronousQueue$TransferStack.transfer(SynchronousQueue.java:362)         at java.util.concurrent.SynchronousQueue.poll(SynchronousQueue.java:941)         at java.util.concurrent.ThreadPoolExecutor.getTask(ThreadPoolExecutor.java:1073)         at java.util.concurrent.ThreadPoolExecutor.runWorker(ThreadPoolExecutor.java:1134)         at java.util.concurrent.ThreadPoolExecutor$Worker.run(ThreadPoolExecutor.java:624)         at java.lang.Thread.run(Thread.java:748)

Stack Trace:
com.carrotsearch.randomizedtesting.ThreadLeakError: There are still zombie threads that couldn't be terminated:
   1) Thread[id=17455, name=zkCallback-3316-thread-4, state=TIMED_WAITING, group=TGRP-CdcrVersionReplicationTest]
        at sun.misc.Unsafe.park(Native Method)
        at java.util.concurrent.locks.LockSupport.parkNanos(LockSupport.java:215)
        at java.util.concurrent.SynchronousQueue$TransferStack.awaitFulfill(SynchronousQueue.java:460)
        at java.util.concurrent.SynchronousQueue$TransferStack.transfer(SynchronousQueue.java:362)
        at java.util.concurrent.SynchronousQueue.poll(SynchronousQueue.java:941)
        at java.util.concurrent.ThreadPoolExecutor.getTask(ThreadPoolExecutor.java:1073)
        at java.util.concurrent.ThreadPoolExecutor.runWorker(ThreadPoolExecutor.java:1134)
        at java.util.concurrent.ThreadPoolExecutor$Worker.run(ThreadPoolExecutor.java:624)
        at java.lang.Thread.run(Thread.java:748)
   2) Thread[id=17446, name=TEST-CdcrVersionReplicationTest.testCdcrDocVersions-seed#[BC69857AD64601BD]-SendThread(127.0.0.1:50641), state=TIMED_WAITING, group=TGRP-CdcrVersionReplicationTest]
        at java.lang.Thread.sleep(Native Method)
        at org.apache.zookeeper.ClientCnxn$SendThread.run(ClientCnxn.java:1051)
   3) Thread[id=17448, name=zkCallback-3316-thread-1, state=TIMED_WAITING, group=TGRP-CdcrVersionReplicationTest]
        at sun.misc.Unsafe.park(Native Method)
        at java.util.concurrent.locks.LockSupport.parkNanos(LockSupport.java:215)
        at java.util.concurrent.SynchronousQueue$TransferStack.awaitFulfill(SynchronousQueue.java:460)
        at java.util.concurrent.SynchronousQueue$TransferStack.transfer(SynchronousQueue.java:362)
        at java.util.concurrent.SynchronousQueue.poll(SynchronousQueue.java:941)
        at java.util.concurrent.ThreadPoolExecutor.getTask(ThreadPoolExecutor.java:1073)
        at java.util.concurrent.ThreadPoolExecutor.runWorker(ThreadPoolExecutor.java:1134)
        at java.util.concurrent.ThreadPoolExecutor$Worker.run(ThreadPoolExecutor.java:624)
        at java.lang.Thread.run(Thread.java:748)
   4) Thread[id=17454, name=zkCallback-3316-thread-3, state=TIMED_WAITING, group=TGRP-CdcrVersionReplicationTest]
        at sun.misc.Unsafe.park(Native Method)
        at java.util.concurrent.locks.LockSupport.parkNanos(LockSupport.java:215)
        at java.util.concurrent.SynchronousQueue$TransferStack.awaitFulfill(SynchronousQueue.java:460)
        at java.util.concurrent.SynchronousQueue$TransferStack.transfer(SynchronousQueue.java:362)
        at java.util.concurrent.SynchronousQueue.poll(SynchronousQueue.java:941)
        at java.util.concurrent.ThreadPoolExecutor.getTask(ThreadPoolExecutor.java:1073)
        at java.util.concurrent.ThreadPoolExecutor.runWorker(ThreadPoolExecutor.java:1134)
        at java.util.concurrent.ThreadPoolExecutor$Worker.run(ThreadPoolExecutor.java:624)
        at java.lang.Thread.run(Thread.java:748)
   5) Thread[id=17456, name=zkCallback-3316-thread-5, state=TIMED_WAITING, group=TGRP-CdcrVersionReplicationTest]
        at sun.misc.Unsafe.park(Native Method)
        at java.util.concurrent.locks.LockSupport.parkNanos(LockSupport.java:215)
        at java.util.concurrent.SynchronousQueue$TransferStack.awaitFulfill(SynchronousQueue.java:460)
        at java.util.concurrent.SynchronousQueue$TransferStack.transfer(SynchronousQueue.java:362)
        at java.util.concurrent.SynchronousQueue.poll(SynchronousQueue.java:941)
        at java.util.concurrent.ThreadPoolExecutor.getTask(ThreadPoolExecutor.java:1073)
        at java.util.concurrent.ThreadPoolExecutor.runWorker(ThreadPoolExecutor.java:1134)
        at java.util.concurrent.ThreadPoolExecutor$Worker.run(ThreadPoolExecutor.java:624)
        at java.lang.Thread.run(Thread.java:748)
   6) Thread[id=17452, name=zkCallback-3316-thread-2, state=TIMED_WAITING, group=TGRP-CdcrVersionReplicationTest]
        at sun.misc.Unsafe.park(Native Method)
        at java.util.concurrent.locks.LockSupport.parkNanos(LockSupport.java:215)
        at java.util.concurrent.SynchronousQueue$TransferStack.awaitFulfill(SynchronousQueue.java:460)
        at java.util.concurrent.SynchronousQueue$TransferStack.transfer(SynchronousQueue.java:362)
        at java.util.concurrent.SynchronousQueue.poll(SynchronousQueue.java:941)
        at java.util.concurrent.ThreadPoolExecutor.getTask(ThreadPoolExecutor.java:1073)
        at java.util.concurrent.ThreadPoolExecutor.runWorker(ThreadPoolExecutor.java:1134)
        at java.util.concurrent.ThreadPoolExecutor$Worker.run(ThreadPoolExecutor.java:624)
        at java.lang.Thread.run(Thread.java:748)
	at __randomizedtesting.SeedInfo.seed([BC69857AD64601BD]:0)


FAILED:  org.apache.solr.cloud.FullSolrCloudDistribCmdsTest.test

Error Message:
Could not find collection:collection2

Stack Trace:
java.lang.AssertionError: Could not find collection:collection2
	at __randomizedtesting.SeedInfo.seed([BC69857AD64601BD:343DBAA078BA6C45]:0)
	at org.junit.Assert.fail(Assert.java:93)
	at org.junit.Assert.assertTrue(Assert.java:43)
	at org.junit.Assert.assertNotNull(Assert.java:526)
	at org.apache.solr.cloud.AbstractDistribZkTestBase.waitForRecoveriesToFinish(AbstractDistribZkTestBase.java:155)
	at org.apache.solr.cloud.AbstractDistribZkTestBase.waitForRecoveriesToFinish(AbstractDistribZkTestBase.java:140)
	at org.apache.solr.cloud.AbstractDistribZkTestBase.waitForRecoveriesToFinish(AbstractDistribZkTestBase.java:135)
	at org.apache.solr.cloud.AbstractFullDistribZkTestBase.waitForRecoveriesToFinish(AbstractFullDistribZkTestBase.java:908)
	at org.apache.solr.cloud.FullSolrCloudDistribCmdsTest.testIndexingBatchPerRequestWithHttpSolrClient(FullSolrCloudDistribCmdsTest.java:612)
	at org.apache.solr.cloud.FullSolrCloudDistribCmdsTest.test(FullSolrCloudDistribCmdsTest.java:152)
	at sun.reflect.NativeMethodAccessorImpl.invoke0(Native Method)
	at sun.reflect.NativeMethodAccessorImpl.invoke(NativeMethodAccessorImpl.java:62)
	at sun.reflect.DelegatingMethodAccessorImpl.invoke(DelegatingMethodAccessorImpl.java:43)
	at java.lang.reflect.Method.invoke(Method.java:498)
	at com.carrotsearch.randomizedtesting.RandomizedRunner.invoke(RandomizedRunner.java:1713)
	at com.carrotsearch.randomizedtesting.RandomizedRunner$8.evaluate(RandomizedRunner.java:907)
	at com.carrotsearch.randomizedtesting.RandomizedRunner$9.evaluate(RandomizedRunner.java:943)
	at com.carrotsearch.randomizedtesting.RandomizedRunner$10.evaluate(RandomizedRunner.java:957)
	at org.apache.solr.BaseDistributedSearchTestCase$ShardsRepeatRule$ShardsFixedStatement.callStatement(BaseDistributedSearchTestCase.java:993)
	at org.apache.solr.BaseDistributedSearchTestCase$ShardsRepeatRule$ShardsStatement.evaluate(BaseDistributedSearchTestCase.java:968)
	at com.carrotsearch.randomizedtesting.rules.SystemPropertiesRestoreRule$1.evaluate(SystemPropertiesRestoreRule.java:57)
	at org.apache.lucene.util.TestRuleSetupTeardownChained$1.evaluate(TestRuleSetupTeardownChained.java:49)
	at org.apache.lucene.util.AbstractBeforeAfterRule$1.evaluate(AbstractBeforeAfterRule.java:45)
	at org.apache.lucene.util.TestRuleThreadAndTestName$1.evaluate(TestRuleThreadAndTestName.java:48)
	at org.apache.lucene.util.TestRuleIgnoreAfterMaxFailures$1.evaluate(TestRuleIgnoreAfterMaxFailures.java:64)
	at org.apache.lucene.util.TestRuleMarkFailure$1.evaluate(TestRuleMarkFailure.java:47)
	at com.carrotsearch.randomizedtesting.rules.StatementAdapter.evaluate(StatementAdapter.java:36)
	at com.carrotsearch.randomizedtesting.ThreadLeakControl$StatementRunner.run(ThreadLeakControl.java:368)
	at com.carrotsearch.randomizedtesting.ThreadLeakControl.forkTimeoutingTask(ThreadLeakControl.java:817)
	at com.carrotsearch.randomizedtesting.ThreadLeakControl$3.evaluate(ThreadLeakControl.java:468)
	at com.carrotsearch.randomizedtesting.RandomizedRunner.runSingleTest(RandomizedRunner.java:916)
	at com.carrotsearch.randomizedtesting.RandomizedRunner$5.evaluate(RandomizedRunner.java:802)
	at com.carrotsearch.randomizedtesting.RandomizedRunner$6.evaluate(RandomizedRunner.java:852)
	at com.carrotsearch.randomizedtesting.RandomizedRunner$7.evaluate(RandomizedRunner.java:863)
	at com.carrotsearch.randomizedtesting.rules.StatementAdapter.evaluate(StatementAdapter.java:36)
	at com.carrotsearch.randomizedtesting.rules.SystemPropertiesRestoreRule$1.evaluate(SystemPropertiesRestoreRule.java:57)
	at org.apache.lucene.util.AbstractBeforeAfterRule$1.evaluate(AbstractBeforeAfterRule.java:45)
	at com.carrotsearch.randomizedtesting.rules.StatementAdapter.evaluate(StatementAdapter.java:36)
	at org.apache.lucene.util.TestRuleStoreClassName$1.evaluate(TestRuleStoreClassName.java:41)
	at com.carrotsearch.randomizedtesting.rules.NoShadowingOrOverridesOnMethodsRule$1.evaluate(NoShadowingOrOverridesOnMethodsRule.java:40)
	at com.carrotsearch.randomizedtesting.rules.NoShadowingOrOverridesOnMethodsRule$1.evaluate(NoShadowingOrOverridesOnMethodsRule.java:40)
	at com.carrotsearch.randomizedtesting.rules.StatementAdapter.evaluate(StatementAdapter.java:36)
	at com.carrotsearch.randomizedtesting.rules.StatementAdapter.evaluate(StatementAdapter.java:36)
	at com.carrotsearch.randomizedtesting.rules.StatementAdapter.evaluate(StatementAdapter.java:36)
	at org.apache.lucene.util.TestRuleAssertionsRequired$1.evaluate(TestRuleAssertionsRequired.java:53)
	at org.apache.lucene.util.TestRuleMarkFailure$1.evaluate(TestRuleMarkFailure.java:47)
	at org.apache.lucene.util.TestRuleIgnoreAfterMaxFailures$1.evaluate(TestRuleIgnoreAfterMaxFailures.java:64)
	at org.apache.lucene.util.TestRuleIgnoreTestSuites$1.evaluate(TestRuleIgnoreTestSuites.java:54)
	at com.carrotsearch.randomizedtesting.rules.StatementAdapter.evaluate(StatementAdapter.java:36)
	at com.carrotsearch.randomizedtesting.ThreadLeakControl$StatementRunner.run(ThreadLeakControl.java:368)
	at java.lang.Thread.run(Thread.java:748)




Build Log:
[...truncated 11956 lines...]
   [junit4] Suite: org.apache.solr.cloud.FullSolrCloudDistribCmdsTest
   [junit4]   2> 1349132 INFO  (SUITE-FullSolrCloudDistribCmdsTest-seed#[BC69857AD64601BD]-worker) [    ] o.a.s.SolrTestCaseJ4 SecureRandom sanity checks: test.solr.allowed.securerandom=null & java.security.egd=file:/dev/./urandom
   [junit4]   2> Creating dataDir: /Users/jenkins/workspace/Lucene-Solr-7.x-MacOSX/solr/build/solr-core/test/J1/temp/solr.cloud.FullSolrCloudDistribCmdsTest_BC69857AD64601BD-001/init-core-data-001
   [junit4]   2> 1349133 WARN  (SUITE-FullSolrCloudDistribCmdsTest-seed#[BC69857AD64601BD]-worker) [    ] o.a.s.SolrTestCaseJ4 startTrackingSearchers: numOpens=2 numCloses=2
   [junit4]   2> 1349133 INFO  (SUITE-FullSolrCloudDistribCmdsTest-seed#[BC69857AD64601BD]-worker) [    ] o.a.s.SolrTestCaseJ4 Using TrieFields (NUMERIC_POINTS_SYSPROP=false) w/NUMERIC_DOCVALUES_SYSPROP=true
   [junit4]   2> 1349135 INFO  (SUITE-FullSolrCloudDistribCmdsTest-seed#[BC69857AD64601BD]-worker) [    ] o.a.s.SolrTestCaseJ4 Randomized ssl (false) and clientAuth (false) via: @org.apache.solr.SolrTestCaseJ4$SuppressSSL(bugUrl=https://issues.apache.org/jira/browse/SOLR-5776) w/ MAC_OS_X supressed clientAuth
   [junit4]   2> 1349135 INFO  (SUITE-FullSolrCloudDistribCmdsTest-seed#[BC69857AD64601BD]-worker) [    ] o.a.s.BaseDistributedSearchTestCase Setting hostContext system property: /
   [junit4]   2> 1349137 INFO  (TEST-FullSolrCloudDistribCmdsTest.test-seed#[BC69857AD64601BD]) [    ] o.a.s.c.ZkTestServer STARTING ZK TEST SERVER
   [junit4]   2> 1349137 INFO  (Thread-3053) [    ] o.a.s.c.ZkTestServer client port:0.0.0.0/0.0.0.0:0
   [junit4]   2> 1349137 INFO  (Thread-3053) [    ] o.a.s.c.ZkTestServer Starting server
   [junit4]   2> 1349139 ERROR (Thread-3053) [    ] o.a.z.s.ZooKeeperServer ZKShutdownHandler is not registered, so ZooKeeper server won't take any action on ERROR or SHUTDOWN server state changes
   [junit4]   2> 1349247 INFO  (TEST-FullSolrCloudDistribCmdsTest.test-seed#[BC69857AD64601BD]) [    ] o.a.s.c.ZkTestServer start zk server on port:50328
   [junit4]   2> 1349318 INFO  (TEST-FullSolrCloudDistribCmdsTest.test-seed#[BC69857AD64601BD]) [    ] o.a.s.c.AbstractZkTestCase put /Users/jenkins/workspace/Lucene-Solr-7.x-MacOSX/solr/core/src/test-files/solr/collection1/conf/solrconfig-tlog.xml to /configs/conf1/solrconfig.xml
   [junit4]   2> 1349321 INFO  (TEST-FullSolrCloudDistribCmdsTest.test-seed#[BC69857AD64601BD]) [    ] o.a.s.c.AbstractZkTestCase put /Users/jenkins/workspace/Lucene-Solr-7.x-MacOSX/solr/core/src/test-files/solr/collection1/conf/schema15.xml to /configs/conf1/schema.xml
   [junit4]   2> 1349323 INFO  (TEST-FullSolrCloudDistribCmdsTest.test-seed#[BC69857AD64601BD]) [    ] o.a.s.c.AbstractZkTestCase put /Users/jenkins/workspace/Lucene-Solr-7.x-MacOSX/solr/core/src/test-files/solr/collection1/conf/solrconfig.snippet.randomindexconfig.xml to /configs/conf1/solrconfig.snippet.randomindexconfig.xml
   [junit4]   2> 1349325 INFO  (TEST-FullSolrCloudDistribCmdsTest.test-seed#[BC69857AD64601BD]) [    ] o.a.s.c.AbstractZkTestCase put /Users/jenkins/workspace/Lucene-Solr-7.x-MacOSX/solr/core/src/test-files/solr/collection1/conf/stopwords.txt to /configs/conf1/stopwords.txt
   [junit4]   2> 1349327 INFO  (TEST-FullSolrCloudDistribCmdsTest.test-seed#[BC69857AD64601BD]) [    ] o.a.s.c.AbstractZkTestCase put /Users/jenkins/workspace/Lucene-Solr-7.x-MacOSX/solr/core/src/test-files/solr/collection1/conf/protwords.txt to /configs/conf1/protwords.txt
   [junit4]   2> 1349328 INFO  (TEST-FullSolrCloudDistribCmdsTest.test-seed#[BC69857AD64601BD]) [    ] o.a.s.c.AbstractZkTestCase put /Users/jenkins/workspace/Lucene-Solr-7.x-MacOSX/solr/core/src/test-files/solr/collection1/conf/currency.xml to /configs/conf1/currency.xml
   [junit4]   2> 1349330 INFO  (TEST-FullSolrCloudDistribCmdsTest.test-seed#[BC69857AD64601BD]) [    ] o.a.s.c.AbstractZkTestCase put /Users/jenkins/workspace/Lucene-Solr-7.x-MacOSX/solr/core/src/test-files/solr/collection1/conf/enumsConfig.xml to /configs/conf1/enumsConfig.xml
   [junit4]   2> 1349332 INFO  (TEST-FullSolrCloudDistribCmdsTest.test-seed#[BC69857AD64601BD]) [    ] o.a.s.c.AbstractZkTestCase put /Users/jenkins/workspace/Lucene-Solr-7.x-MacOSX/solr/core/src/test-files/solr/collection1/conf/open-exchange-rates.json to /configs/conf1/open-exchange-rates.json
   [junit4]   2> 1349334 INFO  (TEST-FullSolrCloudDistribCmdsTest.test-seed#[BC69857AD64601BD]) [    ] o.a.s.c.AbstractZkTestCase put /Users/jenkins/workspace/Lucene-Solr-7.x-MacOSX/solr/core/src/test-files/solr/collection1/conf/mapping-ISOLatin1Accent.txt to /configs/conf1/mapping-ISOLatin1Accent.txt
   [junit4]   2> 1349336 INFO  (TEST-FullSolrCloudDistribCmdsTest.test-seed#[BC69857AD64601BD]) [    ] o.a.s.c.AbstractZkTestCase put /Users/jenkins/workspace/Lucene-Solr-7.x-MacOSX/solr/core/src/test-files/solr/collection1/conf/old_synonyms.txt to /configs/conf1/old_synonyms.txt
   [junit4]   2> 1349338 INFO  (TEST-FullSolrCloudDistribCmdsTest.test-seed#[BC69857AD64601BD]) [    ] o.a.s.c.AbstractZkTestCase put /Users/jenkins/workspace/Lucene-Solr-7.x-MacOSX/solr/core/src/test-files/solr/collection1/conf/synonyms.txt to /configs/conf1/synonyms.txt
   [junit4]   2> 1349340 INFO  (TEST-FullSolrCloudDistribCmdsTest.test-seed#[BC69857AD64601BD]) [    ] o.a.s.c.AbstractFullDistribZkTestBase Will use NRT replicas unless explicitly asked otherwise
   [junit4]   2> 1349599 INFO  (TEST-FullSolrCloudDistribCmdsTest.test-seed#[BC69857AD64601BD]) [    ] o.e.j.s.Server jetty-9.3.14.v20161028
   [junit4]   2> 1349601 INFO  (TEST-FullSolrCloudDistribCmdsTest.test-seed#[BC69857AD64601BD]) [    ] o.e.j.s.h.ContextHandler Started o.e.j.s.ServletContextHandler@48c9f8a4{/,null,AVAILABLE}
   [junit4]   2> 1349601 INFO  (TEST-FullSolrCloudDistribCmdsTest.test-seed#[BC69857AD64601BD]) [    ] o.e.j.s.AbstractConnector Started ServerConnector@762a276b{HTTP/1.1,[http/1.1]}{127.0.0.1:50331}
   [junit4]   2> 1349601 INFO  (TEST-FullSolrCloudDistribCmdsTest.test-seed#[BC69857AD64601BD]) [    ] o.e.j.s.Server Started @1353330ms
   [junit4]   2> 1349601 INFO  (TEST-FullSolrCloudDistribCmdsTest.test-seed#[BC69857AD64601BD]) [    ] o.a.s.c.s.e.JettySolrRunner Jetty properties: {solr.data.dir=/Users/jenkins/workspace/Lucene-Solr-7.x-MacOSX/solr/build/solr-core/test/J1/temp/solr.cloud.FullSolrCloudDistribCmdsTest_BC69857AD64601BD-001/tempDir-001/control/data, replicaType=NRT, hostContext=/, hostPort=50331, coreRootDirectory=/Users/jenkins/workspace/Lucene-Solr-7.x-MacOSX/solr/build/solr-core/test/J1/temp/solr.cloud.FullSolrCloudDistribCmdsTest_BC69857AD64601BD-001/control-001/cores}
   [junit4]   2> 1349602 ERROR (TEST-FullSolrCloudDistribCmdsTest.test-seed#[BC69857AD64601BD]) [    ] o.a.s.s.StartupLoggingUtils Missing Java Option solr.log.dir. Logging may be missing or incomplete.
   [junit4]   2> 1349602 INFO  (TEST-FullSolrCloudDistribCmdsTest.test-seed#[BC69857AD64601BD]) [    ] o.a.s.s.SolrDispatchFilter  ___      _       Welcome to Apache Solr? version 7.1.0
   [junit4]   2> 1349602 INFO  (TEST-FullSolrCloudDistribCmdsTest.test-seed#[BC69857AD64601BD]) [    ] o.a.s.s.SolrDispatchFilter / __| ___| |_ _   Starting in cloud mode on port null
   [junit4]   2> 1349602 INFO  (TEST-FullSolrCloudDistribCmdsTest.test-seed#[BC69857AD64601BD]) [    ] o.a.s.s.SolrDispatchFilter \__ \/ _ \ | '_|  Install dir: null, Default config dir: null
   [junit4]   2> 1349602 INFO  (TEST-FullSolrCloudDistribCmdsTest.test-seed#[BC69857AD64601BD]) [    ] o.a.s.s.SolrDispatchFilter |___/\___/_|_|    Start time: 2017-08-10T21:32:30.428Z
   [junit4]   2> 1349605 INFO  (TEST-FullSolrCloudDistribCmdsTest.test-seed#[BC69857AD64601BD]) [    ] o.a.s.s.SolrDispatchFilter Loading solr.xml from SolrHome (not found in ZooKeeper)
   [junit4]   2> 1349605 INFO  (TEST-FullSolrCloudDistribCmdsTest.test-seed#[BC69857AD64601BD]) [    ] o.a.s.c.SolrXmlConfig Loading container configuration from /Users/jenkins/workspace/Lucene-Solr-7.x-MacOSX/solr/build/solr-core/test/J1/temp/solr.cloud.FullSolrCloudDistribCmdsTest_BC69857AD64601BD-001/control-001/solr.xml
   [junit4]   2> 1349609 INFO  (TEST-FullSolrCloudDistribCmdsTest.test-seed#[BC69857AD64601BD]) [    ] o.a.s.c.SolrXmlConfig MBean server found: com.sun.jmx.mbeanserver.JmxMBeanServer@18f32ada, but no JMX reporters were configured - adding default JMX reporter.
   [junit4]   2> 1349612 INFO  (TEST-FullSolrCloudDistribCmdsTest.test-seed#[BC69857AD64601BD]) [    ] o.a.s.c.ZkContainer Zookeeper client=127.0.0.1:50328/solr
   [junit4]   2> 1349734 INFO  (TEST-FullSolrCloudDistribCmdsTest.test-seed#[BC69857AD64601BD]) [n:127.0.0.1:50331_    ] o.a.s.c.Overseer Overseer (id=null) closing
   [junit4]   2> 1349735 INFO  (TEST-FullSolrCloudDistribCmdsTest.test-seed#[BC69857AD64601BD]) [n:127.0.0.1:50331_    ] o.a.s.c.OverseerElectionContext I am going to be the leader 127.0.0.1:50331_
   [junit4]   2> 1349736 INFO  (TEST-FullSolrCloudDistribCmdsTest.test-seed#[BC69857AD64601BD]) [n:127.0.0.1:50331_    ] o.a.s.c.Overseer Overseer (id=98461335549706244-127.0.0.1:50331_-n_0000000000) starting
   [junit4]   2> 1349745 INFO  (TEST-FullSolrCloudDistribCmdsTest.test-seed#[BC69857AD64601BD]) [n:127.0.0.1:50331_    ] o.a.s.c.ZkController Register node as live in ZooKeeper:/live_nodes/127.0.0.1:50331_
   [junit4]   2> 1349748 INFO  (zkCallback-3233-thread-1-processing-n:127.0.0.1:50331_) [n:127.0.0.1:50331_    ] o.a.s.c.c.ZkStateReader Updated live nodes from ZooKeeper... (0) -> (1)
   [junit4]   2> 1349813 INFO  (TEST-FullSolrCloudDistribCmdsTest.test-seed#[BC69857AD64601BD]) [n:127.0.0.1:50331_    ] o.a.s.m.r.SolrJmxReporter JMX monitoring for 'solr.node' (registry 'solr.node') enabled at server: com.sun.jmx.mbeanserver.JmxMBeanServer@18f32ada
   [junit4]   2> 1349815 INFO  (TEST-FullSolrCloudDistribCmdsTest.test-seed#[BC69857AD64601BD]) [n:127.0.0.1:50331_    ] o.a.s.m.r.SolrJmxReporter JMX monitoring for 'solr.jvm' (registry 'solr.jvm') enabled at server: com.sun.jmx.mbeanserver.JmxMBeanServer@18f32ada
   [junit4]   2> 1349816 INFO  (TEST-FullSolrCloudDistribCmdsTest.test-seed#[BC69857AD64601BD]) [n:127.0.0.1:50331_    ] o.a.s.m.r.SolrJmxReporter JMX monitoring for 'solr.jetty' (registry 'solr.jetty') enabled at server: com.sun.jmx.mbeanserver.JmxMBeanServer@18f32ada
   [junit4]   2> 1349817 INFO  (TEST-FullSolrCloudDistribCmdsTest.test-seed#[BC69857AD64601BD]) [n:127.0.0.1:50331_    ] o.a.s.c.CorePropertiesLocator Found 0 core definitions underneath /Users/jenkins/workspace/Lucene-Solr-7.x-MacOSX/solr/build/solr-core/test/J1/temp/solr.cloud.FullSolrCloudDistribCmdsTest_BC69857AD64601BD-001/control-001/cores
   [junit4]   2> 1349833 INFO  (TEST-FullSolrCloudDistribCmdsTest.test-seed#[BC69857AD64601BD]) [    ] o.a.s.c.c.ZkStateReader Updated live nodes from ZooKeeper... (0) -> (1)
   [junit4]   2> 1349835 INFO  (TEST-FullSolrCloudDistribCmdsTest.test-seed#[BC69857AD64601BD]) [    ] o.a.s.c.s.i.ZkClientClusterStateProvider Cluster at 127.0.0.1:50328/solr ready
   [junit4]   2> 1349838 INFO  (qtp49284942-16948) [n:127.0.0.1:50331_    ] o.a.s.h.a.CollectionsHandler Invoked Collection Action :create with params replicationFactor=1&collection.configName=conf1&name=control_collection&nrtReplicas=1&action=CREATE&numShards=1&createNodeSet=127.0.0.1:50331_&wt=javabin&version=2 and sendToOCPQueue=true
   [junit4]   2> 1349840 INFO  (OverseerThreadFactory-6840-thread-1-processing-n:127.0.0.1:50331_) [n:127.0.0.1:50331_    ] o.a.s.c.CreateCollectionCmd Create collection control_collection
   [junit4]   2> 1349961 INFO  (qtp49284942-16950) [n:127.0.0.1:50331_    ] o.a.s.h.a.CoreAdminOperation core create command qt=/admin/cores&collection.configName=conf1&newCollection=true&name=control_collection_shard1_replica_n1&action=CREATE&numShards=1&collection=control_collection&shard=shard1&wt=javabin&version=2&replicaType=NRT
   [junit4]   2> 1349962 INFO  (qtp49284942-16950) [n:127.0.0.1:50331_    ] o.a.s.c.TransientSolrCoreCacheDefault Allocating transient cache for 4 transient cores
   [junit4]   2> 1350082 INFO  (zkCallback-3233-thread-1-processing-n:127.0.0.1:50331_) [n:127.0.0.1:50331_    ] o.a.s.c.c.ZkStateReader A cluster state change: [WatchedEvent state:SyncConnected type:NodeDataChanged path:/collections/control_collection/state.json] for collection [control_collection] has occurred - updating... (live nodes size: [1])
   [junit4]   2> 1351017 INFO  (qtp49284942-16950) [n:127.0.0.1:50331_ c:control_collection s:shard1  x:control_collection_shard1_replica_n1] o.a.s.c.SolrConfig Using Lucene MatchVersion: 7.1.0
   [junit4]   2> 1351034 INFO  (qtp49284942-16950) [n:127.0.0.1:50331_ c:control_collection s:shard1  x:control_collection_shard1_replica_n1] o.a.s.s.IndexSchema [control_collection_shard1_replica_n1] Schema name=test
   [junit4]   2> 1351108 INFO  (qtp49284942-16950) [n:127.0.0.1:50331_ c:control_collection s:shard1  x:control_collection_shard1_replica_n1] o.a.s.s.IndexSchema Loaded schema test/1.6 with uniqueid field id
   [junit4]   2> 1351133 INFO  (qtp49284942-16950) [n:127.0.0.1:50331_ c:control_collection s:shard1  x:control_collection_shard1_replica_n1] o.a.s.c.CoreContainer Creating SolrCore 'control_collection_shard1_replica_n1' using configuration from collection control_collection, trusted=true
   [junit4]   2> 1351133 INFO  (qtp49284942-16950) [n:127.0.0.1:50331_ c:control_collection s:shard1  x:control_collection_shard1_replica_n1] o.a.s.m.r.SolrJmxReporter JMX monitoring for 'solr.core.control_collection.shard1.replica_n1' (registry 'solr.core.control_collection.shard1.replica_n1') enabled at server: com.sun.jmx.mbeanserver.JmxMBeanServer@18f32ada
   [junit4]   2> 1351134 INFO  (qtp49284942-16950) [n:127.0.0.1:50331_ c:control_collection s:shard1  x:control_collection_shard1_replica_n1] o.a.s.c.SolrCore solr.RecoveryStrategy.Builder
   [junit4]   2> 1351134 INFO  (qtp49284942-16950) [n:127.0.0.1:50331_ c:control_collection s:shard1  x:control_collection_shard1_replica_n1] o.a.s.c.SolrCore [[control_collection_shard1_replica_n1] ] Opening new SolrCore at [/Users/jenkins/workspace/Lucene-Solr-7.x-MacOSX/solr/build/solr-core/test/J1/temp/solr.cloud.FullSolrCloudDistribCmdsTest_BC69857AD64601BD-001/control-001/cores/control_collection_shard1_replica_n1], dataDir=[/Users/jenkins/workspace/Lucene-Solr-7.x-MacOSX/solr/build/solr-core/test/J1/temp/solr.cloud.FullSolrCloudDistribCmdsTest_BC69857AD64601BD-001/control-001/cores/control_collection_shard1_replica_n1/data/]
   [junit4]   2> 1351136 INFO  (qtp49284942-16950) [n:127.0.0.1:50331_ c:control_collection s:shard1  x:control_collection_shard1_replica_n1] o.a.s.u.RandomMergePolicy RandomMergePolicy wrapping class org.apache.lucene.index.LogByteSizeMergePolicy: [LogByteSizeMergePolicy: minMergeSize=1677721, mergeFactor=26, maxMergeSize=2147483648, maxMergeSizeForForcedMerge=9223372036854775807, calibrateSizeByDeletes=true, maxMergeDocs=2147483647, maxCFSSegmentSizeMB=8.796093022207999E12, noCFSRatio=0.0]
   [junit4]   2> 1351138 WARN  (qtp49284942-16950) [n:127.0.0.1:50331_ c:control_collection s:shard1  x:control_collection_shard1_replica_n1] o.a.s.c.RequestHandlers INVALID paramSet a in requestHandler {type = requestHandler,name = /dump,class = DumpRequestHandler,attributes = {initParams=a, name=/dump, class=DumpRequestHandler},args = {defaults={a=A,b=B}}}
   [junit4]   2> 1351180 INFO  (qtp49284942-16950) [n:127.0.0.1:50331_ c:control_collection s:shard1  x:control_collection_shard1_replica_n1] o.a.s.u.UpdateHandler Using UpdateLog implementation: org.apache.solr.update.UpdateLog
   [junit4]   2> 1351180 INFO  (qtp49284942-16950) [n:127.0.0.1:50331_ c:control_collection s:shard1  x:control_collection_shard1_replica_n1] o.a.s.u.UpdateLog Initializing UpdateLog: dataDir= defaultSyncLevel=FLUSH numRecordsToKeep=100 maxNumLogsToKeep=10 numVersionBuckets=65536
   [junit4]   2> 1351181 INFO  (qtp49284942-16950) [n:127.0.0.1:50331_ c:control_collection s:shard1  x:control_collection_shard1_replica_n1] o.a.s.u.CommitTracker Hard AutoCommit: disabled
   [junit4]   2> 1351181 INFO  (qtp49284942-16950) [n:127.0.0.1:50331_ c:control_collection s:shard1  x:control_collection_shard1_replica_n1] o.a.s.u.CommitTracker Soft AutoCommit: disabled
   [junit4]   2> 1351182 INFO  (qtp49284942-16950) [n:127.0.0.1:50331_ c:control_collection s:shard1  x:control_collection_shard1_replica_n1] o.a.s.u.RandomMergePolicy RandomMergePolicy wrapping class org.apache.lucene.index.LogDocMergePolicy: [LogDocMergePolicy: minMergeSize=1000, mergeFactor=48, maxMergeSize=9223372036854775807, maxMergeSizeForForcedMerge=9223372036854775807, calibrateSizeByDeletes=true, maxMergeDocs=2147483647, maxCFSSegmentSizeMB=8.796093022207999E12, noCFSRatio=0.0]
   [junit4]   2> 1351182 INFO  (qtp49284942-16950) [n:127.0.0.1:50331_ c:control_collection s:shard1  x:control_collection_shard1_replica_n1] o.a.s.s.SolrIndexSearcher Opening [Searcher@3302d905[control_collection_shard1_replica_n1] main]
   [junit4]   2> 1351183 INFO  (qtp49284942-16950) [n:127.0.0.1:50331_ c:control_collection s:shard1  x:control_collection_shard1_replica_n1] o.a.s.r.ManagedResourceStorage Configured ZooKeeperStorageIO with znodeBase: /configs/conf1
   [junit4]   2> 1351183 INFO  (qtp49284942-16950) [n:127.0.0.1:50331_ c:control_collection s:shard1  x:control_collection_shard1_replica_n1] o.a.s.r.ManagedResourceStorage Loaded null at path _rest_managed.json using ZooKeeperStorageIO:path=/configs/conf1
   [junit4]   2> 1351184 INFO  (qtp49284942-16950) [n:127.0.0.1:50331_ c:control_collection s:shard1  x:control_collection_shard1_replica_n1] o.a.s.h.ReplicationHandler Commits will be reserved for  10000
   [junit4]   2> 1351184 INFO  (qtp49284942-16950) [n:127.0.0.1:50331_ c:control_collection s:shard1  x:control_collection_shard1_replica_n1] o.a.s.u.UpdateLog Could not find max version in index or recent updates, using new clock 1575381370939637760
   [junit4]   2> 1351185 INFO  (searcherExecutor-6843-thread-1-processing-n:127.0.0.1:50331_ x:control_collection_shard1_replica_n1 s:shard1 c:control_collection) [n:127.0.0.1:50331_ c:control_collection s:shard1  x:control_collection_shard1_replica_n1] o.a.s.c.SolrCore [control_collection_shard1_replica_n1] Registered new searcher Searcher@3302d905[control_collection_shard1_replica_n1] main{ExitableDirectoryReader(UninvertingDirectoryReader())}
   [junit4]   2> 1351191 INFO  (qtp49284942-16950) [n:127.0.0.1:50331_ c:control_collection s:shard1  x:control_collection_shard1_replica_n1] o.a.s.c.ShardLeaderElectionContext Enough replicas found to continue.
   [junit4]   2> 1351191 INFO  (qtp49284942-16950) [n:127.0.0.1:50331_ c:control_collection s:shard1  x:control_collection_shard1_replica_n1] o.a.s.c.ShardLeaderElectionContext I may be the new leader - try and sync
   [junit4]   2> 1351191 INFO  (qtp49284942-16950) [n:127.0.0.1:50331_ c:control_collection s:shard1  x:control_collection_shard1_replica_n1] o.a.s.c.SyncStrategy Sync replicas to http://127.0.0.1:50331/control_collection_shard1_replica_n1/
   [junit4]   2> 1351191 INFO  (qtp49284942-16950) [n:127.0.0.1:50331_ c:control_collection s:shard1  x:control_collection_shard1_replica_n1] o.a.s.c.SyncStrategy Sync Success - now sync replicas to me
   [junit4]   2> 1351191 INFO  (qtp49284942-16950) [n:127.0.0.1:50331_ c:control_collection s:shard1  x:control_collection_shard1_replica_n1] o.a.s.c.SyncStrategy http://127.0.0.1:50331/control_collection_shard1_replica_n1/ has no replicas
   [junit4]   2> 1351191 INFO  (qtp49284942-16950) [n:127.0.0.1:50331_ c:control_collection s:shard1  x:control_collection_shard1_replica_n1] o.a.s.c.ShardLeaderElectionContext Found all replicas participating in election, clear LIR
   [junit4]   2> 1351196 INFO  (qtp49284942-16950) [n:127.0.0.1:50331_ c:control_collection s:shard1  x:control_collection_shard1_replica_n1] o.a.s.c.ShardLeaderElectionContext I am the new leader: http://127.0.0.1:50331/control_collection_shard1_replica_n1/ shard1
   [junit4]   2> 1351310 INFO  (zkCallback-3233-thread-1-processing-n:127.0.0.1:50331_) [n:127.0.0.1:50331_    ] o.a.s.c.c.ZkStateReader A cluster state change: [WatchedEvent state:SyncConnected type:NodeDataChanged path:/collections/control_collection/state.json] for collection [control_collection] has occurred - updating... (live nodes size: [1])
   [junit4]   2> 1351368 INFO  (qtp49284942-16950) [n:127.0.0.1:50331_ c:control_collection s:shard1  x:control_collection_shard1_replica_n1] o.a.s.c.ZkController I am the leader, no recovery necessary
   [junit4]   2> 1351372 INFO  (qtp49284942-16950) [n:127.0.0.1:50331_ c:control_collection s:shard1  x:control_collection_shard1_replica_n1] o.a.s.s.HttpSolrCall [admin] webapp=null path=/admin/cores params={qt=/admin/cores&collection.configName=conf1&newCollection=true&name=control_collection_shard1_replica_n1&action=CREATE&numShards=1&collection=control_collection&shard=shard1&wt=javabin&version=2&replicaType=NRT} status=0 QTime=1411
   [junit4]   2> 1351379 INFO  (qtp49284942-16948) [n:127.0.0.1:50331_    ] o.a.s.h.a.CollectionsHandler Wait for new collection to be active for at most 30 seconds. Check all shard replicas
   [junit4]   2> 1351491 INFO  (zkCallback-3233-thread-1-processing-n:127.0.0.1:50331_) [n:127.0.0.1:50331_    ] o.a.s.c.c.ZkStateReader A cluster state change: [WatchedEvent state:SyncConnected type:NodeDataChanged path:/collections/control_collection/state.json] for collection [control_collection] has occurred - updating... (live nodes size: [1])
   [junit4]   2> 1351854 INFO  (OverseerCollectionConfigSetProcessor-98461335549706244-127.0.0.1:50331_-n_0000000000) [n:127.0.0.1:50331_    ] o.a.s.c.OverseerTaskQueue Response ZK path: /overseer/collection-queue-work/qnr-0000000000 doesn't exist.  Requestor may have disconnected from ZooKeeper
   [junit4]   2> 1352389 INFO  (qtp49284942-16948) [n:127.0.0.1:50331_    ] o.a.s.s.HttpSolrCall [admin] webapp=null path=/admin/collections params={replicationFactor=1&collection.configName=conf1&name=control_collection&nrtReplicas=1&action=CREATE&numShards=1&createNodeSet=127.0.0.1:50331_&wt=javabin&version=2} status=0 QTime=2551
   [junit4]   2> 1352402 INFO  (TEST-FullSolrCloudDistribCmdsTest.test-seed#[BC69857AD64601BD]) [    ] o.a.s.c.c.ZkStateReader Updated live nodes from ZooKeeper... (0) -> (1)
   [junit4]   2> 1352405 INFO  (TEST-FullSolrCloudDistribCmdsTest.test-seed#[BC69857AD64601BD]) [    ] o.a.s.c.s.i.ZkClientClusterStateProvider Cluster at 127.0.0.1:50328/solr ready
   [junit4]   2> 1352405 INFO  (TEST-FullSolrCloudDistribCmdsTest.test-seed#[BC69857AD64601BD]) [    ] o.a.s.c.ChaosMonkey monkey: init - expire sessions:false cause connection loss:false
   [junit4]   2> 1352407 INFO  (qtp49284942-16953) [n:127.0.0.1:50331_    ] o.a.s.h.a.CollectionsHandler Invoked Collection Action :create with params replicationFactor=1&collection.configName=conf1&name=collection1&nrtReplicas=1&action=CREATE&numShards=3&createNodeSet=&stateFormat=2&wt=javabin&version=2 and sendToOCPQueue=true
   [junit4]   2> 1352413 INFO  (OverseerThreadFactory-6840-thread-2-processing-n:127.0.0.1:50331_) [n:127.0.0.1:50331_    ] o.a.s.c.CreateCollectionCmd Create collection collection1
   [junit4]   2> 1352415 WARN  (OverseerThreadFactory-6840-thread-2-processing-n:127.0.0.1:50331_) [n:127.0.0.1:50331_    ] o.a.s.c.CreateCollectionCmd It is unusual to create a collection (collection1) without cores.
   [junit4]   2> 1352644 INFO  (qtp49284942-16953) [n:127.0.0.1:50331_    ] o.a.s.h.a.CollectionsHandler Wait for new collection to be active for at most 30 seconds. Check all shard replicas
   [junit4]   2> 1352645 INFO  (qtp49284942-16953) [n:127.0.0.1:50331_    ] o.a.s.s.HttpSolrCall [admin] webapp=null path=/admin/collections params={replicationFactor=1&collection.configName=conf1&name=collection1&nrtReplicas=1&action=CREATE&numShards=3&createNodeSet=&stateFormat=2&wt=javabin&version=2} status=0 QTime=237
   [junit4]   2> 1352898 INFO  (TEST-FullSolrCloudDistribCmdsTest.test-seed#[BC69857AD64601BD]) [    ] o.a.s.c.AbstractFullDistribZkTestBase create jetty 1 in directory /Users/jenkins/workspace/Lucene-Solr-7.x-MacOSX/solr/build/solr-core/test/J1/temp/solr.cloud.FullSolrCloudDistribCmdsTest_BC69857AD64601BD-001/shard-1-001 of type NRT
   [junit4]   2> 1352898 INFO  (TEST-FullSolrCloudDistribCmdsTest.test-seed#[BC69857AD64601BD]) [    ] o.e.j.s.Server jetty-9.3.14.v20161028
   [junit4]   2> 1352900 INFO  (TEST-FullSolrCloudDistribCmdsTest.test-seed#[BC69857AD64601BD]) [    ] o.e.j.s.h.ContextHandler Started o.e.j.s.ServletContextHandler@5eef1db4{/,null,AVAILABLE}
   [junit4]   2> 1352900 INFO  (TEST-FullSolrCloudDistribCmdsTest.test-seed#[BC69857AD64601BD]) [    ] o.e.j.s.AbstractConnector Started ServerConnector@fcb6411{HTTP/1.1,[http/1.1]}{127.0.0.1:50343}
   [junit4]   2> 1352900 INFO  (TEST-FullSolrCloudDistribCmdsTest.test-seed#[BC69857AD64601BD]) [    ] o.e.j.s.Server Started @1356629ms
   [junit4]   2> 1352900 INFO  (TEST-FullSolrCloudDistribCmdsTest.test-seed#[BC69857AD64601BD]) [    ] o.a.s.c.s.e.JettySolrRunner Jetty properties: {solr.data.dir=/Users/jenkins/workspace/Lucene-Solr-7.x-MacOSX/solr/build/solr-core/test/J1/temp/solr.cloud.FullSolrCloudDistribCmdsTest_BC69857AD64601BD-001/tempDir-001/jetty1, replicaType=NRT, solrconfig=solrconfig.xml, hostContext=/, hostPort=50343, coreRootDirectory=/Users/jenkins/workspace/Lucene-Solr-7.x-MacOSX/solr/build/solr-core/test/J1/temp/solr.cloud.FullSolrCloudDistribCmdsTest_BC69857AD64601BD-001/shard-1-001/cores}
   [junit4]   2> 1352901 ERROR (TEST-FullSolrCloudDistribCmdsTest.test-seed#[BC69857AD64601BD]) [    ] o.a.s.s.StartupLoggingUtils Missing Java Option solr.log.dir. Logging may be missing or incomplete.
   [junit4]   2> 1352901 INFO  (TEST-FullSolrCloudDistribCmdsTest.test-seed#[BC69857AD64601BD]) [    ] o.a.s.s.SolrDispatchFilter  ___      _       Welcome to Apache Solr? version 7.1.0
   [junit4]   2> 1352901 INFO  (TEST-FullSolrCloudDistribCmdsTest.test-seed#[BC69857AD64601BD]) [    ] o.a.s.s.SolrDispatchFilter / __| ___| |_ _   Starting in cloud mode on port null
   [junit4]   2> 1352901 INFO  (TEST-FullSolrCloudDistribCmdsTest.test-seed#[BC69857AD64601BD]) [    ] o.a.s.s.SolrDispatchFilter \__ \/ _ \ | '_|  Install dir: null, Default config dir: null
   [junit4]   2> 1352901 INFO  (TEST-FullSolrCloudDistribCmdsTest.test-seed#[BC69857AD64601BD]) [    ] o.a.s.s.SolrDispatchFilter |___/\___/_|_|    Start time: 2017-08-10T21:32:33.727Z
   [junit4]   2> 1352904 INFO  (TEST-FullSolrCloudDistribCmdsTest.test-seed#[BC69857AD64601BD]) [    ] o.a.s.s.SolrDispatchFilter Loading solr.xml from SolrHome (not found in ZooKeeper)
   [junit4]   2> 1352904 INFO  (TEST-FullSolrCloudDistribCmdsTest.test-seed#[BC69857AD64601BD]) [    ] o.a.s.c.SolrXmlConfig Loading container configuration from /Users/jenkins/workspace/Lucene-Solr-7.x-MacOSX/solr/build/solr-core/test/J1/temp/solr.cloud.FullSolrCloudDistribCmdsTest_BC69857AD64601BD-001/shard-1-001/solr.xml
   [junit4]   2> 1352909 INFO  (TEST-FullSolrCloudDistribCmdsTest.test-seed#[BC69857AD64601BD]) [    ] o.a.s.c.SolrXmlConfig MBean server found: com.sun.jmx.mbeanserver.JmxMBeanServer@18f32ada, but no JMX reporters were configured - adding default JMX reporter.
   [junit4]   2> 1352913 INFO  (TEST-FullSolrCloudDistribCmdsTest.test-seed#[BC69857AD64601BD]) [    ] o.a.s.c.ZkContainer Zookeeper client=127.0.0.1:50328/solr
   [junit4]   2> 1352926 INFO  (TEST-FullSolrCloudDistribCmdsTest.test-seed#[BC69857AD64601BD]) [n:127.0.0.1:50343_    ] o.a.s.c.c.ZkStateReader Updated live nodes from ZooKeeper... (0) -> (1)
   [junit4]   2> 1352930 INFO  (TEST-FullSolrCloudDistribCmdsTest.test-seed#[BC69857AD64601BD]) [n:127.0.0.1:50343_    ] o.a.s.c.Overseer Overseer (id=null) closing
   [junit4]   2> 1352932 INFO  (TEST-FullSolrCloudDistribCmdsTest.test-seed#[BC69857AD64601BD]) [n:127.0.0.1:50343_    ] o.a.s.c.ZkController Register node as live in ZooKeeper:/live_nodes/127.0.0.1:50343_
   [junit4]   2> 1352934 INFO  (zkCallback-3240-thread-1) [    ] o.a.s.c.c.ZkStateReader Updated live nodes from ZooKeeper... (1) -> (2)
   [junit4]   2> 1352934 INFO  (zkCallback-3233-thread-1-processing-n:127.0.0.1:50331_) [n:127.0.0.1:50331_    ] o.a.s.c.c.ZkStateReader Updated live nodes from ZooKeeper... (1) -> (2)
   [junit4]   2> 1352935 INFO  (zkCallback-3245-thread-1-processing-n:127.0.0.1:50343_) [n:127.0.0.1:50343_    ] o.a.s.c.c.ZkStateReader Updated live nodes from ZooKeeper... (1) -> (2)
   [junit4]   2> 1352985 INFO  (TEST-FullSolrCloudDistribCmdsTest.test-seed#[BC69857AD64601BD]) [n:127.0.0.1:50343_    ] o.a.s.m.r.SolrJmxReporter JMX monitoring for 'solr.node' (registry 'solr.node') enabled at server: com.sun.jmx.mbeanserver.JmxMBeanServer@18f32ada
   [junit4]   2> 1352988 INFO  (TEST-FullSolrCloudDistribCmdsTest.test-seed#[BC69857AD64601BD]) [n:127.0.0.1:50343_    ] o.a.s.m.r.SolrJmxReporter JMX monitoring for 'solr.jvm' (registry 'solr.jvm') enabled at server: com.sun.jmx.mbeanserver.JmxMBeanServer@18f32ada
   [junit4]   2> 1352988 INFO  (TEST-FullSolrCloudDistribCmdsTest.test-seed#[BC69857AD64601BD]) [n:127.0.0.1:50343_    ] o.a.s.m.r.SolrJmxReporter JMX monitoring for 'solr.jetty' (registry 'solr.jetty') enabled at server: com.sun.jmx.mbeanserver.JmxMBeanServer@18f32ada
   [junit4]   2> 1352990 INFO  (TEST-FullSolrCloudDistribCmdsTest.test-seed#[BC69857AD64601BD]) [n:127.0.0.1:50343_    ] o.a.s.c.CorePropertiesLocator Found 0 core definitions underneath /Users/jenkins/workspace/Lucene-Solr-7.x-MacOSX/solr/build/solr-core/test/J1/temp/solr.cloud.FullSolrCloudDistribCmdsTest_BC69857AD64601BD-001/shard-1-001/cores
   [junit4]   2> 1353008 INFO  (qtp528219418-16989) [n:127.0.0.1:50343_    ] o.a.s.h.a.CollectionsHandler Invoked Collection Action :addreplica with params node=127.0.0.1:50343_&action=ADDREPLICA&collection=collection1&shard=shard2&type=NRT&wt=javabin&version=2 and sendToOCPQueue=true
   [junit4]   2> 1353011 INFO  (OverseerCollectionConfigSetProcessor-98461335549706244-127.0.0.1:50331_-n_0000000000) [n:127.0.0.1:50331_    ] o.a.s.c.OverseerTaskQueue Response ZK path: /overseer/collection-queue-work/qnr-0000000002 doesn't exist.  Requestor may have disconnected from ZooKeeper
   [junit4]   2> 1353012 INFO  (OverseerThreadFactory-6840-thread-3-processing-n:127.0.0.1:50331_) [n:127.0.0.1:50331_    ] o.a.s.c.AddReplicaCmd Node Identified 127.0.0.1:50343_ for creating new replica
   [junit4]   2> 1353017 INFO  (qtp528219418-16991) [n:127.0.0.1:50343_    ] o.a.s.h.a.CoreAdminOperation core create command qt=/admin/cores&collection.configName=conf1&name=collection1_shard2_replica_n61&action=CREATE&collection=collection1&shard=shard2&wt=javabin&version=2&replicaType=NRT
   [junit4]   2> 1353018 INFO  (qtp528219418-16991) [n:127.0.0.1:50343_    ] o.a.s.c.TransientSolrCoreCacheDefault Allocating transient cache for 4 transient cores
   [junit4]   2> 1353127 INFO  (zkCallback-3245-thread-1-processing-n:127.0.0.1:50343_) [n:127.0.0.1:50343_    ] o.a.s.c.c.ZkStateReader A cluster state change: [WatchedEvent state:SyncConnected type:NodeDataChanged path:/collections/collection1/state.json] for collection [collection1] has occurred - updating... (live nodes size: [2])
   [junit4]   2> 1354072 INFO  (qtp528219418-16991) [n:127.0.0.1:50343_ c:collection1 s:shard2  x:collection1_shard2_replica_n61] o.a.s.c.SolrConfig Using Lucene MatchVersion: 7.1.0
   [junit4]   2> 1354088 INFO  (qtp528219418-16991) [n:127.0.0.1:50343_ c:collection1 s:shard2  x:collection1_shard2_replica_n61] o.a.s.s.IndexSchema [collection1_shard2_replica_n61] Schema name=test
   [junit4]   2> 1354152 INFO  (qtp528219418-16991) [n:127.0.0.1:50343_ c:collection1 s:shard2  x:collection1_shard2_replica_n61] o.a.s.s.IndexSchema Loaded schema test/1.6 with uniqueid field id
   [junit4]   2> 1354172 INFO  (qtp528219418-16991) [n:127.0.0.1:50343_ c:collection1 s:shard2  x:collection1_shard2_replica_n61] o.a.s.c.CoreContainer Creating SolrCore 'collection1_shard2_replica_n61' using configuration from collection collection1, trusted=true
   [junit4]   2> 1354172 INFO  (qtp528219418-16991) [n:127.0.0.1:50343_ c:collection1 s:shard2  x:collection1_shard2_replica_n61] o.a.s.m.r.SolrJmxReporter JMX monitoring for 'solr.core.collection1.shard2.replica_n61' (registry 'solr.core.collection1.shard2.replica_n61') enabled at server: com.sun.jmx.mbeanserver.JmxMBeanServer@18f32ada
   [junit4]   2> 1354172 INFO  (qtp528219418-16991) [n:127.0.0.1:50343_ c:collection1 s:shard2  x:collection1_shard2_replica_n61] o.a.s.c.SolrCore solr.RecoveryStrategy.Builder
   [junit4]   2> 1354172 INFO  (qtp528219418-16991) [n:127.0.0.1:50343_ c:collection1 s:shard2  x:collection1_shard2_replica_n61] o.a.s.c.SolrCore [[collection1_shard2_replica_n61] ] Opening new SolrCore at [/Users/jenkins/workspace/Lucene-Solr-7.x-MacOSX/solr/build/solr-core/test/J1/temp/solr.cloud.FullSolrCloudDistribCmdsTest_BC69857AD64601BD-001/shard-1-001/cores/collection1_shard2_replica_n61], dataDir=[/Users/jenkins/workspace/Lucene-Solr-7.x-MacOSX/solr/build/solr-core/test/J1/temp/solr.cloud.FullSolrCloudDistribCmdsTest_BC69857AD64601BD-001/shard-1-001/cores/collection1_shard2_replica_n61/data/]
   [junit4]   2> 1354174 INFO  (qtp528219418-16991) [n:127.0.0.1:50343_ c:collection1 s:shard2  x:collection1_shard2_replica_n61] o.a.s.u.RandomMergePolicy RandomMergePolicy wrapping class org.apache.lucene.index.LogByteSizeMergePolicy: [LogByteSizeMergePolicy: minMergeSize=1677721, mergeFactor=26, maxMergeSize=2147483648, maxMergeSizeForForcedMerge=9223372036854775807, calibrateSizeByDeletes=true, maxMergeDocs=2147483647, maxCFSSegmentSizeMB=8.796093022207999E12, noCFSRatio=0.0]
   [junit4]   2> 1354177 WARN  (qtp528219418-16991) [n:127.0.0.1:50343_ c:collection1 s:shard2  x:collection1_shard2_replica_n61] o.a.s.c.RequestHandlers INVALID paramSet a in requestHandler {type = requestHandler,name = /dump,class = DumpRequestHandler,attributes = {initParams=a, name=/dump, class=DumpRequestHandler},args = {defaults={a=A,b=B}}}
   [junit4]   2> 1354233 INFO  (qtp528219418-16991) [n:127.0.0.1:50343_ c:collection1 s:shard2  x:collection1_shard2_replica_n61] o.a.s.u.UpdateHandler Using UpdateLog implementation: org.apache.solr.update.UpdateLog
   [junit4]   2> 1354233 INFO  (qtp528219418-16991) [n:127.0.0.1:50343_ c:collection1 s:shard2  x:collection1_shard2_replica_n61] o.a.s.u.UpdateLog Initializing UpdateLog: dataDir= defaultSyncLevel=FLUSH numRecordsToKeep=100 maxNumLogsToKeep=10 numVersionBuckets=65536
   [junit4]   2> 1354234 INFO  (qtp528219418-16991) [n:127.0.0.1:50343_ c:collection1 s:shard2  x:collection1_shard2_replica_n61] o.a.s.u.CommitTracker Hard AutoCommit: disabled
   [junit4]   2> 1354234 INFO  (qtp528219418-16991) [n:127.0.0.1:50343_ c:collection1 s:shard2  x:collection1_shard2_replica_n61] o.a.s.u.CommitTracker Soft AutoCommit: disabled
   [junit4]   2> 1354235 INFO  (qtp528219418-16991) [n:127.0.0.1:50343_ c:collection1 s:shard2  x:collection1_shard2_replica_n61] o.a.s.u.RandomMergePolicy RandomMergePolicy wrapping class org.apache.lucene.index.LogDocMergePolicy: [LogDocMergePolicy: minMergeSize=1000, mergeFactor=48, maxMergeSize=9223372036854775807, maxMergeSizeForForcedMerge=9223372036854775807, calibrateSizeByDeletes=true, maxMergeDocs=2147483647, maxCFSSegmentSizeMB=8.796093022207999E12, noCFSRatio=0.0]
   [junit4]   2> 1354235 INFO  (qtp528219418-16991) [n:127.0.0.1:50343_ c:collection1 s:shard2  x:collection1_shard2_replica_n61] o.a.s.s.SolrIndexSearcher Opening [Searcher@3f92623b[collection1_shard2_replica_n61] main]
   [junit4]   2> 1354237 INFO  (qtp528219418-16991) [n:127.0.0.1:50343_ c:collection1 s:shard2  x:collection1_shard2_replica_n61] o.a.s.r.ManagedResourceStorage Configured ZooKeeperStorageIO with znodeBase: /configs/conf1
   [junit4]   2> 1354238 INFO  (qtp528219418-16991) [n:127.0.0.1:50343_ c:collection1 s:shard2  x:collection1_shard2_replica_n61] o.a.s.r.ManagedResourceStorage Loaded null at path _rest_managed.json using ZooKeeperStorageIO:path=/configs/conf1
   [junit4]   2> 1354238 INFO  (qtp528219418-16991) [n:127.0.0.1:50343_ c:collection1 s:shard2  x:collection1_shard2_replica_n61] o.a.s.h.ReplicationHandler Commits will be reserved for  10000
   [junit4]   2> 1354239 INFO  (qtp528219418-16991) [n:127.0.0.1:50343_ c:collection1 s:shard2  x:collection1_shard2_replica_n61] o.a.s.u.UpdateLog Could not find max version in index or recent updates, using new clock 1575381374143037440
   [junit4]   2> 1354239 INFO  (searcherExecutor-6854-thread-1-processing-n:127.0.0.1:50343_ x:collection1_shard2_replica_n61 s:shard2 c:collection1) [n:127.0.0.1:50343_ c:collection1 s:shard2  x:collection1_shard2_replica_n61] o.a.s.c.SolrCore [collection1_shard2_replica_n61] Registered new searcher Searcher@3f92623b[collection1_shard2_replica_n61] main{ExitableDirectoryReader(UninvertingDirectoryReader())}
   [junit4]   2> 1354252 INFO  (qtp528219418-16991) [n:127.0.0.1:50343_ c:collection1 s:shard2  x:collection1_shard2_replica_n61] o.a.s.c.ShardLeaderElectionContext Enough replicas found to continue.
   [junit4]   2> 1354252 INFO  (qtp528219418-16991) [n:127.0.0.1:50343_ c:collection1 s:shard2  x:collection1_shard2_replica_n61] o.a.s.c.ShardLeaderElectionContext I may be the new leader - try and sync
   [junit4]   2> 1354253 INFO  (qtp528219418-16991) [n:127.0.0.1:50343_ c:collection1 s:shard2  x:collection1_shard2_replica_n61] o.a.s.c.SyncStrategy Sync replicas to http://127.0.0.1:50343/collection1_shard2_replica_n61/
   [junit4]   2> 1354253 INFO  (qtp528219418-16991) [n:127.0.0.1:50343_ c:collection1 s:shard2  x:collection1_shard2_replica_n61] o.a.s.c.SyncStrategy Sync Success - now sync replicas to me
   [junit4]   2> 1354253 INFO  (qtp528219418-16991) [n:127.0.0.1:50343_ c:collection1 s:shard2  x:collection1_shard2_replica_n61] o.a.s.c.SyncStrategy http://127.0.0.1:50343/collection1_shard2_replica_n61/ has no replicas
   [junit4]   2> 1354253 INFO  (qtp528219418-16991) [n:127.0.0.1:50343_ c:collection1 s:shard2  x:collection1_shard2_replica_n61] o.a.s.c.ShardLeaderElectionContext Found all replicas participating in election, clear LIR
   [junit4]   2> 1354259 INFO  (qtp528219418-16991) [n:127.0.0.1:50343_ c:collection1 s:shard2  x:collection1_shard2_replica_n61] o.a.s.c.ShardLeaderElectionContext I am the new leader: http://127.0.0.1:50343/collection1_shard2_replica_n61/ shard2
   [junit4]   2> 1354364 INFO  (zkCallback-3245-thread-1-processing-n:127.0.0.1:50343_) [n:127.0.0.1:50343_    ] o.a.s.c.c.ZkStateReader A cluster state change: [WatchedEvent state:SyncConnected type:NodeDataChanged path:/collections/collection1/state.json] for collection [collection1] has occurred - updating... (live nodes size: [2])
   [junit4]   2> 1354414 INFO  (qtp528219418-16991) [n:127.0.0.1:50343_ c:collection1 s:shard2  x:collection1_shard2_replica_n61] o.a.s.c.ZkController I am the leader, no recovery necessary
   [junit4]   2> 1354416 INFO  (qtp528219418-16991) [n:127.0.0.1:50343_ c:collection1 s:shard2  x:collection1_shard2_replica_n61] o.a.s.s.HttpSolrCall [admin] webapp=null path=/admin/cores params={qt=/admin/cores&collection.configName=conf1&name=collection1_shard2_replica_n61&action=CREATE&collection=collection1&shard=shard2&wt=javabin&version=2&replicaType=NRT} status=0 QTime=1398
   [junit4]   2> 1354419 INFO  (qtp528219418-16989) [n:127.0.0.1:50343_    ] o.a.s.s.HttpSolrCall [admin] webapp=null path=/admin/collections params={node=127.0.0.1:50343_&action=ADDREPLICA&collection=collection1&shard=shard2&type=NRT&wt=javabin&version=2} status=0 QTime=1410
   [junit4]   2> 1354528 INFO  (zkCallback-3245-thread-1-processing-n:127.0.0.1:50343_) [n:127.0.0.1:50343_    ] o.a.s.c.c.ZkStateReader A cluster state change: [WatchedEvent state:SyncConnected type:NodeDataChanged path:/collections/collection1/state.json] for collection [collection1] has occurred - updating... (live nodes size: [2])
   [junit4]   2> 1354652 INFO  (TEST-FullSolrCloudDistribCmdsTest.test-seed#[BC69857AD64601BD]) [    ] o.a.s.c.AbstractFullDistribZkTestBase create jetty 2 in directory /Users/jenkins/workspace/Lucene-Solr-7.x-MacOSX/solr/build/solr-core/test/J1/temp/solr.cloud.FullSolrCloudDistribCmdsTest_BC69857AD64601BD-001/shard-2-001 of type NRT
   [junit4]   2> 1354653 INFO  (TEST-FullSolrCloudDistribCmdsTest.test-seed#[BC69857AD64601BD]) [    ] o.e.j.s.Server jetty-9.3.14.v20161028
   [junit4]   2> 1354654 INFO  (TEST-FullSolrCloudDistribCmdsTest.test-seed#[BC69857AD64601BD]) [    ] o.e.j.s.h.ContextHandler Started o.e.j.s.ServletContextHandler@381809da{/,null,AVAILABLE}
   [junit4]   2> 1354654 INFO  (TEST-FullSolrCloudDistribCmdsTest.test-seed#[BC69857AD64601BD]) [    ] o.e.j.s.AbstractConnector Started ServerConnector@33bbec4a{HTTP/1.1,[http/1.1]}{127.0.0.1:50350}
   [junit4]   2> 1354654 INFO  (TEST-FullSolrCloudDistribCmdsTest.test-seed#[BC69857AD64601BD]) [    ] o.e.j.s.Server Started @1358383ms
   [junit4]   2> 1354654 INFO  (TEST-FullSolrCloudDistribCmdsTest.test-seed#[BC69857AD64601BD]) [    ] o.a.s.c.s.e.JettySolrRunner Jetty properties: {solr.data.dir=/Users/jenkins/workspace/Lucene-Solr-7.x-MacOSX/solr/build/solr-core/test/J1/temp/solr.cloud.FullSolrCloudDistribCmdsTest_BC69857AD64601BD-001/tempDir-001/jetty2, solrconfig=solrconfig.xml, hostContext=/, hostPort=50350, coreRootDirectory=/Users/jenkins/workspace/Lucene-Solr-7.x-MacOSX/solr/build/solr-core/test/J1/../../../../../../../../../Users/jenkins/workspace/Lucene-Solr-7.x-MacOSX/solr/build/solr-core/test/J1/temp/solr.cloud.FullSolrCloudDistribCmdsTest_BC69857AD64601BD-001/shard-2-001/cores}
   [junit4]   2> 1354655 ERROR (TEST-FullSolrCloudDistribCmdsTest.test-seed#[BC69857AD64601BD]) [    ] o.a.s.s.StartupLoggingUtils Missing Java Option solr.log.dir. Logging may be missing or incomplete.
   [junit4]   2> 1354655 INFO  (TEST-FullSolrCloudDistribCmdsTest.test-seed#[BC69857AD64601BD]) [    ] o.a.s.s.SolrDispatchFilter  ___      _       Welcome to Apache Solr? version 7.1.0
   [junit4]   2> 1354655 INFO  (TEST-FullSolrCloudDistribCmdsTest.test-seed#[BC69857AD64601BD]) [    ] o.a.s.s.SolrDispatchFilter / __| ___| |_ _   Starting in cloud mode on port null
   [junit4]   2> 1354655 INFO  (TEST-FullSolrCloudDistribCmdsTest.test-seed#[BC69857AD64601BD]) [    ] o.a.s.s.SolrDispatchFilter \__ \/ _ \ | '_|  Install dir: null, Default config dir: null
   [junit4]   2> 1354655 INFO  (TEST-FullSolrCloudDistribCmdsTest.test-seed#[BC69857AD64601BD]) [    ] o.a.s.s.SolrDispatchFilter |___/\___/_|_|    Start time: 2017-08-10T21:32:35.481Z
   [junit4]   2> 1354658 INFO  (TEST-FullSolrCloudDistribCmdsTest.test-seed#[BC69857AD64601BD]) [    ] o.a.s.s.SolrDispatchFilter Loading solr.xml from SolrHome (not found in ZooKeeper)
   [junit4]   2> 1354658 INFO  (TEST-FullSolrCloudDistribCmdsTest.test-seed#[BC69857AD64601BD]) [    ] o.a.s.c.SolrXmlConfig Loading container configuration from /Users/jenkins/workspace/Lucene-Solr-7.x-MacOSX/solr/build/solr-core/test/J1/temp/solr.cloud.FullSolrCloudDistribCmdsTest_BC69857AD64601BD-001/shard-2-001/solr.xml
   [junit4]   2> 1354662 INFO  (TEST-FullSolrCloudDistribCmdsTest.test-seed#[BC69857AD64601BD]) [    ] o.a.s.c.SolrXmlConfig MBean server found: com.sun.jmx.mbeanserver.JmxMBeanServer@18f32ada, but no JMX reporters were configured - adding default JMX reporter.
   [junit4]   2> 1354665 INFO  (TEST-FullSolrCloudDistribCmdsTest.test-seed#[BC69857AD64601BD]) [    ] o.a.s.c.ZkContainer Zookeeper client=127.0.0.1:50328/solr
   [junit4]   2> 1354676 INFO  (TEST-FullSolrCloudDistribCmdsTest.test-seed#[BC69857AD64601BD]) [n:127.0.0.1:50350_    ] o.a.s.c.c.ZkStateReader Updated live nodes from ZooKeeper... (0) -> (2)
   [junit4]   2> 1354679 INFO  (TEST-FullSolrCloudDistribCmdsTest.test-seed#[BC69857AD64601BD]) [n:127.0.0.1:50350_    ] o.a.s.c.Overseer Overseer (id=null) closing
   [junit4]   2> 1354681 INFO  (TEST-FullSolrCloudDistribCmdsTest.test-seed#[BC69857AD64601BD]) [n:127.0.0.1:50350_    ] o.a.s.c.ZkController Register node as live in ZooKeeper:/live_nodes/127.0.0.1:50350_
   [junit4]   2> 1354683 INFO  (zkCallback-3245-thread-1-processing-n:127.0.0.1:50343_) [n:127.0.0.1:50343_    ] o.a.s.c.c.ZkStateReader Updated live nodes from ZooKeeper... (2) -> (3)
   [junit4]   2> 1354683 INFO  (zkCallback-3233-thread-1-processing-n:127.0.0.1:50331_) [n:127.0.0.1:50331_    ] o.a.s.c.c.ZkStateReader Updated live nodes from ZooKeeper... (2) -> (3)
   [junit4]   2> 1354683 INFO  (zkCallback-3240-thread-1) [    ] o.a.s.c.c.ZkStateReader Updated live nodes from ZooKeeper... (2) -> (3)
   [junit4]   2> 1354684 INFO  (zkCallback-3251-thread-1-processing-n:127.0.0.1:50350_) [n:127.0.0.1:50350_    ] o.a.s.c.c.ZkStateReader Updated live nodes from ZooKeeper... (2) -> (3)
   [junit4]   2> 1354757 INFO  (TEST-FullSolrCloudDistribCmdsTest.test-seed#[BC69857AD64601BD]) [n:127.0.0.1:50350_    ] o.a.s.m.r.SolrJmxReporter JMX monitoring for 'solr.node' (registry 'solr.node') enabled at server: com.sun.jmx.mbeanserver.JmxMBeanServer@18f32ada
   [junit4]   2> 1354760 INFO  (TEST-FullSolrCloudDistribCmdsTest.test-seed#[BC69857AD64601BD]) [n:127.0.0.1:50350_    ] o.a.s.m.r.SolrJmxReporter JMX monitoring for 'solr.jvm' (registry 'solr.jvm') enabled at server: com.sun.jmx.mbeanserver.JmxMBeanServer@18f32ada
   [junit4]   2> 1354760 INFO  (TEST-FullSolrCloudDistribCmdsTest.test-seed#[BC69857AD64601BD]) [n:127.0.0.1:50350_    ] o.a.s.m.r.SolrJmxReporter JMX monitoring for 'solr.jetty' (registry 'solr.jetty') enabled at server: com.sun.jmx.mbeanserver.JmxMBeanServer@18f32ada
   [junit4]   2> 1354761 INFO  (TEST-FullSolrCloudDistribCmdsTest.test-seed#[BC69857AD64601BD]) [n:127.0.0.1:50350_    ] o.a.s.c.CorePropertiesLocator Found 0 core definitions underneath /Users/jenkins/workspace/Lucene-Solr-7.x-MacOSX/solr/build/solr-core/test/J1/../../../../../../../../../Users/jenkins/workspace/Lucene-Solr-7.x-MacOSX/solr/build/solr-core/test/J1/temp/solr.cloud.FullSolrCloudDistribCmdsTest_BC69857AD64601BD-001/shard-2-001/cores
   [junit4]   2> 1354791 INFO  (qtp528219418-16992) [n:127.0.0.1:50343_    ] o.a.s.h.a.CollectionsHandler Invoked Collection Action :addreplica with params node=127.0.0.1:50350_&action=ADDREPLICA&collection=collection1&shard=shard3&type=NRT&wt=javabin&version=2 and sendToOCPQueue=true
   [junit4]   2> 1354794 INFO  (OverseerCollectionConfigSetProcessor-98461335549706244-127.0.0.1:50331_-n_0000000000) [n:127.0.0.1:50331_    ] o.a.s.c.OverseerTaskQueue Response ZK path: /overseer/collection-queue-work/qnr-0000000004 doesn't exist.  Requestor may have disconnected from ZooKeeper
   [junit4]   2> 1354794 INFO  (OverseerThreadFactory-6840-thread-4-processing-n:127.0.0.1:50331_) [n:127.0.0.1:50331_    ] o.a.s.c.AddReplicaCmd Node Identified 127.0.0.1:50350_ for creating new replica
   [junit4]   2> 1354799 INFO  (qtp279311901-17019) [n:127.0.0.1:50350_    ] o.a.s.h.a.CoreAdminOperation core create command qt=/admin/cores&collection.configName=conf1&name=collection1_shard3_replica_n63&action=CREATE&collection=collection1&shard=shard3&wt=javabin&version=2&replicaType=NRT
   [junit4]   2> 1354799 INFO  (qtp279311901-17019) [n:127.0.0.1:50350_    ] o.a.s.c.TransientSolrCoreCacheDefault Allocating transient cache for 4 transient cores
   [junit4]   2> 1354907 INFO  (zkCallback-3245-thread-1-processing-n:127.0.0.1:50343_) [n:127.0.0.1:50343_    ] o.a.s.c.c.ZkStateReader A cluster state change: [WatchedEvent state:SyncConnected type:NodeDataChanged path:/collections/collection1/state.json] for collection [collection1] has occurred - updating... (live nodes size: [3])
   [junit4]   2> 1354907 INFO  (zkCallback-3251-thread-1-processing-n:127.0.0.1:50350_) [n:127.0.0.1:50350_    ] o.a.s.c.c.ZkStateReader A cluster state change: [WatchedEvent state:SyncConnected type:NodeDataChanged path:/collections/collection1/state.json] for collection [collection1] has occurred - updating... (live nodes size: [3])
   [junit4]   2> 1355817 INFO  (qtp279311901-17019) [n:127.0.0.1:50350_ c:collection1 s:shard3  x:collection1_shard3_replica_n63] o.a.s.c.SolrConfig Using Lucene MatchVersion: 7.1.0
   [junit4]   2> 1355826 INFO  (qtp279311901-17019) [n:127.0.0.1:50350_ c:collection1 s:shard3  x:collection1_shard3_replica_n63] o.a.s.s.IndexSchema [collection1_shard3_replica_n63] Schema name=test
   [junit4]   2> 1355884 INFO  (qtp279311901-17019) [n:127.0.0.1:50350_ c:collection1 s:shard3  x:collection1_shard3_replica_n63] o.a.s.s.IndexSchema Loaded schema test/1.6 with uniqueid field id
   [junit4]   2> 1355904 INFO  (qtp279311901-17019) [n:127.0.0.1:50350_ c:collection1 s:shard3  x:collection1_shard3_replica_n63] o.a.s.c.CoreContainer Creating SolrCore 'collection1_shard3_replica_n63' using configuration from collection collection1, trusted=true
   [junit4]   2> 1355905 INFO  (qtp279311901-17019) [n:127.0.0.1:50350_ c:collection1 s:shard3  x:collection1_shard3_replica_n63] o.a.s.m.r.SolrJmxReporter JMX monitoring for 'solr.core.collection1.shard3.replica_n63' (registry 'solr.core.collection1.shard3.replica_n63') enabled at server: com.sun.jmx.mbeanserver.JmxMBeanServer@18f32ada
   [junit4]   2> 1355905 INFO  (qtp279311901-17019) [n:127.0.0.1:50350_ c:collection1 s:shard3  x:collection1_shard3_replica_n63] o.a.s.c.SolrCore solr.RecoveryStrategy.Builder
   [junit4]   2> 1355905 INFO  (qtp279311901-17019) [n:127.0.0.1:50350_ c:collection1 s:shard3  x:collection1_shard3_replica_n63] o.a.s.c.SolrCore [[collection1_shard3_replica_n63] ] Opening new SolrCore at [/Users/jenkins/workspace/Lucene-Solr-7.x-MacOSX/solr/build/solr-core/test/J1/temp/solr.cloud.FullSolrCloudDistribCmdsTest_BC69857AD64601BD-001/shard-2-001/cores/collection1_shard3_replica_n63], dataDir=[/Users/jenkins/workspace/Lucene-Solr-7.x-MacOSX/solr/build/solr-core/test/J1/../../../../../../../../../Users/jenkins/workspace/Lucene-Solr-7.x-MacOSX/solr/build/solr-core/test/J1/temp/solr.cloud.FullSolrCloudDistribCmdsTest_BC69857AD64601BD-001/shard-2-001/cores/collection1_shard3_replica_n63/data/]
   [junit4]   2> 1355908 INFO  (qtp279311901-17019) [n:127.0.0.1:50350_ c:collection1 s:shard3  x:collection1_shard3_replica_n63] o.a.s.u.RandomMergePolicy RandomMergePolicy wrapping class org.apache.lucene.index.LogByteSizeMergePolicy: [LogByteSizeMergePolicy: minMergeSize=1677721, mergeFactor=26, maxMergeSize=2147483648, maxMergeSizeForForcedMerge=9223372036854775807, calibrateSizeByDeletes=true, maxMergeDocs=2147483647, maxCFSSegmentSizeMB=8.796093022207999E12, noCFSRatio=0.0]
   [junit4]   2> 1355910 WARN  (qtp279311901-17019) [n:127.0.0.1:50350_ c:collection1 s:shard3  x:collection1_shard3_replica_n63] o.a.s.c.RequestHandlers INVALID paramSet a in requestHandler {type = requestHandler,name = /dump,class = DumpRequestHandler,attributes = {initParams=a, name=/dump, class=DumpRequestHandler},args = {defaults={a=A,b=B}}}
   [junit4]   2> 1355960 INFO  (qtp279311901-17019) [n:127.0.0.1:50350_ c:collection1 s:shard3  x:collection1_shard3_replica_n63] o.a.s.u.UpdateHandler Using UpdateLog implementation: org.apache.solr.update.UpdateLog
   [junit4]   2> 1355960 INFO  (qtp279311901-17019) [n:127.0.0.1:50350_ c:collection1 s:shard3  x:collection1_shard3_replica_n63] o.a.s.u.UpdateLog Initializing UpdateLog: dataDir= defaultSyncLevel=FLUSH numRecordsToKeep=100 maxNumLogsToKeep=10 numVersionBuckets=65536
   [junit4]   2> 1355961 INFO  (qtp279311901-17019) [n:127.0.0.1:50350_ c:collection1 s:shard3  x:collection1_shard3_replica_n63] o.a.s.u.CommitTracker Hard AutoCommit: disabled
   [junit4]   2> 1355961 INFO  (qtp279311901-17019) [n:127.0.0.1:50350_ c:collection1 s:shard3  x:collection1_shard3_replica_n63] o.a.s.u.CommitTracker Soft AutoCommit: disabled
   [junit4]   2> 1355962 INFO  (qtp279311901-17019) [n:127.0.0.1:50350_ c:collection1 s:shard3  x:collection1_shard3_replica_n63] o.a.s.u.RandomMergePolicy RandomMergePolicy wrapping class org.apache.lucene.index.LogDocMergePolicy: [LogDocMergePolicy: minMergeSize=1000, mergeFactor=48, maxMergeSize=9223372036854775807, maxMergeSizeForForcedMerge=9223372036854775807, calibrateSizeByDeletes=true, maxMergeDocs=2147483647, maxCFSSegmentSizeMB=8.796093022207999E12, noCFSRatio=0.0]
   [junit4]   2> 1355962 INFO  (qtp279311901-17019) [n:127.0.0.1:50350_ c:collection1 s:shard3  x:collection1_shard3_replica_n63] o.a.s.s.SolrIndexSearcher Opening [Searcher@b01290f[collection1_shard3_replica_n63] main]
   [junit4]   2> 1355963 INFO  (qtp279311901-17019) [n:127.0.0.1:50350_ c:collection1 s:shard3  x:collection1_shard3_replica_n63] o.a.s.r.ManagedResourceStorage Configured ZooKeeperStorageIO with znodeBase: /configs/conf1
   [junit4]   2> 1355964 INFO  (qtp279311901-17019) [n:127.0.0.1:50350_ c:collection1 s:shard3  x:collection1_shard3_replica_n63] o.a.s.r.ManagedResourceStorage Loaded null at path _rest_managed.json using ZooKeeperStorageIO:path=/configs/conf1
   [junit4]   2> 1355964 INFO  (qtp279311901-17019) [n:127.0.0.1:50350_ c:collection1 s:shard3  x:collection1_shard3_replica_n63] o.a.s.h.ReplicationHandler Commits will be reserved for  10000
   [junit4]   2> 1355964 INFO  (qtp279311901-17019) [n:127.0.0.1:50350_ c:collection1 s:shard3  x:collection1_shard3_replica_n63] o.a.s.u.UpdateLog Could not find max version in index or recent updates, using new clock 1575381375951831040
   [junit4]   2> 1355965 INFO  (searcherExecutor-6865-thread-1-processing-n:127.0.0.1:50350_ x:collection1_shard3_replica_n63 s:shard3 c:collection1) [n:127.0.0.1:50350_ c:collection1 s:shard3  x:collection1_shard3_replica_n63] o.a.s.c.SolrCore [collection1_shard3_replica_n63] Registered new searcher Searcher@b01290f[collection1_shard3_replica_n63] main{ExitableDirectoryReader(UninvertingDirectoryReader())}
   [junit4]   2> 1355971 INFO  (qtp279311901-17019) [n:127.0.0.1:50350_ c:collection1 s:shard3  x:collection1_shard3_replica_n63] o.a.s.c.ShardLeaderElectionContext Enough replicas found to continue.
   [junit4]   2> 1355971 INFO  (qtp279311901-17019) [n:127.0.0.1:50350_ c:collection1 s:shard3  x:collection1_shard3_replica_n63] o.a.s.c.ShardLeaderElectionContext I may be the new leader - try and sync
   [junit4]   2> 1355971 INFO  (qtp279311901-17019) [n:127.0.0.1:50350_ c:collection1 s:shard3  x:collection1_shard3_replica_n63] o.a.s.c.SyncStrategy Sync replicas to http://127.0.0.1:50350/collection1_shard3_replica_n63/
   [junit4]   2> 1355971 INFO  (qtp279311901-17019) [n:127.0.0.1:50350_ c:collection1 s:shard3  x:collection1_shard3_replica_n63] o.a.s.c.SyncStrategy Sync Success - now sync replicas to me
   [junit4]   2> 1355971 INFO  (qtp279311901-17019) [n:127.0.0.1:50350_ c:collection1 s:shard3  x:collection1_shard3_replica_n63] o.a.s.c.SyncStrategy http://127.0.0.1:50350/collection1_shard3_replica_n63/ has no replicas
   [junit4]   2> 1355971 INFO  (qtp279311901-17019) [n:127.0.0.1:50350_ c:collection1 s:shard3  x:collection1_shard3_replica_n63] o.a.s.c.ShardLeaderElectionContext Found all replicas participating in election, clear LIR
   [junit4]   2> 1355975 INFO  (qtp279311901-17019) [n:127.0.0.1:50350_ c:collection1 s:shard3  x:collecti

[...truncated too long message...]

]    >         at java.util.concurrent.locks.LockSupport.parkNanos(LockSupport.java:215)
   [junit4]    >         at java.util.concurrent.SynchronousQueue$TransferStack.awaitFulfill(SynchronousQueue.java:460)
   [junit4]    >         at java.util.concurrent.SynchronousQueue$TransferStack.transfer(SynchronousQueue.java:362)
   [junit4]    >         at java.util.concurrent.SynchronousQueue.poll(SynchronousQueue.java:941)
   [junit4]    >         at java.util.concurrent.ThreadPoolExecutor.getTask(ThreadPoolExecutor.java:1073)
   [junit4]    >         at java.util.concurrent.ThreadPoolExecutor.runWorker(ThreadPoolExecutor.java:1134)
   [junit4]    >         at java.util.concurrent.ThreadPoolExecutor$Worker.run(ThreadPoolExecutor.java:624)
   [junit4]    >         at java.lang.Thread.run(Thread.java:748)
   [junit4]    >    8) Thread[id=17452, name=zkCallback-3316-thread-2-processing-n:127.0.0.1:50652_, state=TIMED_WAITING, group=TGRP-CdcrVersionReplicationTest]
   [junit4]    >         at java.lang.Thread.sleep(Native Method)
   [junit4]    >         at org.apache.solr.common.cloud.ZkCmdExecutor.retryDelay(ZkCmdExecutor.java:111)
   [junit4]    >         at org.apache.solr.common.cloud.ZkCmdExecutor.retryOperation(ZkCmdExecutor.java:70)
   [junit4]    >         at org.apache.solr.common.cloud.SolrZkClient.exists(SolrZkClient.java:320)
   [junit4]    >         at org.apache.solr.common.cloud.ZkCmdExecutor.ensureExists(ZkCmdExecutor.java:93)
   [junit4]    >         at org.apache.solr.common.cloud.ZkCmdExecutor.ensureExists(ZkCmdExecutor.java:78)
   [junit4]    >         at org.apache.solr.cloud.DistributedQueue.<init>(DistributedQueue.java:104)
   [junit4]    >         at org.apache.solr.cloud.Overseer.getStateUpdateQueue(Overseer.java:632)
   [junit4]    >         at org.apache.solr.cloud.Overseer$ClusterStateUpdater.<init>(Overseer.java:101)
   [junit4]    >         at org.apache.solr.cloud.Overseer.start(Overseer.java:515)
   [junit4]    >         at org.apache.solr.cloud.OverseerElectionContext.runLeaderProcess(ElectionContext.java:784)
   [junit4]    >         at org.apache.solr.cloud.LeaderElector.runIamLeaderProcess(LeaderElector.java:170)
   [junit4]    >         at org.apache.solr.cloud.LeaderElector.checkIfIamLeader(LeaderElector.java:135)
   [junit4]    >         at org.apache.solr.cloud.LeaderElector.access$200(LeaderElector.java:56)
   [junit4]    >         at org.apache.solr.cloud.LeaderElector$ElectionWatcher.process(LeaderElector.java:348)
   [junit4]    >         at org.apache.solr.common.cloud.SolrZkClient$3.lambda$process$0(SolrZkClient.java:269)
   [junit4]    >         at org.apache.solr.common.cloud.SolrZkClient$3$$Lambda$182/1793901903.run(Unknown Source)
   [junit4]    >         at java.util.concurrent.Executors$RunnableAdapter.call(Executors.java:511)
   [junit4]    >         at java.util.concurrent.FutureTask.run(FutureTask.java:266)
   [junit4]    >         at org.apache.solr.common.util.ExecutorUtil$MDCAwareThreadPoolExecutor.lambda$execute$0(ExecutorUtil.java:188)
   [junit4]    >         at org.apache.solr.common.util.ExecutorUtil$MDCAwareThreadPoolExecutor$$Lambda$111/1376189292.run(Unknown Source)
   [junit4]    >         at java.util.concurrent.ThreadPoolExecutor.runWorker(ThreadPoolExecutor.java:1149)
   [junit4]    >         at java.util.concurrent.ThreadPoolExecutor$Worker.run(ThreadPoolExecutor.java:624)
   [junit4]    >         at java.lang.Thread.run(Thread.java:748)
   [junit4]    >    9) Thread[id=17447, name=TEST-CdcrVersionReplicationTest.testCdcrDocVersions-seed#[BC69857AD64601BD]-EventThread, state=WAITING, group=TGRP-CdcrVersionReplicationTest]
   [junit4]    >         at sun.misc.Unsafe.park(Native Method)
   [junit4]    >         at java.util.concurrent.locks.LockSupport.park(LockSupport.java:175)
   [junit4]    >         at java.util.concurrent.locks.AbstractQueuedSynchronizer$ConditionObject.await(AbstractQueuedSynchronizer.java:2039)
   [junit4]    >         at java.util.concurrent.LinkedBlockingQueue.take(LinkedBlockingQueue.java:442)
   [junit4]    >         at org.apache.zookeeper.ClientCnxn$EventThread.run(ClientCnxn.java:501)
   [junit4]    > 	at __randomizedtesting.SeedInfo.seed([BC69857AD64601BD]:0)Throwable #2: com.carrotsearch.randomizedtesting.ThreadLeakError: There are still zombie threads that couldn't be terminated:
   [junit4]    >    1) Thread[id=17455, name=zkCallback-3316-thread-4, state=TIMED_WAITING, group=TGRP-CdcrVersionReplicationTest]
   [junit4]    >         at sun.misc.Unsafe.park(Native Method)
   [junit4]    >         at java.util.concurrent.locks.LockSupport.parkNanos(LockSupport.java:215)
   [junit4]    >         at java.util.concurrent.SynchronousQueue$TransferStack.awaitFulfill(SynchronousQueue.java:460)
   [junit4]    >         at java.util.concurrent.SynchronousQueue$TransferStack.transfer(SynchronousQueue.java:362)
   [junit4]    >         at java.util.concurrent.SynchronousQueue.poll(SynchronousQueue.java:941)
   [junit4]    >         at java.util.concurrent.ThreadPoolExecutor.getTask(ThreadPoolExecutor.java:1073)
   [junit4]    >         at java.util.concurrent.ThreadPoolExecutor.runWorker(ThreadPoolExecutor.java:1134)
   [junit4]    >         at java.util.concurrent.ThreadPoolExecutor$Worker.run(ThreadPoolExecutor.java:624)
   [junit4]    >         at java.lang.Thread.run(Thread.java:748)
   [junit4]    >    2) Thread[id=17446, name=TEST-CdcrVersionReplicationTest.testCdcrDocVersions-seed#[BC69857AD64601BD]-SendThread(127.0.0.1:50641), state=TIMED_WAITING, group=TGRP-CdcrVersionReplicationTest]
   [junit4]    >         at java.lang.Thread.sleep(Native Method)
   [junit4]    >         at org.apache.zookeeper.ClientCnxn$SendThread.run(ClientCnxn.java:1051)
   [junit4]    >    3) Thread[id=17448, name=zkCallback-3316-thread-1, state=TIMED_WAITING, group=TGRP-CdcrVersionReplicationTest]
   [junit4]    >         at sun.misc.Unsafe.park(Native Method)
   [junit4]    >         at java.util.concurrent.locks.LockSupport.parkNanos(LockSupport.java:215)
   [junit4]    >         at java.util.concurrent.SynchronousQueue$TransferStack.awaitFulfill(SynchronousQueue.java:460)
   [junit4]    >         at java.util.concurrent.SynchronousQueue$TransferStack.transfer(SynchronousQueue.java:362)
   [junit4]    >         at java.util.concurrent.SynchronousQueue.poll(SynchronousQueue.java:941)
   [junit4]    >         at java.util.concurrent.ThreadPoolExecutor.getTask(ThreadPoolExecutor.java:1073)
   [junit4]    >         at java.util.concurrent.ThreadPoolExecutor.runWorker(ThreadPoolExecutor.java:1134)
   [junit4]    >         at java.util.concurrent.ThreadPoolExecutor$Worker.run(ThreadPoolExecutor.java:624)
   [junit4]    >         at java.lang.Thread.run(Thread.java:748)
   [junit4]    >    4) Thread[id=17454, name=zkCallback-3316-thread-3, state=TIMED_WAITING, group=TGRP-CdcrVersionReplicationTest]
   [junit4]    >         at sun.misc.Unsafe.park(Native Method)
   [junit4]    >         at java.util.concurrent.locks.LockSupport.parkNanos(LockSupport.java:215)
   [junit4]    >         at java.util.concurrent.SynchronousQueue$TransferStack.awaitFulfill(SynchronousQueue.java:460)
   [junit4]    >         at java.util.concurrent.SynchronousQueue$TransferStack.transfer(SynchronousQueue.java:362)
   [junit4]    >         at java.util.concurrent.SynchronousQueue.poll(SynchronousQueue.java:941)
   [junit4]    >         at java.util.concurrent.ThreadPoolExecutor.getTask(ThreadPoolExecutor.java:1073)
   [junit4]    >         at java.util.concurrent.ThreadPoolExecutor.runWorker(ThreadPoolExecutor.java:1134)
   [junit4]    >         at java.util.concurrent.ThreadPoolExecutor$Worker.run(ThreadPoolExecutor.java:624)
   [junit4]    >         at java.lang.Thread.run(Thread.java:748)
   [junit4]    >    5) Thread[id=17456, name=zkCallback-3316-thread-5, state=TIMED_WAITING, group=TGRP-CdcrVersionReplicationTest]
   [junit4]    >         at sun.misc.Unsafe.park(Native Method)
   [junit4]    >         at java.util.concurrent.locks.LockSupport.parkNanos(LockSupport.java:215)
   [junit4]    >         at java.util.concurrent.SynchronousQueue$TransferStack.awaitFulfill(SynchronousQueue.java:460)
   [junit4]    >         at java.util.concurrent.SynchronousQueue$TransferStack.transfer(SynchronousQueue.java:362)
   [junit4]    >         at java.util.concurrent.SynchronousQueue.poll(SynchronousQueue.java:941)
   [junit4]    >         at java.util.concurrent.ThreadPoolExecutor.getTask(ThreadPoolExecutor.java:1073)
   [junit4]    >         at java.util.concurrent.ThreadPoolExecutor.runWorker(ThreadPoolExecutor.java:1134)
   [junit4]    >         at java.util.concurrent.ThreadPoolExecutor$Worker.run(ThreadPoolExecutor.java:624)
   [junit4]    >         at java.lang.Thread.run(Thread.java:748)
   [junit4]    >    6) Thread[id=17452, name=zkCallback-3316-thread-2, state=TIMED_WAITING, group=TGRP-CdcrVersionReplicationTest]
   [junit4]    >         at sun.misc.Unsafe.park(Native Method)
   [junit4]    >         at java.util.concurrent.locks.LockSupport.parkNanos(LockSupport.java:215)
   [junit4]    >         at java.util.concurrent.SynchronousQueue$TransferStack.awaitFulfill(SynchronousQueue.java:460)
   [junit4]    >         at java.util.concurrent.SynchronousQueue$TransferStack.transfer(SynchronousQueue.java:362)
   [junit4]    >         at java.util.concurrent.SynchronousQueue.poll(SynchronousQueue.java:941)
   [junit4]    >         at java.util.concurrent.ThreadPoolExecutor.getTask(ThreadPoolExecutor.java:1073)
   [junit4]    >         at java.util.concurrent.ThreadPoolExecutor.runWorker(ThreadPoolExecutor.java:1134)
   [junit4]    >         at java.util.concurrent.ThreadPoolExecutor$Worker.run(ThreadPoolExecutor.java:624)
   [junit4]    >         at java.lang.Thread.run(Thread.java:748)
   [junit4]    > 	at __randomizedtesting.SeedInfo.seed([BC69857AD64601BD]:0)
   [junit4] Completed [365/728 (2!)] on J1 in 26.35s, 1 test, 3 errors <<< FAILURES!

[...truncated 44470 lines...]

Mime
View raw message