lucene-dev mailing list archives

Site index · List index
Message view « Date » · « Thread »
Top « Date » · « Thread »
From Policeman Jenkins Server <jenk...@thetaphi.de>
Subject [JENKINS-EA] Lucene-Solr-7.x-Windows (32bit/jdk-9-ea+181) - Build # 109 - Unstable!
Date Fri, 11 Aug 2017 13:12:57 GMT
Build: https://jenkins.thetaphi.de/job/Lucene-Solr-7.x-Windows/109/
Java: 32bit/jdk-9-ea+181 -client -XX:+UseG1GC --illegal-access=deny

3 tests failed.
FAILED:  org.apache.solr.cloud.ForceLeaderTest.testReplicasInLIRNoLeader

Error Message:
Doc with id=1 not found in http://127.0.0.1:63630/e_q/j/forceleader_test_collection due to: Path not found: /id; rsp={doc=null}

Stack Trace:
java.lang.AssertionError: Doc with id=1 not found in http://127.0.0.1:63630/e_q/j/forceleader_test_collection due to: Path not found: /id; rsp={doc=null}
	at __randomizedtesting.SeedInfo.seed([1850FAB0F36466AD:FEC7CE70CAE69FCC]:0)
	at org.junit.Assert.fail(Assert.java:93)
	at org.junit.Assert.assertTrue(Assert.java:43)
	at org.apache.solr.cloud.HttpPartitionTest.assertDocExists(HttpPartitionTest.java:603)
	at org.apache.solr.cloud.HttpPartitionTest.assertDocsExistInAllReplicas(HttpPartitionTest.java:556)
	at org.apache.solr.cloud.ForceLeaderTest.testReplicasInLIRNoLeader(ForceLeaderTest.java:142)
	at java.base/jdk.internal.reflect.NativeMethodAccessorImpl.invoke0(Native Method)
	at java.base/jdk.internal.reflect.NativeMethodAccessorImpl.invoke(NativeMethodAccessorImpl.java:62)
	at java.base/jdk.internal.reflect.DelegatingMethodAccessorImpl.invoke(DelegatingMethodAccessorImpl.java:43)
	at java.base/java.lang.reflect.Method.invoke(Method.java:564)
	at com.carrotsearch.randomizedtesting.RandomizedRunner.invoke(RandomizedRunner.java:1713)
	at com.carrotsearch.randomizedtesting.RandomizedRunner$8.evaluate(RandomizedRunner.java:907)
	at com.carrotsearch.randomizedtesting.RandomizedRunner$9.evaluate(RandomizedRunner.java:943)
	at com.carrotsearch.randomizedtesting.RandomizedRunner$10.evaluate(RandomizedRunner.java:957)
	at org.apache.solr.BaseDistributedSearchTestCase$ShardsRepeatRule$ShardsFixedStatement.callStatement(BaseDistributedSearchTestCase.java:993)
	at org.apache.solr.BaseDistributedSearchTestCase$ShardsRepeatRule$ShardsStatement.evaluate(BaseDistributedSearchTestCase.java:968)
	at com.carrotsearch.randomizedtesting.rules.SystemPropertiesRestoreRule$1.evaluate(SystemPropertiesRestoreRule.java:57)
	at org.apache.lucene.util.TestRuleSetupTeardownChained$1.evaluate(TestRuleSetupTeardownChained.java:49)
	at org.apache.lucene.util.AbstractBeforeAfterRule$1.evaluate(AbstractBeforeAfterRule.java:45)
	at org.apache.lucene.util.TestRuleThreadAndTestName$1.evaluate(TestRuleThreadAndTestName.java:48)
	at org.apache.lucene.util.TestRuleIgnoreAfterMaxFailures$1.evaluate(TestRuleIgnoreAfterMaxFailures.java:64)
	at org.apache.lucene.util.TestRuleMarkFailure$1.evaluate(TestRuleMarkFailure.java:47)
	at com.carrotsearch.randomizedtesting.rules.StatementAdapter.evaluate(StatementAdapter.java:36)
	at com.carrotsearch.randomizedtesting.ThreadLeakControl$StatementRunner.run(ThreadLeakControl.java:368)
	at com.carrotsearch.randomizedtesting.ThreadLeakControl.forkTimeoutingTask(ThreadLeakControl.java:817)
	at com.carrotsearch.randomizedtesting.ThreadLeakControl$3.evaluate(ThreadLeakControl.java:468)
	at com.carrotsearch.randomizedtesting.RandomizedRunner.runSingleTest(RandomizedRunner.java:916)
	at com.carrotsearch.randomizedtesting.RandomizedRunner$5.evaluate(RandomizedRunner.java:802)
	at com.carrotsearch.randomizedtesting.RandomizedRunner$6.evaluate(RandomizedRunner.java:852)
	at com.carrotsearch.randomizedtesting.RandomizedRunner$7.evaluate(RandomizedRunner.java:863)
	at com.carrotsearch.randomizedtesting.rules.StatementAdapter.evaluate(StatementAdapter.java:36)
	at com.carrotsearch.randomizedtesting.rules.SystemPropertiesRestoreRule$1.evaluate(SystemPropertiesRestoreRule.java:57)
	at org.apache.lucene.util.AbstractBeforeAfterRule$1.evaluate(AbstractBeforeAfterRule.java:45)
	at com.carrotsearch.randomizedtesting.rules.StatementAdapter.evaluate(StatementAdapter.java:36)
	at org.apache.lucene.util.TestRuleStoreClassName$1.evaluate(TestRuleStoreClassName.java:41)
	at com.carrotsearch.randomizedtesting.rules.NoShadowingOrOverridesOnMethodsRule$1.evaluate(NoShadowingOrOverridesOnMethodsRule.java:40)
	at com.carrotsearch.randomizedtesting.rules.NoShadowingOrOverridesOnMethodsRule$1.evaluate(NoShadowingOrOverridesOnMethodsRule.java:40)
	at com.carrotsearch.randomizedtesting.rules.StatementAdapter.evaluate(StatementAdapter.java:36)
	at com.carrotsearch.randomizedtesting.rules.StatementAdapter.evaluate(StatementAdapter.java:36)
	at org.apache.lucene.util.TestRuleAssertionsRequired$1.evaluate(TestRuleAssertionsRequired.java:53)
	at org.apache.lucene.util.TestRuleMarkFailure$1.evaluate(TestRuleMarkFailure.java:47)
	at org.apache.lucene.util.TestRuleIgnoreAfterMaxFailures$1.evaluate(TestRuleIgnoreAfterMaxFailures.java:64)
	at org.apache.lucene.util.TestRuleIgnoreTestSuites$1.evaluate(TestRuleIgnoreTestSuites.java:54)
	at com.carrotsearch.randomizedtesting.rules.StatementAdapter.evaluate(StatementAdapter.java:36)
	at com.carrotsearch.randomizedtesting.ThreadLeakControl$StatementRunner.run(ThreadLeakControl.java:368)
	at java.base/java.lang.Thread.run(Thread.java:844)


FAILED:  org.apache.solr.cloud.TestAuthenticationFramework.testBasics

Error Message:
Error from server at http://127.0.0.1:64882/solr/testcollection_shard1_replica_n2: Expected mime type application/octet-stream but got text/html. <html> <head> <meta http-equiv="Content-Type" content="text/html;charset=ISO-8859-1"/> <title>Error 404 </title> </head> <body> <h2>HTTP ERROR: 404</h2> <p>Problem accessing /solr/testcollection_shard1_replica_n2/update. Reason: <pre>    Can not find: /solr/testcollection_shard1_replica_n2/update</pre></p> <hr /><a href="http://eclipse.org/jetty">Powered by Jetty:// 9.3.14.v20161028</a><hr/> </body> </html> 

Stack Trace:
org.apache.solr.client.solrj.impl.CloudSolrClient$RouteException: Error from server at http://127.0.0.1:64882/solr/testcollection_shard1_replica_n2: Expected mime type application/octet-stream but got text/html. <html>
<head>
<meta http-equiv="Content-Type" content="text/html;charset=ISO-8859-1"/>
<title>Error 404 </title>
</head>
<body>
<h2>HTTP ERROR: 404</h2>
<p>Problem accessing /solr/testcollection_shard1_replica_n2/update. Reason:
<pre>    Can not find: /solr/testcollection_shard1_replica_n2/update</pre></p>
<hr /><a href="http://eclipse.org/jetty">Powered by Jetty:// 9.3.14.v20161028</a><hr/>
</body>
</html>

	at __randomizedtesting.SeedInfo.seed([1850FAB0F36466AD:2588549CCB8A38DD]:0)
	at org.apache.solr.client.solrj.impl.CloudSolrClient.directUpdate(CloudSolrClient.java:539)
	at org.apache.solr.client.solrj.impl.CloudSolrClient.sendRequest(CloudSolrClient.java:993)
	at org.apache.solr.client.solrj.impl.CloudSolrClient.requestWithRetryOnStaleState(CloudSolrClient.java:862)
	at org.apache.solr.client.solrj.impl.CloudSolrClient.request(CloudSolrClient.java:793)
	at org.apache.solr.client.solrj.SolrRequest.process(SolrRequest.java:178)
	at org.apache.solr.client.solrj.request.UpdateRequest.commit(UpdateRequest.java:233)
	at org.apache.solr.cloud.TestAuthenticationFramework.collectionCreateSearchDeleteTwice(TestAuthenticationFramework.java:126)
	at org.apache.solr.cloud.TestAuthenticationFramework.testBasics(TestAuthenticationFramework.java:74)
	at java.base/jdk.internal.reflect.NativeMethodAccessorImpl.invoke0(Native Method)
	at java.base/jdk.internal.reflect.NativeMethodAccessorImpl.invoke(NativeMethodAccessorImpl.java:62)
	at java.base/jdk.internal.reflect.DelegatingMethodAccessorImpl.invoke(DelegatingMethodAccessorImpl.java:43)
	at java.base/java.lang.reflect.Method.invoke(Method.java:564)
	at com.carrotsearch.randomizedtesting.RandomizedRunner.invoke(RandomizedRunner.java:1713)
	at com.carrotsearch.randomizedtesting.RandomizedRunner$8.evaluate(RandomizedRunner.java:907)
	at com.carrotsearch.randomizedtesting.RandomizedRunner$9.evaluate(RandomizedRunner.java:943)
	at com.carrotsearch.randomizedtesting.RandomizedRunner$10.evaluate(RandomizedRunner.java:957)
	at com.carrotsearch.randomizedtesting.rules.SystemPropertiesRestoreRule$1.evaluate(SystemPropertiesRestoreRule.java:57)
	at org.apache.lucene.util.TestRuleSetupTeardownChained$1.evaluate(TestRuleSetupTeardownChained.java:49)
	at org.apache.lucene.util.AbstractBeforeAfterRule$1.evaluate(AbstractBeforeAfterRule.java:45)
	at org.apache.lucene.util.TestRuleThreadAndTestName$1.evaluate(TestRuleThreadAndTestName.java:48)
	at org.apache.lucene.util.TestRuleIgnoreAfterMaxFailures$1.evaluate(TestRuleIgnoreAfterMaxFailures.java:64)
	at org.apache.lucene.util.TestRuleMarkFailure$1.evaluate(TestRuleMarkFailure.java:47)
	at com.carrotsearch.randomizedtesting.rules.StatementAdapter.evaluate(StatementAdapter.java:36)
	at com.carrotsearch.randomizedtesting.ThreadLeakControl$StatementRunner.run(ThreadLeakControl.java:368)
	at com.carrotsearch.randomizedtesting.ThreadLeakControl.forkTimeoutingTask(ThreadLeakControl.java:817)
	at com.carrotsearch.randomizedtesting.ThreadLeakControl$3.evaluate(ThreadLeakControl.java:468)
	at com.carrotsearch.randomizedtesting.RandomizedRunner.runSingleTest(RandomizedRunner.java:916)
	at com.carrotsearch.randomizedtesting.RandomizedRunner$5.evaluate(RandomizedRunner.java:802)
	at com.carrotsearch.randomizedtesting.RandomizedRunner$6.evaluate(RandomizedRunner.java:852)
	at com.carrotsearch.randomizedtesting.RandomizedRunner$7.evaluate(RandomizedRunner.java:863)
	at com.carrotsearch.randomizedtesting.rules.StatementAdapter.evaluate(StatementAdapter.java:36)
	at com.carrotsearch.randomizedtesting.rules.SystemPropertiesRestoreRule$1.evaluate(SystemPropertiesRestoreRule.java:57)
	at org.apache.lucene.util.AbstractBeforeAfterRule$1.evaluate(AbstractBeforeAfterRule.java:45)
	at com.carrotsearch.randomizedtesting.rules.StatementAdapter.evaluate(StatementAdapter.java:36)
	at org.apache.lucene.util.TestRuleStoreClassName$1.evaluate(TestRuleStoreClassName.java:41)
	at com.carrotsearch.randomizedtesting.rules.NoShadowingOrOverridesOnMethodsRule$1.evaluate(NoShadowingOrOverridesOnMethodsRule.java:40)
	at com.carrotsearch.randomizedtesting.rules.NoShadowingOrOverridesOnMethodsRule$1.evaluate(NoShadowingOrOverridesOnMethodsRule.java:40)
	at com.carrotsearch.randomizedtesting.rules.StatementAdapter.evaluate(StatementAdapter.java:36)
	at com.carrotsearch.randomizedtesting.rules.StatementAdapter.evaluate(StatementAdapter.java:36)
	at org.apache.lucene.util.TestRuleAssertionsRequired$1.evaluate(TestRuleAssertionsRequired.java:53)
	at org.apache.lucene.util.TestRuleMarkFailure$1.evaluate(TestRuleMarkFailure.java:47)
	at org.apache.lucene.util.TestRuleIgnoreAfterMaxFailures$1.evaluate(TestRuleIgnoreAfterMaxFailures.java:64)
	at org.apache.lucene.util.TestRuleIgnoreTestSuites$1.evaluate(TestRuleIgnoreTestSuites.java:54)
	at com.carrotsearch.randomizedtesting.rules.StatementAdapter.evaluate(StatementAdapter.java:36)
	at com.carrotsearch.randomizedtesting.ThreadLeakControl$StatementRunner.run(ThreadLeakControl.java:368)
	at java.base/java.lang.Thread.run(Thread.java:844)
Caused by: org.apache.solr.client.solrj.impl.HttpSolrClient$RemoteSolrException: Error from server at http://127.0.0.1:64882/solr/testcollection_shard1_replica_n2: Expected mime type application/octet-stream but got text/html. <html>
<head>
<meta http-equiv="Content-Type" content="text/html;charset=ISO-8859-1"/>
<title>Error 404 </title>
</head>
<body>
<h2>HTTP ERROR: 404</h2>
<p>Problem accessing /solr/testcollection_shard1_replica_n2/update. Reason:
<pre>    Can not find: /solr/testcollection_shard1_replica_n2/update</pre></p>
<hr /><a href="http://eclipse.org/jetty">Powered by Jetty:// 9.3.14.v20161028</a><hr/>
</body>
</html>

	at org.apache.solr.client.solrj.impl.HttpSolrClient.executeMethod(HttpSolrClient.java:591)
	at org.apache.solr.client.solrj.impl.HttpSolrClient.request(HttpSolrClient.java:253)
	at org.apache.solr.client.solrj.impl.HttpSolrClient.request(HttpSolrClient.java:242)
	at org.apache.solr.client.solrj.impl.LBHttpSolrClient.doRequest(LBHttpSolrClient.java:483)
	at org.apache.solr.client.solrj.impl.LBHttpSolrClient.request(LBHttpSolrClient.java:413)
	at org.apache.solr.client.solrj.impl.CloudSolrClient.lambda$directUpdate$0(CloudSolrClient.java:516)
	at java.base/java.util.concurrent.FutureTask.run(FutureTask.java:264)
	at org.apache.solr.common.util.ExecutorUtil$MDCAwareThreadPoolExecutor.lambda$execute$0(ExecutorUtil.java:188)
	at java.base/java.util.concurrent.ThreadPoolExecutor.runWorker(ThreadPoolExecutor.java:1167)
	at java.base/java.util.concurrent.ThreadPoolExecutor$Worker.run(ThreadPoolExecutor.java:641)
	... 1 more


FAILED:  org.apache.solr.client.solrj.io.stream.StreamExpressionTest.testParallelExecutorStream

Error Message:
Error from server at http://127.0.0.1:58248/solr/mainCorpus_shard2_replica_n3: Expected mime type application/octet-stream but got text/html. <html> <head> <meta http-equiv="Content-Type" content="text/html;charset=ISO-8859-1"/> <title>Error 404 </title> </head> <body> <h2>HTTP ERROR: 404</h2> <p>Problem accessing /solr/mainCorpus_shard2_replica_n3/update. Reason: <pre>    Can not find: /solr/mainCorpus_shard2_replica_n3/update</pre></p> <hr /><a href="http://eclipse.org/jetty">Powered by Jetty:// 9.3.14.v20161028</a><hr/> </body> </html> 

Stack Trace:
org.apache.solr.client.solrj.impl.CloudSolrClient$RouteException: Error from server at http://127.0.0.1:58248/solr/mainCorpus_shard2_replica_n3: Expected mime type application/octet-stream but got text/html. <html>
<head>
<meta http-equiv="Content-Type" content="text/html;charset=ISO-8859-1"/>
<title>Error 404 </title>
</head>
<body>
<h2>HTTP ERROR: 404</h2>
<p>Problem accessing /solr/mainCorpus_shard2_replica_n3/update. Reason:
<pre>    Can not find: /solr/mainCorpus_shard2_replica_n3/update</pre></p>
<hr /><a href="http://eclipse.org/jetty">Powered by Jetty:// 9.3.14.v20161028</a><hr/>
</body>
</html>

	at __randomizedtesting.SeedInfo.seed([B2527D01DFEFA61A:F450818E6C39B47]:0)
	at org.apache.solr.client.solrj.impl.CloudSolrClient.directUpdate(CloudSolrClient.java:539)
	at org.apache.solr.client.solrj.impl.CloudSolrClient.sendRequest(CloudSolrClient.java:993)
	at org.apache.solr.client.solrj.impl.CloudSolrClient.requestWithRetryOnStaleState(CloudSolrClient.java:862)
	at org.apache.solr.client.solrj.impl.CloudSolrClient.request(CloudSolrClient.java:793)
	at org.apache.solr.client.solrj.SolrRequest.process(SolrRequest.java:178)
	at org.apache.solr.client.solrj.request.UpdateRequest.commit(UpdateRequest.java:233)
	at org.apache.solr.client.solrj.io.stream.StreamExpressionTest.testParallelExecutorStream(StreamExpressionTest.java:6885)
	at java.base/jdk.internal.reflect.NativeMethodAccessorImpl.invoke0(Native Method)
	at java.base/jdk.internal.reflect.NativeMethodAccessorImpl.invoke(NativeMethodAccessorImpl.java:62)
	at java.base/jdk.internal.reflect.DelegatingMethodAccessorImpl.invoke(DelegatingMethodAccessorImpl.java:43)
	at java.base/java.lang.reflect.Method.invoke(Method.java:564)
	at com.carrotsearch.randomizedtesting.RandomizedRunner.invoke(RandomizedRunner.java:1713)
	at com.carrotsearch.randomizedtesting.RandomizedRunner$8.evaluate(RandomizedRunner.java:907)
	at com.carrotsearch.randomizedtesting.RandomizedRunner$9.evaluate(RandomizedRunner.java:943)
	at com.carrotsearch.randomizedtesting.RandomizedRunner$10.evaluate(RandomizedRunner.java:957)
	at com.carrotsearch.randomizedtesting.rules.SystemPropertiesRestoreRule$1.evaluate(SystemPropertiesRestoreRule.java:57)
	at org.apache.lucene.util.TestRuleSetupTeardownChained$1.evaluate(TestRuleSetupTeardownChained.java:49)
	at org.apache.lucene.util.AbstractBeforeAfterRule$1.evaluate(AbstractBeforeAfterRule.java:45)
	at org.apache.lucene.util.TestRuleThreadAndTestName$1.evaluate(TestRuleThreadAndTestName.java:48)
	at org.apache.lucene.util.TestRuleIgnoreAfterMaxFailures$1.evaluate(TestRuleIgnoreAfterMaxFailures.java:64)
	at org.apache.lucene.util.TestRuleMarkFailure$1.evaluate(TestRuleMarkFailure.java:47)
	at com.carrotsearch.randomizedtesting.rules.StatementAdapter.evaluate(StatementAdapter.java:36)
	at com.carrotsearch.randomizedtesting.ThreadLeakControl$StatementRunner.run(ThreadLeakControl.java:368)
	at com.carrotsearch.randomizedtesting.ThreadLeakControl.forkTimeoutingTask(ThreadLeakControl.java:817)
	at com.carrotsearch.randomizedtesting.ThreadLeakControl$3.evaluate(ThreadLeakControl.java:468)
	at com.carrotsearch.randomizedtesting.RandomizedRunner.runSingleTest(RandomizedRunner.java:916)
	at com.carrotsearch.randomizedtesting.RandomizedRunner$5.evaluate(RandomizedRunner.java:802)
	at com.carrotsearch.randomizedtesting.RandomizedRunner$6.evaluate(RandomizedRunner.java:852)
	at com.carrotsearch.randomizedtesting.RandomizedRunner$7.evaluate(RandomizedRunner.java:863)
	at com.carrotsearch.randomizedtesting.rules.StatementAdapter.evaluate(StatementAdapter.java:36)
	at com.carrotsearch.randomizedtesting.rules.SystemPropertiesRestoreRule$1.evaluate(SystemPropertiesRestoreRule.java:57)
	at org.apache.lucene.util.AbstractBeforeAfterRule$1.evaluate(AbstractBeforeAfterRule.java:45)
	at com.carrotsearch.randomizedtesting.rules.StatementAdapter.evaluate(StatementAdapter.java:36)
	at org.apache.lucene.util.TestRuleStoreClassName$1.evaluate(TestRuleStoreClassName.java:41)
	at com.carrotsearch.randomizedtesting.rules.NoShadowingOrOverridesOnMethodsRule$1.evaluate(NoShadowingOrOverridesOnMethodsRule.java:40)
	at com.carrotsearch.randomizedtesting.rules.NoShadowingOrOverridesOnMethodsRule$1.evaluate(NoShadowingOrOverridesOnMethodsRule.java:40)
	at com.carrotsearch.randomizedtesting.rules.StatementAdapter.evaluate(StatementAdapter.java:36)
	at com.carrotsearch.randomizedtesting.rules.StatementAdapter.evaluate(StatementAdapter.java:36)
	at org.apache.lucene.util.TestRuleAssertionsRequired$1.evaluate(TestRuleAssertionsRequired.java:53)
	at org.apache.lucene.util.TestRuleMarkFailure$1.evaluate(TestRuleMarkFailure.java:47)
	at org.apache.lucene.util.TestRuleIgnoreAfterMaxFailures$1.evaluate(TestRuleIgnoreAfterMaxFailures.java:64)
	at org.apache.lucene.util.TestRuleIgnoreTestSuites$1.evaluate(TestRuleIgnoreTestSuites.java:54)
	at com.carrotsearch.randomizedtesting.rules.StatementAdapter.evaluate(StatementAdapter.java:36)
	at com.carrotsearch.randomizedtesting.ThreadLeakControl$StatementRunner.run(ThreadLeakControl.java:368)
	at java.base/java.lang.Thread.run(Thread.java:844)
Caused by: org.apache.solr.client.solrj.impl.HttpSolrClient$RemoteSolrException: Error from server at http://127.0.0.1:58248/solr/mainCorpus_shard2_replica_n3: Expected mime type application/octet-stream but got text/html. <html>
<head>
<meta http-equiv="Content-Type" content="text/html;charset=ISO-8859-1"/>
<title>Error 404 </title>
</head>
<body>
<h2>HTTP ERROR: 404</h2>
<p>Problem accessing /solr/mainCorpus_shard2_replica_n3/update. Reason:
<pre>    Can not find: /solr/mainCorpus_shard2_replica_n3/update</pre></p>
<hr /><a href="http://eclipse.org/jetty">Powered by Jetty:// 9.3.14.v20161028</a><hr/>
</body>
</html>

	at org.apache.solr.client.solrj.impl.HttpSolrClient.executeMethod(HttpSolrClient.java:591)
	at org.apache.solr.client.solrj.impl.HttpSolrClient.request(HttpSolrClient.java:253)
	at org.apache.solr.client.solrj.impl.HttpSolrClient.request(HttpSolrClient.java:242)
	at org.apache.solr.client.solrj.impl.LBHttpSolrClient.doRequest(LBHttpSolrClient.java:483)
	at org.apache.solr.client.solrj.impl.LBHttpSolrClient.request(LBHttpSolrClient.java:413)
	at org.apache.solr.client.solrj.impl.CloudSolrClient.lambda$directUpdate$0(CloudSolrClient.java:516)
	at java.base/java.util.concurrent.FutureTask.run(FutureTask.java:264)
	at org.apache.solr.common.util.ExecutorUtil$MDCAwareThreadPoolExecutor.lambda$execute$0(ExecutorUtil.java:188)
	at java.base/java.util.concurrent.ThreadPoolExecutor.runWorker(ThreadPoolExecutor.java:1167)
	at java.base/java.util.concurrent.ThreadPoolExecutor$Worker.run(ThreadPoolExecutor.java:641)
	... 1 more




Build Log:
[...truncated 12481 lines...]
   [junit4] Suite: org.apache.solr.cloud.ForceLeaderTest
   [junit4]   2> 1907055 INFO  (SUITE-ForceLeaderTest-seed#[1850FAB0F36466AD]-worker) [    ] o.a.s.SolrTestCaseJ4 SecureRandom sanity checks: test.solr.allowed.securerandom=null & java.security.egd=file:/dev/./urandom
   [junit4]   2> Creating dataDir: C:\Users\jenkins\workspace\Lucene-Solr-7.x-Windows\solr\build\solr-core\test\J0\temp\solr.cloud.ForceLeaderTest_1850FAB0F36466AD-001\init-core-data-001
   [junit4]   2> 1907057 WARN  (SUITE-ForceLeaderTest-seed#[1850FAB0F36466AD]-worker) [    ] o.a.s.SolrTestCaseJ4 startTrackingSearchers: numOpens=36 numCloses=36
   [junit4]   2> 1907057 INFO  (SUITE-ForceLeaderTest-seed#[1850FAB0F36466AD]-worker) [    ] o.a.s.SolrTestCaseJ4 Using PointFields (NUMERIC_POINTS_SYSPROP=true) w/NUMERIC_DOCVALUES_SYSPROP=false
   [junit4]   2> 1907061 INFO  (SUITE-ForceLeaderTest-seed#[1850FAB0F36466AD]-worker) [    ] o.a.s.SolrTestCaseJ4 Randomized ssl (false) and clientAuth (false) via: @org.apache.solr.SolrTestCaseJ4$SuppressSSL(bugUrl="https://issues.apache.org/jira/browse/SOLR-5776")
   [junit4]   2> 1907061 INFO  (SUITE-ForceLeaderTest-seed#[1850FAB0F36466AD]-worker) [    ] o.a.s.BaseDistributedSearchTestCase Setting hostContext system property: /e_q/j
   [junit4]   2> 1907065 INFO  (TEST-ForceLeaderTest.testLastPublishedStateIsActive-seed#[1850FAB0F36466AD]) [    ] o.a.s.c.ZkTestServer STARTING ZK TEST SERVER
   [junit4]   2> 1907084 INFO  (Thread-3923) [    ] o.a.s.c.ZkTestServer client port:0.0.0.0/0.0.0.0:0
   [junit4]   2> 1907084 INFO  (Thread-3923) [    ] o.a.s.c.ZkTestServer Starting server
   [junit4]   2> 1907099 ERROR (Thread-3923) [    ] o.a.z.s.ZooKeeperServer ZKShutdownHandler is not registered, so ZooKeeper server won't take any action on ERROR or SHUTDOWN server state changes
   [junit4]   2> 1907166 INFO  (TEST-ForceLeaderTest.testLastPublishedStateIsActive-seed#[1850FAB0F36466AD]) [    ] o.a.s.c.ZkTestServer start zk server on port:63254
   [junit4]   2> 1907179 WARN  (NIOServerCxn.Factory:0.0.0.0/0.0.0.0:0) [    ] o.a.z.s.NIOServerCnxn caught end of stream exception
   [junit4]   2> EndOfStreamException: Unable to read additional data from client sessionid 0x15dd14dca680000, likely client has closed socket
   [junit4]   2> 	at org.apache.zookeeper.server.NIOServerCnxn.doIO(NIOServerCnxn.java:239)
   [junit4]   2> 	at org.apache.zookeeper.server.NIOServerCnxnFactory.run(NIOServerCnxnFactory.java:203)
   [junit4]   2> 	at java.base/java.lang.Thread.run(Thread.java:844)
   [junit4]   2> 1907207 INFO  (TEST-ForceLeaderTest.testLastPublishedStateIsActive-seed#[1850FAB0F36466AD]) [    ] o.a.s.c.AbstractZkTestCase put C:\Users\jenkins\workspace\Lucene-Solr-7.x-Windows\solr\core\src\test-files\solr\collection1\conf\solrconfig-tlog.xml to /configs/conf1/solrconfig.xml
   [junit4]   2> 1907213 INFO  (TEST-ForceLeaderTest.testLastPublishedStateIsActive-seed#[1850FAB0F36466AD]) [    ] o.a.s.c.AbstractZkTestCase put C:\Users\jenkins\workspace\Lucene-Solr-7.x-Windows\solr\core\src\test-files\solr\collection1\conf\schema.xml to /configs/conf1/schema.xml
   [junit4]   2> 1907217 INFO  (TEST-ForceLeaderTest.testLastPublishedStateIsActive-seed#[1850FAB0F36466AD]) [    ] o.a.s.c.AbstractZkTestCase put C:\Users\jenkins\workspace\Lucene-Solr-7.x-Windows\solr\core\src\test-files\solr\collection1\conf\solrconfig.snippet.randomindexconfig.xml to /configs/conf1/solrconfig.snippet.randomindexconfig.xml
   [junit4]   2> 1907220 INFO  (TEST-ForceLeaderTest.testLastPublishedStateIsActive-seed#[1850FAB0F36466AD]) [    ] o.a.s.c.AbstractZkTestCase put C:\Users\jenkins\workspace\Lucene-Solr-7.x-Windows\solr\core\src\test-files\solr\collection1\conf\stopwords.txt to /configs/conf1/stopwords.txt
   [junit4]   2> 1907224 INFO  (TEST-ForceLeaderTest.testLastPublishedStateIsActive-seed#[1850FAB0F36466AD]) [    ] o.a.s.c.AbstractZkTestCase put C:\Users\jenkins\workspace\Lucene-Solr-7.x-Windows\solr\core\src\test-files\solr\collection1\conf\protwords.txt to /configs/conf1/protwords.txt
   [junit4]   2> 1907228 INFO  (TEST-ForceLeaderTest.testLastPublishedStateIsActive-seed#[1850FAB0F36466AD]) [    ] o.a.s.c.AbstractZkTestCase put C:\Users\jenkins\workspace\Lucene-Solr-7.x-Windows\solr\core\src\test-files\solr\collection1\conf\currency.xml to /configs/conf1/currency.xml
   [junit4]   2> 1907232 INFO  (TEST-ForceLeaderTest.testLastPublishedStateIsActive-seed#[1850FAB0F36466AD]) [    ] o.a.s.c.AbstractZkTestCase put C:\Users\jenkins\workspace\Lucene-Solr-7.x-Windows\solr\core\src\test-files\solr\collection1\conf\enumsConfig.xml to /configs/conf1/enumsConfig.xml
   [junit4]   2> 1907236 INFO  (TEST-ForceLeaderTest.testLastPublishedStateIsActive-seed#[1850FAB0F36466AD]) [    ] o.a.s.c.AbstractZkTestCase put C:\Users\jenkins\workspace\Lucene-Solr-7.x-Windows\solr\core\src\test-files\solr\collection1\conf\open-exchange-rates.json to /configs/conf1/open-exchange-rates.json
   [junit4]   2> 1907238 INFO  (TEST-ForceLeaderTest.testLastPublishedStateIsActive-seed#[1850FAB0F36466AD]) [    ] o.a.s.c.AbstractZkTestCase put C:\Users\jenkins\workspace\Lucene-Solr-7.x-Windows\solr\core\src\test-files\solr\collection1\conf\mapping-ISOLatin1Accent.txt to /configs/conf1/mapping-ISOLatin1Accent.txt
   [junit4]   2> 1907241 INFO  (TEST-ForceLeaderTest.testLastPublishedStateIsActive-seed#[1850FAB0F36466AD]) [    ] o.a.s.c.AbstractZkTestCase put C:\Users\jenkins\workspace\Lucene-Solr-7.x-Windows\solr\core\src\test-files\solr\collection1\conf\old_synonyms.txt to /configs/conf1/old_synonyms.txt
   [junit4]   2> 1907244 INFO  (TEST-ForceLeaderTest.testLastPublishedStateIsActive-seed#[1850FAB0F36466AD]) [    ] o.a.s.c.AbstractZkTestCase put C:\Users\jenkins\workspace\Lucene-Solr-7.x-Windows\solr\core\src\test-files\solr\collection1\conf\synonyms.txt to /configs/conf1/synonyms.txt
   [junit4]   2> 1907247 WARN  (NIOServerCxn.Factory:0.0.0.0/0.0.0.0:0) [    ] o.a.z.s.NIOServerCnxn caught end of stream exception
   [junit4]   2> EndOfStreamException: Unable to read additional data from client sessionid 0x15dd14dca680001, likely client has closed socket
   [junit4]   2> 	at org.apache.zookeeper.server.NIOServerCnxn.doIO(NIOServerCnxn.java:239)
   [junit4]   2> 	at org.apache.zookeeper.server.NIOServerCnxnFactory.run(NIOServerCnxnFactory.java:203)
   [junit4]   2> 	at java.base/java.lang.Thread.run(Thread.java:844)
   [junit4]   2> 1907247 INFO  (TEST-ForceLeaderTest.testLastPublishedStateIsActive-seed#[1850FAB0F36466AD]) [    ] o.a.s.c.AbstractFullDistribZkTestBase Will use NRT replicas unless explicitly asked otherwise
   [junit4]   2> 1908551 INFO  (TEST-ForceLeaderTest.testLastPublishedStateIsActive-seed#[1850FAB0F36466AD]) [    ] o.e.j.s.Server jetty-9.3.14.v20161028
   [junit4]   2> 1908554 INFO  (TEST-ForceLeaderTest.testLastPublishedStateIsActive-seed#[1850FAB0F36466AD]) [    ] o.e.j.s.h.ContextHandler Started o.e.j.s.ServletContextHandler@b972b5{/e_q/j,null,AVAILABLE}
   [junit4]   2> 1908556 INFO  (TEST-ForceLeaderTest.testLastPublishedStateIsActive-seed#[1850FAB0F36466AD]) [    ] o.e.j.s.AbstractConnector Started ServerConnector@1ba51a5{HTTP/1.1,[http/1.1]}{127.0.0.1:63262}
   [junit4]   2> 1908557 INFO  (TEST-ForceLeaderTest.testLastPublishedStateIsActive-seed#[1850FAB0F36466AD]) [    ] o.e.j.s.Server Started @1909438ms
   [junit4]   2> 1908557 INFO  (TEST-ForceLeaderTest.testLastPublishedStateIsActive-seed#[1850FAB0F36466AD]) [    ] o.a.s.c.s.e.JettySolrRunner Jetty properties: {hostContext=/e_q/j, solr.data.dir=C:\Users\jenkins\workspace\Lucene-Solr-7.x-Windows\solr\build\solr-core\test\J0\temp\solr.cloud.ForceLeaderTest_1850FAB0F36466AD-001\tempDir-001/control/data, hostPort=63261, coreRootDirectory=C:\Users\jenkins\workspace\Lucene-Solr-7.x-Windows\solr\build\solr-core\test\J0\temp\solr.cloud.ForceLeaderTest_1850FAB0F36466AD-001\control-001\cores}
   [junit4]   2> 1908557 ERROR (TEST-ForceLeaderTest.testLastPublishedStateIsActive-seed#[1850FAB0F36466AD]) [    ] o.a.s.s.StartupLoggingUtils Missing Java Option solr.log.dir. Logging may be missing or incomplete.
   [junit4]   2> 1908558 INFO  (TEST-ForceLeaderTest.testLastPublishedStateIsActive-seed#[1850FAB0F36466AD]) [    ] o.a.s.s.SolrDispatchFilter  ___      _       Welcome to Apache Solr™ version 7.1.0
   [junit4]   2> 1908558 INFO  (TEST-ForceLeaderTest.testLastPublishedStateIsActive-seed#[1850FAB0F36466AD]) [    ] o.a.s.s.SolrDispatchFilter / __| ___| |_ _   Starting in cloud mode on port null
   [junit4]   2> 1908558 INFO  (TEST-ForceLeaderTest.testLastPublishedStateIsActive-seed#[1850FAB0F36466AD]) [    ] o.a.s.s.SolrDispatchFilter \__ \/ _ \ | '_|  Install dir: null, Default config dir: null
   [junit4]   2> 1908558 INFO  (TEST-ForceLeaderTest.testLastPublishedStateIsActive-seed#[1850FAB0F36466AD]) [    ] o.a.s.s.SolrDispatchFilter |___/\___/_|_|    Start time: 2017-08-11T12:38:43.996232900Z
   [junit4]   2> 1908577 WARN  (NIOServerCxn.Factory:0.0.0.0/0.0.0.0:0) [    ] o.a.z.s.NIOServerCnxn caught end of stream exception
   [junit4]   2> EndOfStreamException: Unable to read additional data from client sessionid 0x15dd14dca680002, likely client has closed socket
   [junit4]   2> 	at org.apache.zookeeper.server.NIOServerCnxn.doIO(NIOServerCnxn.java:239)
   [junit4]   2> 	at org.apache.zookeeper.server.NIOServerCnxnFactory.run(NIOServerCnxnFactory.java:203)
   [junit4]   2> 	at java.base/java.lang.Thread.run(Thread.java:844)
   [junit4]   2> 1908584 INFO  (TEST-ForceLeaderTest.testLastPublishedStateIsActive-seed#[1850FAB0F36466AD]) [    ] o.a.s.s.SolrDispatchFilter Loading solr.xml from SolrHome (not found in ZooKeeper)
   [junit4]   2> 1908584 INFO  (TEST-ForceLeaderTest.testLastPublishedStateIsActive-seed#[1850FAB0F36466AD]) [    ] o.a.s.c.SolrXmlConfig Loading container configuration from C:\Users\jenkins\workspace\Lucene-Solr-7.x-Windows\solr\build\solr-core\test\J0\temp\solr.cloud.ForceLeaderTest_1850FAB0F36466AD-001\control-001\solr.xml
   [junit4]   2> 1908610 INFO  (TEST-ForceLeaderTest.testLastPublishedStateIsActive-seed#[1850FAB0F36466AD]) [    ] o.a.s.c.SolrXmlConfig MBean server found: com.sun.jmx.mbeanserver.JmxMBeanServer@132dc62, but no JMX reporters were configured - adding default JMX reporter.
   [junit4]   2> 1908619 INFO  (TEST-ForceLeaderTest.testLastPublishedStateIsActive-seed#[1850FAB0F36466AD]) [    ] o.a.s.c.ZkContainer Zookeeper client=127.0.0.1:63254/solr
   [junit4]   2> 1908633 WARN  (NIOServerCxn.Factory:0.0.0.0/0.0.0.0:0) [    ] o.a.z.s.NIOServerCnxn caught end of stream exception
   [junit4]   2> EndOfStreamException: Unable to read additional data from client sessionid 0x15dd14dca680003, likely client has closed socket
   [junit4]   2> 	at org.apache.zookeeper.server.NIOServerCnxn.doIO(NIOServerCnxn.java:239)
   [junit4]   2> 	at org.apache.zookeeper.server.NIOServerCnxnFactory.run(NIOServerCnxnFactory.java:203)
   [junit4]   2> 	at java.base/java.lang.Thread.run(Thread.java:844)
   [junit4]   2> 1909310 INFO  (TEST-ForceLeaderTest.testLastPublishedStateIsActive-seed#[1850FAB0F36466AD]) [    ] o.a.s.c.Overseer Overseer (id=null) closing
   [junit4]   2> 1909312 INFO  (TEST-ForceLeaderTest.testLastPublishedStateIsActive-seed#[1850FAB0F36466AD]) [    ] o.a.s.c.OverseerElectionContext I am going to be the leader 127.0.0.1:63261_e_q%2Fj
   [junit4]   2> 1909314 INFO  (TEST-ForceLeaderTest.testLastPublishedStateIsActive-seed#[1850FAB0F36466AD]) [    ] o.a.s.c.Overseer Overseer (id=98464898910519300-127.0.0.1:63261_e_q%2Fj-n_0000000000) starting
   [junit4]   2> 1909378 INFO  (TEST-ForceLeaderTest.testLastPublishedStateIsActive-seed#[1850FAB0F36466AD]) [    ] o.a.s.c.ZkController Register node as live in ZooKeeper:/live_nodes/127.0.0.1:63261_e_q%2Fj
   [junit4]   2> 1909383 INFO  (zkCallback-2787-thread-1) [    ] o.a.s.c.c.ZkStateReader Updated live nodes from ZooKeeper... (0) -> (1)
   [junit4]   2> 1909729 INFO  (TEST-ForceLeaderTest.testLastPublishedStateIsActive-seed#[1850FAB0F36466AD]) [    ] o.a.s.m.r.SolrJmxReporter JMX monitoring for 'solr.node' (registry 'solr.node') enabled at server: com.sun.jmx.mbeanserver.JmxMBeanServer@132dc62
   [junit4]   2> 1909742 INFO  (TEST-ForceLeaderTest.testLastPublishedStateIsActive-seed#[1850FAB0F36466AD]) [    ] o.a.s.m.r.SolrJmxReporter JMX monitoring for 'solr.jvm' (registry 'solr.jvm') enabled at server: com.sun.jmx.mbeanserver.JmxMBeanServer@132dc62
   [junit4]   2> 1909742 INFO  (TEST-ForceLeaderTest.testLastPublishedStateIsActive-seed#[1850FAB0F36466AD]) [    ] o.a.s.m.r.SolrJmxReporter JMX monitoring for 'solr.jetty' (registry 'solr.jetty') enabled at server: com.sun.jmx.mbeanserver.JmxMBeanServer@132dc62
   [junit4]   2> 1909750 INFO  (TEST-ForceLeaderTest.testLastPublishedStateIsActive-seed#[1850FAB0F36466AD]) [    ] o.a.s.c.CorePropertiesLocator Found 0 core definitions underneath C:\Users\jenkins\workspace\Lucene-Solr-7.x-Windows\solr\build\solr-core\test\J0\temp\solr.cloud.ForceLeaderTest_1850FAB0F36466AD-001\control-001\cores
   [junit4]   2> 1909825 INFO  (TEST-ForceLeaderTest.testLastPublishedStateIsActive-seed#[1850FAB0F36466AD]) [    ] o.a.s.c.c.ZkStateReader Updated live nodes from ZooKeeper... (0) -> (1)
   [junit4]   2> 1909848 INFO  (TEST-ForceLeaderTest.testLastPublishedStateIsActive-seed#[1850FAB0F36466AD]) [    ] o.a.s.c.s.i.ZkClientClusterStateProvider Cluster at 127.0.0.1:63254/solr ready
   [junit4]   2> 1909863 INFO  (SocketProxy-Acceptor-63261) [    ] o.a.s.c.SocketProxy accepted Socket[addr=/127.0.0.1,port=63277,localport=63261], receiveBufferSize:65536
   [junit4]   2> 1909864 INFO  (SocketProxy-Acceptor-63261) [    ] o.a.s.c.SocketProxy proxy connection Socket[addr=/127.0.0.1,port=63262,localport=63278], receiveBufferSize=65536
   [junit4]   2> 1909878 INFO  (qtp685281-17591) [    ] o.a.s.h.a.CollectionsHandler Invoked Collection Action :create with params replicationFactor=1&collection.configName=conf1&name=control_collection&nrtReplicas=1&action=CREATE&numShards=1&createNodeSet=127.0.0.1:63261_e_q%252Fj&wt=javabin&version=2 and sendToOCPQueue=true
   [junit4]   2> 1909903 INFO  (OverseerThreadFactory-8366-thread-1) [    ] o.a.s.c.CreateCollectionCmd Create collection control_collection
   [junit4]   2> 1910051 INFO  (SocketProxy-Acceptor-63261) [    ] o.a.s.c.SocketProxy accepted Socket[addr=/127.0.0.1,port=63280,localport=63261], receiveBufferSize:65536
   [junit4]   2> 1910052 INFO  (SocketProxy-Acceptor-63261) [    ] o.a.s.c.SocketProxy proxy connection Socket[addr=/127.0.0.1,port=63262,localport=63281], receiveBufferSize=65536
   [junit4]   2> 1910060 INFO  (qtp685281-17587) [    ] o.a.s.h.a.CoreAdminOperation core create command qt=/admin/cores&collection.configName=conf1&newCollection=true&name=control_collection_shard1_replica_n1&action=CREATE&numShards=1&collection=control_collection&shard=shard1&wt=javabin&version=2&replicaType=NRT
   [junit4]   2> 1910061 INFO  (qtp685281-17587) [    ] o.a.s.c.TransientSolrCoreCacheDefault Allocating transient cache for 4 transient cores
   [junit4]   2> 1910185 INFO  (zkCallback-2787-thread-1) [    ] o.a.s.c.c.ZkStateReader A cluster state change: [WatchedEvent state:SyncConnected type:NodeDataChanged path:/collections/control_collection/state.json] for collection [control_collection] has occurred - updating... (live nodes size: [1])
   [junit4]   2> 1911123 INFO  (qtp685281-17587) [    ] o.a.s.c.SolrConfig Using Lucene MatchVersion: 7.1.0
   [junit4]   2> 1911194 INFO  (qtp685281-17587) [    ] o.a.s.s.IndexSchema [control_collection_shard1_replica_n1] Schema name=test
   [junit4]   2> 1911713 INFO  (qtp685281-17587) [    ] o.a.s.s.IndexSchema Loaded schema test/1.0 with uniqueid field id
   [junit4]   2> 1911781 INFO  (qtp685281-17587) [    ] o.a.s.c.CoreContainer Creating SolrCore 'control_collection_shard1_replica_n1' using configuration from collection control_collection, trusted=true
   [junit4]   2> 1911782 INFO  (qtp685281-17587) [    ] o.a.s.m.r.SolrJmxReporter JMX monitoring for 'solr.core.control_collection.shard1.replica_n1' (registry 'solr.core.control_collection.shard1.replica_n1') enabled at server: com.sun.jmx.mbeanserver.JmxMBeanServer@132dc62
   [junit4]   2> 1911783 INFO  (qtp685281-17587) [    ] o.a.s.c.SolrCore solr.RecoveryStrategy.Builder
   [junit4]   2> 1911783 INFO  (qtp685281-17587) [    ] o.a.s.c.SolrCore [[control_collection_shard1_replica_n1] ] Opening new SolrCore at [C:\Users\jenkins\workspace\Lucene-Solr-7.x-Windows\solr\build\solr-core\test\J0\temp\solr.cloud.ForceLeaderTest_1850FAB0F36466AD-001\control-001\cores\control_collection_shard1_replica_n1], dataDir=[C:\Users\jenkins\workspace\Lucene-Solr-7.x-Windows\solr\build\solr-core\test\J0\temp\solr.cloud.ForceLeaderTest_1850FAB0F36466AD-001\control-001\cores\control_collection_shard1_replica_n1\data\]
   [junit4]   2> 1911813 INFO  (qtp685281-17587) [    ] o.a.s.u.RandomMergePolicy RandomMergePolicy wrapping class org.apache.lucene.index.TieredMergePolicy: [TieredMergePolicy: maxMergeAtOnce=50, maxMergeAtOnceExplicit=10, maxMergedSegmentMB=73.1435546875, floorSegmentMB=0.513671875, forceMergeDeletesPctAllowed=26.85845096969746, segmentsPerTier=18.0, maxCFSSegmentSizeMB=8.796093022207999E12, noCFSRatio=0.5502204549756781
   [junit4]   2> 1911839 WARN  (qtp685281-17587) [    ] o.a.s.c.RequestHandlers INVALID paramSet a in requestHandler {type = requestHandler,name = /dump,class = DumpRequestHandler,attributes = {initParams=a, name=/dump, class=DumpRequestHandler},args = {defaults={a=A,b=B}}}
   [junit4]   2> 1912188 INFO  (qtp685281-17587) [    ] o.a.s.u.UpdateHandler Using UpdateLog implementation: org.apache.solr.update.UpdateLog
   [junit4]   2> 1912188 INFO  (qtp685281-17587) [    ] o.a.s.u.UpdateLog Initializing UpdateLog: dataDir= defaultSyncLevel=FLUSH numRecordsToKeep=100 maxNumLogsToKeep=10 numVersionBuckets=65536
   [junit4]   2> 1912197 INFO  (qtp685281-17587) [    ] o.a.s.u.CommitTracker Hard AutoCommit: disabled
   [junit4]   2> 1912197 INFO  (qtp685281-17587) [    ] o.a.s.u.CommitTracker Soft AutoCommit: disabled
   [junit4]   2> 1912200 INFO  (qtp685281-17587) [    ] o.a.s.u.RandomMergePolicy RandomMergePolicy wrapping class org.apache.lucene.index.LogByteSizeMergePolicy: [LogByteSizeMergePolicy: minMergeSize=1677721, mergeFactor=15, maxMergeSize=2147483648, maxMergeSizeForForcedMerge=9223372036854775807, calibrateSizeByDeletes=true, maxMergeDocs=2147483647, maxCFSSegmentSizeMB=8.796093022207999E12, noCFSRatio=0.7938252268394589]
   [junit4]   2> 1912200 INFO  (qtp685281-17587) [    ] o.a.s.s.SolrIndexSearcher Opening [Searcher@1ae78d[control_collection_shard1_replica_n1] main]
   [junit4]   2> 1912220 INFO  (qtp685281-17587) [    ] o.a.s.r.ManagedResourceStorage Configured ZooKeeperStorageIO with znodeBase: /configs/conf1
   [junit4]   2> 1912222 INFO  (qtp685281-17587) [    ] o.a.s.r.ManagedResourceStorage Loaded null at path _rest_managed.json using ZooKeeperStorageIO:path=/configs/conf1
   [junit4]   2> 1912227 INFO  (qtp685281-17587) [    ] o.a.s.h.ReplicationHandler Commits will be reserved for  10000
   [junit4]   2> 1912228 INFO  (qtp685281-17587) [    ] o.a.s.u.UpdateLog Could not find max version in index or recent updates, using new clock 1575438387947503616
   [junit4]   2> 1912229 INFO  (searcherExecutor-8369-thread-1) [    ] o.a.s.c.SolrCore [control_collection_shard1_replica_n1] Registered new searcher Searcher@1ae78d[control_collection_shard1_replica_n1] main{ExitableDirectoryReader(UninvertingDirectoryReader())}
   [junit4]   2> 1912254 INFO  (qtp685281-17587) [    ] o.a.s.c.ShardLeaderElectionContext Enough replicas found to continue.
   [junit4]   2> 1912255 INFO  (qtp685281-17587) [    ] o.a.s.c.ShardLeaderElectionContext I may be the new leader - try and sync
   [junit4]   2> 1912256 INFO  (qtp685281-17587) [    ] o.a.s.c.SyncStrategy Sync replicas to http://127.0.0.1:63261/e_q/j/control_collection_shard1_replica_n1/
   [junit4]   2> 1912256 INFO  (qtp685281-17587) [    ] o.a.s.c.SyncStrategy Sync Success - now sync replicas to me
   [junit4]   2> 1912256 INFO  (qtp685281-17587) [    ] o.a.s.c.SyncStrategy http://127.0.0.1:63261/e_q/j/control_collection_shard1_replica_n1/ has no replicas
   [junit4]   2> 1912256 INFO  (qtp685281-17587) [    ] o.a.s.c.ShardLeaderElectionContext Found all replicas participating in election, clear LIR
   [junit4]   2> 1912261 INFO  (zkCallback-2787-thread-1) [    ] o.a.s.c.c.ZkStateReader A cluster state change: [WatchedEvent state:SyncConnected type:NodeDataChanged path:/collections/control_collection/state.json] for collection [control_collection] has occurred - updating... (live nodes size: [1])
   [junit4]   2> 1912261 INFO  (qtp685281-17587) [    ] o.a.s.c.ShardLeaderElectionContext I am the new leader: http://127.0.0.1:63261/e_q/j/control_collection_shard1_replica_n1/ shard1
   [junit4]   2> 1912383 INFO  (zkCallback-2787-thread-1) [    ] o.a.s.c.c.ZkStateReader A cluster state change: [WatchedEvent state:SyncConnected type:NodeDataChanged path:/collections/control_collection/state.json] for collection [control_collection] has occurred - updating... (live nodes size: [1])
   [junit4]   2> 1912422 INFO  (qtp685281-17587) [    ] o.a.s.c.ZkController I am the leader, no recovery necessary
   [junit4]   2> 1912425 INFO  (qtp685281-17587) [    ] o.a.s.s.HttpSolrCall [admin] webapp=null path=/admin/cores params={qt=/admin/cores&collection.configName=conf1&newCollection=true&name=control_collection_shard1_replica_n1&action=CREATE&numShards=1&collection=control_collection&shard=shard1&wt=javabin&version=2&replicaType=NRT} status=0 QTime=2366
   [junit4]   2> 1912439 INFO  (qtp685281-17591) [    ] o.a.s.h.a.CollectionsHandler Wait for new collection to be active for at most 30 seconds. Check all shard replicas
   [junit4]   2> 1912550 INFO  (zkCallback-2787-thread-1) [    ] o.a.s.c.c.ZkStateReader A cluster state change: [WatchedEvent state:SyncConnected type:NodeDataChanged path:/collections/control_collection/state.json] for collection [control_collection] has occurred - updating... (live nodes size: [1])
   [junit4]   2> 1913442 INFO  (qtp685281-17591) [    ] o.a.s.s.HttpSolrCall [admin] webapp=null path=/admin/collections params={replicationFactor=1&collection.configName=conf1&name=control_collection&nrtReplicas=1&action=CREATE&numShards=1&createNodeSet=127.0.0.1:63261_e_q%252Fj&wt=javabin&version=2} status=0 QTime=3563
   [junit4]   2> 1913447 WARN  (NIOServerCxn.Factory:0.0.0.0/0.0.0.0:0) [    ] o.a.z.s.NIOServerCnxn caught end of stream exception
   [junit4]   2> EndOfStreamException: Unable to read additional data from client sessionid 0x15dd14dca680005, likely client has closed socket
   [junit4]   2> 	at org.apache.zookeeper.server.NIOServerCnxn.doIO(NIOServerCnxn.java:239)
   [junit4]   2> 	at org.apache.zookeeper.server.NIOServerCnxnFactory.run(NIOServerCnxnFactory.java:203)
   [junit4]   2> 	at java.base/java.lang.Thread.run(Thread.java:844)
   [junit4]   2> 1913459 INFO  (TEST-ForceLeaderTest.testLastPublishedStateIsActive-seed#[1850FAB0F36466AD]) [    ] o.a.s.c.c.ZkStateReader Updated live nodes from ZooKeeper... (0) -> (1)
   [junit4]   2> 1913465 INFO  (TEST-ForceLeaderTest.testLastPublishedStateIsActive-seed#[1850FAB0F36466AD]) [    ] o.a.s.c.s.i.ZkClientClusterStateProvider Cluster at 127.0.0.1:63254/solr ready
   [junit4]   2> 1913467 INFO  (TEST-ForceLeaderTest.testLastPublishedStateIsActive-seed#[1850FAB0F36466AD]) [    ] o.a.s.c.ChaosMonkey monkey: init - expire sessions:false cause connection loss:false
   [junit4]   2> 1913468 INFO  (SocketProxy-Acceptor-63261) [    ] o.a.s.c.SocketProxy accepted Socket[addr=/127.0.0.1,port=63285,localport=63261], receiveBufferSize:65536
   [junit4]   2> 1913469 INFO  (SocketProxy-Acceptor-63261) [    ] o.a.s.c.SocketProxy proxy connection Socket[addr=/127.0.0.1,port=63262,localport=63286], receiveBufferSize=65536
   [junit4]   2> 1913472 INFO  (qtp685281-17585) [    ] o.a.s.h.a.CollectionsHandler Invoked Collection Action :create with params replicationFactor=1&collection.configName=conf1&name=collection1&nrtReplicas=1&action=CREATE&numShards=2&createNodeSet=&stateFormat=1&wt=javabin&version=2 and sendToOCPQueue=true
   [junit4]   2> 1913481 INFO  (OverseerCollectionConfigSetProcessor-98464898910519300-127.0.0.1:63261_e_q%2Fj-n_0000000000) [    ] o.a.s.c.OverseerTaskQueue Response ZK path: /overseer/collection-queue-work/qnr-0000000000 doesn't exist.  Requestor may have disconnected from ZooKeeper
   [junit4]   2> 1913481 INFO  (OverseerThreadFactory-8366-thread-2) [    ] o.a.s.c.CreateCollectionCmd Create collection collection1
   [junit4]   2> 1913488 WARN  (OverseerThreadFactory-8366-thread-2) [    ] o.a.s.c.CreateCollectionCmd It is unusual to create a collection (collection1) without cores.
   [junit4]   2> 1913725 INFO  (qtp685281-17585) [    ] o.a.s.h.a.CollectionsHandler Wait for new collection to be active for at most 30 seconds. Check all shard replicas
   [junit4]   2> 1913725 INFO  (qtp685281-17585) [    ] o.a.s.s.HttpSolrCall [admin] webapp=null path=/admin/collections params={replicationFactor=1&collection.configName=conf1&name=collection1&nrtReplicas=1&action=CREATE&numShards=2&createNodeSet=&stateFormat=1&wt=javabin&version=2} status=0 QTime=252
   [junit4]   2> 1913744 INFO  (OverseerCollectionConfigSetProcessor-98464898910519300-127.0.0.1:63261_e_q%2Fj-n_0000000000) [    ] o.a.s.c.OverseerTaskQueue Response ZK path: /overseer/collection-queue-work/qnr-0000000002 doesn't exist.  Requestor may have disconnected from ZooKeeper
   [junit4]   2> 1915357 INFO  (TEST-ForceLeaderTest.testLastPublishedStateIsActive-seed#[1850FAB0F36466AD]) [    ] o.a.s.c.AbstractFullDistribZkTestBase create jetty 1 in directory C:\Users\jenkins\workspace\Lucene-Solr-7.x-Windows\solr\build\solr-core\test\J0\temp\solr.cloud.ForceLeaderTest_1850FAB0F36466AD-001\shard-1-001 of type NRT
   [junit4]   2> 1915358 INFO  (TEST-ForceLeaderTest.testLastPublishedStateIsActive-seed#[1850FAB0F36466AD]) [    ] o.e.j.s.Server jetty-9.3.14.v20161028
   [junit4]   2> 1915359 INFO  (TEST-ForceLeaderTest.testLastPublishedStateIsActive-seed#[1850FAB0F36466AD]) [    ] o.e.j.s.h.ContextHandler Started o.e.j.s.ServletContextHandler@1c6c703{/e_q/j,null,AVAILABLE}
   [junit4]   2> 1915361 INFO  (TEST-ForceLeaderTest.testLastPublishedStateIsActive-seed#[1850FAB0F36466AD]) [    ] o.e.j.s.AbstractConnector Started ServerConnector@ff126a{HTTP/1.1,[http/1.1]}{127.0.0.1:63289}
   [junit4]   2> 1915366 INFO  (TEST-ForceLeaderTest.testLastPublishedStateIsActive-seed#[1850FAB0F36466AD]) [    ] o.e.j.s.Server Started @1916248ms
   [junit4]   2> 1915366 INFO  (TEST-ForceLeaderTest.testLastPublishedStateIsActive-seed#[1850FAB0F36466AD]) [    ] o.a.s.c.s.e.JettySolrRunner Jetty properties: {hostContext=/e_q/j, solrconfig=solrconfig.xml, solr.data.dir=C:\Users\jenkins\workspace\Lucene-Solr-7.x-Windows\solr\build\solr-core\test\J0\temp\solr.cloud.ForceLeaderTest_1850FAB0F36466AD-001\tempDir-001/jetty1, hostPort=63288, coreRootDirectory=C:\Users\jenkins\workspace\Lucene-Solr-7.x-Windows\solr\build\solr-core\test\J0\temp\solr.cloud.ForceLeaderTest_1850FAB0F36466AD-001\shard-1-001\cores, replicaType=NRT}
   [junit4]   2> 1915367 ERROR (TEST-ForceLeaderTest.testLastPublishedStateIsActive-seed#[1850FAB0F36466AD]) [    ] o.a.s.s.StartupLoggingUtils Missing Java Option solr.log.dir. Logging may be missing or incomplete.
   [junit4]   2> 1915367 INFO  (TEST-ForceLeaderTest.testLastPublishedStateIsActive-seed#[1850FAB0F36466AD]) [    ] o.a.s.s.SolrDispatchFilter  ___      _       Welcome to Apache Solr™ version 7.1.0
   [junit4]   2> 1915367 INFO  (TEST-ForceLeaderTest.testLastPublishedStateIsActive-seed#[1850FAB0F36466AD]) [    ] o.a.s.s.SolrDispatchFilter / __| ___| |_ _   Starting in cloud mode on port null
   [junit4]   2> 1915368 INFO  (TEST-ForceLeaderTest.testLastPublishedStateIsActive-seed#[1850FAB0F36466AD]) [    ] o.a.s.s.SolrDispatchFilter \__ \/ _ \ | '_|  Install dir: null, Default config dir: null
   [junit4]   2> 1915368 INFO  (TEST-ForceLeaderTest.testLastPublishedStateIsActive-seed#[1850FAB0F36466AD]) [    ] o.a.s.s.SolrDispatchFilter |___/\___/_|_|    Start time: 2017-08-11T12:38:50.806690200Z
   [junit4]   2> 1915397 WARN  (NIOServerCxn.Factory:0.0.0.0/0.0.0.0:0) [    ] o.a.z.s.NIOServerCnxn caught end of stream exception
   [junit4]   2> EndOfStreamException: Unable to read additional data from client sessionid 0x15dd14dca680007, likely client has closed socket
   [junit4]   2> 	at org.apache.zookeeper.server.NIOServerCnxn.doIO(NIOServerCnxn.java:239)
   [junit4]   2> 	at org.apache.zookeeper.server.NIOServerCnxnFactory.run(NIOServerCnxnFactory.java:203)
   [junit4]   2> 	at java.base/java.lang.Thread.run(Thread.java:844)
   [junit4]   2> 1915398 INFO  (TEST-ForceLeaderTest.testLastPublishedStateIsActive-seed#[1850FAB0F36466AD]) [    ] o.a.s.s.SolrDispatchFilter Loading solr.xml from SolrHome (not found in ZooKeeper)
   [junit4]   2> 1915398 INFO  (TEST-ForceLeaderTest.testLastPublishedStateIsActive-seed#[1850FAB0F36466AD]) [    ] o.a.s.c.SolrXmlConfig Loading container configuration from C:\Users\jenkins\workspace\Lucene-Solr-7.x-Windows\solr\build\solr-core\test\J0\temp\solr.cloud.ForceLeaderTest_1850FAB0F36466AD-001\shard-1-001\solr.xml
   [junit4]   2> 1915428 INFO  (TEST-ForceLeaderTest.testLastPublishedStateIsActive-seed#[1850FAB0F36466AD]) [    ] o.a.s.c.SolrXmlConfig MBean server found: com.sun.jmx.mbeanserver.JmxMBeanServer@132dc62, but no JMX reporters were configured - adding default JMX reporter.
   [junit4]   2> 1915439 INFO  (TEST-ForceLeaderTest.testLastPublishedStateIsActive-seed#[1850FAB0F36466AD]) [    ] o.a.s.c.ZkContainer Zookeeper client=127.0.0.1:63254/solr
   [junit4]   2> 1915568 INFO  (TEST-ForceLeaderTest.testLastPublishedStateIsActive-seed#[1850FAB0F36466AD]) [    ] o.a.s.c.c.ZkStateReader Updated live nodes from ZooKeeper... (0) -> (1)
   [junit4]   2> 1915604 INFO  (TEST-ForceLeaderTest.testLastPublishedStateIsActive-seed#[1850FAB0F36466AD]) [    ] o.a.s.c.Overseer Overseer (id=null) closing
   [junit4]   2> 1915609 INFO  (TEST-ForceLeaderTest.testLastPublishedStateIsActive-seed#[1850FAB0F36466AD]) [    ] o.a.s.c.ZkController Register node as live in ZooKeeper:/live_nodes/127.0.0.1:63288_e_q%2Fj
   [junit4]   2> 1915609 INFO  (zkCallback-2794-thread-1) [    ] o.a.s.c.c.ZkStateReader Updated live nodes from ZooKeeper... (1) -> (2)
   [junit4]   2> 1915626 INFO  (zkCallback-2787-thread-1) [    ] o.a.s.c.c.ZkStateReader Updated live nodes from ZooKeeper... (1) -> (2)
   [junit4]   2> 1915609 INFO  (zkCallback-2799-thread-1) [    ] o.a.s.c.c.ZkStateReader Updated live nodes from ZooKeeper... (1) -> (2)
   [junit4]   2> 1916410 INFO  (TEST-ForceLeaderTest.testLastPublishedStateIsActive-seed#[1850FAB0F36466AD]) [    ] o.a.s.m.r.SolrJmxReporter JMX monitoring for 'solr.node' (registry 'solr.node') enabled at server: com.sun.jmx.mbeanserver.JmxMBeanServer@132dc62
   [junit4]   2> 1916432 INFO  (TEST-ForceLeaderTest.testLastPublishedStateIsActive-seed#[1850FAB0F36466AD]) [    ] o.a.s.m.r.SolrJmxReporter JMX monitoring for 'solr.jvm' (registry 'solr.jvm') enabled at server: com.sun.jmx.mbeanserver.JmxMBeanServer@132dc62
   [junit4]   2> 1916433 INFO  (TEST-ForceLeaderTest.testLastPublishedStateIsActive-seed#[1850FAB0F36466AD]) [    ] o.a.s.m.r.SolrJmxReporter JMX monitoring for 'solr.jetty' (registry 'solr.jetty') enabled at server: com.sun.jmx.mbeanserver.JmxMBeanServer@132dc62
   [junit4]   2> 1916443 INFO  (TEST-ForceLeaderTest.testLastPublishedStateIsActive-seed#[1850FAB0F36466AD]) [    ] o.a.s.c.CorePropertiesLocator Found 0 core definitions underneath C:\Users\jenkins\workspace\Lucene-Solr-7.x-Windows\solr\build\solr-core\test\J0\temp\solr.cloud.ForceLeaderTest_1850FAB0F36466AD-001\shard-1-001\cores
   [junit4]   2> 1916498 INFO  (qtp685281-17582) [    ] o.a.s.h.a.CollectionsHandler Invoked Collection Action :addreplica with params node=127.0.0.1:63288_e_q%252Fj&action=ADDREPLICA&collection=collection1&shard=shard2&type=NRT&wt=javabin&version=2 and sendToOCPQueue=true
   [junit4]   2> 1916509 INFO  (OverseerThreadFactory-8366-thread-3) [    ] o.a.s.c.AddReplicaCmd Node Identified 127.0.0.1:63288_e_q%2Fj for creating new replica
   [junit4]   2> 1916517 INFO  (SocketProxy-Acceptor-63288) [    ] o.a.s.c.SocketProxy accepted Socket[addr=/127.0.0.1,port=63301,localport=63288], receiveBufferSize:65536
   [junit4]   2> 1916517 INFO  (SocketProxy-Acceptor-63288) [    ] o.a.s.c.SocketProxy proxy connection Socket[addr=/127.0.0.1,port=63289,localport=63302], receiveBufferSize=65536
   [junit4]   2> 1916599 INFO  (qtp28923209-17632) [    ] o.a.s.h.a.CoreAdminOperation core create command qt=/admin/cores&collection.configName=conf1&name=collection1_shard2_replica_n41&action=CREATE&collection=collection1&shard=shard2&wt=javabin&version=2&replicaType=NRT
   [junit4]   2> 1916601 INFO  (qtp28923209-17632) [    ] o.a.s.c.TransientSolrCoreCacheDefault Allocating transient cache for 4 transient cores
   [junit4]   2> 1917644 INFO  (qtp28923209-17632) [    ] o.a.s.c.SolrConfig Using Lucene MatchVersion: 7.1.0
   [junit4]   2> 1917673 INFO  (qtp28923209-17632) [    ] o.a.s.s.IndexSchema [collection1_shard2_replica_n41] Schema name=test
   [junit4]   2> 1917980 INFO  (qtp28923209-17632) [    ] o.a.s.s.IndexSchema Loaded schema test/1.0 with uniqueid field id
   [junit4]   2> 1918087 INFO  (qtp28923209-17632) [    ] o.a.s.c.CoreContainer Creating SolrCore 'collection1_shard2_replica_n41' using configuration from collection collection1, trusted=true
   [junit4]   2> 1918088 INFO  (qtp28923209-17632) [    ] o.a.s.m.r.SolrJmxReporter JMX monitoring for 'solr.core.collection1.shard2.replica_n41' (registry 'solr.core.collection1.shard2.replica_n41') enabled at server: com.sun.jmx.mbeanserver.JmxMBeanServer@132dc62
   [junit4]   2> 1918088 INFO  (qtp28923209-17632) [    ] o.a.s.c.SolrCore solr.RecoveryStrategy.Builder
   [junit4]   2> 1918089 INFO  (qtp28923209-17632) [    ] o.a.s.c.SolrCore [[collection1_shard2_replica_n41] ] Opening new SolrCore at [C:\Users\jenkins\workspace\Lucene-Solr-7.x-Windows\solr\build\solr-core\test\J0\temp\solr.cloud.ForceLeaderTest_1850FAB0F36466AD-001\shard-1-001\cores\collection1_shard2_replica_n41], dataDir=[C:\Users\jenkins\workspace\Lucene-Solr-7.x-Windows\solr\build\solr-core\test\J0\temp\solr.cloud.ForceLeaderTest_1850FAB0F36466AD-001\shard-1-001\cores\collection1_shard2_replica_n41\data\]
   [junit4]   2> 1918095 INFO  (qtp28923209-17632) [    ] o.a.s.u.RandomMergePolicy RandomMergePolicy wrapping class org.apache.lucene.index.TieredMergePolicy: [TieredMergePolicy: maxMergeAtOnce=50, maxMergeAtOnceExplicit=10, maxMergedSegmentMB=73.1435546875, floorSegmentMB=0.513671875, forceMergeDeletesPctAllowed=26.85845096969746, segmentsPerTier=18.0, maxCFSSegmentSizeMB=8.796093022207999E12, noCFSRatio=0.5502204549756781
   [junit4]   2> 1918102 WARN  (qtp28923209-17632) [    ] o.a.s.c.RequestHandlers INVALID paramSet a in requestHandler {type = requestHandler,name = /dump,class = DumpRequestHandler,attributes = {initParams=a, name=/dump, class=DumpRequestHandler},args = {defaults={a=A,b=B}}}
   [junit4]   2> 1918340 INFO  (qtp28923209-17632) [    ] o.a.s.u.UpdateHandler Using UpdateLog implementation: org.apache.solr.update.UpdateLog
   [junit4]   2> 1918340 INFO  (qtp28923209-17632) [    ] o.a.s.u.UpdateLog Initializing UpdateLog: dataDir= defaultSyncLevel=FLUSH numRecordsToKeep=100 maxNumLogsToKeep=10 numVersionBuckets=65536
   [junit4]   2> 1918346 INFO  (qtp28923209-17632) [    ] o.a.s.u.CommitTracker Hard AutoCommit: disabled
   [junit4]   2> 1918346 INFO  (qtp28923209-17632) [    ] o.a.s.u.CommitTracker Soft AutoCommit: disabled
   [junit4]   2> 1918350 INFO  (qtp28923209-17632) [    ] o.a.s.u.RandomMergePolicy RandomMergePolicy wrapping class org.apache.lucene.index.LogByteSizeMergePolicy: [LogByteSizeMergePolicy: minMergeSize=1677721, mergeFactor=15, maxMergeSize=2147483648, maxMergeSizeForForcedMerge=9223372036854775807, calibrateSizeByDeletes=true, maxMergeDocs=2147483647, maxCFSSegmentSizeMB=8.796093022207999E12, noCFSRatio=0.7938252268394589]
   [junit4]   2> 1918351 INFO  (qtp28923209-17632) [    ] o.a.s.s.SolrIndexSearcher Opening [Searcher@1680ed0[collection1_shard2_replica_n41] main]
   [junit4]   2> 1918366 INFO  (qtp28923209-17632) [    ] o.a.s.r.ManagedResourceStorage Configured ZooKeeperStorageIO with znodeBase: /configs/conf1
   [junit4]   2> 1918367 INFO  (qtp28923209-17632) [    ] o.a.s.r.ManagedResourceStorage Loaded null at path _rest_managed.json using ZooKeeperStorageIO:path=/configs/conf1
   [junit4]   2> 1918369 INFO  (qtp28923209-17632) [    ] o.a.s.h.ReplicationHandler Commits will be reserved for  10000
   [junit4]   2> 1918373 INFO  (searcherExecutor-8380-thread-1) [    ] o.a.s.c.SolrCore [collection1_shard2_replica_n41] Registered new searcher Searcher@1680ed0[collection1_shard2_replica_n41] main{ExitableDirectoryReader(UninvertingDirectoryReader())}
   [junit4]   2> 1918373 INFO  (qtp28923209-17632) [    ] o.a.s.u.UpdateLog Could not find max version in index or recent updates, using new clock 1575438394391003136
   [junit4]   2> 1918408 INFO  (qtp28923209-17632) [    ] o.a.s.c.ShardLeaderElectionContext Enough replicas found to continue.
   [junit4]   2> 1918408 INFO  (qtp28923209-17632) [    ] o.a.s.c.ShardLeaderElectionContext I may be the new leader - try and sync
   [junit4]   2> 1918408 INFO  (qtp28923209-17632) [    ] o.a.s.c.SyncStrategy Sync replicas to http://127.0.0.1:63288/e_q/j/collection1_shard2_replica_n41/
   [junit4]   2> 1918408 INFO  (qtp28923209-17632) [    ] o.a.s.c.SyncStrategy Sync Success - now sync replicas to me
   [junit4]   2> 1918408 INFO  (qtp28923209-17632) [    ] o.a.s.c.SyncStrategy http://127.0.0.1:63288/e_q/j/collection1_shard2_replica_n41/ has no replicas
   [junit4]   2> 1918408 INFO  (qtp28923209-17632) [    ] o.a.s.c.ShardLeaderElectionContext Found all replicas participating in election, clear LIR
   [junit4]   2> 1918420 INFO  (qtp28923209-17632) [    ] o.a.s.c.ShardLeaderElectionContext I am the new leader: http://127.0.0.1:63288/e_q/j/collection1_shard2_replica_n41/ shard2
   [junit4]   2> 1918573 INFO  (qtp28923209-17632) [    ] o.a.s.c.ZkController I am the leader, no recovery necessary
   [junit4]   2> 1918576 INFO  (qtp28923209-17632) [    ] o.a.s.s.HttpSolrCall [admin] webapp=null path=/admin/cores params={qt=/admin/cores&collection.configName=conf1&name=collection1_shard2_replica_n41&action=CREATE&collection=collection1&shard=shard2&wt=javabin&version=2&replicaType=NRT} status=0 QTime=2046
   [junit4]   2> 1918583 INFO  (qtp685281-17582) [    ] o.a.s.s.HttpSolrCall [admin] webapp=null path=/admin/collections params={node=127.0.0.1:63288_e_q%252Fj&action=ADDREPLICA&collection=collection1&shard=shard2&type=NRT&wt=javabin&version=2} status=0 QTime=2084
   [junit4]   2> 1919979 INFO  (TEST-ForceLeaderTest.testLastPublishedStateIsActive-seed#[1850FAB0F36466AD]) [    ] o.a.s.c.AbstractFullDistribZkTestBase create jetty 2 in directory C:\Users\jenkins\workspace\Lucene-Solr-7.x-Windows\solr\build\solr-core\test\J0\temp\solr.cloud.ForceLeaderTest_1850FAB0F36466AD-001\shard-2-001 of type NRT
   [junit4]   2> 1919980 INFO  (TEST-ForceLeaderTest.testLastPublishedStateIsActive-seed#[1850FAB0F36466AD]) [    ] o.e.j.s.Server jetty-9.3.14.v20161028
   [junit4]   2> 1919981 INFO  (TEST-ForceLeaderTest.testLastPublishedStateIsActive-seed#[1850FAB0F36466AD]) [    ] o.e.j.s.h.ContextHandler Started o.e.j.s.ServletContextHandler@bc48b9{/e_q/j,null,AVAILABLE}
   [junit4]   2> 1919990 INFO  (TEST-ForceLeaderTest.testLastPublishedStateIsActive-seed#[1850FAB0F36466AD]) [    ] o.e.j.s.AbstractConnector Started ServerConnector@47c546{HTTP/1.1,[http/1.1]}{127.0.0.1:63304}
   [junit4]   2> 1919990 INFO  (TEST-ForceLeaderTest.testLastPublishedStateIsActive-seed#[1850FAB0F36466AD]) [    ] o.e.j.s.Server Started @1920871ms
   [junit4]   2> 1919990 INFO  (TEST-ForceLeaderTest.testLastPublishedStateIsActive-seed#[1850FAB0F36466AD]) [    ] o.a.s.c.s.e.JettySolrRunner Jetty properties: {hostContext=/e_q/j, solrconfig=solrconfig.xml, solr.data.dir=C:\Users\jenkins\workspace\Lucene-Solr-7.x-Windows\solr\build\solr-core\test\J0\temp\solr.cloud.ForceLeaderTest_1850FAB0F36466AD-001\tempDir-001/jetty2, hostPort=63303, coreRootDirectory=C:\Users\jenkins\workspace\Lucene-Solr-7.x-Windows\solr\build\solr-core\test\J0\temp\solr.cloud.ForceLeaderTest_1850FAB0F36466AD-001\shard-2-001\cores, replicaType=NRT}
   [junit4]   2> 1919990 ERROR (TEST-ForceLeaderTest.testLastPublishedStateIsActive-seed#[1850FAB0F36466AD]) [    ] o.a.s.s.StartupLoggingUtils Missing Java Option solr.log.dir. Logging may be missing or incomplete.
   [junit4]   2> 1919991 INFO  (TEST-ForceLeaderTest.testLastPublishedStateIsActive-seed#[1850FAB0F36466AD]) [    ] o.a.s.s.SolrDispatchFilter  ___      _       Welcome to Apache Solr™ version 7.1.0
   [junit4]   2> 1919991 INFO  (TEST-ForceLeaderTest.testLastPublishedStateIsActive-seed#[1850FAB0F36466AD]) [    ] o.a.s.s.SolrDispatchFilter / __| ___| |_ _   Starting in cloud mode on port null
   [junit4]   2> 1919991 INFO  (TEST-ForceLeaderTest.testLastPublishedStateIsActive-seed#[1850FAB0F36466AD]) [    ] o.a.s.s.SolrDispatchFilter \__ \/ _ \ | '_|  Install dir: null, Default config dir: null
   [junit4]   2> 1919991 INFO  (TEST-ForceLeaderTest.testLastPublishedStateIsActive-seed#[1850FAB0F36466AD]) [    ] o.a.s.s.SolrDispatchFilter |___/\___/_|_|    Start time: 2017-08-11T12:38:55.429180300Z
   [junit4]   2> 1919997 INFO  (TEST-ForceLeaderTest.testLastPublishedStateIsActive-seed#[1850FAB0F36466AD]) [    ] o.a.s.s.SolrDispatchFilter Loading solr.xml from SolrHome (not found in ZooKeeper)
   [junit4]   2> 1919997 INFO  (TEST-ForceLeaderTest.testLastPublishedStateIsActive-seed#[1850FAB0F36466AD]) [    ] o.a.s.c.SolrXmlConfig Loading container configuration from C:\Users\jenkins\workspace\Lucene-Solr-7.x-Windows\solr\build\solr-core\test\J0\temp\solr.cloud.ForceLeaderTest_1850FAB0F36466AD-001\shard-2-001\solr.xml
   [junit4]   2> 1920005 INFO  (TEST-ForceLeaderTest.testLastPublishedStateIsActive-seed#[1850FAB0F36466AD]) [    ] o.a.s.c.SolrXmlConfig MBean server found: com.sun.jmx.mbeanserver.JmxMBeanServer@132dc62, but no JMX reporters were configured - adding default JMX reporter.
   [junit4]   2> 1920011 INFO  (TEST-ForceLeaderTest.testLastPublishedStateIsActive-seed#[1850FAB0F36466AD]) [    ] o.a.s.c.ZkContainer Zookeeper client=127.0.0.1:63254/solr
   [junit4]   2> 1920022 WARN  (NIOServerCxn.Factory:0.0.0.0/0.0.0.0:0) [    ] o.a.z.s.NIOServerCnxn caught end of stream exception
   [junit4]   2> EndOfStreamException: Unable to read additional data from client sessionid 0x15dd14dca68000b, likely client has closed socket
   [junit4]   2> 	at org.apache.zookeeper.server.NIOServerCnxn.doIO(NIOServerCnxn.java:239)
   [junit4]   2> 	at org.apache.zookeeper.server.NIOServerCnxnFactory.run(NIOServerCnxnFactory.java:203)
   [junit4]   2> 	at java.base/java.lang.Thread.run(Thread.java:844)
   [junit4]   2> 1920049 INFO  (TEST-ForceLeaderTest.testLastPublishedStateIsActive-seed#[1850FAB0F36466AD]) [    ] o.a.s.c.c.ZkStateReader Updated live nodes from ZooKeeper... (0) -> (2)
   [junit4]   2> 1920070 INFO  (TEST-ForceLeaderTest.testLastPublishedStateIsActive-seed#[1850FAB0F36466AD]) [    ] o.a.s.c.Overseer Overseer (id=null) closing
   [junit4]   2> 1920078 INFO  (TEST-ForceLeaderTest.testLastPublishedStateIsActive-seed#[1850FAB0F36466AD]) [    ] o.a.s.c.ZkController Register node as live in ZooKeeper:/live_nodes/127.0.0.1:63303_e_q%2Fj
   [junit4]   2> 1920094 INFO  (zkCallback-2787-thread-2) [    ] o.a.s.c.c.ZkStateReader Updated live nodes from ZooKeeper... (2) -> (3)
   [junit4]   2> 1920094 INFO  (zkCallback-2794-thread-1) [    ] o.a.s.c.c.ZkStateReader Updated live nodes from ZooKeeper... (2) -> (3)
   [junit4]   2> 1920094 INFO  (zkCallback-2799-thread-1) [    ] o.a.s.c.c.ZkStateReader Updated live nodes from ZooKeeper... (2) -> (3)
   [junit4]   2> 1920094 INFO  (zkCallback-2805-thread-1) [    ] o.a.s.c.c.ZkStateReader Updated live nodes from ZooKeeper... (2) -> (3)
   [junit4]   2> 1920525 INFO  (OverseerCollectionConfigSetProcessor-98464898910519300-127.0.0.1:63261_e_q%2Fj-n_0000000000) [    ] o.a.s.c.OverseerTaskQueue Response ZK path: /overseer/collection-queue-work/qnr-0000000004 doesn't exist.  Requestor may have disconnected from ZooKeeper
   [junit4]   2> 1920548 INFO  (TEST-ForceLeaderTest.testLastPublishedStateIsActive-seed#[1850FAB0F36466AD]) [    ] o.a.s.m.r.SolrJmxReporter JMX monitoring for 'solr.node' (registry 'solr.node') enabled at server: com.sun.jmx.mbeanserver.JmxMBeanServer@132dc62
   [junit4]   2> 1920560 INFO  (TEST-ForceLeaderTest.testLastPublishedStateIsActive-seed#[1850FAB0F36466AD]) [    ] o.a.s.m.r.SolrJmxReporter JMX monitoring for 'solr.jvm' (registry 'solr.jvm') enabled at server: com.sun.jmx.mbeanserver.JmxMBeanServer@132dc62
   [junit4]   2> 1920561 INFO  (TEST-ForceLeaderTest.testLastPublishedStateIsActive-seed#[1850FAB0F36466AD]) [    ] o.a.s.m.r.SolrJmxReporter JMX monitoring for 'solr.jetty' (registry 'solr.jetty') enabled at server: com.sun.jmx.mbeanserver.JmxMBeanServer@132dc62
   [junit4]   2> 1920565 INFO  (TEST-ForceLeaderTest.testLastPublishedStateIsActive-seed#[1850FAB0F36466AD]) [    ] o.a.s.c.CorePropertiesLocator Found 0 core definitions underneath C:\Users\jenkins\workspace\Lucene-Solr-7.x-Windows\solr\build\solr-core\test\J0\temp\solr.cloud.ForceLeaderTest_1850FAB0F36466AD-001\shard-2-001\cores
   [junit4]   2> 1920634 INFO  (qtp685281-17593) [    ] o.a.s.h.a.CollectionsHandler Invoked Collection Action :addreplica with params node=127.0.0.1:63303_e_q%252Fj&action=ADDREPLICA&collection=collection1&shard=shard1&type=NRT&wt=javabin&version=2 and sendToOCPQueue=true
   [junit4]   2> 1920647 INFO  (OverseerThreadFactory-8366-thread-4) [    ] o.a.s.c.AddReplicaCmd Node Identified 127.0.0.1:63303_e_q%2Fj for creating new replica
   [junit4]   2> 1920651 INFO  (SocketProxy-Acceptor-63303) [    ] o.a.s.c.SocketProxy accepted Socket[addr=/127.0.0.1,port=63316,localport=63303], receiveBufferSize:65536
   [junit4]   2> 1920651 INFO  (SocketProxy-Acceptor-63303) [    ] o.a.s.c.SocketProxy proxy connection Socket[addr=/127.0.0.1,port=63304,localport=63317], receiveBufferSize=65536
   [junit4]   2> 1920657 INFO  (qtp22780421-17668) [    ] o.a.s.h.a.CoreAdminOperation core create command qt=/admin/cores&collection.configName=conf1&name=collection1_shard1_replica_n43&action=CREATE&collection=collection1&shard=shard1&wt=javabin&version=2&replicaType=NRT
   [junit4]   2> 1920657 INFO  (qtp22780421-17668) [    ] o.a.s.c.TransientSolrCoreCacheDefault Allocating transient cache for 4 transient cores
   [junit4]   2> 1921719 INFO  (qtp22780421-17668) [    ] o.a.s.c.SolrConfig Using Lucene MatchVersion: 7.1.0
   [junit4]   2> 1921747 INFO  (qtp22780421-17668) [    ] o.a.s.s.IndexSchema [collection1_shard1_replica_n43] Schema name=test
   [junit4]   2> 1922113 INFO  (qtp22780421-17668) [    ] o.a.s.s.IndexSchema Loaded schema test/1.0 with uniqueid field id
   [junit4]   2> 1922258 INFO  (qtp22780421-17668) [    ] o.a.s.c.CoreContainer Creating SolrCore 'collection1_shard1_replica_n43' using configuration from collection collection1, trusted=true
   [junit4]   2> 1922258 INFO  (qtp22780421-17668) [    ] o.a.s.m.r.SolrJmxReporter JMX monitoring for 'solr.core.collection1.shard1.replica_n43' (registry 'solr.core.collection1.shard1.replica_n43') enabled at server: com.sun.jmx.mbeanserver.JmxMBeanServer@132dc62
   [junit4]   2> 1922258 INFO  (qtp22780421-17668) [    ] o.a.s.c.SolrCore solr.RecoveryStrategy.Builder
   [junit4]   2> 1922258 INFO  (qtp22780421-17668) [    ] o.a.s.c.SolrCore [[collection1_shard1_replica_n43] ] Opening new SolrCore at [C:\Users\jenkins\workspace\Lucene-Solr-7.x-Windows\solr\build\solr-core\test\J0\temp\solr.cloud.ForceLeaderTest_1850FAB0F36466AD-001\shard-2-001\cores\collection1_shard1_replica_n43], dataDir=[C:\Users\jenkins\workspace\Lucene-Solr-7.x-Windows\solr\build\solr-core\test\J0\temp\solr.cloud.ForceLeaderTest_1850FAB0F36466AD-001\shard-2-001\cores\collection1_shard1_replica_n43\data\]
   [junit4]   2> 1922267 INFO  (qtp22780421-17668) [    ] o.a.s.u.RandomMergePolicy RandomMergePolicy wrapping class org.apache.lucene.index.TieredMergePolicy: [TieredMergePolicy: maxMergeAtOnce=50, maxMergeAtOnceExplicit=10, maxMergedSegmentMB=73.1435546875, floorSegmentMB=0.513671875, forceMergeDeletesPctAllowed=26.85845096969746, segmentsPerTier=18.0, maxCFSSegmentSizeMB=8.796093022207999E12, noCFSRatio=0.5502204549756781
   [junit4]   2> 1922274 WARN  (qtp22780421-17668) [    ] o.a.s.c.RequestHandlers INVALID paramSet a in requestHandler {type = requestHandler,name = /dump,class = DumpRequestHandler,attributes = {initParams=a, name=/dump, class=DumpRequestHandler},args = {defaults={a=A,b=B}}}
   [junit4]   2> 1922550 INFO  (qtp22780421-17668) [    ] o.a.s.u.UpdateHandler Using UpdateLog implementation: org.apache.solr.update.UpdateLog
   [junit4]   2> 1922550 INFO  (qtp22780421-17668) [    ] o.a.s.u.UpdateLog Initializing UpdateLog: dataDir= defaultSyncLevel=FLUSH numRecordsToKeep=100 maxNumLogsToKeep=10 numVersionBuckets=65536
   [junit4]   2> 1922558 INFO  (qtp22780421-17668) [    ] o.a.s.u.CommitTracker Hard AutoCommit: disabled
   [junit4]   2> 1922559 INFO  (qtp22780421-17668) [    ] o.a.s.u.CommitTracker Soft AutoCommit: disabled
   [junit4]   2> 1922561 INFO  (qtp22780421-17668) [    ] o.a.s.u.RandomMergePolicy RandomMergePolicy wrapping class org.apache.lucene.index.LogByteSizeMergePolicy: [LogByteSizeMergePolicy: minMergeSize=1677721, mergeFactor=15, maxMergeSize=2147483648, maxMergeSizeForForcedMerge=9223372036854775807, calibrateSizeByDeletes=true, maxMergeDocs=2147483647, maxCFSSegmentSizeMB=8.796093022207999E12, noCFSRatio=0.7938252268394589]
   [junit4]   2> 1922563 INFO  (qtp22780421-17668) [    ] o.a.s.s.SolrIndexSearcher Opening [Searcher@2624c0[collection1_shard1_replica_n43] main]
   [junit4]   2> 1922578 INFO  (qtp22780421-17668) [    ] o.a.s.r.ManagedResourceStorage Configured ZooKeeperStorageIO with znodeBase: /configs/conf1
   [junit4]   2> 1922579 INFO  (qtp22780421-17668) [    ] o.a.s.r.ManagedResourceStorage Loaded null at path _rest_managed.json using ZooKeeperStorageIO:path=/configs/conf1
   [junit4]   2> 1922580 INFO  (qtp22780421-17668) [    ] o.a.s.h.ReplicationHandler Commits will be reserved for  10000
   [junit4]   2> 1922580 INFO  (qtp22780421-17668) [    ] o.a.s.u.UpdateLog Could not find max version in index or recent updates, using new clock 1575438398802362368
   [junit4]   2> 1922595 INFO  (searcherExecutor-8391-thread-1) [    ] o.a.s.c.SolrCore [collection1_shard1_replica_n43] Registered new searcher Searcher@2624c0[collection1_shard1_replica_n43] main{ExitableDirectoryReader(UninvertingDirectoryReader())}
   [junit4]   2> 1922631 INFO  (qtp22780421-17668) [    ] o.a.s.c.ShardLeaderElectionContext Enough replicas found to continue.
   [junit4]   2> 1922631 INFO  (qtp22780421-17668) [    ] o.a.s.c.ShardLeaderElectionContext I may be the new leader - try and sync
   [junit4]   2> 1922631 INFO  (qtp22780421-17668) [    ] o.a.s.c.SyncStrategy Sync replicas to http://127.0.0.1:63303/e_q/j/collection1_shard1_replica_n43/
   [junit4]   2> 1922631 INFO  (qtp22780421-17668) [    ] o.a.s.c.SyncStrategy Sync Success - now sync replicas to me
   [junit4]   2> 1922631 INFO  (qtp22780421-17668) [    ] o.a.s.c.SyncStrategy http://127.0.0.1:63303/e_q/j/collection1_shard1_replica_n43/ has no replicas
   [junit4]   2> 1922631 INFO  (qtp22780421-17668) [    ] o.a.s.c.ShardLeaderElectionContext Found all replicas participating in election, clear LIR
   [junit4]   2> 1922655 INFO  (qtp22780421-17668) [    ] o.a.s.c.ShardLeaderElectionContext I am the new leader: http://127.0.0.1:63303/e_q/j/collection1_shard1_replica_n43/ shard1
   [junit4]   2> 1922828 INFO  (qtp22780421-17668) [    ] o.a.s.c.ZkController I am the leader, no recovery necessary
   [junit4]   2> 1922842 INFO  (qtp22780421-17668) [    ] o.a.s.s.HttpSolrCall [admin] webapp=null path=/admin/cores params={qt=/admin/cores&collection.configName=conf1&name=collection1_shard1_replica_n43&action=CREATE&collection=collection1&shard=shard1&wt=javabin&version=2&replicaType=NRT} status=0 QTime=2185
   [junit4]   2> 1922855 INFO  (qtp685281-17593) [    ] o.a.s.s.HttpSolrCall [admin] webapp=null path=/admin/collections params={node=127.0.0.1:63303_e_q%252Fj&action=ADDREPLICA&collection=collection1&shard=shard1&type=NRT&wt=javabin&version=2} status=0 QTime=2221
   [junit4]   2> 1924530 INFO  (TEST-ForceLeaderTest.testLastPublishedStateIsActive-seed#[1850FAB0F36466AD]) [    ] o.a.s.c.AbstractFullDistribZkTestBase create jetty 3 in directory C:\Users\jenkins\workspace\Lucene-Solr-7.x-Windows\solr\build\solr-core\test\J0\temp\solr.cloud.ForceLeaderTest_1850FAB0F36466AD-001\shard-3-001 of type NRT
   [junit4]   2> 1924531 INFO  (TEST-ForceLeaderTest.testLastPublishedStateIsActive-seed#[1850FAB0F36466AD]) [    ] o.e.j.s.Server jetty-9.3.14.v20161028
   [junit4]   2> 1924532 INFO  (TEST-ForceLeaderTest.testLastPublishedStateIsActive-seed#[1850FAB0F36466AD]) [    ] o.e.j.s.h.ContextHandler Started o.e.j.s.ServletContextHandler@e895ee{/e_q/j,null,AVAILABLE}
   [junit4]   2> 1924533 INFO  (TEST-ForceLeaderTest.testLastPublishedStateIsActive-seed#[1850FAB0F36466AD]) [    ] o.e.j.s.AbstractConnector Started ServerConnector@841{HTTP/1.1,[http/1.1]}{127.0.0.1:63322}
   [junit4]   2> 1924533 INFO  (TEST-ForceLeaderTest.testLastPublishedStateIsActive-seed#[1850FAB0F36466AD]) [    ] o.e.j.s.Server Started @1925415ms
   [junit4]   2> 1924533 INFO  (TEST-ForceLeaderTest.testLastPublishedStateIsActive-seed#[1850FAB0F36466AD]) [    ] o.a.s.c.s.e.JettySolrRunner Jetty properties: {hostContext=/e_q/j, solrconfig=solrconfig.xml, solr.data.dir=C:\Users\jenkins\workspace\Lucene-Solr-7.x-Windows\solr\build\solr-core\test\J0\temp\solr.cloud.ForceLeaderTest_1850FAB0F36466AD-001\tempDir-001/jetty3, hostPort=63321, coreRootDirectory=C:\Users\jenkins\workspace\Lucene-Solr-7.x-Windows\solr\build\solr-core\test\J0\temp\solr.cloud.ForceLeaderTest_1850FAB0F36466AD-001\shard-3-001\cores, replicaType=NRT}
   [junit4]   2> 1924534 ERROR (TEST-ForceLeaderTest.testLastPublishedStateIsActive-seed#[1850FAB0F36466AD]) [    ] o.a.s.s.StartupLoggingUtils Missing Java Option solr.log.dir. Logging may be missing or incomplete.
   [junit4]   2> 1924534 INFO  (TEST-ForceLeaderTest.testLastPublishedStateIsActive-seed#[1850FAB0F36466AD]) [    ] o.a.s.s.SolrDispatchFilter  ___      _       Welcome to Apache Solr™ version 7.1.0
   [junit4]   2> 1924534 INFO  (TEST-ForceLeaderTest.testLastPublishedStateIsActive-seed#[1850FAB0F36466AD]) [    ] o.a.s.s.SolrDispatchFilter / __| ___| |_ _   Starting in cloud mode on port null
   [junit4]   2> 1924534 INFO  (TEST-ForceLeaderTest.testLastPublishedStateIsActive-seed#[1850FAB0F36466AD]) [    ] o.a.s.s.SolrDispatchFilter \__ \/ _ \ | '_|  Install dir: null, Default config dir: null
   [junit4]   2> 1924534 INFO  (TEST-ForceLeaderTest.testLastPublishedStateIsActive-seed#[1850FAB0F36466AD]) [    ] o.a.s.s.SolrDispatchFilter |___/\___/_|_|    Start time: 2017-08-11T12:38:59.972897100Z
   [junit4]   2> 1924603 INFO  (TEST-ForceLeaderTest.testLastPublishedStateIsActive-seed#[1850FAB0F36466AD]) [    ] o.a.s.s.SolrDispatchFilter Loading solr.xml from SolrHome (not found in ZooKeeper)
   [junit4]   2> 1924603 INFO  (TEST-ForceLeaderTest.testLastPublishedStateIsActive-seed#[1850FAB0F36466AD]) [    ] o.a.s.c.SolrXmlConfig Loading container configuration from C:\Users\jenkins\workspace\Lucene-Solr-7.x-Windows\solr\build\solr-core\test\J0\temp\solr.cloud.ForceLeaderTest_1850FAB0F36466AD-001\shard-3-001\solr.xml
   [junit4]   2> 1924612 INFO  (TEST-ForceLeaderTest.testLastPublishedStateIsActive-seed#[1850FAB0F36466AD]) [    ] o.a.s.c.SolrXmlConfig MBean server found: com.sun.jmx.mbeanserver.JmxMBeanServer@132dc62, but no JMX reporters were configured - adding default JMX reporter.
   [junit4]   2> 1924618 INFO  (TEST-ForceLeaderTest.testLastPublishedStateIsActive-seed#[1850FAB0F36466AD]) [    ] o.a.s.c.ZkContainer Zookeeper client=127.0.0.1:63254/solr
   [junit4]   2> 1924662 INFO  (OverseerCollectionConfigSetProcessor-98464898910519300-127.0.0.1:63261_e_q%2Fj-n_0000000000) [    ] o.a.s.c.OverseerTaskQueue Response ZK path: /overseer/collection-queue-work/qnr-0000000006 doesn't exist.  Requestor may have disconnected from ZooKeeper
   [junit4]   2> 1924689 INFO  (TEST-ForceLeaderTest.testLastPublishedStateIsActive-seed#[1850FAB0F36466AD]) [    ] o.a.s.c.c.ZkStateReader Updated live nodes from ZooKeeper... (0) -> (3)
   [junit4]   2> 1924693 INFO  (TEST-ForceLeaderTest.testLastPublishedStateIsActive-seed#[1850FAB0F36466AD]) [    ] o.a.s.c.Overseer Overseer (id=null) closing
   [junit4]   2> 1924696 INFO  (TEST-ForceLeaderTest.testLastPublishedStateIsActive-seed#[1850FAB0F36466AD]) [    ] o.a.s.c.ZkController Register node as live in ZooKeeper:/live_nodes/127.0.0.1:63321_e_q%2Fj
   [junit4]   2> 1924701 INFO  (zkCallback-2787-thread-2) [    ] o.a.s.c.c.ZkStateReader Updated live nodes from ZooKeeper... (3) -> (4)
   [junit4]   2> 1924701 INFO  (zkCallback-2794-thread-1) [    ] o.a.s.c.c.ZkStateReader Updated live nodes from ZooKeeper... (3) -> (4)
   [junit4]   2> 1924701 INFO  (zkCallback-2799-thread-1) [    ] o.a.s.c.c.ZkStateReader Updated live nodes from ZooKeeper... (3) -> (4)
   [junit4]   2> 1924701 INFO  (zkCallback-2811-thread-1) [    ] o.a.s.c.c.ZkStateReader Updated live nodes from ZooKeeper... (3) -> (4)
   [junit4]   2> 1924701 INFO  (zkCallback-2805-thread-1) [    ] o.a.s.c.c.ZkStateReader Updated live nodes from ZooKeeper... (3) -> (4)
   [junit4]   2> 1924983 INFO  (TEST-ForceLeaderTest.testLastPublishedStateIsActive-seed#[1850FAB0F36466AD]) [    ] o.a.s.m.r.SolrJmxReporter JMX monitoring for 'solr.node' (registry 'solr.node') enabled at server: com.sun.jmx.mbeanserver.JmxMBeanServer@132dc62
   [junit4]   2> 1924994 INFO  (TEST-ForceLeaderTest.testLastPublishedStateIsActive-seed#[1850FAB0F36466AD]) [    ] o.a.s.m.r.SolrJmxReporter JMX monitoring for 'solr.jvm' (registry 'solr.jvm') enabled at server: com.sun.jmx.mbeanserver.JmxMBeanServer@132dc62
   [junit4]   2> 1924994 INFO  (TEST-ForceLeaderTest.testLastPublishedStateIsActive-seed#[1850FAB0F36466AD]) [    ] o.a.s.m.r.SolrJmxReporter JMX monitoring for 'solr.jetty' (registry 'solr.jetty') enabled at server: com.sun.jmx.mbeanserver.JmxMBeanServer@132dc62
   [junit4]   2> 1924996 INFO  (TEST-ForceLeaderTest.testLastPublishedStateIsActive-seed#[1850FAB0F36466AD]) [    ] o.a.s.c.CorePropertiesLocator Found 0 core definitions underneath C:\Users\jenkins\workspace\Lucene-Solr-7.x-Windows\solr\build\solr-core\test\J0\temp\solr.cloud.ForceLeaderTest_1850FAB0F36466AD-001\shard-3-001\cores
   [junit4]   2> 1925093 INFO  (qtp685281-17580) [    ] o.a.s.h.a.CollectionsHandler Invoked Collection Action :addreplica with params node=127.0.0.1:63321_e_q%252Fj&action=ADDREPLICA&collection=collection1&shard=shard2&type=NRT&wt=javabin&version=2 and sendToOCPQueue=true
   [junit4]   2> 1925123 INFO  (OverseerThreadFactory-8366-thread-5) [    ] o.a.s.c.AddReplicaCmd Node Identified 127.0.0.1:63321_e_q%2Fj for creating new replica
   [junit4]   2> 1925157 INFO  (SocketProxy-Acceptor-63321) [    ] o.a.s.c.SocketProxy accepted Socket[addr=/127.0.0.1,port=63334,localport=63321], receiveBufferSize:65536
   [junit4]   2> 1925157 INFO  (SocketProxy-Acceptor-63321) [    ] o.a.s.c.SocketProxy proxy connection Socket[addr=/127.0.0.1,port=63322,localport=63335], receiveBufferSize=65536
   [junit4]   2> 1925190 INFO  (qtp2975258-17709) [    ] o.a.s.h.a.CoreAdminOperation core create command qt=/admin/cores&collection.configName=conf1&name=collection1_shard2_replica_n45&action=CREATE&collection=collection1&shard=shard2&wt=javabin&version=2&replicaType=NRT
   [junit4]   2> 1925190 INFO  (qtp2975258-17709) [    ] o.a.s.c.TransientSolrCoreCacheDefault Allocating transient cache for 4 transient cores
   [junit4]   2> 1926258 INFO  (qtp2975258-17709) [    ] o.a.s.c.SolrConfig Using Lucene MatchVersion: 7.1.0
   [junit4]   2> 1926301 INFO  (qtp2975258-17709) [    ] o.a.s.s.IndexSchema [collection1_shard2_replica_n45] Schema name=test
   [junit4]   2> 1926501 INFO  (qtp2975258-17709) [    ] o.a.s.s.IndexSchema Loaded schema test/1.0 with uniqueid field id
   [junit4]   2> 1926628 INFO  (qtp2975258-17709) [    ] o.a.s.c.CoreContainer Creating SolrCore 'collection1_shard2_replica_n45' using configuration from collection collection1, trusted=true
   [junit4]   2> 1926629 INFO  (qtp2975258-17709) [    ] o.a.s.m.r.SolrJmxReporter JMX monitoring for 'solr.core.collection1.shard2.replica_n45' (registry 'solr.core.collection1.shard2.replica_n45') enabled at server: com.sun.jmx.mbeanserver.JmxMBeanServer@132dc62
   [junit4]   2> 1926629 INFO  (qtp2975258-17709) [    ] o.a.s.c.SolrCore solr.RecoveryStrategy.Builder
   [junit4]   2> 1926629 INFO  (qtp2975258-17709) [    ] o.a.s.c.SolrCore [[collection1_shard2_replica_n45] ] Opening new SolrCore at [C:\Users\jenkins\workspace\Lucene-Solr-7.x-Windows\solr\build\solr-core\test\J0\temp\solr.cloud.ForceLeaderTest_1850FAB0F36466AD-001\shard-3-001\cores\collection1_shard2_replica_n45], dataDir=[C:\Users\jenkins\workspace\Lucene-Solr-7.x-Windows\solr\build\solr-core\test\J0\temp\solr.cloud.ForceLeaderTest_1850FAB0F36466AD-001\shard-3-001\cores\collection1_shard2_replica_n45\data\]
   [junit4]   2> 1926643 INFO  (qtp2975258-17709) [    ] o.a.s.u.RandomMergePolicy RandomMergePolicy wrapping class org.apache.lucene.index.TieredMergePolicy: [TieredMergePolicy: maxMergeAtOnce=50, maxMergeAtOnceExplicit=10, maxMergedSegmentMB=73.1435546875, floorSegmentMB=0.513671875, forceMergeDeletesPctAllowed=26.85845096969746, segmentsPerTier=18.0, maxCFSSegmentSizeMB=8.796093022207999E12, noCFSRatio=0.5502204549756781
   [junit4]   2> 1926652 WARN  (qtp2975258-17709) [    ] o.a.s.c.RequestHandlers INVALID paramSet a in requestHandler {type = requestHandler,name = /dump,class = DumpRequestHandler,attributes = {initParams=a, name=/dump, class=DumpRequestHandler},args = {defaults={a=A,b=B}}}
   [junit4]   2> 1926902 INFO  (qtp2975258-17709) [    ] o.a.s.u.UpdateHandler Using UpdateLog implementation: org.apache.solr.update.UpdateLog
   [junit4]   2> 1926902 INFO  (qtp2975258-17709) [    ] o.a.s.u.UpdateLog Initializing UpdateLog: dataDir= defaultSyncLevel=FLUSH numRecordsToKeep=100 maxNumLogsToKeep=10 numVersionBuckets=65536
   [junit4]   2> 1926912 INFO  (qtp2975258-17709) [    ] o.a.s.u.CommitTracker Hard AutoCommit: disabled
   [junit4]   2> 1926912 INFO  (qtp2975258-17709) [    ] o.a.s.u.CommitTracker Soft AutoCommit: disabled
   [junit4]   2> 1926917 INFO  (qtp2975258-17709) [    ] o.a.s.u.RandomMergePolicy RandomMergePolicy wrapping class org.apache.lucene.index.LogByteSizeMergePolicy: [LogByteSizeMergePolicy: minMergeSize=1677721, mergeFactor=15, maxMergeSize=2147483648, maxMergeSizeForForcedMerge=9223372036854775807, calibrateSizeByDeletes=true, maxMergeDocs=2147483647, maxCFSSegmentSizeMB=8.796093022207999E12, noCFSRatio=0.7938252268394589]
   [junit4]   2> 1926918 INFO  (qtp2975258-17709) [    ] o.a.s.s.SolrIndexSearcher Opening [Searcher@1496286[collection1_shard2_replica_n45] main]
   [junit4]   2> 1926925 INFO  (qtp2975258-17709) [    ] o.a.s.r.ManagedResourceStorage Configured ZooKeeperStorageIO with znodeBase: /configs/conf1
   [junit4]   2> 1926926 INFO  (qtp2975258-17709) [    ] o.a.s.r.ManagedResourceStorage Loaded null at path _rest_managed.json using ZooKeeperStorageIO:path=/configs/conf1
   [junit4]   2> 1926928 INFO  (qtp2975258-17709) [    ] o.a.s.h.ReplicationHandler Commits will be reserved for  10000
   [junit4]   2> 1926930 INFO  (searcherExecutor-8402-thread-1) [    ] o.a.s.c.SolrCore [collection1_shard2_replica_n45] Registered new searcher Searcher@1496286[collection1_shard2_replica_n45] main{ExitableDirectoryReader(UninvertingDirectoryReader())}
   [junit4]   2> 1926931 INFO  (qtp2975258-17709) [    ] o.a.s.u.UpdateLog Could not find max version in index or recent updates, using new clock 1575438403364716544
   [junit4]   2> 1926944 INFO  (qtp2975258-17709) [    ] o.a.s.c.ZkController Core needs to recover:collection1_shard2_replica_n45
   [junit4]   2> 1926945 INFO  (updateExecutor-2808-thread-1) [    ] o.a.s.u.DefaultSolrCoreState Running recovery
   [junit4]   2> 1926945 INFO  (qtp2975258-17709) [    ] o.a.s.s.HttpSolrCall [admin] webapp=null path=/admin/cores params={qt=/admin/cores&collection.configName=conf1&name=collection1_shard2_replica_n45&action=CREATE&collection=collection1&shard=shard2&wt=javabin&version=2&replicaType=NRT} status=0 QTime=1754
   [junit4]   2> 1926946 INFO  (recoveryExecutor-2809-thread-1) [    ] o.a.s.c.RecoveryStrategy Starting recovery process. recoveringAfterStartup=true
   [junit4]   2> 1926946 INFO  (recoveryExecutor-2809-thread-1) [    ] o.a.s.c.RecoveryStrategy ###### startupVersions=[[]]
   [junit4]   2> 1926947 INFO  (recoveryExecutor-2809-thread-1) [    ] o.a.s.c.RecoveryStrategy Begin buffering updates. core=[collection1_shard2_replica_n45]
   [junit4]   2> 1926947 INFO  (recoveryExecutor-2809-thread-1) [    ] o.a.s.u.UpdateLog Starting to buffer updates. FSUpdateLog{state=ACTIVE, tlog=null}
   [junit4]   2> 1926947 INFO  (recoveryExecutor-2809-thread-1) [    ] o.a.s.c.RecoveryStrategy Publishing state of core [collection1_shard2_replica_n45] as recovering, leader is [http://127.0.0.1:63288/e_q/j/collection1_shard2_replica_n41/] and I am [http://127.0.0.1:63321/e_q/j/collection1_shard2_replica_n45/]
   [junit4]   2> 1926948 INFO  (qtp685281-17580) [    ] o.a.s.s.HttpSolrCall [admin] webapp=null path=/admin/collections params={node=127.0.0.1:63321_e_q%252Fj&action=ADDREPLICA&collection=collection1&shard=shard2&type=NRT&wt=javabin&version=2} status=0 QTime=1858
   [junit4]   2> 1926958 INFO  (TEST-ForceLeaderTest.testLastPublishedStateIsActive-seed#[1850FAB0F36466AD]) [    ] o.a.s.SolrTestCaseJ4 ###Starting testLastPublishedStateIsActive
   [junit4]   2> 1926959 INFO  (recoveryExecutor-2809-thread-1) [    ] o.a.s.c.RecoveryStrategy Sending prep recovery command to [http://127.0.0.1:63288/e_q/j]; [WaitForState: action=PREPRECOVERY&core=collection1_shard2_replica_n41&nodeName=127.0.0.1:63321_e_q%252Fj&coreNodeName=core_node46&state=recovering&checkLive=true&onlyIfLeader=true&onlyIfLeaderActive=true]
   [junit4]   2> 1926959 INFO  (TEST-ForceLeaderTest.testLastPublishedStateIsActive-seed#[1850FAB0F36466AD]) [    ] o.a.s.c.AbstractFullDistribZkTestBase Creating collection with stateFormat=1: forceleader_last_published
   [junit4]   2> 1926963 INFO  (SocketProxy-Acceptor-63288) [    ] o.a.s.c.SocketProxy accepted Socket[addr=/127.0.0.1,port=63336,localport=63288], receiveBufferSize:65536
   [junit4]   2> 1926963 INFO  (SocketProxy-Acceptor-63303) [    ] o.a.s.c.SocketProxy accepted Socket[addr=/127.0.0.1,port=63337,localport=63303], receiveBufferSize:65536
   [junit4]   2> 1926963 INFO  (SocketProxy-Acceptor-63288) [    ] o.a.s.c.SocketProxy proxy connection Socket[addr=/127.0.0.1,port=63289,localport=63338], receiveBufferSize=65536
   [junit4]   2> 1926964 INFO  (SocketProxy-Acceptor-63303) [    ] o.a.s.c.SocketProxy proxy connection Socket[addr=/127.0.0.1,port=63304,localport=63339], receiveBufferSize=65536
   [junit4]   2> 1926965 INFO  (qtp28923209-17638) [    ] o.a.s.h.a.PrepRecoveryOp Going to wait for coreNodeName: core_node46, state: recovering, checkLive: true, onlyIfLeader: true, onlyIfLeaderActive: true, maxTime: 183 s
   [junit4]   2> 1926965 INFO  (qtp22780421-17669) [    ] o.a.s.h.a.CollectionsHandler Invoked Collection Action :create with params pullReplicas=0&maxShardsPerNode=1&collection.configName=conf1&nrtReplicas=3&name=forceleader_last_published&action=CREATE&numShards=1&tlogReplicas=0&stateFormat=1&wt=javabin&version=2 and sendToOCPQueue=true
   [junit4]   2> 1926966 INFO  (qtp28923209-17638) [    ] o.a.s.h.a.PrepRecoveryOp In WaitForState(recovering): collection=collection1, shard=shard2, thisCore=collection1_shard2_replica_n41, leaderDoesNotNeedRecovery=false, isLeader? true, live=true, checkLive=true, currentState=down, localState=active, nodeName=127.0.0.1:63321_e_q%2Fj, coreNodeName=core_node46, onlyIfActiveCheckResult=false, nodeProps: core_node46:{"core":"collection1_shard2_replica_n45","base_url":"http://127.0.0.1:63321/e_q/j","node_name":"127.0.0.1:63321_e_q%2Fj","state":"down","type":"NRT"}
   [junit4]   2> 1926981 INFO  (OverseerThreadFactory-8366-thread-5) [    ] o.a.s.c.CreateCollectionCmd Create collection forceleader_last_published
   [junit4]   2> 1926986 INFO  (OverseerCollectionConfigSetProcessor-98464898910519300-127.0.0.1:63261_e_q%2Fj-n_0000000000) [    ] o.a.s.c.OverseerTaskQueue Response ZK path: /overseer/collection-queue-work/qnr-0000000008 doesn't exist.  Requestor may have disconnected from ZooKeeper
   [junit4]   2> 1927231 INFO  (qtp2975258-17705) [    ] o.a.s.h.a.CoreAdminOperation core create command qt=/admin/cores&collection.configName=conf1&newCollection=true&name=forceleader_last_published_shard1_replica_n1&action=CREATE&numShards=1&collection=forceleader_last_published&shard=shard1&wt=javabin&version=2&replicaType=NRT
   [junit4]   2> 1927248 INFO  (qtp28923209-17636) [    ] o.a.s.h.a.CoreAdminOperation core create command qt=/admin/cores&collection.configName=conf1&newCollection=true&name=forceleader_last_published_shard1_replica_n2&action=CREATE&numShards=1&collection=forceleader_last_published&shard=shard1&wt=javabin&version=2&replicaType=NRT
   [junit4]   2> 1927250 INFO  (qtp685281-17586) [    ] o.a.s.h.a.CoreAdminOperation core create command qt=/admin/cores&collection.configName=conf1&newCollection=true&name=forceleade

[...truncated too long message...]

ServerCnxn.java:239)
   [junit4]   2> 	at org.apache.zookeeper.server.NIOServerCnxnFactory.run(NIOServerCnxnFactory.java:203)
   [junit4]   2> 	at java.base/java.lang.Thread.run(Thread.java:844)
   [junit4]   2> 240530 INFO  (coreCloseExecutor-978-thread-1) [    ] o.a.s.m.SolrMetricManager Closing metric reporters for registry=solr.collection.collection1.shard1.leader, tag=24192197
   [junit4]   2> 240531 INFO  (coreCloseExecutor-977-thread-1) [    ] o.a.s.m.SolrMetricManager Closing metric reporters for registry=solr.collection.workQueue.shard2.leader, tag=23561622
   [junit4]   2> 240531 INFO  (coreCloseExecutor-980-thread-2) [    ] o.a.s.m.SolrMetricManager Closing metric reporters for registry=solr.collection.destination.shard2.leader, tag=30312992
   [junit4]   2> 240532 INFO  (coreCloseExecutor-977-thread-2) [    ] o.a.s.m.SolrMetricManager Closing metric reporters for registry=solr.core.mainCorpus.shard1.replica_n1, tag=16678599
   [junit4]   2> 240532 INFO  (coreCloseExecutor-980-thread-1) [    ] o.a.s.m.SolrMetricManager Closing metric reporters for registry=solr.core.workQueue.shard1.replica_n1, tag=9530908
   [junit4]   2> 240535 WARN  (NIOServerCxn.Factory:0.0.0.0/0.0.0.0:0) [    ] o.a.z.s.NIOServerCnxn caught end of stream exception
   [junit4]   2> EndOfStreamException: Unable to read additional data from client sessionid 0x15dd1619ff80009, likely client has closed socket
   [junit4]   2> 	at org.apache.zookeeper.server.NIOServerCnxn.doIO(NIOServerCnxn.java:239)
   [junit4]   2> 	at org.apache.zookeeper.server.NIOServerCnxnFactory.run(NIOServerCnxnFactory.java:203)
   [junit4]   2> 	at java.base/java.lang.Thread.run(Thread.java:844)
   [junit4]   2> 240536 INFO  (zkCallback-333-thread-1) [    ] o.a.s.c.c.ZkStateReader Updated live nodes from ZooKeeper... (4) -> (3)
   [junit4]   2> 240536 INFO  (zkCallback-331-thread-1) [    ] o.a.s.c.c.ZkStateReader Updated live nodes from ZooKeeper... (4) -> (3)
   [junit4]   2> 240536 INFO  (zkCallback-330-thread-1) [    ] o.a.s.c.c.ZkStateReader Updated live nodes from ZooKeeper... (4) -> (3)
   [junit4]   2> 240545 INFO  (coreCloseExecutor-979-thread-2) [    ] o.a.s.m.SolrMetricManager Closing metric reporters for registry=solr.core.mainCorpus.shard2.replica_n2, tag=30621707
   [junit4]   2> 240550 INFO  (coreCloseExecutor-977-thread-2) [    ] o.a.s.m.SolrMetricManager Closing metric reporters for registry=solr.collection.mainCorpus.shard1.leader, tag=16678599
   [junit4]   2> 240552 WARN  (zkCallback-330-thread-1) [    ] o.a.s.c.c.ZkStateReader ZooKeeper watch triggered, but Solr cannot talk to ZK: [KeeperErrorCode = Session expired for /live_nodes]
   [junit4]   2> 240552 INFO  (coreCloseExecutor-980-thread-1) [    ] o.a.s.m.SolrMetricManager Closing metric reporters for registry=solr.collection.workQueue.shard1.leader, tag=9530908
   [junit4]   2> 240552 INFO  (jetty-closer-312-thread-2) [    ] o.e.j.s.h.ContextHandler Stopped o.e.j.s.ServletContextHandler@189693{/solr,null,UNAVAILABLE}
   [junit4]   2> 240552 INFO  (zkCallback-333-thread-1) [    ] o.a.s.c.c.ZkStateReader Updated live nodes from ZooKeeper... (3) -> (2)
   [junit4]   2> 240553 INFO  (zkCallback-331-thread-1) [    ] o.a.s.c.c.ZkStateReader Updated live nodes from ZooKeeper... (3) -> (2)
   [junit4]   2> 240554 INFO  (coreCloseExecutor-979-thread-2) [    ] o.a.s.m.SolrMetricManager Closing metric reporters for registry=solr.collection.mainCorpus.shard2.leader, tag=30621707
   [junit4]   2> 240554 INFO  (coreCloseExecutor-979-thread-1) [    ] o.a.s.m.SolrMetricManager Closing metric reporters for registry=solr.collection.collection1.shard2.leader, tag=27484233
   [junit4]   2> 240554 INFO  (jetty-closer-312-thread-4) [    ] o.a.s.c.Overseer Overseer (id=98464984097882124-127.0.0.1:58245_solr-n_0000000000) closing
   [junit4]   2> 240554 INFO  (OverseerStateUpdate-98464984097882124-127.0.0.1:58245_solr-n_0000000000) [    ] o.a.s.c.Overseer Overseer Loop exiting : 127.0.0.1:58245_solr
   [junit4]   2> 240556 WARN  (NIOServerCxn.Factory:0.0.0.0/0.0.0.0:0) [    ] o.a.z.s.NIOServerCnxn caught end of stream exception
   [junit4]   2> EndOfStreamException: Unable to read additional data from client sessionid 0x15dd1619ff8000c, likely client has closed socket
   [junit4]   2> 	at org.apache.zookeeper.server.NIOServerCnxn.doIO(NIOServerCnxn.java:239)
   [junit4]   2> 	at org.apache.zookeeper.server.NIOServerCnxnFactory.run(NIOServerCnxnFactory.java:203)
   [junit4]   2> 	at java.base/java.lang.Thread.run(Thread.java:844)
   [junit4]   2> 240556 WARN  (zkCallback-333-thread-1) [    ] o.a.s.c.c.ZkStateReader ZooKeeper watch triggered, but Solr cannot talk to ZK: [KeeperErrorCode = Session expired for /live_nodes]
   [junit4]   2> 240556 WARN  (NIOServerCxn.Factory:0.0.0.0/0.0.0.0:0) [    ] o.a.z.s.NIOServerCnxn caught end of stream exception
   [junit4]   2> EndOfStreamException: Unable to read additional data from client sessionid 0x15dd1619ff8000b, likely client has closed socket
   [junit4]   2> 	at org.apache.zookeeper.server.NIOServerCnxn.doIO(NIOServerCnxn.java:239)
   [junit4]   2> 	at org.apache.zookeeper.server.NIOServerCnxnFactory.run(NIOServerCnxnFactory.java:203)
   [junit4]   2> 	at java.base/java.lang.Thread.run(Thread.java:844)
   [junit4]   2> 240558 INFO  (jetty-closer-312-thread-4) [    ] o.e.j.s.h.ContextHandler Stopped o.e.j.s.ServletContextHandler@1149c08{/solr,null,UNAVAILABLE}
   [junit4]   2> 242036 WARN  (zkCallback-332-thread-2) [    ] o.a.s.c.c.ZkStateReader ZooKeeper watch triggered, but Solr cannot talk to ZK: [KeeperErrorCode = Session expired for /live_nodes]
   [junit4]   2> 242036 INFO  (jetty-closer-312-thread-3) [    ] o.e.j.s.h.ContextHandler Stopped o.e.j.s.ServletContextHandler@11be8a1{/solr,null,UNAVAILABLE}
   [junit4]   2> 242057 WARN  (zkCallback-331-thread-2) [    ] o.a.s.c.c.ZkStateReader ZooKeeper watch triggered, but Solr cannot talk to ZK: [KeeperErrorCode = Session expired for /live_nodes]
   [junit4]   2> 242057 INFO  (jetty-closer-312-thread-1) [    ] o.e.j.s.h.ContextHandler Stopped o.e.j.s.ServletContextHandler@1b1525d{/solr,null,UNAVAILABLE}
   [junit4]   2> 242058 ERROR (SUITE-StreamExpressionTest-seed#[B2527D01DFEFA61A]-worker) [    ] o.a.z.s.ZooKeeperServer ZKShutdownHandler is not registered, so ZooKeeper server won't take any action on ERROR or SHUTDOWN server state changes
   [junit4]   2> 242059 INFO  (SUITE-StreamExpressionTest-seed#[B2527D01DFEFA61A]-worker) [    ] o.a.s.c.ZkTestServer connecting to 127.0.0.1:58228 58228
   [junit4]   2> 242060 INFO  (Thread-216) [    ] o.a.s.c.ZkTestServer connecting to 127.0.0.1:58228 58228
   [junit4]   2> 242061 WARN  (Thread-216) [    ] o.a.s.c.ZkTestServer Watch limit violations: 
   [junit4]   2> Maximum concurrent create/delete watches above limit:
   [junit4]   2> 
   [junit4]   2> 	93	/solr/aliases.json
   [junit4]   2> 	93	/solr/clusterprops.json
   [junit4]   2> 	8	/solr/configs/conf
   [junit4]   2> 	7	/solr/configs/ml
   [junit4]   2> 	4	/solr/security.json
   [junit4]   2> 
   [junit4]   2> Maximum concurrent data watches above limit:
   [junit4]   2> 
   [junit4]   2> 	93	/solr/clusterstate.json
   [junit4]   2> 	40	/solr/collections/destinationCollection/state.json
   [junit4]   2> 	28	/solr/collections/parallelDestinationCollection1/state.json
   [junit4]   2> 	20	/solr/collections/destination/state.json
   [junit4]   2> 	20	/solr/collections/parallelDestinationCollection/state.json
   [junit4]   2> 	20	/solr/collections/mainCorpus/state.json
   [junit4]   2> 	18	/solr/collections/workQueue/state.json
   [junit4]   2> 	10	/solr/collections/collection1/state.json
   [junit4]   2> 	10	/solr/collections/uknownCollection/state.json
   [junit4]   2> 	10	/solr/collections/modelCollection/state.json
   [junit4]   2> 	10	/solr/collections/checkpointCollection/state.json
   [junit4]   2> 
   [junit4]   2> Maximum concurrent children watches above limit:
   [junit4]   2> 
   [junit4]   2> 	93	/solr/live_nodes
   [junit4]   2> 	93	/solr/collections
   [junit4]   2> 
   [junit4]   2> NOTE: leaving temporary files on disk at: C:\Users\jenkins\workspace\Lucene-Solr-7.x-Windows\solr\build\solr-solrj\test\J0\temp\solr.client.solrj.io.stream.StreamExpressionTest_B2527D01DFEFA61A-001
   [junit4]   2> Aug 11, 2017 1:02:12 PM com.carrotsearch.randomizedtesting.ThreadLeakControl checkThreadLeaks
   [junit4]   2> WARNING: Will linger awaiting termination of 1 leaked thread(s).
   [junit4]   2> NOTE: test params are: codec=FastCompressingStoredFields(storedFieldsFormat=CompressingStoredFieldsFormat(compressionMode=FAST, chunkSize=4698, maxDocsPerChunk=275, blockSize=5), termVectorsFormat=CompressingTermVectorsFormat(compressionMode=FAST, chunkSize=4698, blockSize=5)), sim=RandomSimilarity(queryNorm=true): {}, locale=vai, timezone=Asia/Kabul
   [junit4]   2> NOTE: Windows 10 10.0 x86/Oracle Corporation 9 (32-bit)/cpus=3,threads=1,free=115890688,total=343932928
   [junit4]   2> NOTE: All tests run in this JVM: [TestSpellCheckResponse, NamedListTest, TestSolrProperties, JsonValidatorTest, AbsoluteValueEvaluatorTest, TestUpdateRequestCodec, TestCoreAdmin, CommonParamsTest, JettyWebappTest, TestSuggesterResponse, ModifiableSolrParamsTest, CloudSolrClientTest, TestJavaBinCodec, ConcurrentUpdateSolrClientTest, TestZkConfigManager, ArcSineEvaluatorTest, FieldAnalysisResponseTest, HttpSolrClientConPoolTest, GreaterThanEqualToEvaluatorTest, TestPathTrie, LessThanEqualToEvaluatorTest, TestEmbeddedSolrServer, TestClusteringResponse, TestHash, ArrayEvaluatorTest, SolrExampleEmbeddedTest, TestV2Request, TermsResponseTest, HyperbolicTangentEvaluatorTest, BasicHttpSolrClientTest, SolrExampleStreamingTest, CloudSolrClientBuilderTest, CloudSolrClientCacheTest, HttpSolrClientSSLAuthConPoolTest, GraphExpressionTest, StreamExpressionTest]
   [junit4] Completed [135/135 (1!)] on J0 in 110.78s, 94 tests, 1 error <<< FAILURES!

[...truncated 35692 lines...]

Mime
View raw message