lucene-dev mailing list archives

Site index · List index
Message view « Date » · « Thread »
Top « Date » · « Thread »
From Policeman Jenkins Server <jenk...@thetaphi.de>
Subject [JENKINS] Lucene-Solr-7.x-Windows (32bit/jdk1.8.0_141) - Build # 95 - Unstable!
Date Tue, 01 Aug 2017 02:30:04 GMT
Build: https://jenkins.thetaphi.de/job/Lucene-Solr-7.x-Windows/95/
Java: 32bit/jdk1.8.0_141 -server -XX:+UseParallelGC

26 tests failed.
FAILED:  org.apache.solr.TestDistributedSearch.test

Error Message:
Error from server at http://127.0.0.1:53200//collection1: Cannot use facet.mincount=0 on field a_n_tdt which is Points-based

Stack Trace:
org.apache.solr.client.solrj.impl.HttpSolrClient$RemoteSolrException: Error from server at http://127.0.0.1:53200//collection1: Cannot use facet.mincount=0 on field a_n_tdt which is Points-based
	at __randomizedtesting.SeedInfo.seed([2DBE584676D8550C:A5EA679CD82438F4]:0)
	at org.apache.solr.client.solrj.impl.HttpSolrClient.executeMethod(HttpSolrClient.java:626)
	at org.apache.solr.client.solrj.impl.HttpSolrClient.request(HttpSolrClient.java:252)
	at org.apache.solr.client.solrj.impl.HttpSolrClient.request(HttpSolrClient.java:241)
	at org.apache.solr.client.solrj.SolrRequest.process(SolrRequest.java:178)
	at org.apache.solr.client.solrj.SolrClient.query(SolrClient.java:942)
	at org.apache.solr.client.solrj.SolrClient.query(SolrClient.java:957)
	at org.apache.solr.BaseDistributedSearchTestCase.query(BaseDistributedSearchTestCase.java:599)
	at org.apache.solr.BaseDistributedSearchTestCase.query(BaseDistributedSearchTestCase.java:587)
	at org.apache.solr.BaseDistributedSearchTestCase.query(BaseDistributedSearchTestCase.java:566)
	at org.apache.solr.TestDistributedSearch.test(TestDistributedSearch.java:241)
	at sun.reflect.NativeMethodAccessorImpl.invoke0(Native Method)
	at sun.reflect.NativeMethodAccessorImpl.invoke(NativeMethodAccessorImpl.java:62)
	at sun.reflect.DelegatingMethodAccessorImpl.invoke(DelegatingMethodAccessorImpl.java:43)
	at java.lang.reflect.Method.invoke(Method.java:498)
	at com.carrotsearch.randomizedtesting.RandomizedRunner.invoke(RandomizedRunner.java:1713)
	at com.carrotsearch.randomizedtesting.RandomizedRunner$8.evaluate(RandomizedRunner.java:907)
	at com.carrotsearch.randomizedtesting.RandomizedRunner$9.evaluate(RandomizedRunner.java:943)
	at com.carrotsearch.randomizedtesting.RandomizedRunner$10.evaluate(RandomizedRunner.java:957)
	at org.apache.solr.BaseDistributedSearchTestCase$ShardsRepeatRule$ShardsRepeatStatement.callStatement(BaseDistributedSearchTestCase.java:1011)
	at org.apache.solr.BaseDistributedSearchTestCase$ShardsRepeatRule$ShardsStatement.evaluate(BaseDistributedSearchTestCase.java:960)
	at com.carrotsearch.randomizedtesting.rules.SystemPropertiesRestoreRule$1.evaluate(SystemPropertiesRestoreRule.java:57)
	at org.apache.lucene.util.TestRuleSetupTeardownChained$1.evaluate(TestRuleSetupTeardownChained.java:49)
	at org.apache.lucene.util.AbstractBeforeAfterRule$1.evaluate(AbstractBeforeAfterRule.java:45)
	at org.apache.lucene.util.TestRuleThreadAndTestName$1.evaluate(TestRuleThreadAndTestName.java:48)
	at org.apache.lucene.util.TestRuleIgnoreAfterMaxFailures$1.evaluate(TestRuleIgnoreAfterMaxFailures.java:64)
	at org.apache.lucene.util.TestRuleMarkFailure$1.evaluate(TestRuleMarkFailure.java:47)
	at com.carrotsearch.randomizedtesting.rules.StatementAdapter.evaluate(StatementAdapter.java:36)
	at com.carrotsearch.randomizedtesting.ThreadLeakControl$StatementRunner.run(ThreadLeakControl.java:368)
	at com.carrotsearch.randomizedtesting.ThreadLeakControl.forkTimeoutingTask(ThreadLeakControl.java:817)
	at com.carrotsearch.randomizedtesting.ThreadLeakControl$3.evaluate(ThreadLeakControl.java:468)
	at com.carrotsearch.randomizedtesting.RandomizedRunner.runSingleTest(RandomizedRunner.java:916)
	at com.carrotsearch.randomizedtesting.RandomizedRunner$5.evaluate(RandomizedRunner.java:802)
	at com.carrotsearch.randomizedtesting.RandomizedRunner$6.evaluate(RandomizedRunner.java:852)
	at com.carrotsearch.randomizedtesting.RandomizedRunner$7.evaluate(RandomizedRunner.java:863)
	at com.carrotsearch.randomizedtesting.rules.StatementAdapter.evaluate(StatementAdapter.java:36)
	at com.carrotsearch.randomizedtesting.rules.SystemPropertiesRestoreRule$1.evaluate(SystemPropertiesRestoreRule.java:57)
	at org.apache.lucene.util.AbstractBeforeAfterRule$1.evaluate(AbstractBeforeAfterRule.java:45)
	at com.carrotsearch.randomizedtesting.rules.StatementAdapter.evaluate(StatementAdapter.java:36)
	at org.apache.lucene.util.TestRuleStoreClassName$1.evaluate(TestRuleStoreClassName.java:41)
	at com.carrotsearch.randomizedtesting.rules.NoShadowingOrOverridesOnMethodsRule$1.evaluate(NoShadowingOrOverridesOnMethodsRule.java:40)
	at com.carrotsearch.randomizedtesting.rules.NoShadowingOrOverridesOnMethodsRule$1.evaluate(NoShadowingOrOverridesOnMethodsRule.java:40)
	at com.carrotsearch.randomizedtesting.rules.StatementAdapter.evaluate(StatementAdapter.java:36)
	at com.carrotsearch.randomizedtesting.rules.StatementAdapter.evaluate(StatementAdapter.java:36)
	at com.carrotsearch.randomizedtesting.rules.StatementAdapter.evaluate(StatementAdapter.java:36)
	at org.apache.lucene.util.TestRuleAssertionsRequired$1.evaluate(TestRuleAssertionsRequired.java:53)
	at org.apache.lucene.util.TestRuleMarkFailure$1.evaluate(TestRuleMarkFailure.java:47)
	at org.apache.lucene.util.TestRuleIgnoreAfterMaxFailures$1.evaluate(TestRuleIgnoreAfterMaxFailures.java:64)
	at org.apache.lucene.util.TestRuleIgnoreTestSuites$1.evaluate(TestRuleIgnoreTestSuites.java:54)
	at com.carrotsearch.randomizedtesting.rules.StatementAdapter.evaluate(StatementAdapter.java:36)
	at com.carrotsearch.randomizedtesting.ThreadLeakControl$StatementRunner.run(ThreadLeakControl.java:368)
	at java.lang.Thread.run(Thread.java:748)


FAILED:  org.apache.solr.TestGroupingSearch.testGroupAPI

Error Message:
Cannot use facet.mincount=0 on field foo_i which is Points-based

Stack Trace:
org.apache.solr.common.SolrException: Cannot use facet.mincount=0 on field foo_i which is Points-based
	at __randomizedtesting.SeedInfo.seed([2DBE584676D8550C:B01B6C0BE5E5A526]:0)
	at org.apache.solr.request.NumericFacets.getCountsSingleValue(NumericFacets.java:184)
	at org.apache.solr.request.NumericFacets.getCounts(NumericFacets.java:170)
	at org.apache.solr.request.SimpleFacets.getTermCounts(SimpleFacets.java:499)
	at org.apache.solr.request.SimpleFacets.getTermCounts(SimpleFacets.java:405)
	at org.apache.solr.request.SimpleFacets.lambda$getFacetFieldCounts$0(SimpleFacets.java:803)
	at java.util.concurrent.FutureTask.run(FutureTask.java:266)
	at org.apache.solr.request.SimpleFacets$3.execute(SimpleFacets.java:742)
	at org.apache.solr.request.SimpleFacets.getFacetFieldCounts(SimpleFacets.java:818)
	at org.apache.solr.handler.component.FacetComponent.getFacetCounts(FacetComponent.java:329)
	at org.apache.solr.handler.component.FacetComponent.process(FacetComponent.java:273)
	at org.apache.solr.handler.component.SearchHandler.handleRequestBody(SearchHandler.java:295)
	at org.apache.solr.handler.RequestHandlerBase.handleRequest(RequestHandlerBase.java:177)
	at org.apache.solr.core.SolrCore.execute(SolrCore.java:2473)
	at org.apache.solr.util.TestHarness.query(TestHarness.java:337)
	at org.apache.solr.util.TestHarness.query(TestHarness.java:319)
	at org.apache.solr.SolrTestCaseJ4.assertJQ(SolrTestCaseJ4.java:952)
	at org.apache.solr.SolrTestCaseJ4.assertJQ(SolrTestCaseJ4.java:921)
	at org.apache.solr.TestGroupingSearch.testGroupAPI(TestGroupingSearch.java:532)
	at sun.reflect.NativeMethodAccessorImpl.invoke0(Native Method)
	at sun.reflect.NativeMethodAccessorImpl.invoke(NativeMethodAccessorImpl.java:62)
	at sun.reflect.DelegatingMethodAccessorImpl.invoke(DelegatingMethodAccessorImpl.java:43)
	at java.lang.reflect.Method.invoke(Method.java:498)
	at com.carrotsearch.randomizedtesting.RandomizedRunner.invoke(RandomizedRunner.java:1713)
	at com.carrotsearch.randomizedtesting.RandomizedRunner$8.evaluate(RandomizedRunner.java:907)
	at com.carrotsearch.randomizedtesting.RandomizedRunner$9.evaluate(RandomizedRunner.java:943)
	at com.carrotsearch.randomizedtesting.RandomizedRunner$10.evaluate(RandomizedRunner.java:957)
	at com.carrotsearch.randomizedtesting.rules.SystemPropertiesRestoreRule$1.evaluate(SystemPropertiesRestoreRule.java:57)
	at org.apache.lucene.util.TestRuleSetupTeardownChained$1.evaluate(TestRuleSetupTeardownChained.java:49)
	at org.apache.lucene.util.AbstractBeforeAfterRule$1.evaluate(AbstractBeforeAfterRule.java:45)
	at org.apache.lucene.util.TestRuleThreadAndTestName$1.evaluate(TestRuleThreadAndTestName.java:48)
	at org.apache.lucene.util.TestRuleIgnoreAfterMaxFailures$1.evaluate(TestRuleIgnoreAfterMaxFailures.java:64)
	at org.apache.lucene.util.TestRuleMarkFailure$1.evaluate(TestRuleMarkFailure.java:47)
	at com.carrotsearch.randomizedtesting.rules.StatementAdapter.evaluate(StatementAdapter.java:36)
	at com.carrotsearch.randomizedtesting.ThreadLeakControl$StatementRunner.run(ThreadLeakControl.java:368)
	at com.carrotsearch.randomizedtesting.ThreadLeakControl.forkTimeoutingTask(ThreadLeakControl.java:817)
	at com.carrotsearch.randomizedtesting.ThreadLeakControl$3.evaluate(ThreadLeakControl.java:468)
	at com.carrotsearch.randomizedtesting.RandomizedRunner.runSingleTest(RandomizedRunner.java:916)
	at com.carrotsearch.randomizedtesting.RandomizedRunner$5.evaluate(RandomizedRunner.java:802)
	at com.carrotsearch.randomizedtesting.RandomizedRunner$6.evaluate(RandomizedRunner.java:852)
	at com.carrotsearch.randomizedtesting.RandomizedRunner$7.evaluate(RandomizedRunner.java:863)
	at com.carrotsearch.randomizedtesting.rules.StatementAdapter.evaluate(StatementAdapter.java:36)
	at com.carrotsearch.randomizedtesting.rules.SystemPropertiesRestoreRule$1.evaluate(SystemPropertiesRestoreRule.java:57)
	at org.apache.lucene.util.AbstractBeforeAfterRule$1.evaluate(AbstractBeforeAfterRule.java:45)
	at com.carrotsearch.randomizedtesting.rules.StatementAdapter.evaluate(StatementAdapter.java:36)
	at org.apache.lucene.util.TestRuleStoreClassName$1.evaluate(TestRuleStoreClassName.java:41)
	at com.carrotsearch.randomizedtesting.rules.NoShadowingOrOverridesOnMethodsRule$1.evaluate(NoShadowingOrOverridesOnMethodsRule.java:40)
	at com.carrotsearch.randomizedtesting.rules.NoShadowingOrOverridesOnMethodsRule$1.evaluate(NoShadowingOrOverridesOnMethodsRule.java:40)
	at com.carrotsearch.randomizedtesting.rules.StatementAdapter.evaluate(StatementAdapter.java:36)
	at com.carrotsearch.randomizedtesting.rules.StatementAdapter.evaluate(StatementAdapter.java:36)
	at com.carrotsearch.randomizedtesting.rules.StatementAdapter.evaluate(StatementAdapter.java:36)
	at org.apache.lucene.util.TestRuleAssertionsRequired$1.evaluate(TestRuleAssertionsRequired.java:53)
	at org.apache.lucene.util.TestRuleMarkFailure$1.evaluate(TestRuleMarkFailure.java:47)
	at org.apache.lucene.util.TestRuleIgnoreAfterMaxFailures$1.evaluate(TestRuleIgnoreAfterMaxFailures.java:64)
	at org.apache.lucene.util.TestRuleIgnoreTestSuites$1.evaluate(TestRuleIgnoreTestSuites.java:54)
	at com.carrotsearch.randomizedtesting.rules.StatementAdapter.evaluate(StatementAdapter.java:36)
	at com.carrotsearch.randomizedtesting.ThreadLeakControl$StatementRunner.run(ThreadLeakControl.java:368)
	at java.lang.Thread.run(Thread.java:748)


FAILED:  org.apache.solr.TestRandomFaceting.testRandomFaceting

Error Message:
Cannot use facet.mincount=0 on field score_f which is Points-based

Stack Trace:
org.apache.solr.common.SolrException: Cannot use facet.mincount=0 on field score_f which is Points-based
	at __randomizedtesting.SeedInfo.seed([2DBE584676D8550C:20D6789323219DB3]:0)
	at org.apache.solr.request.NumericFacets.getCountsSingleValue(NumericFacets.java:184)
	at org.apache.solr.request.NumericFacets.getCounts(NumericFacets.java:170)
	at org.apache.solr.request.SimpleFacets.getTermCounts(SimpleFacets.java:499)
	at org.apache.solr.request.SimpleFacets.getTermCounts(SimpleFacets.java:405)
	at org.apache.solr.request.SimpleFacets.lambda$getFacetFieldCounts$0(SimpleFacets.java:803)
	at java.util.concurrent.FutureTask.run(FutureTask.java:266)
	at org.apache.solr.request.SimpleFacets$3.execute(SimpleFacets.java:742)
	at org.apache.solr.request.SimpleFacets.getFacetFieldCounts(SimpleFacets.java:818)
	at org.apache.solr.handler.component.FacetComponent.getFacetCounts(FacetComponent.java:329)
	at org.apache.solr.handler.component.FacetComponent.process(FacetComponent.java:273)
	at org.apache.solr.handler.component.SearchHandler.handleRequestBody(SearchHandler.java:295)
	at org.apache.solr.handler.RequestHandlerBase.handleRequest(RequestHandlerBase.java:177)
	at org.apache.solr.core.SolrCore.execute(SolrCore.java:2473)
	at org.apache.solr.util.TestHarness.query(TestHarness.java:337)
	at org.apache.solr.util.TestHarness.query(TestHarness.java:319)
	at org.apache.solr.TestRandomFaceting.doFacetTests(TestRandomFaceting.java:288)
	at org.apache.solr.TestRandomFaceting.doFacetTests(TestRandomFaceting.java:177)
	at org.apache.solr.TestRandomFaceting.testRandomFaceting(TestRandomFaceting.java:160)
	at sun.reflect.NativeMethodAccessorImpl.invoke0(Native Method)
	at sun.reflect.NativeMethodAccessorImpl.invoke(NativeMethodAccessorImpl.java:62)
	at sun.reflect.DelegatingMethodAccessorImpl.invoke(DelegatingMethodAccessorImpl.java:43)
	at java.lang.reflect.Method.invoke(Method.java:498)
	at com.carrotsearch.randomizedtesting.RandomizedRunner.invoke(RandomizedRunner.java:1713)
	at com.carrotsearch.randomizedtesting.RandomizedRunner$8.evaluate(RandomizedRunner.java:907)
	at com.carrotsearch.randomizedtesting.RandomizedRunner$9.evaluate(RandomizedRunner.java:943)
	at com.carrotsearch.randomizedtesting.RandomizedRunner$10.evaluate(RandomizedRunner.java:957)
	at com.carrotsearch.randomizedtesting.rules.SystemPropertiesRestoreRule$1.evaluate(SystemPropertiesRestoreRule.java:57)
	at org.apache.lucene.util.TestRuleSetupTeardownChained$1.evaluate(TestRuleSetupTeardownChained.java:49)
	at org.apache.lucene.util.AbstractBeforeAfterRule$1.evaluate(AbstractBeforeAfterRule.java:45)
	at org.apache.lucene.util.TestRuleThreadAndTestName$1.evaluate(TestRuleThreadAndTestName.java:48)
	at org.apache.lucene.util.TestRuleIgnoreAfterMaxFailures$1.evaluate(TestRuleIgnoreAfterMaxFailures.java:64)
	at org.apache.lucene.util.TestRuleMarkFailure$1.evaluate(TestRuleMarkFailure.java:47)
	at com.carrotsearch.randomizedtesting.rules.StatementAdapter.evaluate(StatementAdapter.java:36)
	at com.carrotsearch.randomizedtesting.ThreadLeakControl$StatementRunner.run(ThreadLeakControl.java:368)
	at com.carrotsearch.randomizedtesting.ThreadLeakControl.forkTimeoutingTask(ThreadLeakControl.java:817)
	at com.carrotsearch.randomizedtesting.ThreadLeakControl$3.evaluate(ThreadLeakControl.java:468)
	at com.carrotsearch.randomizedtesting.RandomizedRunner.runSingleTest(RandomizedRunner.java:916)
	at com.carrotsearch.randomizedtesting.RandomizedRunner$5.evaluate(RandomizedRunner.java:802)
	at com.carrotsearch.randomizedtesting.RandomizedRunner$6.evaluate(RandomizedRunner.java:852)
	at com.carrotsearch.randomizedtesting.RandomizedRunner$7.evaluate(RandomizedRunner.java:863)
	at com.carrotsearch.randomizedtesting.rules.StatementAdapter.evaluate(StatementAdapter.java:36)
	at com.carrotsearch.randomizedtesting.rules.SystemPropertiesRestoreRule$1.evaluate(SystemPropertiesRestoreRule.java:57)
	at org.apache.lucene.util.AbstractBeforeAfterRule$1.evaluate(AbstractBeforeAfterRule.java:45)
	at com.carrotsearch.randomizedtesting.rules.StatementAdapter.evaluate(StatementAdapter.java:36)
	at org.apache.lucene.util.TestRuleStoreClassName$1.evaluate(TestRuleStoreClassName.java:41)
	at com.carrotsearch.randomizedtesting.rules.NoShadowingOrOverridesOnMethodsRule$1.evaluate(NoShadowingOrOverridesOnMethodsRule.java:40)
	at com.carrotsearch.randomizedtesting.rules.NoShadowingOrOverridesOnMethodsRule$1.evaluate(NoShadowingOrOverridesOnMethodsRule.java:40)
	at com.carrotsearch.randomizedtesting.rules.StatementAdapter.evaluate(StatementAdapter.java:36)
	at com.carrotsearch.randomizedtesting.rules.StatementAdapter.evaluate(StatementAdapter.java:36)
	at com.carrotsearch.randomizedtesting.rules.StatementAdapter.evaluate(StatementAdapter.java:36)
	at org.apache.lucene.util.TestRuleAssertionsRequired$1.evaluate(TestRuleAssertionsRequired.java:53)
	at org.apache.lucene.util.TestRuleMarkFailure$1.evaluate(TestRuleMarkFailure.java:47)
	at org.apache.lucene.util.TestRuleIgnoreAfterMaxFailures$1.evaluate(TestRuleIgnoreAfterMaxFailures.java:64)
	at org.apache.lucene.util.TestRuleIgnoreTestSuites$1.evaluate(TestRuleIgnoreTestSuites.java:54)
	at com.carrotsearch.randomizedtesting.rules.StatementAdapter.evaluate(StatementAdapter.java:36)
	at com.carrotsearch.randomizedtesting.ThreadLeakControl$StatementRunner.run(ThreadLeakControl.java:368)
	at java.lang.Thread.run(Thread.java:748)


FAILED:  org.apache.solr.cloud.DocValuesNotIndexedTest.testDistribFaceting

Error Message:
Error from server at http://127.0.0.1:59044/solr/dv_coll: Error from server at http://127.0.0.1:59044/solr/dv_coll_shard2_replica_n2: Cannot use facet.mincount=0 on field intField which is Points-based

Stack Trace:
org.apache.solr.client.solrj.impl.HttpSolrClient$RemoteSolrException: Error from server at http://127.0.0.1:59044/solr/dv_coll: Error from server at http://127.0.0.1:59044/solr/dv_coll_shard2_replica_n2: Cannot use facet.mincount=0 on field intField which is Points-based
	at __randomizedtesting.SeedInfo.seed([2DBE584676D8550C:4F0FA67B12C37EDE]:0)
	at org.apache.solr.client.solrj.impl.HttpSolrClient.executeMethod(HttpSolrClient.java:626)
	at org.apache.solr.client.solrj.impl.HttpSolrClient.request(HttpSolrClient.java:252)
	at org.apache.solr.client.solrj.impl.HttpSolrClient.request(HttpSolrClient.java:241)
	at org.apache.solr.client.solrj.impl.LBHttpSolrClient.doRequest(LBHttpSolrClient.java:483)
	at org.apache.solr.client.solrj.impl.LBHttpSolrClient.request(LBHttpSolrClient.java:413)
	at org.apache.solr.client.solrj.impl.CloudSolrClient.sendRequest(CloudSolrClient.java:1121)
	at org.apache.solr.client.solrj.impl.CloudSolrClient.requestWithRetryOnStaleState(CloudSolrClient.java:862)
	at org.apache.solr.client.solrj.impl.CloudSolrClient.request(CloudSolrClient.java:793)
	at org.apache.solr.client.solrj.SolrRequest.process(SolrRequest.java:178)
	at org.apache.solr.client.solrj.SolrClient.query(SolrClient.java:942)
	at org.apache.solr.cloud.DocValuesNotIndexedTest.testDistribFaceting(DocValuesNotIndexedTest.java:213)
	at sun.reflect.NativeMethodAccessorImpl.invoke0(Native Method)
	at sun.reflect.NativeMethodAccessorImpl.invoke(NativeMethodAccessorImpl.java:62)
	at sun.reflect.DelegatingMethodAccessorImpl.invoke(DelegatingMethodAccessorImpl.java:43)
	at java.lang.reflect.Method.invoke(Method.java:498)
	at com.carrotsearch.randomizedtesting.RandomizedRunner.invoke(RandomizedRunner.java:1713)
	at com.carrotsearch.randomizedtesting.RandomizedRunner$8.evaluate(RandomizedRunner.java:907)
	at com.carrotsearch.randomizedtesting.RandomizedRunner$9.evaluate(RandomizedRunner.java:943)
	at com.carrotsearch.randomizedtesting.RandomizedRunner$10.evaluate(RandomizedRunner.java:957)
	at com.carrotsearch.randomizedtesting.rules.SystemPropertiesRestoreRule$1.evaluate(SystemPropertiesRestoreRule.java:57)
	at org.apache.lucene.util.TestRuleSetupTeardownChained$1.evaluate(TestRuleSetupTeardownChained.java:49)
	at org.apache.lucene.util.AbstractBeforeAfterRule$1.evaluate(AbstractBeforeAfterRule.java:45)
	at org.apache.lucene.util.TestRuleThreadAndTestName$1.evaluate(TestRuleThreadAndTestName.java:48)
	at org.apache.lucene.util.TestRuleIgnoreAfterMaxFailures$1.evaluate(TestRuleIgnoreAfterMaxFailures.java:64)
	at org.apache.lucene.util.TestRuleMarkFailure$1.evaluate(TestRuleMarkFailure.java:47)
	at com.carrotsearch.randomizedtesting.rules.StatementAdapter.evaluate(StatementAdapter.java:36)
	at com.carrotsearch.randomizedtesting.ThreadLeakControl$StatementRunner.run(ThreadLeakControl.java:368)
	at com.carrotsearch.randomizedtesting.ThreadLeakControl.forkTimeoutingTask(ThreadLeakControl.java:817)
	at com.carrotsearch.randomizedtesting.ThreadLeakControl$3.evaluate(ThreadLeakControl.java:468)
	at com.carrotsearch.randomizedtesting.RandomizedRunner.runSingleTest(RandomizedRunner.java:916)
	at com.carrotsearch.randomizedtesting.RandomizedRunner$5.evaluate(RandomizedRunner.java:802)
	at com.carrotsearch.randomizedtesting.RandomizedRunner$6.evaluate(RandomizedRunner.java:852)
	at com.carrotsearch.randomizedtesting.RandomizedRunner$7.evaluate(RandomizedRunner.java:863)
	at com.carrotsearch.randomizedtesting.rules.StatementAdapter.evaluate(StatementAdapter.java:36)
	at com.carrotsearch.randomizedtesting.rules.SystemPropertiesRestoreRule$1.evaluate(SystemPropertiesRestoreRule.java:57)
	at org.apache.lucene.util.AbstractBeforeAfterRule$1.evaluate(AbstractBeforeAfterRule.java:45)
	at com.carrotsearch.randomizedtesting.rules.StatementAdapter.evaluate(StatementAdapter.java:36)
	at org.apache.lucene.util.TestRuleStoreClassName$1.evaluate(TestRuleStoreClassName.java:41)
	at com.carrotsearch.randomizedtesting.rules.NoShadowingOrOverridesOnMethodsRule$1.evaluate(NoShadowingOrOverridesOnMethodsRule.java:40)
	at com.carrotsearch.randomizedtesting.rules.NoShadowingOrOverridesOnMethodsRule$1.evaluate(NoShadowingOrOverridesOnMethodsRule.java:40)
	at com.carrotsearch.randomizedtesting.rules.StatementAdapter.evaluate(StatementAdapter.java:36)
	at com.carrotsearch.randomizedtesting.rules.StatementAdapter.evaluate(StatementAdapter.java:36)
	at com.carrotsearch.randomizedtesting.rules.StatementAdapter.evaluate(StatementAdapter.java:36)
	at org.apache.lucene.util.TestRuleAssertionsRequired$1.evaluate(TestRuleAssertionsRequired.java:53)
	at org.apache.lucene.util.TestRuleMarkFailure$1.evaluate(TestRuleMarkFailure.java:47)
	at org.apache.lucene.util.TestRuleIgnoreAfterMaxFailures$1.evaluate(TestRuleIgnoreAfterMaxFailures.java:64)
	at org.apache.lucene.util.TestRuleIgnoreTestSuites$1.evaluate(TestRuleIgnoreTestSuites.java:54)
	at com.carrotsearch.randomizedtesting.rules.StatementAdapter.evaluate(StatementAdapter.java:36)
	at com.carrotsearch.randomizedtesting.ThreadLeakControl$StatementRunner.run(ThreadLeakControl.java:368)
	at java.lang.Thread.run(Thread.java:748)


FAILED:  org.apache.solr.cloud.LeaderElectionContextKeyTest.test

Error Message:


Stack Trace:
java.lang.AssertionError
	at __randomizedtesting.SeedInfo.seed([2DBE584676D8550C:A5EA679CD82438F4]:0)
	at org.junit.Assert.fail(Assert.java:92)
	at org.junit.Assert.assertTrue(Assert.java:43)
	at org.junit.Assert.assertTrue(Assert.java:54)
	at org.apache.solr.cloud.LeaderElectionContextKeyTest.test(LeaderElectionContextKeyTest.java:88)
	at sun.reflect.NativeMethodAccessorImpl.invoke0(Native Method)
	at sun.reflect.NativeMethodAccessorImpl.invoke(NativeMethodAccessorImpl.java:62)
	at sun.reflect.DelegatingMethodAccessorImpl.invoke(DelegatingMethodAccessorImpl.java:43)
	at java.lang.reflect.Method.invoke(Method.java:498)
	at com.carrotsearch.randomizedtesting.RandomizedRunner.invoke(RandomizedRunner.java:1713)
	at com.carrotsearch.randomizedtesting.RandomizedRunner$8.evaluate(RandomizedRunner.java:907)
	at com.carrotsearch.randomizedtesting.RandomizedRunner$9.evaluate(RandomizedRunner.java:943)
	at com.carrotsearch.randomizedtesting.RandomizedRunner$10.evaluate(RandomizedRunner.java:957)
	at com.carrotsearch.randomizedtesting.rules.SystemPropertiesRestoreRule$1.evaluate(SystemPropertiesRestoreRule.java:57)
	at org.apache.lucene.util.TestRuleSetupTeardownChained$1.evaluate(TestRuleSetupTeardownChained.java:49)
	at org.apache.lucene.util.AbstractBeforeAfterRule$1.evaluate(AbstractBeforeAfterRule.java:45)
	at org.apache.lucene.util.TestRuleThreadAndTestName$1.evaluate(TestRuleThreadAndTestName.java:48)
	at org.apache.lucene.util.TestRuleIgnoreAfterMaxFailures$1.evaluate(TestRuleIgnoreAfterMaxFailures.java:64)
	at org.apache.lucene.util.TestRuleMarkFailure$1.evaluate(TestRuleMarkFailure.java:47)
	at com.carrotsearch.randomizedtesting.rules.StatementAdapter.evaluate(StatementAdapter.java:36)
	at com.carrotsearch.randomizedtesting.ThreadLeakControl$StatementRunner.run(ThreadLeakControl.java:368)
	at com.carrotsearch.randomizedtesting.ThreadLeakControl.forkTimeoutingTask(ThreadLeakControl.java:817)
	at com.carrotsearch.randomizedtesting.ThreadLeakControl$3.evaluate(ThreadLeakControl.java:468)
	at com.carrotsearch.randomizedtesting.RandomizedRunner.runSingleTest(RandomizedRunner.java:916)
	at com.carrotsearch.randomizedtesting.RandomizedRunner$5.evaluate(RandomizedRunner.java:802)
	at com.carrotsearch.randomizedtesting.RandomizedRunner$6.evaluate(RandomizedRunner.java:852)
	at com.carrotsearch.randomizedtesting.RandomizedRunner$7.evaluate(RandomizedRunner.java:863)
	at com.carrotsearch.randomizedtesting.rules.StatementAdapter.evaluate(StatementAdapter.java:36)
	at com.carrotsearch.randomizedtesting.rules.SystemPropertiesRestoreRule$1.evaluate(SystemPropertiesRestoreRule.java:57)
	at org.apache.lucene.util.AbstractBeforeAfterRule$1.evaluate(AbstractBeforeAfterRule.java:45)
	at com.carrotsearch.randomizedtesting.rules.StatementAdapter.evaluate(StatementAdapter.java:36)
	at org.apache.lucene.util.TestRuleStoreClassName$1.evaluate(TestRuleStoreClassName.java:41)
	at com.carrotsearch.randomizedtesting.rules.NoShadowingOrOverridesOnMethodsRule$1.evaluate(NoShadowingOrOverridesOnMethodsRule.java:40)
	at com.carrotsearch.randomizedtesting.rules.NoShadowingOrOverridesOnMethodsRule$1.evaluate(NoShadowingOrOverridesOnMethodsRule.java:40)
	at com.carrotsearch.randomizedtesting.rules.StatementAdapter.evaluate(StatementAdapter.java:36)
	at com.carrotsearch.randomizedtesting.rules.StatementAdapter.evaluate(StatementAdapter.java:36)
	at com.carrotsearch.randomizedtesting.rules.StatementAdapter.evaluate(StatementAdapter.java:36)
	at org.apache.lucene.util.TestRuleAssertionsRequired$1.evaluate(TestRuleAssertionsRequired.java:53)
	at org.apache.lucene.util.TestRuleMarkFailure$1.evaluate(TestRuleMarkFailure.java:47)
	at org.apache.lucene.util.TestRuleIgnoreAfterMaxFailures$1.evaluate(TestRuleIgnoreAfterMaxFailures.java:64)
	at org.apache.lucene.util.TestRuleIgnoreTestSuites$1.evaluate(TestRuleIgnoreTestSuites.java:54)
	at com.carrotsearch.randomizedtesting.rules.StatementAdapter.evaluate(StatementAdapter.java:36)
	at com.carrotsearch.randomizedtesting.ThreadLeakControl$StatementRunner.run(ThreadLeakControl.java:368)
	at java.lang.Thread.run(Thread.java:748)


FAILED:  junit.framework.TestSuite.org.apache.solr.cloud.TestCloudRecovery

Error Message:
Could not remove the following files (in the order of attempts):    C:\Users\jenkins\workspace\Lucene-Solr-7.x-Windows\solr\build\solr-core\test\J1\temp\solr.cloud.TestCloudRecovery_2DBE584676D8550C-001\tempDir-001\node1\collection1_shard2_replica_n6\data\tlog\tlog.0000000000000000001: java.nio.file.FileSystemException: C:\Users\jenkins\workspace\Lucene-Solr-7.x-Windows\solr\build\solr-core\test\J1\temp\solr.cloud.TestCloudRecovery_2DBE584676D8550C-001\tempDir-001\node1\collection1_shard2_replica_n6\data\tlog\tlog.0000000000000000001: The process cannot access the file because it is being used by another process.     C:\Users\jenkins\workspace\Lucene-Solr-7.x-Windows\solr\build\solr-core\test\J1\temp\solr.cloud.TestCloudRecovery_2DBE584676D8550C-001\tempDir-001\node1\collection1_shard2_replica_n6\data\tlog: java.nio.file.DirectoryNotEmptyException: C:\Users\jenkins\workspace\Lucene-Solr-7.x-Windows\solr\build\solr-core\test\J1\temp\solr.cloud.TestCloudRecovery_2DBE584676D8550C-001\tempDir-001\node1\collection1_shard2_replica_n6\data\tlog    C:\Users\jenkins\workspace\Lucene-Solr-7.x-Windows\solr\build\solr-core\test\J1\temp\solr.cloud.TestCloudRecovery_2DBE584676D8550C-001\tempDir-001\node1\collection1_shard2_replica_n6\data: java.nio.file.DirectoryNotEmptyException: C:\Users\jenkins\workspace\Lucene-Solr-7.x-Windows\solr\build\solr-core\test\J1\temp\solr.cloud.TestCloudRecovery_2DBE584676D8550C-001\tempDir-001\node1\collection1_shard2_replica_n6\data    C:\Users\jenkins\workspace\Lucene-Solr-7.x-Windows\solr\build\solr-core\test\J1\temp\solr.cloud.TestCloudRecovery_2DBE584676D8550C-001\tempDir-001\node1\collection1_shard2_replica_n6: java.nio.file.DirectoryNotEmptyException: C:\Users\jenkins\workspace\Lucene-Solr-7.x-Windows\solr\build\solr-core\test\J1\temp\solr.cloud.TestCloudRecovery_2DBE584676D8550C-001\tempDir-001\node1\collection1_shard2_replica_n6    C:\Users\jenkins\workspace\Lucene-Solr-7.x-Windows\solr\build\solr-core\test\J1\temp\solr.cloud.TestCloudRecovery_2DBE584676D8550C-001\tempDir-001\node1\collection1_shard1_replica_n2\data\tlog\tlog.0000000000000000001: java.nio.file.FileSystemException: C:\Users\jenkins\workspace\Lucene-Solr-7.x-Windows\solr\build\solr-core\test\J1\temp\solr.cloud.TestCloudRecovery_2DBE584676D8550C-001\tempDir-001\node1\collection1_shard1_replica_n2\data\tlog\tlog.0000000000000000001: The process cannot access the file because it is being used by another process.     C:\Users\jenkins\workspace\Lucene-Solr-7.x-Windows\solr\build\solr-core\test\J1\temp\solr.cloud.TestCloudRecovery_2DBE584676D8550C-001\tempDir-001\node1\collection1_shard1_replica_n2\data\tlog: java.nio.file.DirectoryNotEmptyException: C:\Users\jenkins\workspace\Lucene-Solr-7.x-Windows\solr\build\solr-core\test\J1\temp\solr.cloud.TestCloudRecovery_2DBE584676D8550C-001\tempDir-001\node1\collection1_shard1_replica_n2\data\tlog    C:\Users\jenkins\workspace\Lucene-Solr-7.x-Windows\solr\build\solr-core\test\J1\temp\solr.cloud.TestCloudRecovery_2DBE584676D8550C-001\tempDir-001\node1\collection1_shard1_replica_n2\data: java.nio.file.DirectoryNotEmptyException: C:\Users\jenkins\workspace\Lucene-Solr-7.x-Windows\solr\build\solr-core\test\J1\temp\solr.cloud.TestCloudRecovery_2DBE584676D8550C-001\tempDir-001\node1\collection1_shard1_replica_n2\data    C:\Users\jenkins\workspace\Lucene-Solr-7.x-Windows\solr\build\solr-core\test\J1\temp\solr.cloud.TestCloudRecovery_2DBE584676D8550C-001\tempDir-001\node1\collection1_shard1_replica_n2: java.nio.file.DirectoryNotEmptyException: C:\Users\jenkins\workspace\Lucene-Solr-7.x-Windows\solr\build\solr-core\test\J1\temp\solr.cloud.TestCloudRecovery_2DBE584676D8550C-001\tempDir-001\node1\collection1_shard1_replica_n2    C:\Users\jenkins\workspace\Lucene-Solr-7.x-Windows\solr\build\solr-core\test\J1\temp\solr.cloud.TestCloudRecovery_2DBE584676D8550C-001\tempDir-001\node1: java.nio.file.DirectoryNotEmptyException: C:\Users\jenkins\workspace\Lucene-Solr-7.x-Windows\solr\build\solr-core\test\J1\temp\solr.cloud.TestCloudRecovery_2DBE584676D8550C-001\tempDir-001\node1    C:\Users\jenkins\workspace\Lucene-Solr-7.x-Windows\solr\build\solr-core\test\J1\temp\solr.cloud.TestCloudRecovery_2DBE584676D8550C-001\tempDir-001\node2\collection1_shard2_replica_n4\data\tlog\tlog.0000000000000000001: java.nio.file.FileSystemException: C:\Users\jenkins\workspace\Lucene-Solr-7.x-Windows\solr\build\solr-core\test\J1\temp\solr.cloud.TestCloudRecovery_2DBE584676D8550C-001\tempDir-001\node2\collection1_shard2_replica_n4\data\tlog\tlog.0000000000000000001: The process cannot access the file because it is being used by another process.     C:\Users\jenkins\workspace\Lucene-Solr-7.x-Windows\solr\build\solr-core\test\J1\temp\solr.cloud.TestCloudRecovery_2DBE584676D8550C-001\tempDir-001\node2\collection1_shard2_replica_n4\data\tlog: java.nio.file.DirectoryNotEmptyException: C:\Users\jenkins\workspace\Lucene-Solr-7.x-Windows\solr\build\solr-core\test\J1\temp\solr.cloud.TestCloudRecovery_2DBE584676D8550C-001\tempDir-001\node2\collection1_shard2_replica_n4\data\tlog    C:\Users\jenkins\workspace\Lucene-Solr-7.x-Windows\solr\build\solr-core\test\J1\temp\solr.cloud.TestCloudRecovery_2DBE584676D8550C-001\tempDir-001\node2\collection1_shard2_replica_n4\data: java.nio.file.DirectoryNotEmptyException: C:\Users\jenkins\workspace\Lucene-Solr-7.x-Windows\solr\build\solr-core\test\J1\temp\solr.cloud.TestCloudRecovery_2DBE584676D8550C-001\tempDir-001\node2\collection1_shard2_replica_n4\data    C:\Users\jenkins\workspace\Lucene-Solr-7.x-Windows\solr\build\solr-core\test\J1\temp\solr.cloud.TestCloudRecovery_2DBE584676D8550C-001\tempDir-001\node2\collection1_shard2_replica_n4: java.nio.file.DirectoryNotEmptyException: C:\Users\jenkins\workspace\Lucene-Solr-7.x-Windows\solr\build\solr-core\test\J1\temp\solr.cloud.TestCloudRecovery_2DBE584676D8550C-001\tempDir-001\node2\collection1_shard2_replica_n4    C:\Users\jenkins\workspace\Lucene-Solr-7.x-Windows\solr\build\solr-core\test\J1\temp\solr.cloud.TestCloudRecovery_2DBE584676D8550C-001\tempDir-001\node2\collection1_shard1_replica_n1\data\tlog\tlog.0000000000000000001: java.nio.file.FileSystemException: C:\Users\jenkins\workspace\Lucene-Solr-7.x-Windows\solr\build\solr-core\test\J1\temp\solr.cloud.TestCloudRecovery_2DBE584676D8550C-001\tempDir-001\node2\collection1_shard1_replica_n1\data\tlog\tlog.0000000000000000001: The process cannot access the file because it is being used by another process.     C:\Users\jenkins\workspace\Lucene-Solr-7.x-Windows\solr\build\solr-core\test\J1\temp\solr.cloud.TestCloudRecovery_2DBE584676D8550C-001\tempDir-001\node2\collection1_shard1_replica_n1\data\tlog: java.nio.file.DirectoryNotEmptyException: C:\Users\jenkins\workspace\Lucene-Solr-7.x-Windows\solr\build\solr-core\test\J1\temp\solr.cloud.TestCloudRecovery_2DBE584676D8550C-001\tempDir-001\node2\collection1_shard1_replica_n1\data\tlog    C:\Users\jenkins\workspace\Lucene-Solr-7.x-Windows\solr\build\solr-core\test\J1\temp\solr.cloud.TestCloudRecovery_2DBE584676D8550C-001\tempDir-001\node2\collection1_shard1_replica_n1\data: java.nio.file.DirectoryNotEmptyException: C:\Users\jenkins\workspace\Lucene-Solr-7.x-Windows\solr\build\solr-core\test\J1\temp\solr.cloud.TestCloudRecovery_2DBE584676D8550C-001\tempDir-001\node2\collection1_shard1_replica_n1\data    C:\Users\jenkins\workspace\Lucene-Solr-7.x-Windows\solr\build\solr-core\test\J1\temp\solr.cloud.TestCloudRecovery_2DBE584676D8550C-001\tempDir-001\node2\collection1_shard1_replica_n1: java.nio.file.DirectoryNotEmptyException: C:\Users\jenkins\workspace\Lucene-Solr-7.x-Windows\solr\build\solr-core\test\J1\temp\solr.cloud.TestCloudRecovery_2DBE584676D8550C-001\tempDir-001\node2\collection1_shard1_replica_n1    C:\Users\jenkins\workspace\Lucene-Solr-7.x-Windows\solr\build\solr-core\test\J1\temp\solr.cloud.TestCloudRecovery_2DBE584676D8550C-001\tempDir-001\node2: java.nio.file.DirectoryNotEmptyException: C:\Users\jenkins\workspace\Lucene-Solr-7.x-Windows\solr\build\solr-core\test\J1\temp\solr.cloud.TestCloudRecovery_2DBE584676D8550C-001\tempDir-001\node2    C:\Users\jenkins\workspace\Lucene-Solr-7.x-Windows\solr\build\solr-core\test\J1\temp\solr.cloud.TestCloudRecovery_2DBE584676D8550C-001\tempDir-001: java.nio.file.DirectoryNotEmptyException: C:\Users\jenkins\workspace\Lucene-Solr-7.x-Windows\solr\build\solr-core\test\J1\temp\solr.cloud.TestCloudRecovery_2DBE584676D8550C-001\tempDir-001    C:\Users\jenkins\workspace\Lucene-Solr-7.x-Windows\solr\build\solr-core\test\J1\temp\solr.cloud.TestCloudRecovery_2DBE584676D8550C-001: java.nio.file.DirectoryNotEmptyException: C:\Users\jenkins\workspace\Lucene-Solr-7.x-Windows\solr\build\solr-core\test\J1\temp\solr.cloud.TestCloudRecovery_2DBE584676D8550C-001 

Stack Trace:
java.io.IOException: Could not remove the following files (in the order of attempts):
   C:\Users\jenkins\workspace\Lucene-Solr-7.x-Windows\solr\build\solr-core\test\J1\temp\solr.cloud.TestCloudRecovery_2DBE584676D8550C-001\tempDir-001\node1\collection1_shard2_replica_n6\data\tlog\tlog.0000000000000000001: java.nio.file.FileSystemException: C:\Users\jenkins\workspace\Lucene-Solr-7.x-Windows\solr\build\solr-core\test\J1\temp\solr.cloud.TestCloudRecovery_2DBE584676D8550C-001\tempDir-001\node1\collection1_shard2_replica_n6\data\tlog\tlog.0000000000000000001: The process cannot access the file because it is being used by another process.

   C:\Users\jenkins\workspace\Lucene-Solr-7.x-Windows\solr\build\solr-core\test\J1\temp\solr.cloud.TestCloudRecovery_2DBE584676D8550C-001\tempDir-001\node1\collection1_shard2_replica_n6\data\tlog: java.nio.file.DirectoryNotEmptyException: C:\Users\jenkins\workspace\Lucene-Solr-7.x-Windows\solr\build\solr-core\test\J1\temp\solr.cloud.TestCloudRecovery_2DBE584676D8550C-001\tempDir-001\node1\collection1_shard2_replica_n6\data\tlog
   C:\Users\jenkins\workspace\Lucene-Solr-7.x-Windows\solr\build\solr-core\test\J1\temp\solr.cloud.TestCloudRecovery_2DBE584676D8550C-001\tempDir-001\node1\collection1_shard2_replica_n6\data: java.nio.file.DirectoryNotEmptyException: C:\Users\jenkins\workspace\Lucene-Solr-7.x-Windows\solr\build\solr-core\test\J1\temp\solr.cloud.TestCloudRecovery_2DBE584676D8550C-001\tempDir-001\node1\collection1_shard2_replica_n6\data
   C:\Users\jenkins\workspace\Lucene-Solr-7.x-Windows\solr\build\solr-core\test\J1\temp\solr.cloud.TestCloudRecovery_2DBE584676D8550C-001\tempDir-001\node1\collection1_shard2_replica_n6: java.nio.file.DirectoryNotEmptyException: C:\Users\jenkins\workspace\Lucene-Solr-7.x-Windows\solr\build\solr-core\test\J1\temp\solr.cloud.TestCloudRecovery_2DBE584676D8550C-001\tempDir-001\node1\collection1_shard2_replica_n6
   C:\Users\jenkins\workspace\Lucene-Solr-7.x-Windows\solr\build\solr-core\test\J1\temp\solr.cloud.TestCloudRecovery_2DBE584676D8550C-001\tempDir-001\node1\collection1_shard1_replica_n2\data\tlog\tlog.0000000000000000001: java.nio.file.FileSystemException: C:\Users\jenkins\workspace\Lucene-Solr-7.x-Windows\solr\build\solr-core\test\J1\temp\solr.cloud.TestCloudRecovery_2DBE584676D8550C-001\tempDir-001\node1\collection1_shard1_replica_n2\data\tlog\tlog.0000000000000000001: The process cannot access the file because it is being used by another process.

   C:\Users\jenkins\workspace\Lucene-Solr-7.x-Windows\solr\build\solr-core\test\J1\temp\solr.cloud.TestCloudRecovery_2DBE584676D8550C-001\tempDir-001\node1\collection1_shard1_replica_n2\data\tlog: java.nio.file.DirectoryNotEmptyException: C:\Users\jenkins\workspace\Lucene-Solr-7.x-Windows\solr\build\solr-core\test\J1\temp\solr.cloud.TestCloudRecovery_2DBE584676D8550C-001\tempDir-001\node1\collection1_shard1_replica_n2\data\tlog
   C:\Users\jenkins\workspace\Lucene-Solr-7.x-Windows\solr\build\solr-core\test\J1\temp\solr.cloud.TestCloudRecovery_2DBE584676D8550C-001\tempDir-001\node1\collection1_shard1_replica_n2\data: java.nio.file.DirectoryNotEmptyException: C:\Users\jenkins\workspace\Lucene-Solr-7.x-Windows\solr\build\solr-core\test\J1\temp\solr.cloud.TestCloudRecovery_2DBE584676D8550C-001\tempDir-001\node1\collection1_shard1_replica_n2\data
   C:\Users\jenkins\workspace\Lucene-Solr-7.x-Windows\solr\build\solr-core\test\J1\temp\solr.cloud.TestCloudRecovery_2DBE584676D8550C-001\tempDir-001\node1\collection1_shard1_replica_n2: java.nio.file.DirectoryNotEmptyException: C:\Users\jenkins\workspace\Lucene-Solr-7.x-Windows\solr\build\solr-core\test\J1\temp\solr.cloud.TestCloudRecovery_2DBE584676D8550C-001\tempDir-001\node1\collection1_shard1_replica_n2
   C:\Users\jenkins\workspace\Lucene-Solr-7.x-Windows\solr\build\solr-core\test\J1\temp\solr.cloud.TestCloudRecovery_2DBE584676D8550C-001\tempDir-001\node1: java.nio.file.DirectoryNotEmptyException: C:\Users\jenkins\workspace\Lucene-Solr-7.x-Windows\solr\build\solr-core\test\J1\temp\solr.cloud.TestCloudRecovery_2DBE584676D8550C-001\tempDir-001\node1
   C:\Users\jenkins\workspace\Lucene-Solr-7.x-Windows\solr\build\solr-core\test\J1\temp\solr.cloud.TestCloudRecovery_2DBE584676D8550C-001\tempDir-001\node2\collection1_shard2_replica_n4\data\tlog\tlog.0000000000000000001: java.nio.file.FileSystemException: C:\Users\jenkins\workspace\Lucene-Solr-7.x-Windows\solr\build\solr-core\test\J1\temp\solr.cloud.TestCloudRecovery_2DBE584676D8550C-001\tempDir-001\node2\collection1_shard2_replica_n4\data\tlog\tlog.0000000000000000001: The process cannot access the file because it is being used by another process.

   C:\Users\jenkins\workspace\Lucene-Solr-7.x-Windows\solr\build\solr-core\test\J1\temp\solr.cloud.TestCloudRecovery_2DBE584676D8550C-001\tempDir-001\node2\collection1_shard2_replica_n4\data\tlog: java.nio.file.DirectoryNotEmptyException: C:\Users\jenkins\workspace\Lucene-Solr-7.x-Windows\solr\build\solr-core\test\J1\temp\solr.cloud.TestCloudRecovery_2DBE584676D8550C-001\tempDir-001\node2\collection1_shard2_replica_n4\data\tlog
   C:\Users\jenkins\workspace\Lucene-Solr-7.x-Windows\solr\build\solr-core\test\J1\temp\solr.cloud.TestCloudRecovery_2DBE584676D8550C-001\tempDir-001\node2\collection1_shard2_replica_n4\data: java.nio.file.DirectoryNotEmptyException: C:\Users\jenkins\workspace\Lucene-Solr-7.x-Windows\solr\build\solr-core\test\J1\temp\solr.cloud.TestCloudRecovery_2DBE584676D8550C-001\tempDir-001\node2\collection1_shard2_replica_n4\data
   C:\Users\jenkins\workspace\Lucene-Solr-7.x-Windows\solr\build\solr-core\test\J1\temp\solr.cloud.TestCloudRecovery_2DBE584676D8550C-001\tempDir-001\node2\collection1_shard2_replica_n4: java.nio.file.DirectoryNotEmptyException: C:\Users\jenkins\workspace\Lucene-Solr-7.x-Windows\solr\build\solr-core\test\J1\temp\solr.cloud.TestCloudRecovery_2DBE584676D8550C-001\tempDir-001\node2\collection1_shard2_replica_n4
   C:\Users\jenkins\workspace\Lucene-Solr-7.x-Windows\solr\build\solr-core\test\J1\temp\solr.cloud.TestCloudRecovery_2DBE584676D8550C-001\tempDir-001\node2\collection1_shard1_replica_n1\data\tlog\tlog.0000000000000000001: java.nio.file.FileSystemException: C:\Users\jenkins\workspace\Lucene-Solr-7.x-Windows\solr\build\solr-core\test\J1\temp\solr.cloud.TestCloudRecovery_2DBE584676D8550C-001\tempDir-001\node2\collection1_shard1_replica_n1\data\tlog\tlog.0000000000000000001: The process cannot access the file because it is being used by another process.

   C:\Users\jenkins\workspace\Lucene-Solr-7.x-Windows\solr\build\solr-core\test\J1\temp\solr.cloud.TestCloudRecovery_2DBE584676D8550C-001\tempDir-001\node2\collection1_shard1_replica_n1\data\tlog: java.nio.file.DirectoryNotEmptyException: C:\Users\jenkins\workspace\Lucene-Solr-7.x-Windows\solr\build\solr-core\test\J1\temp\solr.cloud.TestCloudRecovery_2DBE584676D8550C-001\tempDir-001\node2\collection1_shard1_replica_n1\data\tlog
   C:\Users\jenkins\workspace\Lucene-Solr-7.x-Windows\solr\build\solr-core\test\J1\temp\solr.cloud.TestCloudRecovery_2DBE584676D8550C-001\tempDir-001\node2\collection1_shard1_replica_n1\data: java.nio.file.DirectoryNotEmptyException: C:\Users\jenkins\workspace\Lucene-Solr-7.x-Windows\solr\build\solr-core\test\J1\temp\solr.cloud.TestCloudRecovery_2DBE584676D8550C-001\tempDir-001\node2\collection1_shard1_replica_n1\data
   C:\Users\jenkins\workspace\Lucene-Solr-7.x-Windows\solr\build\solr-core\test\J1\temp\solr.cloud.TestCloudRecovery_2DBE584676D8550C-001\tempDir-001\node2\collection1_shard1_replica_n1: java.nio.file.DirectoryNotEmptyException: C:\Users\jenkins\workspace\Lucene-Solr-7.x-Windows\solr\build\solr-core\test\J1\temp\solr.cloud.TestCloudRecovery_2DBE584676D8550C-001\tempDir-001\node2\collection1_shard1_replica_n1
   C:\Users\jenkins\workspace\Lucene-Solr-7.x-Windows\solr\build\solr-core\test\J1\temp\solr.cloud.TestCloudRecovery_2DBE584676D8550C-001\tempDir-001\node2: java.nio.file.DirectoryNotEmptyException: C:\Users\jenkins\workspace\Lucene-Solr-7.x-Windows\solr\build\solr-core\test\J1\temp\solr.cloud.TestCloudRecovery_2DBE584676D8550C-001\tempDir-001\node2
   C:\Users\jenkins\workspace\Lucene-Solr-7.x-Windows\solr\build\solr-core\test\J1\temp\solr.cloud.TestCloudRecovery_2DBE584676D8550C-001\tempDir-001: java.nio.file.DirectoryNotEmptyException: C:\Users\jenkins\workspace\Lucene-Solr-7.x-Windows\solr\build\solr-core\test\J1\temp\solr.cloud.TestCloudRecovery_2DBE584676D8550C-001\tempDir-001
   C:\Users\jenkins\workspace\Lucene-Solr-7.x-Windows\solr\build\solr-core\test\J1\temp\solr.cloud.TestCloudRecovery_2DBE584676D8550C-001: java.nio.file.DirectoryNotEmptyException: C:\Users\jenkins\workspace\Lucene-Solr-7.x-Windows\solr\build\solr-core\test\J1\temp\solr.cloud.TestCloudRecovery_2DBE584676D8550C-001

	at __randomizedtesting.SeedInfo.seed([2DBE584676D8550C]:0)
	at org.apache.lucene.util.IOUtils.rm(IOUtils.java:329)
	at org.apache.lucene.util.TestRuleTemporaryFilesCleanup.afterAlways(TestRuleTemporaryFilesCleanup.java:216)
	at com.carrotsearch.randomizedtesting.rules.TestRuleAdapter$1.afterAlways(TestRuleAdapter.java:31)
	at com.carrotsearch.randomizedtesting.rules.StatementAdapter.evaluate(StatementAdapter.java:43)
	at com.carrotsearch.randomizedtesting.rules.StatementAdapter.evaluate(StatementAdapter.java:36)
	at org.apache.lucene.util.TestRuleAssertionsRequired$1.evaluate(TestRuleAssertionsRequired.java:53)
	at org.apache.lucene.util.TestRuleMarkFailure$1.evaluate(TestRuleMarkFailure.java:47)
	at org.apache.lucene.util.TestRuleIgnoreAfterMaxFailures$1.evaluate(TestRuleIgnoreAfterMaxFailures.java:64)
	at org.apache.lucene.util.TestRuleIgnoreTestSuites$1.evaluate(TestRuleIgnoreTestSuites.java:54)
	at com.carrotsearch.randomizedtesting.rules.StatementAdapter.evaluate(StatementAdapter.java:36)
	at com.carrotsearch.randomizedtesting.ThreadLeakControl$StatementRunner.run(ThreadLeakControl.java:368)
	at java.lang.Thread.run(Thread.java:748)


FAILED:  org.apache.solr.request.TestFaceting.testFacetSortWithMinCount

Error Message:
Exception during query

Stack Trace:
java.lang.RuntimeException: Exception during query
	at __randomizedtesting.SeedInfo.seed([2DBE584676D8550C:A6B557D1DD1F7FCA]:0)
	at org.apache.solr.SolrTestCaseJ4.assertQ(SolrTestCaseJ4.java:886)
	at org.apache.solr.SolrTestCaseJ4.assertQ(SolrTestCaseJ4.java:846)
	at org.apache.solr.request.TestFaceting.testFacetSortWithMinCount(TestFaceting.java:312)
	at sun.reflect.NativeMethodAccessorImpl.invoke0(Native Method)
	at sun.reflect.NativeMethodAccessorImpl.invoke(NativeMethodAccessorImpl.java:62)
	at sun.reflect.DelegatingMethodAccessorImpl.invoke(DelegatingMethodAccessorImpl.java:43)
	at java.lang.reflect.Method.invoke(Method.java:498)
	at com.carrotsearch.randomizedtesting.RandomizedRunner.invoke(RandomizedRunner.java:1713)
	at com.carrotsearch.randomizedtesting.RandomizedRunner$8.evaluate(RandomizedRunner.java:907)
	at com.carrotsearch.randomizedtesting.RandomizedRunner$9.evaluate(RandomizedRunner.java:943)
	at com.carrotsearch.randomizedtesting.RandomizedRunner$10.evaluate(RandomizedRunner.java:957)
	at com.carrotsearch.randomizedtesting.rules.SystemPropertiesRestoreRule$1.evaluate(SystemPropertiesRestoreRule.java:57)
	at org.apache.lucene.util.TestRuleSetupTeardownChained$1.evaluate(TestRuleSetupTeardownChained.java:49)
	at org.apache.lucene.util.AbstractBeforeAfterRule$1.evaluate(AbstractBeforeAfterRule.java:45)
	at org.apache.lucene.util.TestRuleThreadAndTestName$1.evaluate(TestRuleThreadAndTestName.java:48)
	at org.apache.lucene.util.TestRuleIgnoreAfterMaxFailures$1.evaluate(TestRuleIgnoreAfterMaxFailures.java:64)
	at org.apache.lucene.util.TestRuleMarkFailure$1.evaluate(TestRuleMarkFailure.java:47)
	at com.carrotsearch.randomizedtesting.rules.StatementAdapter.evaluate(StatementAdapter.java:36)
	at com.carrotsearch.randomizedtesting.ThreadLeakControl$StatementRunner.run(ThreadLeakControl.java:368)
	at com.carrotsearch.randomizedtesting.ThreadLeakControl.forkTimeoutingTask(ThreadLeakControl.java:817)
	at com.carrotsearch.randomizedtesting.ThreadLeakControl$3.evaluate(ThreadLeakControl.java:468)
	at com.carrotsearch.randomizedtesting.RandomizedRunner.runSingleTest(RandomizedRunner.java:916)
	at com.carrotsearch.randomizedtesting.RandomizedRunner$5.evaluate(RandomizedRunner.java:802)
	at com.carrotsearch.randomizedtesting.RandomizedRunner$6.evaluate(RandomizedRunner.java:852)
	at com.carrotsearch.randomizedtesting.RandomizedRunner$7.evaluate(RandomizedRunner.java:863)
	at com.carrotsearch.randomizedtesting.rules.StatementAdapter.evaluate(StatementAdapter.java:36)
	at com.carrotsearch.randomizedtesting.rules.SystemPropertiesRestoreRule$1.evaluate(SystemPropertiesRestoreRule.java:57)
	at org.apache.lucene.util.AbstractBeforeAfterRule$1.evaluate(AbstractBeforeAfterRule.java:45)
	at com.carrotsearch.randomizedtesting.rules.StatementAdapter.evaluate(StatementAdapter.java:36)
	at org.apache.lucene.util.TestRuleStoreClassName$1.evaluate(TestRuleStoreClassName.java:41)
	at com.carrotsearch.randomizedtesting.rules.NoShadowingOrOverridesOnMethodsRule$1.evaluate(NoShadowingOrOverridesOnMethodsRule.java:40)
	at com.carrotsearch.randomizedtesting.rules.NoShadowingOrOverridesOnMethodsRule$1.evaluate(NoShadowingOrOverridesOnMethodsRule.java:40)
	at com.carrotsearch.randomizedtesting.rules.StatementAdapter.evaluate(StatementAdapter.java:36)
	at com.carrotsearch.randomizedtesting.rules.StatementAdapter.evaluate(StatementAdapter.java:36)
	at com.carrotsearch.randomizedtesting.rules.StatementAdapter.evaluate(StatementAdapter.java:36)
	at org.apache.lucene.util.TestRuleAssertionsRequired$1.evaluate(TestRuleAssertionsRequired.java:53)
	at org.apache.lucene.util.TestRuleMarkFailure$1.evaluate(TestRuleMarkFailure.java:47)
	at org.apache.lucene.util.TestRuleIgnoreAfterMaxFailures$1.evaluate(TestRuleIgnoreAfterMaxFailures.java:64)
	at org.apache.lucene.util.TestRuleIgnoreTestSuites$1.evaluate(TestRuleIgnoreTestSuites.java:54)
	at com.carrotsearch.randomizedtesting.rules.StatementAdapter.evaluate(StatementAdapter.java:36)
	at com.carrotsearch.randomizedtesting.ThreadLeakControl$StatementRunner.run(ThreadLeakControl.java:368)
	at java.lang.Thread.run(Thread.java:748)
Caused by: org.apache.solr.common.SolrException: Cannot use facet.mincount=0 on field f_td which is Points-based
	at org.apache.solr.request.NumericFacets.getCountsSingleValue(NumericFacets.java:184)
	at org.apache.solr.request.NumericFacets.getCounts(NumericFacets.java:170)
	at org.apache.solr.request.SimpleFacets.getTermCounts(SimpleFacets.java:499)
	at org.apache.solr.request.SimpleFacets.getTermCounts(SimpleFacets.java:405)
	at org.apache.solr.request.SimpleFacets.lambda$getFacetFieldCounts$0(SimpleFacets.java:803)
	at java.util.concurrent.FutureTask.run(FutureTask.java:266)
	at org.apache.solr.request.SimpleFacets$3.execute(SimpleFacets.java:742)
	at org.apache.solr.request.SimpleFacets.getFacetFieldCounts(SimpleFacets.java:818)
	at org.apache.solr.handler.component.FacetComponent.getFacetCounts(FacetComponent.java:329)
	at org.apache.solr.handler.component.FacetComponent.process(FacetComponent.java:273)
	at org.apache.solr.handler.component.SearchHandler.handleRequestBody(SearchHandler.java:295)
	at org.apache.solr.handler.RequestHandlerBase.handleRequest(RequestHandlerBase.java:177)
	at org.apache.solr.core.SolrCore.execute(SolrCore.java:2473)
	at org.apache.solr.util.TestHarness.query(TestHarness.java:337)
	at org.apache.solr.util.TestHarness.query(TestHarness.java:319)
	at org.apache.solr.SolrTestCaseJ4.assertQ(SolrTestCaseJ4.java:860)
	... 41 more


FAILED:  org.apache.solr.request.TestWriterPerf.testPerf

Error Message:
Cannot use facet.mincount=0 on field f_i which is Points-based

Stack Trace:
org.apache.solr.common.SolrException: Cannot use facet.mincount=0 on field f_i which is Points-based
	at __randomizedtesting.SeedInfo.seed([2DBE584676D8550C:C89B9C11E567E3D]:0)
	at org.apache.solr.request.NumericFacets.getCountsSingleValue(NumericFacets.java:184)
	at org.apache.solr.request.NumericFacets.getCounts(NumericFacets.java:170)
	at org.apache.solr.request.SimpleFacets.getTermCounts(SimpleFacets.java:499)
	at org.apache.solr.request.SimpleFacets.getTermCounts(SimpleFacets.java:405)
	at org.apache.solr.request.SimpleFacets.lambda$getFacetFieldCounts$0(SimpleFacets.java:803)
	at java.util.concurrent.FutureTask.run(FutureTask.java:266)
	at org.apache.solr.request.SimpleFacets$3.execute(SimpleFacets.java:742)
	at org.apache.solr.request.SimpleFacets.getFacetFieldCounts(SimpleFacets.java:818)
	at org.apache.solr.handler.component.FacetComponent.getFacetCounts(FacetComponent.java:329)
	at org.apache.solr.handler.component.FacetComponent.process(FacetComponent.java:273)
	at org.apache.solr.handler.component.SearchHandler.handleRequestBody(SearchHandler.java:295)
	at org.apache.solr.handler.RequestHandlerBase.handleRequest(RequestHandlerBase.java:177)
	at org.apache.solr.core.SolrCore.execute(SolrCore.java:2473)
	at org.apache.solr.request.TestWriterPerf.getResponse(TestWriterPerf.java:98)
	at org.apache.solr.request.TestWriterPerf.doPerf(TestWriterPerf.java:107)
	at org.apache.solr.request.TestWriterPerf.testPerf(TestWriterPerf.java:180)
	at sun.reflect.NativeMethodAccessorImpl.invoke0(Native Method)
	at sun.reflect.NativeMethodAccessorImpl.invoke(NativeMethodAccessorImpl.java:62)
	at sun.reflect.DelegatingMethodAccessorImpl.invoke(DelegatingMethodAccessorImpl.java:43)
	at java.lang.reflect.Method.invoke(Method.java:498)
	at com.carrotsearch.randomizedtesting.RandomizedRunner.invoke(RandomizedRunner.java:1713)
	at com.carrotsearch.randomizedtesting.RandomizedRunner$8.evaluate(RandomizedRunner.java:907)
	at com.carrotsearch.randomizedtesting.RandomizedRunner$9.evaluate(RandomizedRunner.java:943)
	at com.carrotsearch.randomizedtesting.RandomizedRunner$10.evaluate(RandomizedRunner.java:957)
	at com.carrotsearch.randomizedtesting.rules.SystemPropertiesRestoreRule$1.evaluate(SystemPropertiesRestoreRule.java:57)
	at org.apache.lucene.util.TestRuleSetupTeardownChained$1.evaluate(TestRuleSetupTeardownChained.java:49)
	at org.apache.lucene.util.AbstractBeforeAfterRule$1.evaluate(AbstractBeforeAfterRule.java:45)
	at org.apache.lucene.util.TestRuleThreadAndTestName$1.evaluate(TestRuleThreadAndTestName.java:48)
	at org.apache.lucene.util.TestRuleIgnoreAfterMaxFailures$1.evaluate(TestRuleIgnoreAfterMaxFailures.java:64)
	at org.apache.lucene.util.TestRuleMarkFailure$1.evaluate(TestRuleMarkFailure.java:47)
	at com.carrotsearch.randomizedtesting.rules.StatementAdapter.evaluate(StatementAdapter.java:36)
	at com.carrotsearch.randomizedtesting.ThreadLeakControl$StatementRunner.run(ThreadLeakControl.java:368)
	at com.carrotsearch.randomizedtesting.ThreadLeakControl.forkTimeoutingTask(ThreadLeakControl.java:817)
	at com.carrotsearch.randomizedtesting.ThreadLeakControl$3.evaluate(ThreadLeakControl.java:468)
	at com.carrotsearch.randomizedtesting.RandomizedRunner.runSingleTest(RandomizedRunner.java:916)
	at com.carrotsearch.randomizedtesting.RandomizedRunner$5.evaluate(RandomizedRunner.java:802)
	at com.carrotsearch.randomizedtesting.RandomizedRunner$6.evaluate(RandomizedRunner.java:852)
	at com.carrotsearch.randomizedtesting.RandomizedRunner$7.evaluate(RandomizedRunner.java:863)
	at com.carrotsearch.randomizedtesting.rules.StatementAdapter.evaluate(StatementAdapter.java:36)
	at com.carrotsearch.randomizedtesting.rules.SystemPropertiesRestoreRule$1.evaluate(SystemPropertiesRestoreRule.java:57)
	at org.apache.lucene.util.AbstractBeforeAfterRule$1.evaluate(AbstractBeforeAfterRule.java:45)
	at com.carrotsearch.randomizedtesting.rules.StatementAdapter.evaluate(StatementAdapter.java:36)
	at org.apache.lucene.util.TestRuleStoreClassName$1.evaluate(TestRuleStoreClassName.java:41)
	at com.carrotsearch.randomizedtesting.rules.NoShadowingOrOverridesOnMethodsRule$1.evaluate(NoShadowingOrOverridesOnMethodsRule.java:40)
	at com.carrotsearch.randomizedtesting.rules.NoShadowingOrOverridesOnMethodsRule$1.evaluate(NoShadowingOrOverridesOnMethodsRule.java:40)
	at com.carrotsearch.randomizedtesting.rules.StatementAdapter.evaluate(StatementAdapter.java:36)
	at com.carrotsearch.randomizedtesting.rules.StatementAdapter.evaluate(StatementAdapter.java:36)
	at com.carrotsearch.randomizedtesting.rules.StatementAdapter.evaluate(StatementAdapter.java:36)
	at org.apache.lucene.util.TestRuleAssertionsRequired$1.evaluate(TestRuleAssertionsRequired.java:53)
	at org.apache.lucene.util.TestRuleMarkFailure$1.evaluate(TestRuleMarkFailure.java:47)
	at org.apache.lucene.util.TestRuleIgnoreAfterMaxFailures$1.evaluate(TestRuleIgnoreAfterMaxFailures.java:64)
	at org.apache.lucene.util.TestRuleIgnoreTestSuites$1.evaluate(TestRuleIgnoreTestSuites.java:54)
	at com.carrotsearch.randomizedtesting.rules.StatementAdapter.evaluate(StatementAdapter.java:36)
	at com.carrotsearch.randomizedtesting.ThreadLeakControl$StatementRunner.run(ThreadLeakControl.java:368)
	at java.lang.Thread.run(Thread.java:748)


FAILED:  org.apache.solr.schema.DocValuesMultiTest.testDocValuesFacetingSimple

Error Message:
Exception during query

Stack Trace:
java.lang.RuntimeException: Exception during query
	at __randomizedtesting.SeedInfo.seed([2DBE584676D8550C:6CFDDA4EF1554D8]:0)
	at org.apache.solr.SolrTestCaseJ4.assertQ(SolrTestCaseJ4.java:886)
	at org.apache.solr.SolrTestCaseJ4.assertQ(SolrTestCaseJ4.java:846)
	at org.apache.solr.schema.DocValuesMultiTest.testDocValuesFacetingSimple(DocValuesMultiTest.java:292)
	at sun.reflect.NativeMethodAccessorImpl.invoke0(Native Method)
	at sun.reflect.NativeMethodAccessorImpl.invoke(NativeMethodAccessorImpl.java:62)
	at sun.reflect.DelegatingMethodAccessorImpl.invoke(DelegatingMethodAccessorImpl.java:43)
	at java.lang.reflect.Method.invoke(Method.java:498)
	at com.carrotsearch.randomizedtesting.RandomizedRunner.invoke(RandomizedRunner.java:1713)
	at com.carrotsearch.randomizedtesting.RandomizedRunner$8.evaluate(RandomizedRunner.java:907)
	at com.carrotsearch.randomizedtesting.RandomizedRunner$9.evaluate(RandomizedRunner.java:943)
	at com.carrotsearch.randomizedtesting.RandomizedRunner$10.evaluate(RandomizedRunner.java:957)
	at com.carrotsearch.randomizedtesting.rules.SystemPropertiesRestoreRule$1.evaluate(SystemPropertiesRestoreRule.java:57)
	at org.apache.lucene.util.TestRuleSetupTeardownChained$1.evaluate(TestRuleSetupTeardownChained.java:49)
	at org.apache.lucene.util.AbstractBeforeAfterRule$1.evaluate(AbstractBeforeAfterRule.java:45)
	at org.apache.lucene.util.TestRuleThreadAndTestName$1.evaluate(TestRuleThreadAndTestName.java:48)
	at org.apache.lucene.util.TestRuleIgnoreAfterMaxFailures$1.evaluate(TestRuleIgnoreAfterMaxFailures.java:64)
	at org.apache.lucene.util.TestRuleMarkFailure$1.evaluate(TestRuleMarkFailure.java:47)
	at com.carrotsearch.randomizedtesting.rules.StatementAdapter.evaluate(StatementAdapter.java:36)
	at com.carrotsearch.randomizedtesting.ThreadLeakControl$StatementRunner.run(ThreadLeakControl.java:368)
	at com.carrotsearch.randomizedtesting.ThreadLeakControl.forkTimeoutingTask(ThreadLeakControl.java:817)
	at com.carrotsearch.randomizedtesting.ThreadLeakControl$3.evaluate(ThreadLeakControl.java:468)
	at com.carrotsearch.randomizedtesting.RandomizedRunner.runSingleTest(RandomizedRunner.java:916)
	at com.carrotsearch.randomizedtesting.RandomizedRunner$5.evaluate(RandomizedRunner.java:802)
	at com.carrotsearch.randomizedtesting.RandomizedRunner$6.evaluate(RandomizedRunner.java:852)
	at com.carrotsearch.randomizedtesting.RandomizedRunner$7.evaluate(RandomizedRunner.java:863)
	at com.carrotsearch.randomizedtesting.rules.StatementAdapter.evaluate(StatementAdapter.java:36)
	at com.carrotsearch.randomizedtesting.rules.SystemPropertiesRestoreRule$1.evaluate(SystemPropertiesRestoreRule.java:57)
	at org.apache.lucene.util.AbstractBeforeAfterRule$1.evaluate(AbstractBeforeAfterRule.java:45)
	at com.carrotsearch.randomizedtesting.rules.StatementAdapter.evaluate(StatementAdapter.java:36)
	at org.apache.lucene.util.TestRuleStoreClassName$1.evaluate(TestRuleStoreClassName.java:41)
	at com.carrotsearch.randomizedtesting.rules.NoShadowingOrOverridesOnMethodsRule$1.evaluate(NoShadowingOrOverridesOnMethodsRule.java:40)
	at com.carrotsearch.randomizedtesting.rules.NoShadowingOrOverridesOnMethodsRule$1.evaluate(NoShadowingOrOverridesOnMethodsRule.java:40)
	at com.carrotsearch.randomizedtesting.rules.StatementAdapter.evaluate(StatementAdapter.java:36)
	at com.carrotsearch.randomizedtesting.rules.StatementAdapter.evaluate(StatementAdapter.java:36)
	at com.carrotsearch.randomizedtesting.rules.StatementAdapter.evaluate(StatementAdapter.java:36)
	at org.apache.lucene.util.TestRuleAssertionsRequired$1.evaluate(TestRuleAssertionsRequired.java:53)
	at org.apache.lucene.util.TestRuleMarkFailure$1.evaluate(TestRuleMarkFailure.java:47)
	at org.apache.lucene.util.TestRuleIgnoreAfterMaxFailures$1.evaluate(TestRuleIgnoreAfterMaxFailures.java:64)
	at org.apache.lucene.util.TestRuleIgnoreTestSuites$1.evaluate(TestRuleIgnoreTestSuites.java:54)
	at com.carrotsearch.randomizedtesting.rules.StatementAdapter.evaluate(StatementAdapter.java:36)
	at com.carrotsearch.randomizedtesting.ThreadLeakControl$StatementRunner.run(ThreadLeakControl.java:368)
	at java.lang.Thread.run(Thread.java:748)
Caused by: org.apache.solr.common.SolrException: Cannot use facet.mincount=0 on field longdv which is Points-based
	at org.apache.solr.request.NumericFacets.getCountsMultiValued(NumericFacets.java:425)
	at org.apache.solr.request.NumericFacets.getCounts(NumericFacets.java:168)
	at org.apache.solr.request.SimpleFacets.getTermCounts(SimpleFacets.java:499)
	at org.apache.solr.request.SimpleFacets.getTermCounts(SimpleFacets.java:405)
	at org.apache.solr.request.SimpleFacets.lambda$getFacetFieldCounts$0(SimpleFacets.java:803)
	at java.util.concurrent.FutureTask.run(FutureTask.java:266)
	at org.apache.solr.request.SimpleFacets$3.execute(SimpleFacets.java:742)
	at org.apache.solr.request.SimpleFacets.getFacetFieldCounts(SimpleFacets.java:818)
	at org.apache.solr.handler.component.FacetComponent.getFacetCounts(FacetComponent.java:329)
	at org.apache.solr.handler.component.FacetComponent.process(FacetComponent.java:273)
	at org.apache.solr.handler.component.SearchHandler.handleRequestBody(SearchHandler.java:295)
	at org.apache.solr.handler.RequestHandlerBase.handleRequest(RequestHandlerBase.java:177)
	at org.apache.solr.core.SolrCore.execute(SolrCore.java:2473)
	at org.apache.solr.util.TestHarness.query(TestHarness.java:337)
	at org.apache.solr.util.TestHarness.query(TestHarness.java:319)
	at org.apache.solr.SolrTestCaseJ4.assertQ(SolrTestCaseJ4.java:860)
	... 41 more


FAILED:  org.apache.solr.schema.DocValuesTest.testDocValuesFaceting

Error Message:
Exception during query

Stack Trace:
java.lang.RuntimeException: Exception during query
	at __randomizedtesting.SeedInfo.seed([2DBE584676D8550C:B7A11F189D40C5B4]:0)
	at org.apache.solr.SolrTestCaseJ4.assertQ(SolrTestCaseJ4.java:886)
	at org.apache.solr.SolrTestCaseJ4.assertQ(SolrTestCaseJ4.java:846)
	at org.apache.solr.schema.DocValuesTest.testDocValuesFaceting(DocValuesTest.java:250)
	at sun.reflect.NativeMethodAccessorImpl.invoke0(Native Method)
	at sun.reflect.NativeMethodAccessorImpl.invoke(NativeMethodAccessorImpl.java:62)
	at sun.reflect.DelegatingMethodAccessorImpl.invoke(DelegatingMethodAccessorImpl.java:43)
	at java.lang.reflect.Method.invoke(Method.java:498)
	at com.carrotsearch.randomizedtesting.RandomizedRunner.invoke(RandomizedRunner.java:1713)
	at com.carrotsearch.randomizedtesting.RandomizedRunner$8.evaluate(RandomizedRunner.java:907)
	at com.carrotsearch.randomizedtesting.RandomizedRunner$9.evaluate(RandomizedRunner.java:943)
	at com.carrotsearch.randomizedtesting.RandomizedRunner$10.evaluate(RandomizedRunner.java:957)
	at com.carrotsearch.randomizedtesting.rules.SystemPropertiesRestoreRule$1.evaluate(SystemPropertiesRestoreRule.java:57)
	at org.apache.lucene.util.TestRuleSetupTeardownChained$1.evaluate(TestRuleSetupTeardownChained.java:49)
	at org.apache.lucene.util.AbstractBeforeAfterRule$1.evaluate(AbstractBeforeAfterRule.java:45)
	at org.apache.lucene.util.TestRuleThreadAndTestName$1.evaluate(TestRuleThreadAndTestName.java:48)
	at org.apache.lucene.util.TestRuleIgnoreAfterMaxFailures$1.evaluate(TestRuleIgnoreAfterMaxFailures.java:64)
	at org.apache.lucene.util.TestRuleMarkFailure$1.evaluate(TestRuleMarkFailure.java:47)
	at com.carrotsearch.randomizedtesting.rules.StatementAdapter.evaluate(StatementAdapter.java:36)
	at com.carrotsearch.randomizedtesting.ThreadLeakControl$StatementRunner.run(ThreadLeakControl.java:368)
	at com.carrotsearch.randomizedtesting.ThreadLeakControl.forkTimeoutingTask(ThreadLeakControl.java:817)
	at com.carrotsearch.randomizedtesting.ThreadLeakControl$3.evaluate(ThreadLeakControl.java:468)
	at com.carrotsearch.randomizedtesting.RandomizedRunner.runSingleTest(RandomizedRunner.java:916)
	at com.carrotsearch.randomizedtesting.RandomizedRunner$5.evaluate(RandomizedRunner.java:802)
	at com.carrotsearch.randomizedtesting.RandomizedRunner$6.evaluate(RandomizedRunner.java:852)
	at com.carrotsearch.randomizedtesting.RandomizedRunner$7.evaluate(RandomizedRunner.java:863)
	at com.carrotsearch.randomizedtesting.rules.StatementAdapter.evaluate(StatementAdapter.java:36)
	at com.carrotsearch.randomizedtesting.rules.SystemPropertiesRestoreRule$1.evaluate(SystemPropertiesRestoreRule.java:57)
	at org.apache.lucene.util.AbstractBeforeAfterRule$1.evaluate(AbstractBeforeAfterRule.java:45)
	at com.carrotsearch.randomizedtesting.rules.StatementAdapter.evaluate(StatementAdapter.java:36)
	at org.apache.lucene.util.TestRuleStoreClassName$1.evaluate(TestRuleStoreClassName.java:41)
	at com.carrotsearch.randomizedtesting.rules.NoShadowingOrOverridesOnMethodsRule$1.evaluate(NoShadowingOrOverridesOnMethodsRule.java:40)
	at com.carrotsearch.randomizedtesting.rules.NoShadowingOrOverridesOnMethodsRule$1.evaluate(NoShadowingOrOverridesOnMethodsRule.java:40)
	at com.carrotsearch.randomizedtesting.rules.StatementAdapter.evaluate(StatementAdapter.java:36)
	at com.carrotsearch.randomizedtesting.rules.StatementAdapter.evaluate(StatementAdapter.java:36)
	at com.carrotsearch.randomizedtesting.rules.StatementAdapter.evaluate(StatementAdapter.java:36)
	at org.apache.lucene.util.TestRuleAssertionsRequired$1.evaluate(TestRuleAssertionsRequired.java:53)
	at org.apache.lucene.util.TestRuleMarkFailure$1.evaluate(TestRuleMarkFailure.java:47)
	at org.apache.lucene.util.TestRuleIgnoreAfterMaxFailures$1.evaluate(TestRuleIgnoreAfterMaxFailures.java:64)
	at org.apache.lucene.util.TestRuleIgnoreTestSuites$1.evaluate(TestRuleIgnoreTestSuites.java:54)
	at com.carrotsearch.randomizedtesting.rules.StatementAdapter.evaluate(StatementAdapter.java:36)
	at com.carrotsearch.randomizedtesting.ThreadLeakControl$StatementRunner.run(ThreadLeakControl.java:368)
	at java.lang.Thread.run(Thread.java:748)
Caused by: org.apache.solr.common.SolrException: Cannot use facet.mincount=0 on field longdv which is Points-based
	at org.apache.solr.request.NumericFacets.getCountsSingleValue(NumericFacets.java:184)
	at org.apache.solr.request.NumericFacets.getCounts(NumericFacets.java:170)
	at org.apache.solr.request.SimpleFacets.getTermCounts(SimpleFacets.java:499)
	at org.apache.solr.request.SimpleFacets.getTermCounts(SimpleFacets.java:405)
	at org.apache.solr.request.SimpleFacets.lambda$getFacetFieldCounts$0(SimpleFacets.java:803)
	at java.util.concurrent.FutureTask.run(FutureTask.java:266)
	at org.apache.solr.request.SimpleFacets$3.execute(SimpleFacets.java:742)
	at org.apache.solr.request.SimpleFacets.getFacetFieldCounts(SimpleFacets.java:818)
	at org.apache.solr.handler.component.FacetComponent.getFacetCounts(FacetComponent.java:329)
	at org.apache.solr.handler.component.FacetComponent.process(FacetComponent.java:273)
	at org.apache.solr.handler.component.SearchHandler.handleRequestBody(SearchHandler.java:295)
	at org.apache.solr.handler.RequestHandlerBase.handleRequest(RequestHandlerBase.java:177)
	at org.apache.solr.core.SolrCore.execute(SolrCore.java:2473)
	at org.apache.solr.util.TestHarness.query(TestHarness.java:337)
	at org.apache.solr.util.TestHarness.query(TestHarness.java:319)
	at org.apache.solr.SolrTestCaseJ4.assertQ(SolrTestCaseJ4.java:860)
	... 41 more


FAILED:  org.apache.solr.schema.TestPointFields.testDoublePointFieldFacetField

Error Message:
Exception during query

Stack Trace:
java.lang.RuntimeException: Exception during query
	at __randomizedtesting.SeedInfo.seed([2DBE584676D8550C:AF02D686782375F2]:0)
	at org.apache.solr.SolrTestCaseJ4.assertQ(SolrTestCaseJ4.java:886)
	at org.apache.solr.SolrTestCaseJ4.assertQ(SolrTestCaseJ4.java:846)
	at org.apache.solr.schema.TestPointFields.doTestPointFieldFacetField(TestPointFields.java:2407)
	at org.apache.solr.schema.TestPointFields.testDoublePointFieldFacetField(TestPointFields.java:597)
	at sun.reflect.NativeMethodAccessorImpl.invoke0(Native Method)
	at sun.reflect.NativeMethodAccessorImpl.invoke(NativeMethodAccessorImpl.java:62)
	at sun.reflect.DelegatingMethodAccessorImpl.invoke(DelegatingMethodAccessorImpl.java:43)
	at java.lang.reflect.Method.invoke(Method.java:498)
	at com.carrotsearch.randomizedtesting.RandomizedRunner.invoke(RandomizedRunner.java:1713)
	at com.carrotsearch.randomizedtesting.RandomizedRunner$8.evaluate(RandomizedRunner.java:907)
	at com.carrotsearch.randomizedtesting.RandomizedRunner$9.evaluate(RandomizedRunner.java:943)
	at com.carrotsearch.randomizedtesting.RandomizedRunner$10.evaluate(RandomizedRunner.java:957)
	at com.carrotsearch.randomizedtesting.rules.SystemPropertiesRestoreRule$1.evaluate(SystemPropertiesRestoreRule.java:57)
	at org.apache.lucene.util.TestRuleSetupTeardownChained$1.evaluate(TestRuleSetupTeardownChained.java:49)
	at org.apache.lucene.util.AbstractBeforeAfterRule$1.evaluate(AbstractBeforeAfterRule.java:45)
	at org.apache.lucene.util.TestRuleThreadAndTestName$1.evaluate(TestRuleThreadAndTestName.java:48)
	at org.apache.lucene.util.TestRuleIgnoreAfterMaxFailures$1.evaluate(TestRuleIgnoreAfterMaxFailures.java:64)
	at org.apache.lucene.util.TestRuleMarkFailure$1.evaluate(TestRuleMarkFailure.java:47)
	at com.carrotsearch.randomizedtesting.rules.StatementAdapter.evaluate(StatementAdapter.java:36)
	at com.carrotsearch.randomizedtesting.ThreadLeakControl$StatementRunner.run(ThreadLeakControl.java:368)
	at com.carrotsearch.randomizedtesting.ThreadLeakControl.forkTimeoutingTask(ThreadLeakControl.java:817)
	at com.carrotsearch.randomizedtesting.ThreadLeakControl$3.evaluate(ThreadLeakControl.java:468)
	at com.carrotsearch.randomizedtesting.RandomizedRunner.runSingleTest(RandomizedRunner.java:916)
	at com.carrotsearch.randomizedtesting.RandomizedRunner$5.evaluate(RandomizedRunner.java:802)
	at com.carrotsearch.randomizedtesting.RandomizedRunner$6.evaluate(RandomizedRunner.java:852)
	at com.carrotsearch.randomizedtesting.RandomizedRunner$7.evaluate(RandomizedRunner.java:863)
	at com.carrotsearch.randomizedtesting.rules.StatementAdapter.evaluate(StatementAdapter.java:36)
	at com.carrotsearch.randomizedtesting.rules.SystemPropertiesRestoreRule$1.evaluate(SystemPropertiesRestoreRule.java:57)
	at org.apache.lucene.util.AbstractBeforeAfterRule$1.evaluate(AbstractBeforeAfterRule.java:45)
	at com.carrotsearch.randomizedtesting.rules.StatementAdapter.evaluate(StatementAdapter.java:36)
	at org.apache.lucene.util.TestRuleStoreClassName$1.evaluate(TestRuleStoreClassName.java:41)
	at com.carrotsearch.randomizedtesting.rules.NoShadowingOrOverridesOnMethodsRule$1.evaluate(NoShadowingOrOverridesOnMethodsRule.java:40)
	at com.carrotsearch.randomizedtesting.rules.NoShadowingOrOverridesOnMethodsRule$1.evaluate(NoShadowingOrOverridesOnMethodsRule.java:40)
	at com.carrotsearch.randomizedtesting.rules.StatementAdapter.evaluate(StatementAdapter.java:36)
	at com.carrotsearch.randomizedtesting.rules.StatementAdapter.evaluate(StatementAdapter.java:36)
	at com.carrotsearch.randomizedtesting.rules.StatementAdapter.evaluate(StatementAdapter.java:36)
	at org.apache.lucene.util.TestRuleAssertionsRequired$1.evaluate(TestRuleAssertionsRequired.java:53)
	at org.apache.lucene.util.TestRuleMarkFailure$1.evaluate(TestRuleMarkFailure.java:47)
	at org.apache.lucene.util.TestRuleIgnoreAfterMaxFailures$1.evaluate(TestRuleIgnoreAfterMaxFailures.java:64)
	at org.apache.lucene.util.TestRuleIgnoreTestSuites$1.evaluate(TestRuleIgnoreTestSuites.java:54)
	at com.carrotsearch.randomizedtesting.rules.StatementAdapter.evaluate(StatementAdapter.java:36)
	at com.carrotsearch.randomizedtesting.ThreadLeakControl$StatementRunner.run(ThreadLeakControl.java:368)
	at java.lang.Thread.run(Thread.java:748)
Caused by: org.apache.solr.common.SolrException: Cannot use facet.mincount=0 on field number_p_d_dv which is Points-based
	at org.apache.solr.request.NumericFacets.getCountsSingleValue(NumericFacets.java:184)
	at org.apache.solr.request.NumericFacets.getCounts(NumericFacets.java:170)
	at org.apache.solr.request.SimpleFacets.getTermCounts(SimpleFacets.java:499)
	at org.apache.solr.request.SimpleFacets.getTermCounts(SimpleFacets.java:405)
	at org.apache.solr.request.SimpleFacets.lambda$getFacetFieldCounts$0(SimpleFacets.java:803)
	at java.util.concurrent.FutureTask.run(FutureTask.java:266)
	at org.apache.solr.request.SimpleFacets$3.execute(SimpleFacets.java:742)
	at org.apache.solr.request.SimpleFacets.getFacetFieldCounts(SimpleFacets.java:818)
	at org.apache.solr.handler.component.FacetComponent.getFacetCounts(FacetComponent.java:329)
	at org.apache.solr.handler.component.FacetComponent.process(FacetComponent.java:273)
	at org.apache.solr.handler.component.SearchHandler.handleRequestBody(SearchHandler.java:295)
	at org.apache.solr.handler.RequestHandlerBase.handleRequest(RequestHandlerBase.java:177)
	at org.apache.solr.core.SolrCore.execute(SolrCore.java:2473)
	at org.apache.solr.util.TestHarness.query(TestHarness.java:337)
	at org.apache.solr.util.TestHarness.query(TestHarness.java:319)
	at org.apache.solr.SolrTestCaseJ4.assertQ(SolrTestCaseJ4.java:860)
	... 42 more


FAILED:  org.apache.solr.schema.TestPointFields.testDatePointFieldMultiValuedFacetField

Error Message:
Exception during query

Stack Trace:
java.lang.RuntimeException: Exception during query
	at __randomizedtesting.SeedInfo.seed([2DBE584676D8550C:1CC32F3227B62C5A]:0)
	at org.apache.solr.SolrTestCaseJ4.assertQ(SolrTestCaseJ4.java:886)
	at org.apache.solr.SolrTestCaseJ4.assertQ(SolrTestCaseJ4.java:846)
	at org.apache.solr.schema.TestPointFields.doTestPointFieldMultiValuedFacetField(TestPointFields.java:2749)
	at org.apache.solr.schema.TestPointFields.testDatePointFieldMultiValuedFacetField(TestPointFields.java:1884)
	at sun.reflect.NativeMethodAccessorImpl.invoke0(Native Method)
	at sun.reflect.NativeMethodAccessorImpl.invoke(NativeMethodAccessorImpl.java:62)
	at sun.reflect.DelegatingMethodAccessorImpl.invoke(DelegatingMethodAccessorImpl.java:43)
	at java.lang.reflect.Method.invoke(Method.java:498)
	at com.carrotsearch.randomizedtesting.RandomizedRunner.invoke(RandomizedRunner.java:1713)
	at com.carrotsearch.randomizedtesting.RandomizedRunner$8.evaluate(RandomizedRunner.java:907)
	at com.carrotsearch.randomizedtesting.RandomizedRunner$9.evaluate(RandomizedRunner.java:943)
	at com.carrotsearch.randomizedtesting.RandomizedRunner$10.evaluate(RandomizedRunner.java:957)
	at com.carrotsearch.randomizedtesting.rules.SystemPropertiesRestoreRule$1.evaluate(SystemPropertiesRestoreRule.java:57)
	at org.apache.lucene.util.TestRuleSetupTeardownChained$1.evaluate(TestRuleSetupTeardownChained.java:49)
	at org.apache.lucene.util.AbstractBeforeAfterRule$1.evaluate(AbstractBeforeAfterRule.java:45)
	at org.apache.lucene.util.TestRuleThreadAndTestName$1.evaluate(TestRuleThreadAndTestName.java:48)
	at org.apache.lucene.util.TestRuleIgnoreAfterMaxFailures$1.evaluate(TestRuleIgnoreAfterMaxFailures.java:64)
	at org.apache.lucene.util.TestRuleMarkFailure$1.evaluate(TestRuleMarkFailure.java:47)
	at com.carrotsearch.randomizedtesting.rules.StatementAdapter.evaluate(StatementAdapter.java:36)
	at com.carrotsearch.randomizedtesting.ThreadLeakControl$StatementRunner.run(ThreadLeakControl.java:368)
	at com.carrotsearch.randomizedtesting.ThreadLeakControl.forkTimeoutingTask(ThreadLeakControl.java:817)
	at com.carrotsearch.randomizedtesting.ThreadLeakControl$3.evaluate(ThreadLeakControl.java:468)
	at com.carrotsearch.randomizedtesting.RandomizedRunner.runSingleTest(RandomizedRunner.java:916)
	at com.carrotsearch.randomizedtesting.RandomizedRunner$5.evaluate(RandomizedRunner.java:802)
	at com.carrotsearch.randomizedtesting.RandomizedRunner$6.evaluate(RandomizedRunner.java:852)
	at com.carrotsearch.randomizedtesting.RandomizedRunner$7.evaluate(RandomizedRunner.java:863)
	at com.carrotsearch.randomizedtesting.rules.StatementAdapter.evaluate(StatementAdapter.java:36)
	at com.carrotsearch.randomizedtesting.rules.SystemPropertiesRestoreRule$1.evaluate(SystemPropertiesRestoreRule.java:57)
	at org.apache.lucene.util.AbstractBeforeAfterRule$1.evaluate(AbstractBeforeAfterRule.java:45)
	at com.carrotsearch.randomizedtesting.rules.StatementAdapter.evaluate(StatementAdapter.java:36)
	at org.apache.lucene.util.TestRuleStoreClassName$1.evaluate(TestRuleStoreClassName.java:41)
	at com.carrotsearch.randomizedtesting.rules.NoShadowingOrOverridesOnMethodsRule$1.evaluate(NoShadowingOrOverridesOnMethodsRule.java:40)
	at com.carrotsearch.randomizedtesting.rules.NoShadowingOrOverridesOnMethodsRule$1.evaluate(NoShadowingOrOverridesOnMethodsRule.java:40)
	at com.carrotsearch.randomizedtesting.rules.StatementAdapter.evaluate(StatementAdapter.java:36)
	at com.carrotsearch.randomizedtesting.rules.StatementAdapter.evaluate(StatementAdapter.java:36)
	at com.carrotsearch.randomizedtesting.rules.StatementAdapter.evaluate(StatementAdapter.java:36)
	at org.apache.lucene.util.TestRuleAssertionsRequired$1.evaluate(TestRuleAssertionsRequired.java:53)
	at org.apache.lucene.util.TestRuleMarkFailure$1.evaluate(TestRuleMarkFailure.java:47)
	at org.apache.lucene.util.TestRuleIgnoreAfterMaxFailures$1.evaluate(TestRuleIgnoreAfterMaxFailures.java:64)
	at org.apache.lucene.util.TestRuleIgnoreTestSuites$1.evaluate(TestRuleIgnoreTestSuites.java:54)
	at com.carrotsearch.randomizedtesting.rules.StatementAdapter.evaluate(StatementAdapter.java:36)
	at com.carrotsearch.randomizedtesting.ThreadLeakControl$StatementRunner.run(ThreadLeakControl.java:368)
	at java.lang.Thread.run(Thread.java:748)
Caused by: org.apache.solr.common.SolrException: Cannot use facet.mincount=0 on field number_p_dt_mv_dv which is Points-based
	at org.apache.solr.request.NumericFacets.getCountsMultiValued(NumericFacets.java:425)
	at org.apache.solr.request.NumericFacets.getCounts(NumericFacets.java:168)
	at org.apache.solr.request.SimpleFacets.getTermCounts(SimpleFacets.java:499)
	at org.apache.solr.request.SimpleFacets.getTermCounts(SimpleFacets.java:405)
	at org.apache.solr.request.SimpleFacets.lambda$getFacetFieldCounts$0(SimpleFacets.java:803)
	at java.util.concurrent.FutureTask.run(FutureTask.java:266)
	at org.apache.solr.request.SimpleFacets$3.execute(SimpleFacets.java:742)
	at org.apache.solr.request.SimpleFacets.getFacetFieldCounts(SimpleFacets.java:818)
	at org.apache.solr.handler.component.FacetComponent.getFacetCounts(FacetComponent.java:329)
	at org.apache.solr.handler.component.FacetComponent.process(FacetComponent.java:273)
	at org.apache.solr.handler.component.SearchHandler.handleRequestBody(SearchHandler.java:295)
	at org.apache.solr.handler.RequestHandlerBase.handleRequest(RequestHandlerBase.java:177)
	at org.apache.solr.core.SolrCore.execute(SolrCore.java:2473)
	at org.apache.solr.util.TestHarness.query(TestHarness.java:337)
	at org.apache.solr.util.TestHarness.query(TestHarness.java:319)
	at org.apache.solr.SolrTestCaseJ4.assertQ(SolrTestCaseJ4.java:860)
	... 42 more


FAILED:  org.apache.solr.schema.TestPointFields.testIntPointFieldFacetField

Error Message:
Exception during query

Stack Trace:
java.lang.RuntimeException: Exception during query
	at __randomizedtesting.SeedInfo.seed([2DBE584676D8550C:1EB8513022753C96]:0)
	at org.apache.solr.SolrTestCaseJ4.assertQ(SolrTestCaseJ4.java:886)
	at org.apache.solr.SolrTestCaseJ4.assertQ(SolrTestCaseJ4.java:846)
	at org.apache.solr.schema.TestPointFields.doTestPointFieldFacetField(TestPointFields.java:2407)
	at org.apache.solr.schema.TestPointFields.testIntPointFieldFacetField(TestPointFields.java:196)
	at sun.reflect.NativeMethodAccessorImpl.invoke0(Native Method)
	at sun.reflect.NativeMethodAccessorImpl.invoke(NativeMethodAccessorImpl.java:62)
	at sun.reflect.DelegatingMethodAccessorImpl.invoke(DelegatingMethodAccessorImpl.java:43)
	at java.lang.reflect.Method.invoke(Method.java:498)
	at com.carrotsearch.randomizedtesting.RandomizedRunner.invoke(RandomizedRunner.java:1713)
	at com.carrotsearch.randomizedtesting.RandomizedRunner$8.evaluate(RandomizedRunner.java:907)
	at com.carrotsearch.randomizedtesting.RandomizedRunner$9.evaluate(RandomizedRunner.java:943)
	at com.carrotsearch.randomizedtesting.RandomizedRunner$10.evaluate(RandomizedRunner.java:957)
	at com.carrotsearch.randomizedtesting.rules.SystemPropertiesRestoreRule$1.evaluate(SystemPropertiesRestoreRule.java:57)
	at org.apache.lucene.util.TestRuleSetupTeardownChained$1.evaluate(TestRuleSetupTeardownChained.java:49)
	at org.apache.lucene.util.AbstractBeforeAfterRule$1.evaluate(AbstractBeforeAfterRule.java:45)
	at org.apache.lucene.util.TestRuleThreadAndTestName$1.evaluate(TestRuleThreadAndTestName.java:48)
	at org.apache.lucene.util.TestRuleIgnoreAfterMaxFailures$1.evaluate(TestRuleIgnoreAfterMaxFailures.java:64)
	at org.apache.lucene.util.TestRuleMarkFailure$1.evaluate(TestRuleMarkFailure.java:47)
	at com.carrotsearch.randomizedtesting.rules.StatementAdapter.evaluate(StatementAdapter.java:36)
	at com.carrotsearch.randomizedtesting.ThreadLeakControl$StatementRunner.run(ThreadLeakControl.java:368)
	at com.carrotsearch.randomizedtesting.ThreadLeakControl.forkTimeoutingTask(ThreadLeakControl.java:817)
	at com.carrotsearch.randomizedtesting.ThreadLeakControl$3.evaluate(ThreadLeakControl.java:468)
	at com.carrotsearch.randomizedtesting.RandomizedRunner.runSingleTest(RandomizedRunner.java:916)
	at com.carrotsearch.randomizedtesting.RandomizedRunner$5.evaluate(RandomizedRunner.java:802)
	at com.carrotsearch.randomizedtesting.RandomizedRunner$6.evaluate(RandomizedRunner.java:852)
	at com.carrotsearch.randomizedtesting.RandomizedRunner$7.evaluate(RandomizedRunner.java:863)
	at com.carrotsearch.randomizedtesting.rules.StatementAdapter.evaluate(StatementAdapter.java:36)
	at com.carrotsearch.randomizedtesting.rules.SystemPropertiesRestoreRule$1.evaluate(SystemPropertiesRestoreRule.java:57)
	at org.apache.lucene.util.AbstractBeforeAfterRule$1.evaluate(AbstractBeforeAfterRule.java:45)
	at com.carrotsearch.randomizedtesting.rules.StatementAdapter.evaluate(StatementAdapter.java:36)
	at org.apache.lucene.util.TestRuleStoreClassName$1.evaluate(TestRuleStoreClassName.java:41)
	at com.carrotsearch.randomizedtesting.rules.NoShadowingOrOverridesOnMethodsRule$1.evaluate(NoShadowingOrOverridesOnMethodsRule.java:40)
	at com.carrotsearch.randomizedtesting.rules.NoShadowingOrOverridesOnMethodsRule$1.evaluate(NoShadowingOrOverridesOnMethodsRule.java:40)
	at com.carrotsearch.randomizedtesting.rules.StatementAdapter.evaluate(StatementAdapter.java:36)
	at com.carrotsearch.randomizedtesting.rules.StatementAdapter.evaluate(StatementAdapter.java:36)
	at com.carrotsearch.randomizedtesting.rules.StatementAdapter.evaluate(StatementAdapter.java:36)
	at org.apache.lucene.util.TestRuleAssertionsRequired$1.evaluate(TestRuleAssertionsRequired.java:53)
	at org.apache.lucene.util.TestRuleMarkFailure$1.evaluate(TestRuleMarkFailure.java:47)
	at org.apache.lucene.util.TestRuleIgnoreAfterMaxFailures$1.evaluate(TestRuleIgnoreAfterMaxFailures.java:64)
	at org.apache.lucene.util.TestRuleIgnoreTestSuites$1.evaluate(TestRuleIgnoreTestSuites.java:54)
	at com.carrotsearch.randomizedtesting.rules.StatementAdapter.evaluate(StatementAdapter.java:36)
	at com.carrotsearch.randomizedtesting.ThreadLeakControl$StatementRunner.run(ThreadLeakControl.java:368)
	at java.lang.Thread.run(Thread.java:748)
Caused by: org.apache.solr.common.SolrException: Cannot use facet.mincount=0 on field number_p_i_dv which is Points-based
	at org.apache.solr.request.NumericFacets.getCountsSingleValue(NumericFacets.java:184)
	at org.apache.solr.request.NumericFacets.getCounts(NumericFacets.java:170)
	at org.apache.solr.request.SimpleFacets.getTermCounts(SimpleFacets.java:499)
	at org.apache.solr.request.SimpleFacets.getTermCounts(SimpleFacets.java:405)
	at org.apache.solr.request.SimpleFacets.lambda$getFacetFieldCounts$0(SimpleFacets.java:803)
	at java.util.concurrent.FutureTask.run(FutureTask.java:266)
	at org.apache.solr.request.SimpleFacets$3.execute(SimpleFacets.java:742)
	at org.apache.solr.request.SimpleFacets.getFacetFieldCounts(SimpleFacets.java:818)
	at org.apache.solr.handler.component.FacetComponent.getFacetCounts(FacetComponent.java:329)
	at org.apache.solr.handler.component.FacetComponent.process(FacetComponent.java:273)
	at org.apache.solr.handler.component.SearchHandler.handleRequestBody(SearchHandler.java:295)
	at org.apache.solr.handler.RequestHandlerBase.handleRequest(RequestHandlerBase.java:177)
	at org.apache.solr.core.SolrCore.execute(SolrCore.java:2473)
	at org.apache.solr.util.TestHarness.query(TestHarness.java:337)
	at org.apache.solr.util.TestHarness.query(TestHarness.java:319)
	at org.apache.solr.SolrTestCaseJ4.assertQ(SolrTestCaseJ4.java:860)
	... 42 more


FAILED:  org.apache.solr.schema.TestPointFields.testFloatPointFieldFacetField

Error Message:
Exception during query

Stack Trace:
java.lang.RuntimeException: Exception during query
	at __randomizedtesting.SeedInfo.seed([2DBE584676D8550C:9707BA795534FD4C]:0)
	at org.apache.solr.SolrTestCaseJ4.assertQ(SolrTestCaseJ4.java:886)
	at org.apache.solr.SolrTestCaseJ4.assertQ(SolrTestCaseJ4.java:846)
	at org.apache.solr.schema.TestPointFields.doTestPointFieldFacetField(TestPointFields.java:2407)
	at org.apache.solr.schema.TestPointFields.testFloatPointFieldFacetField(TestPointFields.java:1003)
	at sun.reflect.NativeMethodAccessorImpl.invoke0(Native Method)
	at sun.reflect.NativeMethodAccessorImpl.invoke(NativeMethodAccessorImpl.java:62)
	at sun.reflect.DelegatingMethodAccessorImpl.invoke(DelegatingMethodAccessorImpl.java:43)
	at java.lang.reflect.Method.invoke(Method.java:498)
	at com.carrotsearch.randomizedtesting.RandomizedRunner.invoke(RandomizedRunner.java:1713)
	at com.carrotsearch.randomizedtesting.RandomizedRunner$8.evaluate(RandomizedRunner.java:907)
	at com.carrotsearch.randomizedtesting.RandomizedRunner$9.evaluate(RandomizedRunner.java:943)
	at com.carrotsearch.randomizedtesting.RandomizedRunner$10.evaluate(RandomizedRunner.java:957)
	at com.carrotsearch.randomizedtesting.rules.SystemPropertiesRestoreRule$1.evaluate(SystemPropertiesRestoreRule.java:57)
	at org.apache.lucene.util.TestRuleSetupTeardownChained$1.evaluate(TestRuleSetupTeardownChained.java:49)
	at org.apache.lucene.util.AbstractBeforeAfterRule$1.evaluate(AbstractBeforeAfterRule.java:45)
	at org.apache.lucene.util.TestRuleThreadAndTestName$1.evaluate(TestRuleThreadAndTestName.java:48)
	at org.apache.lucene.util.TestRuleIgnoreAfterMaxFailures$1.evaluate(TestRuleIgnoreAfterMaxFailures.java:64)
	at org.apache.lucene.util.TestRuleMarkFailure$1.evaluate(TestRuleMarkFailure.java:47)
	at com.carrotsearch.randomizedtesting.rules.StatementAdapter.evaluate(StatementAdapter.java:36)
	at com.carrotsearch.randomizedtesting.ThreadLeakControl$StatementRunner.run(ThreadLeakControl.java:368)
	at com.carrotsearch.randomizedtesting.ThreadLeakControl.forkTimeoutingTask(ThreadLeakControl.java:817)
	at com.carrotsearch.randomizedtesting.ThreadLeakControl$3.evaluate(ThreadLeakControl.java:468)
	at com.carrotsearch.randomizedtesting.RandomizedRunner.runSingleTest(RandomizedRunner.java:916)
	at com.carrotsearch.randomizedtesting.RandomizedRunner$5.evaluate(RandomizedRunner.java:802)
	at com.carrotsearch.randomizedtesting.RandomizedRunner$6.evaluate(RandomizedRunner.java:852)
	at com.carrotsearch.randomizedtesting.RandomizedRunner$7.evaluate(RandomizedRunner.java:863)
	at com.carrotsearch.randomizedtesting.rules.StatementAdapter.evaluate(StatementAdapter.java:36)
	at com.carrotsearch.randomizedtesting.rules.SystemPropertiesRestoreRule$1.evaluate(SystemPropertiesRestoreRule.java:57)
	at org.apache.lucene.util.AbstractBeforeAfterRule$1.evaluate(AbstractBeforeAfterRule.java:45)
	at com.carrotsearch.randomizedtesting.rules.StatementAdapter.evaluate(StatementAdapter.java:36)
	at org.apache.lucene.util.TestRuleStoreClassName$1.evaluate(TestRuleStoreClassName.java:41)
	at com.carrotsearch.randomizedtesting.rules.NoShadowingOrOverridesOnMethodsRule$1.evaluate(NoShadowingOrOverridesOnMethodsRule.java:40)
	at com.carrotsearch.randomizedtesting.rules.NoShadowingOrOverridesOnMethodsRule$1.evaluate(NoShadowingOrOverridesOnMethodsRule.java:40)
	at com.carrotsearch.randomizedtesting.rules.StatementAdapter.evaluate(StatementAdapter.java:36)
	at com.carrotsearch.randomizedtesting.rules.StatementAdapter.evaluate(StatementAdapter.java:36)
	at com.carrotsearch.randomizedtesting.rules.StatementAdapter.evaluate(StatementAdapter.java:36)
	at org.apache.lucene.util.TestRuleAssertionsRequired$1.evaluate(TestRuleAssertionsRequired.java:53)
	at org.apache.lucene.util.TestRuleMarkFailure$1.evaluate(TestRuleMarkFailure.java:47)
	at org.apache.lucene.util.TestRuleIgnoreAfterMaxFailures$1.evaluate(TestRuleIgnoreAfterMaxFailures.java:64)
	at org.apache.lucene.util.TestRuleIgnoreTestSuites$1.evaluate(TestRuleIgnoreTestSuites.java:54)
	at com.carrotsearch.randomizedtesting.rules.StatementAdapter.evaluate(StatementAdapter.java:36)
	at com.carrotsearch.randomizedtesting.ThreadLeakControl$StatementRunner.run(ThreadLeakControl.java:368)
	at java.lang.Thread.run(Thread.java:748)
Caused by: org.apache.solr.common.SolrException: Cannot use facet.mincount=0 on field number_p_f_dv which is Points-based
	at org.apache.solr.request.NumericFacets.getCountsSingleValue(NumericFacets.java:184)
	at org.apache.solr.request.NumericFacets.getCounts(NumericFacets.java:170)
	at org.apache.solr.request.SimpleFacets.getTermCounts(SimpleFacets.java:499)
	at org.apache.solr.request.SimpleFacets.getTermCounts(SimpleFacets.java:405)
	at org.apache.solr.request.SimpleFacets.lambda$getFacetFieldCounts$0(SimpleFacets.java:803)
	at java.util.concurrent.FutureTask.run(FutureTask.java:266)
	at org.apache.solr.request.SimpleFacets$3.execute(SimpleFacets.java:742)
	at org.apache.solr.request.SimpleFacets.getFacetFieldCounts(SimpleFacets.java:818)
	at org.apache.solr.handler.component.FacetComponent.getFacetCounts(FacetComponent.java:329)
	at org.apache.solr.handler.component.FacetComponent.process(FacetComponent.java:273)
	at org.apache.solr.handler.component.SearchHandler.handleRequestBody(SearchHandler.java:295)
	at org.apache.solr.handler.RequestHandlerBase.handleRequest(RequestHandlerBase.java:177)
	at org.apache.solr.core.SolrCore.execute(SolrCore.java:2473)
	at org.apach

[...truncated too long message...]

   x:collection1] o.a.s.c.S.Request [collection1]  webapp=/solr path=/select params={q=id:testSetNullUpdates&wt=javabin&version=2} hits=1 status=0 QTime=0
   [junit4]   2> 112860 INFO  (TEST-SolrExampleJettyTest.testSetNullUpdates-seed#[E7F14E451A38FDBF]) [    ] o.a.s.SolrTestCaseJ4 ###Ending testSetNullUpdates
   [junit4]   2> 112861 INFO  (SUITE-SolrExampleJettyTest-seed#[E7F14E451A38FDBF]-worker) [    ] o.e.j.s.AbstractConnector Stopped ServerConnector@62d480{HTTP/1.1,[http/1.1]}{127.0.0.1:0}
   [junit4]   2> 112862 INFO  (SUITE-SolrExampleJettyTest-seed#[E7F14E451A38FDBF]-worker) [    ] o.a.s.c.CoreContainer Shutting down CoreContainer instance=20627361
   [junit4]   2> 112862 INFO  (SUITE-SolrExampleJettyTest-seed#[E7F14E451A38FDBF]-worker) [    ] o.a.s.m.SolrMetricManager Closing metric reporters for registry=solr.node, tag=null
   [junit4]   2> 112863 INFO  (SUITE-SolrExampleJettyTest-seed#[E7F14E451A38FDBF]-worker) [    ] o.a.s.m.SolrMetricManager Closing metric reporters for registry=solr.jvm, tag=null
   [junit4]   2> 112864 INFO  (SUITE-SolrExampleJettyTest-seed#[E7F14E451A38FDBF]-worker) [    ] o.a.s.m.SolrMetricManager Closing metric reporters for registry=solr.jetty, tag=null
   [junit4]   2> 112864 INFO  (SUITE-SolrExampleJettyTest-seed#[E7F14E451A38FDBF]-worker) [    ] o.a.s.c.TransientSolrCoreCacheDefault Allocating transient cache for 2147483647 transient cores
   [junit4]   2> 112865 INFO  (coreCloseExecutor-385-thread-1) [    x:collection1] o.a.s.c.SolrCore [collection1]  CLOSING SolrCore org.apache.solr.core.SolrCore@e74fc0
   [junit4]   2> 112866 INFO  (coreCloseExecutor-385-thread-1) [    x:collection1] o.a.s.u.LoggingInfoStream [IW][coreCloseExecutor-385-thread-1]: now flush at close
   [junit4]   2> 112866 INFO  (coreCloseExecutor-385-thread-1) [    x:collection1] o.a.s.u.LoggingInfoStream [IW][coreCloseExecutor-385-thread-1]:   start flush: applyAllDeletes=true
   [junit4]   2> 112866 INFO  (coreCloseExecutor-385-thread-1) [    x:collection1] o.a.s.u.LoggingInfoStream [IW][coreCloseExecutor-385-thread-1]:   index before flush _1a(7.1.0):C2 _1c(7.1.0):C1
   [junit4]   2> 112866 INFO  (coreCloseExecutor-385-thread-1) [    x:collection1] o.a.s.u.LoggingInfoStream [DW][coreCloseExecutor-385-thread-1]: startFullFlush
   [junit4]   2> 112866 INFO  (coreCloseExecutor-385-thread-1) [    x:collection1] o.a.s.u.LoggingInfoStream [DW][coreCloseExecutor-385-thread-1]: coreCloseExecutor-385-thread-1 finishFullFlush success=true
   [junit4]   2> 112866 INFO  (coreCloseExecutor-385-thread-1) [    x:collection1] o.a.s.u.LoggingInfoStream [IW][coreCloseExecutor-385-thread-1]: now apply all deletes for all segments buffered updates bytesUsed=0 reader pool bytesUsed=0
   [junit4]   2> 112866 INFO  (coreCloseExecutor-385-thread-1) [    x:collection1] o.a.s.u.LoggingInfoStream [BD][coreCloseExecutor-385-thread-1]: waitApply: no deletes to apply
   [junit4]   2> 112866 INFO  (coreCloseExecutor-385-thread-1) [    x:collection1] o.a.s.u.LoggingInfoStream [MS][coreCloseExecutor-385-thread-1]: updateMergeThreads ioThrottle=true targetMBPerSec=10240.0 MB/sec
   [junit4]   2> 112866 INFO  (coreCloseExecutor-385-thread-1) [    x:collection1] o.a.s.u.LoggingInfoStream [MS][coreCloseExecutor-385-thread-1]: now merge
   [junit4]   2> 112866 INFO  (coreCloseExecutor-385-thread-1) [    x:collection1] o.a.s.u.LoggingInfoStream [MS][coreCloseExecutor-385-thread-1]:   index: _1a(7.1.0):C2 _1c(7.1.0):C1
   [junit4]   2> 112866 INFO  (coreCloseExecutor-385-thread-1) [    x:collection1] o.a.s.u.LoggingInfoStream [MS][coreCloseExecutor-385-thread-1]:   no more merges pending; now return
   [junit4]   2> 112866 INFO  (coreCloseExecutor-385-thread-1) [    x:collection1] o.a.s.u.LoggingInfoStream [IW][coreCloseExecutor-385-thread-1]: waitForMerges
   [junit4]   2> 112866 INFO  (coreCloseExecutor-385-thread-1) [    x:collection1] o.a.s.u.LoggingInfoStream [IW][coreCloseExecutor-385-thread-1]: waitForMerges done
   [junit4]   2> 112866 INFO  (coreCloseExecutor-385-thread-1) [    x:collection1] o.a.s.u.LoggingInfoStream [IW][coreCloseExecutor-385-thread-1]: commit: start
   [junit4]   2> 112866 INFO  (coreCloseExecutor-385-thread-1) [    x:collection1] o.a.s.u.LoggingInfoStream [IW][coreCloseExecutor-385-thread-1]: commit: enter lock
   [junit4]   2> 112866 INFO  (coreCloseExecutor-385-thread-1) [    x:collection1] o.a.s.u.LoggingInfoStream [IW][coreCloseExecutor-385-thread-1]: commit: now prepare
   [junit4]   2> 112866 INFO  (coreCloseExecutor-385-thread-1) [    x:collection1] o.a.s.u.LoggingInfoStream [IW][coreCloseExecutor-385-thread-1]: prepareCommit: flush
   [junit4]   2> 112866 INFO  (coreCloseExecutor-385-thread-1) [    x:collection1] o.a.s.u.LoggingInfoStream [IW][coreCloseExecutor-385-thread-1]:   index before flush _1a(7.1.0):C2 _1c(7.1.0):C1
   [junit4]   2> 112866 INFO  (coreCloseExecutor-385-thread-1) [    x:collection1] o.a.s.u.LoggingInfoStream [DW][coreCloseExecutor-385-thread-1]: startFullFlush
   [junit4]   2> 112866 INFO  (coreCloseExecutor-385-thread-1) [    x:collection1] o.a.s.u.LoggingInfoStream [IW][coreCloseExecutor-385-thread-1]: now apply all deletes for all segments buffered updates bytesUsed=0 reader pool bytesUsed=0
   [junit4]   2> 112866 INFO  (coreCloseExecutor-385-thread-1) [    x:collection1] o.a.s.u.LoggingInfoStream [BD][coreCloseExecutor-385-thread-1]: waitApply: no deletes to apply
   [junit4]   2> 112866 INFO  (coreCloseExecutor-385-thread-1) [    x:collection1] o.a.s.u.LoggingInfoStream [DW][coreCloseExecutor-385-thread-1]: coreCloseExecutor-385-thread-1 finishFullFlush success=true
   [junit4]   2> 112866 INFO  (coreCloseExecutor-385-thread-1) [    x:collection1] o.a.s.u.LoggingInfoStream [IW][coreCloseExecutor-385-thread-1]: startCommit(): start
   [junit4]   2> 112866 INFO  (coreCloseExecutor-385-thread-1) [    x:collection1] o.a.s.u.LoggingInfoStream [IW][coreCloseExecutor-385-thread-1]:   skip startCommit(): no changes pending
   [junit4]   2> 112866 INFO  (coreCloseExecutor-385-thread-1) [    x:collection1] o.a.s.u.LoggingInfoStream [IW][coreCloseExecutor-385-thread-1]: commit: pendingCommit == null; skip
   [junit4]   2> 112866 INFO  (coreCloseExecutor-385-thread-1) [    x:collection1] o.a.s.u.LoggingInfoStream [IW][coreCloseExecutor-385-thread-1]: commit: took 0.2 msec
   [junit4]   2> 112866 INFO  (coreCloseExecutor-385-thread-1) [    x:collection1] o.a.s.u.LoggingInfoStream [IW][coreCloseExecutor-385-thread-1]: commit: done
   [junit4]   2> 112866 INFO  (coreCloseExecutor-385-thread-1) [    x:collection1] o.a.s.u.LoggingInfoStream [IW][coreCloseExecutor-385-thread-1]: rollback
   [junit4]   2> 112866 INFO  (coreCloseExecutor-385-thread-1) [    x:collection1] o.a.s.u.LoggingInfoStream [IW][coreCloseExecutor-385-thread-1]: all running merges have aborted
   [junit4]   2> 112866 INFO  (coreCloseExecutor-385-thread-1) [    x:collection1] o.a.s.u.LoggingInfoStream [IW][coreCloseExecutor-385-thread-1]: rollback: done finish merges
   [junit4]   2> 112866 INFO  (coreCloseExecutor-385-thread-1) [    x:collection1] o.a.s.u.LoggingInfoStream [DW][coreCloseExecutor-385-thread-1]: abort
   [junit4]   2> 112867 INFO  (coreCloseExecutor-385-thread-1) [    x:collection1] o.a.s.u.LoggingInfoStream [DW][coreCloseExecutor-385-thread-1]: done abort success=true
   [junit4]   2> 112867 INFO  (coreCloseExecutor-385-thread-1) [    x:collection1] o.a.s.u.LoggingInfoStream [IW][coreCloseExecutor-385-thread-1]: rollback: infos=_1a(7.1.0):C2 _1c(7.1.0):C1
   [junit4]   2> 112867 INFO  (coreCloseExecutor-385-thread-1) [    x:collection1] o.a.s.u.LoggingInfoStream [IFD][coreCloseExecutor-385-thread-1]: now checkpoint "_1a(7.1.0):C2 _1c(7.1.0):C1" [2 segments ; isCommit = false]
   [junit4]   2> 112867 INFO  (coreCloseExecutor-385-thread-1) [    x:collection1] o.a.s.u.LoggingInfoStream [IFD][coreCloseExecutor-385-thread-1]: 0 msec to checkpoint
   [junit4]   2> 112868 INFO  (coreCloseExecutor-385-thread-1) [    x:collection1] o.a.s.m.SolrMetricManager Closing metric reporters for registry=solr.core.collection1, tag=15159232
   [junit4]   2> 112872 INFO  (SUITE-SolrExampleJettyTest-seed#[E7F14E451A38FDBF]-worker) [    ] o.e.j.s.h.ContextHandler Stopped o.e.j.s.ServletContextHandler@541c94{/solr,null,UNAVAILABLE}
   [junit4]   2> NOTE: leaving temporary files on disk at: C:\Users\jenkins\workspace\Lucene-Solr-7.x-Windows\solr\build\solr-solrj\test\J0\temp\solr.client.solrj.embedded.SolrExampleJettyTest_E7F14E451A38FDBF-001
   [junit4]   2> NOTE: test params are: codec=FastCompressingStoredFields(storedFieldsFormat=CompressingStoredFieldsFormat(compressionMode=FAST, chunkSize=23559, maxDocsPerChunk=717, blockSize=5), termVectorsFormat=CompressingTermVectorsFormat(compressionMode=FAST, chunkSize=23559, blockSize=5)), sim=RandomSimilarity(queryNorm=false): {}, locale=ar, timezone=America/Boa_Vista
   [junit4]   2> NOTE: Windows 10 10.0 x86/Oracle Corporation 1.8.0_141 (32-bit)/cpus=3,threads=1,free=110534248,total=265814016
   [junit4]   2> NOTE: All tests run in this JVM: [TestConfigSetAdminRequest, NamedListTest, SolrExampleXMLTest, StreamExpressionParserTest, CommonParamsTest, CloudSolrClientTest, GraphExpressionTest, TestXMLEscaping, CubedRootEvaluatorTest, AndEvaluatorTest, FieldAnalysisResponseTest, LBHttpSolrClientBuilderTest, CloudSolrClientCacheTest, ArcSineEvaluatorTest, SolrExampleEmbeddedTest, SineEvaluatorTest, HyperbolicCosineEvaluatorTest, TestSuggesterResponse, TestUpdateRequestCodec, SolrSchemalessExampleTest, AbsoluteValueEvaluatorTest, HyperbolicTangentEvaluatorTest, OrEvaluatorTest, JsonValidatorTest, ArrayEvaluatorTest, SolrPingTest, StreamExpressionToExplanationTest, TestBatchUpdate, CollectionAdminRequestRequiredParamsTest, TestSpellCheckResponse, JettyWebappTest, TestV2Request, SolrExampleStreamingTest, SolrExampleJettyTest]
   [junit4] Completed [74/135 (6!)] on J0 in 6.76s, 37 tests, 1 error <<< FAILURES!

[...truncated 38715 lines...]

Mime
View raw message