lucene-dev mailing list archives

Site index · List index
Message view « Date » · « Thread »
Top « Date » · « Thread »
From Policeman Jenkins Server <jenk...@thetaphi.de>
Subject [JENKINS] Lucene-Solr-7.x-MacOSX (64bit/jdk1.8.0) - Build # 102 - Still Unstable!
Date Thu, 10 Aug 2017 06:15:54 GMT
Build: https://jenkins.thetaphi.de/job/Lucene-Solr-7.x-MacOSX/102/
Java: 64bit/jdk1.8.0 -XX:-UseCompressedOops -XX:+UseSerialGC

3 tests failed.
FAILED:  org.apache.solr.cloud.CustomCollectionTest.testCustomCollectionsAPI

Error Message:
Could not find collection : implicitcoll

Stack Trace:
org.apache.solr.common.SolrException: Could not find collection : implicitcoll
	at __randomizedtesting.SeedInfo.seed([2324542594E36A9E:49C5DA4EA979DCE6]:0)
	at org.apache.solr.common.cloud.ClusterState.getCollection(ClusterState.java:109)
	at org.apache.solr.cloud.SolrCloudTestCase.getCollectionState(SolrCloudTestCase.java:247)
	at org.apache.solr.cloud.CustomCollectionTest.testCustomCollectionsAPI(CustomCollectionTest.java:68)
	at sun.reflect.NativeMethodAccessorImpl.invoke0(Native Method)
	at sun.reflect.NativeMethodAccessorImpl.invoke(NativeMethodAccessorImpl.java:62)
	at sun.reflect.DelegatingMethodAccessorImpl.invoke(DelegatingMethodAccessorImpl.java:43)
	at java.lang.reflect.Method.invoke(Method.java:498)
	at com.carrotsearch.randomizedtesting.RandomizedRunner.invoke(RandomizedRunner.java:1713)
	at com.carrotsearch.randomizedtesting.RandomizedRunner$8.evaluate(RandomizedRunner.java:907)
	at com.carrotsearch.randomizedtesting.RandomizedRunner$9.evaluate(RandomizedRunner.java:943)
	at com.carrotsearch.randomizedtesting.RandomizedRunner$10.evaluate(RandomizedRunner.java:957)
	at com.carrotsearch.randomizedtesting.rules.SystemPropertiesRestoreRule$1.evaluate(SystemPropertiesRestoreRule.java:57)
	at org.apache.lucene.util.TestRuleSetupTeardownChained$1.evaluate(TestRuleSetupTeardownChained.java:49)
	at org.apache.lucene.util.AbstractBeforeAfterRule$1.evaluate(AbstractBeforeAfterRule.java:45)
	at org.apache.lucene.util.TestRuleThreadAndTestName$1.evaluate(TestRuleThreadAndTestName.java:48)
	at org.apache.lucene.util.TestRuleIgnoreAfterMaxFailures$1.evaluate(TestRuleIgnoreAfterMaxFailures.java:64)
	at org.apache.lucene.util.TestRuleMarkFailure$1.evaluate(TestRuleMarkFailure.java:47)
	at com.carrotsearch.randomizedtesting.rules.StatementAdapter.evaluate(StatementAdapter.java:36)
	at com.carrotsearch.randomizedtesting.ThreadLeakControl$StatementRunner.run(ThreadLeakControl.java:368)
	at com.carrotsearch.randomizedtesting.ThreadLeakControl.forkTimeoutingTask(ThreadLeakControl.java:817)
	at com.carrotsearch.randomizedtesting.ThreadLeakControl$3.evaluate(ThreadLeakControl.java:468)
	at com.carrotsearch.randomizedtesting.RandomizedRunner.runSingleTest(RandomizedRunner.java:916)
	at com.carrotsearch.randomizedtesting.RandomizedRunner$5.evaluate(RandomizedRunner.java:802)
	at com.carrotsearch.randomizedtesting.RandomizedRunner$6.evaluate(RandomizedRunner.java:852)
	at com.carrotsearch.randomizedtesting.RandomizedRunner$7.evaluate(RandomizedRunner.java:863)
	at com.carrotsearch.randomizedtesting.rules.StatementAdapter.evaluate(StatementAdapter.java:36)
	at com.carrotsearch.randomizedtesting.rules.SystemPropertiesRestoreRule$1.evaluate(SystemPropertiesRestoreRule.java:57)
	at org.apache.lucene.util.AbstractBeforeAfterRule$1.evaluate(AbstractBeforeAfterRule.java:45)
	at com.carrotsearch.randomizedtesting.rules.StatementAdapter.evaluate(StatementAdapter.java:36)
	at org.apache.lucene.util.TestRuleStoreClassName$1.evaluate(TestRuleStoreClassName.java:41)
	at com.carrotsearch.randomizedtesting.rules.NoShadowingOrOverridesOnMethodsRule$1.evaluate(NoShadowingOrOverridesOnMethodsRule.java:40)
	at com.carrotsearch.randomizedtesting.rules.NoShadowingOrOverridesOnMethodsRule$1.evaluate(NoShadowingOrOverridesOnMethodsRule.java:40)
	at com.carrotsearch.randomizedtesting.rules.StatementAdapter.evaluate(StatementAdapter.java:36)
	at com.carrotsearch.randomizedtesting.rules.StatementAdapter.evaluate(StatementAdapter.java:36)
	at com.carrotsearch.randomizedtesting.rules.StatementAdapter.evaluate(StatementAdapter.java:36)
	at org.apache.lucene.util.TestRuleAssertionsRequired$1.evaluate(TestRuleAssertionsRequired.java:53)
	at org.apache.lucene.util.TestRuleMarkFailure$1.evaluate(TestRuleMarkFailure.java:47)
	at org.apache.lucene.util.TestRuleIgnoreAfterMaxFailures$1.evaluate(TestRuleIgnoreAfterMaxFailures.java:64)
	at org.apache.lucene.util.TestRuleIgnoreTestSuites$1.evaluate(TestRuleIgnoreTestSuites.java:54)
	at com.carrotsearch.randomizedtesting.rules.StatementAdapter.evaluate(StatementAdapter.java:36)
	at com.carrotsearch.randomizedtesting.ThreadLeakControl$StatementRunner.run(ThreadLeakControl.java:368)
	at java.lang.Thread.run(Thread.java:748)


FAILED:  org.apache.solr.cloud.FullSolrCloudDistribCmdsTest.test

Error Message:
Could not find collection:collection2

Stack Trace:
java.lang.AssertionError: Could not find collection:collection2
	at __randomizedtesting.SeedInfo.seed([2324542594E36A9E:AB706BFF3A1F0766]:0)
	at org.junit.Assert.fail(Assert.java:93)
	at org.junit.Assert.assertTrue(Assert.java:43)
	at org.junit.Assert.assertNotNull(Assert.java:526)
	at org.apache.solr.cloud.AbstractDistribZkTestBase.waitForRecoveriesToFinish(AbstractDistribZkTestBase.java:155)
	at org.apache.solr.cloud.AbstractDistribZkTestBase.waitForRecoveriesToFinish(AbstractDistribZkTestBase.java:140)
	at org.apache.solr.cloud.AbstractDistribZkTestBase.waitForRecoveriesToFinish(AbstractDistribZkTestBase.java:135)
	at org.apache.solr.cloud.AbstractFullDistribZkTestBase.waitForRecoveriesToFinish(AbstractFullDistribZkTestBase.java:908)
	at org.apache.solr.cloud.FullSolrCloudDistribCmdsTest.testIndexingBatchPerRequestWithHttpSolrClient(FullSolrCloudDistribCmdsTest.java:612)
	at org.apache.solr.cloud.FullSolrCloudDistribCmdsTest.test(FullSolrCloudDistribCmdsTest.java:152)
	at sun.reflect.NativeMethodAccessorImpl.invoke0(Native Method)
	at sun.reflect.NativeMethodAccessorImpl.invoke(NativeMethodAccessorImpl.java:62)
	at sun.reflect.DelegatingMethodAccessorImpl.invoke(DelegatingMethodAccessorImpl.java:43)
	at java.lang.reflect.Method.invoke(Method.java:498)
	at com.carrotsearch.randomizedtesting.RandomizedRunner.invoke(RandomizedRunner.java:1713)
	at com.carrotsearch.randomizedtesting.RandomizedRunner$8.evaluate(RandomizedRunner.java:907)
	at com.carrotsearch.randomizedtesting.RandomizedRunner$9.evaluate(RandomizedRunner.java:943)
	at com.carrotsearch.randomizedtesting.RandomizedRunner$10.evaluate(RandomizedRunner.java:957)
	at org.apache.solr.BaseDistributedSearchTestCase$ShardsRepeatRule$ShardsFixedStatement.callStatement(BaseDistributedSearchTestCase.java:993)
	at org.apache.solr.BaseDistributedSearchTestCase$ShardsRepeatRule$ShardsStatement.evaluate(BaseDistributedSearchTestCase.java:968)
	at com.carrotsearch.randomizedtesting.rules.SystemPropertiesRestoreRule$1.evaluate(SystemPropertiesRestoreRule.java:57)
	at org.apache.lucene.util.TestRuleSetupTeardownChained$1.evaluate(TestRuleSetupTeardownChained.java:49)
	at org.apache.lucene.util.AbstractBeforeAfterRule$1.evaluate(AbstractBeforeAfterRule.java:45)
	at org.apache.lucene.util.TestRuleThreadAndTestName$1.evaluate(TestRuleThreadAndTestName.java:48)
	at org.apache.lucene.util.TestRuleIgnoreAfterMaxFailures$1.evaluate(TestRuleIgnoreAfterMaxFailures.java:64)
	at org.apache.lucene.util.TestRuleMarkFailure$1.evaluate(TestRuleMarkFailure.java:47)
	at com.carrotsearch.randomizedtesting.rules.StatementAdapter.evaluate(StatementAdapter.java:36)
	at com.carrotsearch.randomizedtesting.ThreadLeakControl$StatementRunner.run(ThreadLeakControl.java:368)
	at com.carrotsearch.randomizedtesting.ThreadLeakControl.forkTimeoutingTask(ThreadLeakControl.java:817)
	at com.carrotsearch.randomizedtesting.ThreadLeakControl$3.evaluate(ThreadLeakControl.java:468)
	at com.carrotsearch.randomizedtesting.RandomizedRunner.runSingleTest(RandomizedRunner.java:916)
	at com.carrotsearch.randomizedtesting.RandomizedRunner$5.evaluate(RandomizedRunner.java:802)
	at com.carrotsearch.randomizedtesting.RandomizedRunner$6.evaluate(RandomizedRunner.java:852)
	at com.carrotsearch.randomizedtesting.RandomizedRunner$7.evaluate(RandomizedRunner.java:863)
	at com.carrotsearch.randomizedtesting.rules.StatementAdapter.evaluate(StatementAdapter.java:36)
	at com.carrotsearch.randomizedtesting.rules.SystemPropertiesRestoreRule$1.evaluate(SystemPropertiesRestoreRule.java:57)
	at org.apache.lucene.util.AbstractBeforeAfterRule$1.evaluate(AbstractBeforeAfterRule.java:45)
	at com.carrotsearch.randomizedtesting.rules.StatementAdapter.evaluate(StatementAdapter.java:36)
	at org.apache.lucene.util.TestRuleStoreClassName$1.evaluate(TestRuleStoreClassName.java:41)
	at com.carrotsearch.randomizedtesting.rules.NoShadowingOrOverridesOnMethodsRule$1.evaluate(NoShadowingOrOverridesOnMethodsRule.java:40)
	at com.carrotsearch.randomizedtesting.rules.NoShadowingOrOverridesOnMethodsRule$1.evaluate(NoShadowingOrOverridesOnMethodsRule.java:40)
	at com.carrotsearch.randomizedtesting.rules.StatementAdapter.evaluate(StatementAdapter.java:36)
	at com.carrotsearch.randomizedtesting.rules.StatementAdapter.evaluate(StatementAdapter.java:36)
	at com.carrotsearch.randomizedtesting.rules.StatementAdapter.evaluate(StatementAdapter.java:36)
	at org.apache.lucene.util.TestRuleAssertionsRequired$1.evaluate(TestRuleAssertionsRequired.java:53)
	at org.apache.lucene.util.TestRuleMarkFailure$1.evaluate(TestRuleMarkFailure.java:47)
	at org.apache.lucene.util.TestRuleIgnoreAfterMaxFailures$1.evaluate(TestRuleIgnoreAfterMaxFailures.java:64)
	at org.apache.lucene.util.TestRuleIgnoreTestSuites$1.evaluate(TestRuleIgnoreTestSuites.java:54)
	at com.carrotsearch.randomizedtesting.rules.StatementAdapter.evaluate(StatementAdapter.java:36)
	at com.carrotsearch.randomizedtesting.ThreadLeakControl$StatementRunner.run(ThreadLeakControl.java:368)
	at java.lang.Thread.run(Thread.java:748)


FAILED:  org.apache.solr.cloud.ReplaceNodeTest.test

Error Message:
Captured an uncaught exception in thread: Thread[id=22542, name=OverseerThreadFactory-9032-thread-2, state=RUNNABLE, group=Overseer collection creation process.]

Stack Trace:
com.carrotsearch.randomizedtesting.UncaughtExceptionError: Captured an uncaught exception in thread: Thread[id=22542, name=OverseerThreadFactory-9032-thread-2, state=RUNNABLE, group=Overseer collection creation process.]
Caused by: java.lang.NoClassDefFoundError: org/apache/solr/cloud/ReplaceNodeCmd$RecoveryWatcher
	at __randomizedtesting.SeedInfo.seed([2324542594E36A9E]:0)
	at org.apache.solr.cloud.ReplaceNodeCmd.call(ReplaceNodeCmd.java:130)
	at org.apache.solr.cloud.OverseerCollectionMessageHandler.processMessage(OverseerCollectionMessageHandler.java:227)
	at org.apache.solr.cloud.OverseerTaskProcessor$Runner.run(OverseerTaskProcessor.java:464)
	at org.apache.solr.common.util.ExecutorUtil$MDCAwareThreadPoolExecutor.lambda$execute$0(ExecutorUtil.java:188)
	at java.util.concurrent.ThreadPoolExecutor.runWorker(ThreadPoolExecutor.java:1149)
	at java.util.concurrent.ThreadPoolExecutor$Worker.run(ThreadPoolExecutor.java:624)
	at java.lang.Thread.run(Thread.java:748)
Caused by: java.lang.ClassNotFoundException: org.apache.solr.cloud.ReplaceNodeCmd$RecoveryWatcher
	at java.net.URLClassLoader$1.run(URLClassLoader.java:370)
	at java.net.URLClassLoader$1.run(URLClassLoader.java:362)
	at java.security.AccessController.doPrivileged(Native Method)
	at java.net.URLClassLoader.findClass(URLClassLoader.java:361)
	at java.lang.ClassLoader.loadClass(ClassLoader.java:424)
	at sun.misc.Launcher$AppClassLoader.loadClass(Launcher.java:335)
	at java.lang.ClassLoader.loadClass(ClassLoader.java:357)
	... 7 more
Caused by: java.io.FileNotFoundException: /Users/jenkins/workspace/Lucene-Solr-7.x-MacOSX/solr/build/solr-core/classes/java/org/apache/solr/cloud/ReplaceNodeCmd$RecoveryWatcher.class (Too many open files)
	at java.io.FileInputStream.open0(Native Method)
	at java.io.FileInputStream.open(FileInputStream.java:195)
	at java.io.FileInputStream.<init>(FileInputStream.java:138)
	at sun.misc.URLClassPath$FileLoader$1.getInputStream(URLClassPath.java:1288)
	at sun.misc.Resource.cachedInputStream(Resource.java:77)
	at sun.misc.Resource.getByteBuffer(Resource.java:160)
	at java.net.URLClassLoader.defineClass(URLClassLoader.java:454)
	at java.net.URLClassLoader.access$100(URLClassLoader.java:73)
	at java.net.URLClassLoader$1.run(URLClassLoader.java:368)
	... 13 more




Build Log:
[...truncated 12038 lines...]
   [junit4] Suite: org.apache.solr.cloud.FullSolrCloudDistribCmdsTest
   [junit4]   2> Creating dataDir: /Users/jenkins/workspace/Lucene-Solr-7.x-MacOSX/solr/build/solr-core/test/J1/temp/solr.cloud.FullSolrCloudDistribCmdsTest_2324542594E36A9E-001/init-core-data-001
   [junit4]   2> 1515925 WARN  (SUITE-FullSolrCloudDistribCmdsTest-seed#[2324542594E36A9E]-worker) [    ] o.a.s.SolrTestCaseJ4 startTrackingSearchers: numOpens=10 numCloses=10
   [junit4]   2> 1515925 INFO  (SUITE-FullSolrCloudDistribCmdsTest-seed#[2324542594E36A9E]-worker) [    ] o.a.s.SolrTestCaseJ4 Using PointFields (NUMERIC_POINTS_SYSPROP=true) w/NUMERIC_DOCVALUES_SYSPROP=false
   [junit4]   2> 1515933 INFO  (SUITE-FullSolrCloudDistribCmdsTest-seed#[2324542594E36A9E]-worker) [    ] o.a.s.SolrTestCaseJ4 Randomized ssl (false) and clientAuth (false) via: @org.apache.solr.SolrTestCaseJ4$SuppressSSL(bugUrl=https://issues.apache.org/jira/browse/SOLR-5776) w/ MAC_OS_X supressed clientAuth
   [junit4]   2> 1515933 INFO  (SUITE-FullSolrCloudDistribCmdsTest-seed#[2324542594E36A9E]-worker) [    ] o.a.s.SolrTestCaseJ4 SecureRandom sanity checks: test.solr.allowed.securerandom=null & java.security.egd=file:/dev/./urandom
   [junit4]   2> 1515933 INFO  (SUITE-FullSolrCloudDistribCmdsTest-seed#[2324542594E36A9E]-worker) [    ] o.a.s.BaseDistributedSearchTestCase Setting hostContext system property: /kw_z/
   [junit4]   2> 1515935 INFO  (TEST-FullSolrCloudDistribCmdsTest.test-seed#[2324542594E36A9E]) [    ] o.a.s.c.ZkTestServer STARTING ZK TEST SERVER
   [junit4]   2> 1515935 INFO  (Thread-3222) [    ] o.a.s.c.ZkTestServer client port:0.0.0.0/0.0.0.0:0
   [junit4]   2> 1515935 INFO  (Thread-3222) [    ] o.a.s.c.ZkTestServer Starting server
   [junit4]   2> 1515938 ERROR (Thread-3222) [    ] o.a.z.s.ZooKeeperServer ZKShutdownHandler is not registered, so ZooKeeper server won't take any action on ERROR or SHUTDOWN server state changes
   [junit4]   2> 1516045 INFO  (TEST-FullSolrCloudDistribCmdsTest.test-seed#[2324542594E36A9E]) [    ] o.a.s.c.ZkTestServer start zk server on port:51935
   [junit4]   2> 1516087 INFO  (TEST-FullSolrCloudDistribCmdsTest.test-seed#[2324542594E36A9E]) [    ] o.a.s.c.AbstractZkTestCase put /Users/jenkins/workspace/Lucene-Solr-7.x-MacOSX/solr/core/src/test-files/solr/collection1/conf/solrconfig-tlog.xml to /configs/conf1/solrconfig.xml
   [junit4]   2> 1516091 INFO  (TEST-FullSolrCloudDistribCmdsTest.test-seed#[2324542594E36A9E]) [    ] o.a.s.c.AbstractZkTestCase put /Users/jenkins/workspace/Lucene-Solr-7.x-MacOSX/solr/core/src/test-files/solr/collection1/conf/schema15.xml to /configs/conf1/schema.xml
   [junit4]   2> 1516099 INFO  (TEST-FullSolrCloudDistribCmdsTest.test-seed#[2324542594E36A9E]) [    ] o.a.s.c.AbstractZkTestCase put /Users/jenkins/workspace/Lucene-Solr-7.x-MacOSX/solr/core/src/test-files/solr/collection1/conf/solrconfig.snippet.randomindexconfig.xml to /configs/conf1/solrconfig.snippet.randomindexconfig.xml
   [junit4]   2> 1516101 INFO  (TEST-FullSolrCloudDistribCmdsTest.test-seed#[2324542594E36A9E]) [    ] o.a.s.c.AbstractZkTestCase put /Users/jenkins/workspace/Lucene-Solr-7.x-MacOSX/solr/core/src/test-files/solr/collection1/conf/stopwords.txt to /configs/conf1/stopwords.txt
   [junit4]   2> 1516106 INFO  (TEST-FullSolrCloudDistribCmdsTest.test-seed#[2324542594E36A9E]) [    ] o.a.s.c.AbstractZkTestCase put /Users/jenkins/workspace/Lucene-Solr-7.x-MacOSX/solr/core/src/test-files/solr/collection1/conf/protwords.txt to /configs/conf1/protwords.txt
   [junit4]   2> 1516108 INFO  (TEST-FullSolrCloudDistribCmdsTest.test-seed#[2324542594E36A9E]) [    ] o.a.s.c.AbstractZkTestCase put /Users/jenkins/workspace/Lucene-Solr-7.x-MacOSX/solr/core/src/test-files/solr/collection1/conf/currency.xml to /configs/conf1/currency.xml
   [junit4]   2> 1516111 INFO  (TEST-FullSolrCloudDistribCmdsTest.test-seed#[2324542594E36A9E]) [    ] o.a.s.c.AbstractZkTestCase put /Users/jenkins/workspace/Lucene-Solr-7.x-MacOSX/solr/core/src/test-files/solr/collection1/conf/enumsConfig.xml to /configs/conf1/enumsConfig.xml
   [junit4]   2> 1516113 INFO  (TEST-FullSolrCloudDistribCmdsTest.test-seed#[2324542594E36A9E]) [    ] o.a.s.c.AbstractZkTestCase put /Users/jenkins/workspace/Lucene-Solr-7.x-MacOSX/solr/core/src/test-files/solr/collection1/conf/open-exchange-rates.json to /configs/conf1/open-exchange-rates.json
   [junit4]   2> 1516115 INFO  (TEST-FullSolrCloudDistribCmdsTest.test-seed#[2324542594E36A9E]) [    ] o.a.s.c.AbstractZkTestCase put /Users/jenkins/workspace/Lucene-Solr-7.x-MacOSX/solr/core/src/test-files/solr/collection1/conf/mapping-ISOLatin1Accent.txt to /configs/conf1/mapping-ISOLatin1Accent.txt
   [junit4]   2> 1516117 INFO  (TEST-FullSolrCloudDistribCmdsTest.test-seed#[2324542594E36A9E]) [    ] o.a.s.c.AbstractZkTestCase put /Users/jenkins/workspace/Lucene-Solr-7.x-MacOSX/solr/core/src/test-files/solr/collection1/conf/old_synonyms.txt to /configs/conf1/old_synonyms.txt
   [junit4]   2> 1516119 INFO  (TEST-FullSolrCloudDistribCmdsTest.test-seed#[2324542594E36A9E]) [    ] o.a.s.c.AbstractZkTestCase put /Users/jenkins/workspace/Lucene-Solr-7.x-MacOSX/solr/core/src/test-files/solr/collection1/conf/synonyms.txt to /configs/conf1/synonyms.txt
   [junit4]   2> 1516122 INFO  (TEST-FullSolrCloudDistribCmdsTest.test-seed#[2324542594E36A9E]) [    ] o.a.s.c.AbstractFullDistribZkTestBase Will use NRT replicas unless explicitly asked otherwise
   [junit4]   2> 1517164 INFO  (TEST-FullSolrCloudDistribCmdsTest.test-seed#[2324542594E36A9E]) [    ] o.e.j.s.Server jetty-9.3.14.v20161028
   [junit4]   2> 1517166 INFO  (TEST-FullSolrCloudDistribCmdsTest.test-seed#[2324542594E36A9E]) [    ] o.e.j.s.h.ContextHandler Started o.e.j.s.ServletContextHandler@781c5c82{/kw_z,null,AVAILABLE}
   [junit4]   2> 1517167 INFO  (TEST-FullSolrCloudDistribCmdsTest.test-seed#[2324542594E36A9E]) [    ] o.e.j.s.AbstractConnector Started ServerConnector@7f12d9f4{HTTP/1.1,[http/1.1]}{127.0.0.1:51938}
   [junit4]   2> 1517167 INFO  (TEST-FullSolrCloudDistribCmdsTest.test-seed#[2324542594E36A9E]) [    ] o.e.j.s.Server Started @1520482ms
   [junit4]   2> 1517167 INFO  (TEST-FullSolrCloudDistribCmdsTest.test-seed#[2324542594E36A9E]) [    ] o.a.s.c.s.e.JettySolrRunner Jetty properties: {solr.data.dir=/Users/jenkins/workspace/Lucene-Solr-7.x-MacOSX/solr/build/solr-core/test/J1/temp/solr.cloud.FullSolrCloudDistribCmdsTest_2324542594E36A9E-001/tempDir-001/control/data, replicaType=NRT, hostContext=/kw_z, hostPort=51938, coreRootDirectory=/Users/jenkins/workspace/Lucene-Solr-7.x-MacOSX/solr/build/solr-core/test/J1/temp/solr.cloud.FullSolrCloudDistribCmdsTest_2324542594E36A9E-001/control-001/cores}
   [junit4]   2> 1517168 ERROR (TEST-FullSolrCloudDistribCmdsTest.test-seed#[2324542594E36A9E]) [    ] o.a.s.s.StartupLoggingUtils Missing Java Option solr.log.dir. Logging may be missing or incomplete.
   [junit4]   2> 1517168 INFO  (TEST-FullSolrCloudDistribCmdsTest.test-seed#[2324542594E36A9E]) [    ] o.a.s.s.SolrDispatchFilter  ___      _       Welcome to Apache Solr? version 7.1.0
   [junit4]   2> 1517168 INFO  (TEST-FullSolrCloudDistribCmdsTest.test-seed#[2324542594E36A9E]) [    ] o.a.s.s.SolrDispatchFilter / __| ___| |_ _   Starting in cloud mode on port null
   [junit4]   2> 1517168 INFO  (TEST-FullSolrCloudDistribCmdsTest.test-seed#[2324542594E36A9E]) [    ] o.a.s.s.SolrDispatchFilter \__ \/ _ \ | '_|  Install dir: null, Default config dir: null
   [junit4]   2> 1517168 INFO  (TEST-FullSolrCloudDistribCmdsTest.test-seed#[2324542594E36A9E]) [    ] o.a.s.s.SolrDispatchFilter |___/\___/_|_|    Start time: 2017-08-10T05:34:29.576Z
   [junit4]   2> 1517175 INFO  (TEST-FullSolrCloudDistribCmdsTest.test-seed#[2324542594E36A9E]) [    ] o.a.s.s.SolrDispatchFilter Loading solr.xml from SolrHome (not found in ZooKeeper)
   [junit4]   2> 1517177 INFO  (TEST-FullSolrCloudDistribCmdsTest.test-seed#[2324542594E36A9E]) [    ] o.a.s.c.SolrXmlConfig Loading container configuration from /Users/jenkins/workspace/Lucene-Solr-7.x-MacOSX/solr/build/solr-core/test/J1/temp/solr.cloud.FullSolrCloudDistribCmdsTest_2324542594E36A9E-001/control-001/solr.xml
   [junit4]   2> 1517186 INFO  (TEST-FullSolrCloudDistribCmdsTest.test-seed#[2324542594E36A9E]) [    ] o.a.s.c.SolrXmlConfig MBean server found: com.sun.jmx.mbeanserver.JmxMBeanServer@6925413e, but no JMX reporters were configured - adding default JMX reporter.
   [junit4]   2> 1517192 INFO  (TEST-FullSolrCloudDistribCmdsTest.test-seed#[2324542594E36A9E]) [    ] o.a.s.c.ZkContainer Zookeeper client=127.0.0.1:51935/solr
   [junit4]   2> 1517381 INFO  (TEST-FullSolrCloudDistribCmdsTest.test-seed#[2324542594E36A9E]) [n:127.0.0.1:51938_kw_z    ] o.a.s.c.Overseer Overseer (id=null) closing
   [junit4]   2> 1517382 INFO  (TEST-FullSolrCloudDistribCmdsTest.test-seed#[2324542594E36A9E]) [n:127.0.0.1:51938_kw_z    ] o.a.s.c.OverseerElectionContext I am going to be the leader 127.0.0.1:51938_kw_z
   [junit4]   2> 1517384 INFO  (TEST-FullSolrCloudDistribCmdsTest.test-seed#[2324542594E36A9E]) [n:127.0.0.1:51938_kw_z    ] o.a.s.c.Overseer Overseer (id=98457568434257924-127.0.0.1:51938_kw_z-n_0000000000) starting
   [junit4]   2> 1517398 INFO  (TEST-FullSolrCloudDistribCmdsTest.test-seed#[2324542594E36A9E]) [n:127.0.0.1:51938_kw_z    ] o.a.s.c.ZkController Register node as live in ZooKeeper:/live_nodes/127.0.0.1:51938_kw_z
   [junit4]   2> 1517400 INFO  (zkCallback-3033-thread-1-processing-n:127.0.0.1:51938_kw_z) [n:127.0.0.1:51938_kw_z    ] o.a.s.c.c.ZkStateReader Updated live nodes from ZooKeeper... (0) -> (1)
   [junit4]   2> 1517494 INFO  (TEST-FullSolrCloudDistribCmdsTest.test-seed#[2324542594E36A9E]) [n:127.0.0.1:51938_kw_z    ] o.a.s.m.r.SolrJmxReporter JMX monitoring for 'solr.node' (registry 'solr.node') enabled at server: com.sun.jmx.mbeanserver.JmxMBeanServer@6925413e
   [junit4]   2> 1517501 INFO  (TEST-FullSolrCloudDistribCmdsTest.test-seed#[2324542594E36A9E]) [n:127.0.0.1:51938_kw_z    ] o.a.s.m.r.SolrJmxReporter JMX monitoring for 'solr.jvm' (registry 'solr.jvm') enabled at server: com.sun.jmx.mbeanserver.JmxMBeanServer@6925413e
   [junit4]   2> 1517501 INFO  (TEST-FullSolrCloudDistribCmdsTest.test-seed#[2324542594E36A9E]) [n:127.0.0.1:51938_kw_z    ] o.a.s.m.r.SolrJmxReporter JMX monitoring for 'solr.jetty' (registry 'solr.jetty') enabled at server: com.sun.jmx.mbeanserver.JmxMBeanServer@6925413e
   [junit4]   2> 1517503 INFO  (TEST-FullSolrCloudDistribCmdsTest.test-seed#[2324542594E36A9E]) [n:127.0.0.1:51938_kw_z    ] o.a.s.c.CorePropertiesLocator Found 0 core definitions underneath /Users/jenkins/workspace/Lucene-Solr-7.x-MacOSX/solr/build/solr-core/test/J1/temp/solr.cloud.FullSolrCloudDistribCmdsTest_2324542594E36A9E-001/control-001/cores
   [junit4]   2> 1517525 INFO  (TEST-FullSolrCloudDistribCmdsTest.test-seed#[2324542594E36A9E]) [    ] o.a.s.c.c.ZkStateReader Updated live nodes from ZooKeeper... (0) -> (1)
   [junit4]   2> 1517527 INFO  (TEST-FullSolrCloudDistribCmdsTest.test-seed#[2324542594E36A9E]) [    ] o.a.s.c.s.i.ZkClientClusterStateProvider Cluster at 127.0.0.1:51935/solr ready
   [junit4]   2> 1517529 INFO  (qtp1717663443-16698) [n:127.0.0.1:51938_kw_z    ] o.a.s.h.a.CollectionsHandler Invoked Collection Action :create with params replicationFactor=1&collection.configName=conf1&name=control_collection&nrtReplicas=1&action=CREATE&numShards=1&createNodeSet=127.0.0.1:51938_kw_z&wt=javabin&version=2 and sendToOCPQueue=true
   [junit4]   2> 1517532 INFO  (OverseerThreadFactory-6277-thread-1-processing-n:127.0.0.1:51938_kw_z) [n:127.0.0.1:51938_kw_z    ] o.a.s.c.CreateCollectionCmd Create collection control_collection
   [junit4]   2> 1517643 INFO  (qtp1717663443-16699) [n:127.0.0.1:51938_kw_z    ] o.a.s.h.a.CoreAdminOperation core create command qt=/admin/cores&collection.configName=conf1&newCollection=true&name=control_collection_shard1_replica_n1&action=CREATE&numShards=1&collection=control_collection&shard=shard1&wt=javabin&version=2&replicaType=NRT
   [junit4]   2> 1517643 INFO  (qtp1717663443-16699) [n:127.0.0.1:51938_kw_z    ] o.a.s.c.TransientSolrCoreCacheDefault Allocating transient cache for 4 transient cores
   [junit4]   2> 1517765 INFO  (zkCallback-3033-thread-1-processing-n:127.0.0.1:51938_kw_z) [n:127.0.0.1:51938_kw_z    ] o.a.s.c.c.ZkStateReader A cluster state change: [WatchedEvent state:SyncConnected type:NodeDataChanged path:/collections/control_collection/state.json] for collection [control_collection] has occurred - updating... (live nodes size: [1])
   [junit4]   2> 1518685 INFO  (qtp1717663443-16699) [n:127.0.0.1:51938_kw_z c:control_collection s:shard1  x:control_collection_shard1_replica_n1] o.a.s.c.SolrConfig Using Lucene MatchVersion: 7.1.0
   [junit4]   2> 1518698 INFO  (qtp1717663443-16699) [n:127.0.0.1:51938_kw_z c:control_collection s:shard1  x:control_collection_shard1_replica_n1] o.a.s.s.IndexSchema [control_collection_shard1_replica_n1] Schema name=test
   [junit4]   2> 1518786 INFO  (qtp1717663443-16699) [n:127.0.0.1:51938_kw_z c:control_collection s:shard1  x:control_collection_shard1_replica_n1] o.a.s.s.IndexSchema Loaded schema test/1.6 with uniqueid field id
   [junit4]   2> 1518811 INFO  (qtp1717663443-16699) [n:127.0.0.1:51938_kw_z c:control_collection s:shard1  x:control_collection_shard1_replica_n1] o.a.s.c.CoreContainer Creating SolrCore 'control_collection_shard1_replica_n1' using configuration from collection control_collection, trusted=true
   [junit4]   2> 1518812 INFO  (qtp1717663443-16699) [n:127.0.0.1:51938_kw_z c:control_collection s:shard1  x:control_collection_shard1_replica_n1] o.a.s.m.r.SolrJmxReporter JMX monitoring for 'solr.core.control_collection.shard1.replica_n1' (registry 'solr.core.control_collection.shard1.replica_n1') enabled at server: com.sun.jmx.mbeanserver.JmxMBeanServer@6925413e
   [junit4]   2> 1518812 INFO  (qtp1717663443-16699) [n:127.0.0.1:51938_kw_z c:control_collection s:shard1  x:control_collection_shard1_replica_n1] o.a.s.c.SolrCore solr.RecoveryStrategy.Builder
   [junit4]   2> 1518812 INFO  (qtp1717663443-16699) [n:127.0.0.1:51938_kw_z c:control_collection s:shard1  x:control_collection_shard1_replica_n1] o.a.s.c.SolrCore [[control_collection_shard1_replica_n1] ] Opening new SolrCore at [/Users/jenkins/workspace/Lucene-Solr-7.x-MacOSX/solr/build/solr-core/test/J1/temp/solr.cloud.FullSolrCloudDistribCmdsTest_2324542594E36A9E-001/control-001/cores/control_collection_shard1_replica_n1], dataDir=[/Users/jenkins/workspace/Lucene-Solr-7.x-MacOSX/solr/build/solr-core/test/J1/temp/solr.cloud.FullSolrCloudDistribCmdsTest_2324542594E36A9E-001/control-001/cores/control_collection_shard1_replica_n1/data/]
   [junit4]   2> 1518816 INFO  (qtp1717663443-16699) [n:127.0.0.1:51938_kw_z c:control_collection s:shard1  x:control_collection_shard1_replica_n1] o.a.s.u.RandomMergePolicy RandomMergePolicy wrapping class org.apache.lucene.index.TieredMergePolicy: [TieredMergePolicy: maxMergeAtOnce=10, maxMergeAtOnceExplicit=34, maxMergedSegmentMB=87.537109375, floorSegmentMB=1.884765625, forceMergeDeletesPctAllowed=14.57583930032816, segmentsPerTier=48.0, maxCFSSegmentSizeMB=8.796093022207999E12, noCFSRatio=1.0
   [junit4]   2> 1518824 WARN  (qtp1717663443-16699) [n:127.0.0.1:51938_kw_z c:control_collection s:shard1  x:control_collection_shard1_replica_n1] o.a.s.c.RequestHandlers INVALID paramSet a in requestHandler {type = requestHandler,name = /dump,class = DumpRequestHandler,attributes = {initParams=a, name=/dump, class=DumpRequestHandler},args = {defaults={a=A,b=B}}}
   [junit4]   2> 1518891 INFO  (qtp1717663443-16699) [n:127.0.0.1:51938_kw_z c:control_collection s:shard1  x:control_collection_shard1_replica_n1] o.a.s.u.UpdateHandler Using UpdateLog implementation: org.apache.solr.update.UpdateLog
   [junit4]   2> 1518891 INFO  (qtp1717663443-16699) [n:127.0.0.1:51938_kw_z c:control_collection s:shard1  x:control_collection_shard1_replica_n1] o.a.s.u.UpdateLog Initializing UpdateLog: dataDir= defaultSyncLevel=FLUSH numRecordsToKeep=100 maxNumLogsToKeep=10 numVersionBuckets=65536
   [junit4]   2> 1518892 INFO  (qtp1717663443-16699) [n:127.0.0.1:51938_kw_z c:control_collection s:shard1  x:control_collection_shard1_replica_n1] o.a.s.u.CommitTracker Hard AutoCommit: disabled
   [junit4]   2> 1518892 INFO  (qtp1717663443-16699) [n:127.0.0.1:51938_kw_z c:control_collection s:shard1  x:control_collection_shard1_replica_n1] o.a.s.u.CommitTracker Soft AutoCommit: disabled
   [junit4]   2> 1518894 INFO  (qtp1717663443-16699) [n:127.0.0.1:51938_kw_z c:control_collection s:shard1  x:control_collection_shard1_replica_n1] o.a.s.u.RandomMergePolicy RandomMergePolicy wrapping class org.apache.lucene.index.TieredMergePolicy: [TieredMergePolicy: maxMergeAtOnce=14, maxMergeAtOnceExplicit=31, maxMergedSegmentMB=41.3359375, floorSegmentMB=1.6318359375, forceMergeDeletesPctAllowed=28.374413868387162, segmentsPerTier=34.0, maxCFSSegmentSizeMB=8.796093022207999E12, noCFSRatio=0.13088276496878573
   [junit4]   2> 1518894 INFO  (qtp1717663443-16699) [n:127.0.0.1:51938_kw_z c:control_collection s:shard1  x:control_collection_shard1_replica_n1] o.a.s.s.SolrIndexSearcher Opening [Searcher@785e5a24[control_collection_shard1_replica_n1] main]
   [junit4]   2> 1518896 INFO  (qtp1717663443-16699) [n:127.0.0.1:51938_kw_z c:control_collection s:shard1  x:control_collection_shard1_replica_n1] o.a.s.r.ManagedResourceStorage Configured ZooKeeperStorageIO with znodeBase: /configs/conf1
   [junit4]   2> 1518896 INFO  (qtp1717663443-16699) [n:127.0.0.1:51938_kw_z c:control_collection s:shard1  x:control_collection_shard1_replica_n1] o.a.s.r.ManagedResourceStorage Loaded null at path _rest_managed.json using ZooKeeperStorageIO:path=/configs/conf1
   [junit4]   2> 1518897 INFO  (qtp1717663443-16699) [n:127.0.0.1:51938_kw_z c:control_collection s:shard1  x:control_collection_shard1_replica_n1] o.a.s.h.ReplicationHandler Commits will be reserved for  10000
   [junit4]   2> 1518897 INFO  (qtp1717663443-16699) [n:127.0.0.1:51938_kw_z c:control_collection s:shard1  x:control_collection_shard1_replica_n1] o.a.s.u.UpdateLog Could not find max version in index or recent updates, using new clock 1575321098051911680
   [junit4]   2> 1518915 INFO  (searcherExecutor-6280-thread-1-processing-n:127.0.0.1:51938_kw_z x:control_collection_shard1_replica_n1 s:shard1 c:control_collection) [n:127.0.0.1:51938_kw_z c:control_collection s:shard1  x:control_collection_shard1_replica_n1] o.a.s.c.SolrCore [control_collection_shard1_replica_n1] Registered new searcher Searcher@785e5a24[control_collection_shard1_replica_n1] main{ExitableDirectoryReader(UninvertingDirectoryReader())}
   [junit4]   2> 1518922 INFO  (qtp1717663443-16699) [n:127.0.0.1:51938_kw_z c:control_collection s:shard1  x:control_collection_shard1_replica_n1] o.a.s.c.ShardLeaderElectionContext Enough replicas found to continue.
   [junit4]   2> 1518922 INFO  (qtp1717663443-16699) [n:127.0.0.1:51938_kw_z c:control_collection s:shard1  x:control_collection_shard1_replica_n1] o.a.s.c.ShardLeaderElectionContext I may be the new leader - try and sync
   [junit4]   2> 1518922 INFO  (qtp1717663443-16699) [n:127.0.0.1:51938_kw_z c:control_collection s:shard1  x:control_collection_shard1_replica_n1] o.a.s.c.SyncStrategy Sync replicas to http://127.0.0.1:51938/kw_z/control_collection_shard1_replica_n1/
   [junit4]   2> 1518922 INFO  (qtp1717663443-16699) [n:127.0.0.1:51938_kw_z c:control_collection s:shard1  x:control_collection_shard1_replica_n1] o.a.s.c.SyncStrategy Sync Success - now sync replicas to me
   [junit4]   2> 1518922 INFO  (qtp1717663443-16699) [n:127.0.0.1:51938_kw_z c:control_collection s:shard1  x:control_collection_shard1_replica_n1] o.a.s.c.SyncStrategy http://127.0.0.1:51938/kw_z/control_collection_shard1_replica_n1/ has no replicas
   [junit4]   2> 1518922 INFO  (qtp1717663443-16699) [n:127.0.0.1:51938_kw_z c:control_collection s:shard1  x:control_collection_shard1_replica_n1] o.a.s.c.ShardLeaderElectionContext Found all replicas participating in election, clear LIR
   [junit4]   2> 1518931 INFO  (qtp1717663443-16699) [n:127.0.0.1:51938_kw_z c:control_collection s:shard1  x:control_collection_shard1_replica_n1] o.a.s.c.ShardLeaderElectionContext I am the new leader: http://127.0.0.1:51938/kw_z/control_collection_shard1_replica_n1/ shard1
   [junit4]   2> 1519037 INFO  (zkCallback-3033-thread-1-processing-n:127.0.0.1:51938_kw_z) [n:127.0.0.1:51938_kw_z    ] o.a.s.c.c.ZkStateReader A cluster state change: [WatchedEvent state:SyncConnected type:NodeDataChanged path:/collections/control_collection/state.json] for collection [control_collection] has occurred - updating... (live nodes size: [1])
   [junit4]   2> 1519039 INFO  (qtp1717663443-16699) [n:127.0.0.1:51938_kw_z c:control_collection s:shard1  x:control_collection_shard1_replica_n1] o.a.s.c.ZkController I am the leader, no recovery necessary
   [junit4]   2> 1519041 INFO  (qtp1717663443-16699) [n:127.0.0.1:51938_kw_z c:control_collection s:shard1  x:control_collection_shard1_replica_n1] o.a.s.s.HttpSolrCall [admin] webapp=null path=/admin/cores params={qt=/admin/cores&collection.configName=conf1&newCollection=true&name=control_collection_shard1_replica_n1&action=CREATE&numShards=1&collection=control_collection&shard=shard1&wt=javabin&version=2&replicaType=NRT} status=0 QTime=1397
   [junit4]   2> 1519049 INFO  (qtp1717663443-16698) [n:127.0.0.1:51938_kw_z    ] o.a.s.h.a.CollectionsHandler Wait for new collection to be active for at most 30 seconds. Check all shard replicas
   [junit4]   2> 1519149 INFO  (zkCallback-3033-thread-1-processing-n:127.0.0.1:51938_kw_z) [n:127.0.0.1:51938_kw_z    ] o.a.s.c.c.ZkStateReader A cluster state change: [WatchedEvent state:SyncConnected type:NodeDataChanged path:/collections/control_collection/state.json] for collection [control_collection] has occurred - updating... (live nodes size: [1])
   [junit4]   2> 1519535 INFO  (OverseerCollectionConfigSetProcessor-98457568434257924-127.0.0.1:51938_kw_z-n_0000000000) [n:127.0.0.1:51938_kw_z    ] o.a.s.c.OverseerTaskQueue Response ZK path: /overseer/collection-queue-work/qnr-0000000000 doesn't exist.  Requestor may have disconnected from ZooKeeper
   [junit4]   2> 1520050 INFO  (qtp1717663443-16698) [n:127.0.0.1:51938_kw_z    ] o.a.s.s.HttpSolrCall [admin] webapp=null path=/admin/collections params={replicationFactor=1&collection.configName=conf1&name=control_collection&nrtReplicas=1&action=CREATE&numShards=1&createNodeSet=127.0.0.1:51938_kw_z&wt=javabin&version=2} status=0 QTime=2521
   [junit4]   2> 1520058 INFO  (TEST-FullSolrCloudDistribCmdsTest.test-seed#[2324542594E36A9E]) [    ] o.a.s.c.c.ZkStateReader Updated live nodes from ZooKeeper... (0) -> (1)
   [junit4]   2> 1520060 INFO  (TEST-FullSolrCloudDistribCmdsTest.test-seed#[2324542594E36A9E]) [    ] o.a.s.c.s.i.ZkClientClusterStateProvider Cluster at 127.0.0.1:51935/solr ready
   [junit4]   2> 1520060 INFO  (TEST-FullSolrCloudDistribCmdsTest.test-seed#[2324542594E36A9E]) [    ] o.a.s.c.ChaosMonkey monkey: init - expire sessions:false cause connection loss:false
   [junit4]   2> 1520061 INFO  (qtp1717663443-16702) [n:127.0.0.1:51938_kw_z    ] o.a.s.h.a.CollectionsHandler Invoked Collection Action :create with params replicationFactor=1&collection.configName=conf1&name=collection1&nrtReplicas=1&action=CREATE&numShards=3&createNodeSet=&stateFormat=1&wt=javabin&version=2 and sendToOCPQueue=true
   [junit4]   2> 1520066 INFO  (OverseerThreadFactory-6277-thread-2-processing-n:127.0.0.1:51938_kw_z) [n:127.0.0.1:51938_kw_z    ] o.a.s.c.CreateCollectionCmd Create collection collection1
   [junit4]   2> 1520067 WARN  (OverseerThreadFactory-6277-thread-2-processing-n:127.0.0.1:51938_kw_z) [n:127.0.0.1:51938_kw_z    ] o.a.s.c.CreateCollectionCmd It is unusual to create a collection (collection1) without cores.
   [junit4]   2> 1520284 INFO  (qtp1717663443-16702) [n:127.0.0.1:51938_kw_z    ] o.a.s.h.a.CollectionsHandler Wait for new collection to be active for at most 30 seconds. Check all shard replicas
   [junit4]   2> 1520284 INFO  (qtp1717663443-16702) [n:127.0.0.1:51938_kw_z    ] o.a.s.s.HttpSolrCall [admin] webapp=null path=/admin/collections params={replicationFactor=1&collection.configName=conf1&name=collection1&nrtReplicas=1&action=CREATE&numShards=3&createNodeSet=&stateFormat=1&wt=javabin&version=2} status=0 QTime=223
   [junit4]   2> 1520715 INFO  (TEST-FullSolrCloudDistribCmdsTest.test-seed#[2324542594E36A9E]) [    ] o.a.s.c.AbstractFullDistribZkTestBase create jetty 1 in directory /Users/jenkins/workspace/Lucene-Solr-7.x-MacOSX/solr/build/solr-core/test/J1/temp/solr.cloud.FullSolrCloudDistribCmdsTest_2324542594E36A9E-001/shard-1-001 of type NRT
   [junit4]   2> 1520715 INFO  (TEST-FullSolrCloudDistribCmdsTest.test-seed#[2324542594E36A9E]) [    ] o.e.j.s.Server jetty-9.3.14.v20161028
   [junit4]   2> 1520717 INFO  (TEST-FullSolrCloudDistribCmdsTest.test-seed#[2324542594E36A9E]) [    ] o.e.j.s.h.ContextHandler Started o.e.j.s.ServletContextHandler@289700f5{/kw_z,null,AVAILABLE}
   [junit4]   2> 1520718 INFO  (TEST-FullSolrCloudDistribCmdsTest.test-seed#[2324542594E36A9E]) [    ] o.e.j.s.AbstractConnector Started ServerConnector@21f2180f{HTTP/1.1,[http/1.1]}{127.0.0.1:51947}
   [junit4]   2> 1520718 INFO  (TEST-FullSolrCloudDistribCmdsTest.test-seed#[2324542594E36A9E]) [    ] o.e.j.s.Server Started @1524032ms
   [junit4]   2> 1520718 INFO  (TEST-FullSolrCloudDistribCmdsTest.test-seed#[2324542594E36A9E]) [    ] o.a.s.c.s.e.JettySolrRunner Jetty properties: {solr.data.dir=/Users/jenkins/workspace/Lucene-Solr-7.x-MacOSX/solr/build/solr-core/test/J1/temp/solr.cloud.FullSolrCloudDistribCmdsTest_2324542594E36A9E-001/tempDir-001/jetty1, solrconfig=solrconfig.xml, hostContext=/kw_z, hostPort=51947, coreRootDirectory=/Users/jenkins/workspace/Lucene-Solr-7.x-MacOSX/solr/build/solr-core/test/J1/../../../../../../../../../Users/jenkins/workspace/Lucene-Solr-7.x-MacOSX/solr/build/solr-core/test/J1/temp/solr.cloud.FullSolrCloudDistribCmdsTest_2324542594E36A9E-001/shard-1-001/cores}
   [junit4]   2> 1520719 ERROR (TEST-FullSolrCloudDistribCmdsTest.test-seed#[2324542594E36A9E]) [    ] o.a.s.s.StartupLoggingUtils Missing Java Option solr.log.dir. Logging may be missing or incomplete.
   [junit4]   2> 1520719 INFO  (TEST-FullSolrCloudDistribCmdsTest.test-seed#[2324542594E36A9E]) [    ] o.a.s.s.SolrDispatchFilter  ___      _       Welcome to Apache Solr? version 7.1.0
   [junit4]   2> 1520719 INFO  (TEST-FullSolrCloudDistribCmdsTest.test-seed#[2324542594E36A9E]) [    ] o.a.s.s.SolrDispatchFilter / __| ___| |_ _   Starting in cloud mode on port null
   [junit4]   2> 1520719 INFO  (TEST-FullSolrCloudDistribCmdsTest.test-seed#[2324542594E36A9E]) [    ] o.a.s.s.SolrDispatchFilter \__ \/ _ \ | '_|  Install dir: null, Default config dir: null
   [junit4]   2> 1520719 INFO  (TEST-FullSolrCloudDistribCmdsTest.test-seed#[2324542594E36A9E]) [    ] o.a.s.s.SolrDispatchFilter |___/\___/_|_|    Start time: 2017-08-10T05:34:33.127Z
   [junit4]   2> 1520722 INFO  (TEST-FullSolrCloudDistribCmdsTest.test-seed#[2324542594E36A9E]) [    ] o.a.s.s.SolrDispatchFilter Loading solr.xml from SolrHome (not found in ZooKeeper)
   [junit4]   2> 1520722 INFO  (TEST-FullSolrCloudDistribCmdsTest.test-seed#[2324542594E36A9E]) [    ] o.a.s.c.SolrXmlConfig Loading container configuration from /Users/jenkins/workspace/Lucene-Solr-7.x-MacOSX/solr/build/solr-core/test/J1/temp/solr.cloud.FullSolrCloudDistribCmdsTest_2324542594E36A9E-001/shard-1-001/solr.xml
   [junit4]   2> 1520732 INFO  (TEST-FullSolrCloudDistribCmdsTest.test-seed#[2324542594E36A9E]) [    ] o.a.s.c.SolrXmlConfig MBean server found: com.sun.jmx.mbeanserver.JmxMBeanServer@6925413e, but no JMX reporters were configured - adding default JMX reporter.
   [junit4]   2> 1520740 INFO  (TEST-FullSolrCloudDistribCmdsTest.test-seed#[2324542594E36A9E]) [    ] o.a.s.c.ZkContainer Zookeeper client=127.0.0.1:51935/solr
   [junit4]   2> 1520756 INFO  (TEST-FullSolrCloudDistribCmdsTest.test-seed#[2324542594E36A9E]) [n:127.0.0.1:51947_kw_z    ] o.a.s.c.c.ZkStateReader Updated live nodes from ZooKeeper... (0) -> (1)
   [junit4]   2> 1520762 INFO  (TEST-FullSolrCloudDistribCmdsTest.test-seed#[2324542594E36A9E]) [n:127.0.0.1:51947_kw_z    ] o.a.s.c.Overseer Overseer (id=null) closing
   [junit4]   2> 1520765 INFO  (TEST-FullSolrCloudDistribCmdsTest.test-seed#[2324542594E36A9E]) [n:127.0.0.1:51947_kw_z    ] o.a.s.c.ZkController Register node as live in ZooKeeper:/live_nodes/127.0.0.1:51947_kw_z
   [junit4]   2> 1520767 INFO  (zkCallback-3033-thread-1-processing-n:127.0.0.1:51938_kw_z) [n:127.0.0.1:51938_kw_z    ] o.a.s.c.c.ZkStateReader Updated live nodes from ZooKeeper... (1) -> (2)
   [junit4]   2> 1520767 INFO  (zkCallback-3045-thread-1-processing-n:127.0.0.1:51947_kw_z) [n:127.0.0.1:51947_kw_z    ] o.a.s.c.c.ZkStateReader Updated live nodes from ZooKeeper... (1) -> (2)
   [junit4]   2> 1520767 INFO  (zkCallback-3040-thread-1) [    ] o.a.s.c.c.ZkStateReader Updated live nodes from ZooKeeper... (1) -> (2)
   [junit4]   2> 1520869 INFO  (TEST-FullSolrCloudDistribCmdsTest.test-seed#[2324542594E36A9E]) [n:127.0.0.1:51947_kw_z    ] o.a.s.m.r.SolrJmxReporter JMX monitoring for 'solr.node' (registry 'solr.node') enabled at server: com.sun.jmx.mbeanserver.JmxMBeanServer@6925413e
   [junit4]   2> 1520876 INFO  (TEST-FullSolrCloudDistribCmdsTest.test-seed#[2324542594E36A9E]) [n:127.0.0.1:51947_kw_z    ] o.a.s.m.r.SolrJmxReporter JMX monitoring for 'solr.jvm' (registry 'solr.jvm') enabled at server: com.sun.jmx.mbeanserver.JmxMBeanServer@6925413e
   [junit4]   2> 1520876 INFO  (TEST-FullSolrCloudDistribCmdsTest.test-seed#[2324542594E36A9E]) [n:127.0.0.1:51947_kw_z    ] o.a.s.m.r.SolrJmxReporter JMX monitoring for 'solr.jetty' (registry 'solr.jetty') enabled at server: com.sun.jmx.mbeanserver.JmxMBeanServer@6925413e
   [junit4]   2> 1520879 INFO  (TEST-FullSolrCloudDistribCmdsTest.test-seed#[2324542594E36A9E]) [n:127.0.0.1:51947_kw_z    ] o.a.s.c.CorePropertiesLocator Found 0 core definitions underneath /Users/jenkins/workspace/Lucene-Solr-7.x-MacOSX/solr/build/solr-core/test/J1/../../../../../../../../../Users/jenkins/workspace/Lucene-Solr-7.x-MacOSX/solr/build/solr-core/test/J1/temp/solr.cloud.FullSolrCloudDistribCmdsTest_2324542594E36A9E-001/shard-1-001/cores
   [junit4]   2> 1520935 INFO  (qtp407050851-16739) [n:127.0.0.1:51947_kw_z    ] o.a.s.h.a.CollectionsHandler Invoked Collection Action :addreplica with params node=127.0.0.1:51947_kw_z&action=ADDREPLICA&collection=collection1&shard=shard2&type=NRT&wt=javabin&version=2 and sendToOCPQueue=true
   [junit4]   2> 1520939 INFO  (OverseerThreadFactory-6277-thread-3-processing-n:127.0.0.1:51938_kw_z) [n:127.0.0.1:51938_kw_z    ] o.a.s.c.AddReplicaCmd Node Identified 127.0.0.1:51947_kw_z for creating new replica
   [junit4]   2> 1520940 INFO  (OverseerCollectionConfigSetProcessor-98457568434257924-127.0.0.1:51938_kw_z-n_0000000000) [n:127.0.0.1:51938_kw_z    ] o.a.s.c.OverseerTaskQueue Response ZK path: /overseer/collection-queue-work/qnr-0000000002 doesn't exist.  Requestor may have disconnected from ZooKeeper
   [junit4]   2> 1520944 INFO  (qtp407050851-16740) [n:127.0.0.1:51947_kw_z    ] o.a.s.h.a.CoreAdminOperation core create command qt=/admin/cores&collection.configName=conf1&name=collection1_shard2_replica_n61&action=CREATE&collection=collection1&shard=shard2&wt=javabin&version=2&replicaType=NRT
   [junit4]   2> 1520945 INFO  (qtp407050851-16740) [n:127.0.0.1:51947_kw_z    ] o.a.s.c.TransientSolrCoreCacheDefault Allocating transient cache for 4 transient cores
   [junit4]   2> 1521967 INFO  (qtp407050851-16740) [n:127.0.0.1:51947_kw_z c:collection1 s:shard2  x:collection1_shard2_replica_n61] o.a.s.c.SolrConfig Using Lucene MatchVersion: 7.1.0
   [junit4]   2> 1521979 INFO  (qtp407050851-16740) [n:127.0.0.1:51947_kw_z c:collection1 s:shard2  x:collection1_shard2_replica_n61] o.a.s.s.IndexSchema [collection1_shard2_replica_n61] Schema name=test
   [junit4]   2> 1522077 INFO  (qtp407050851-16740) [n:127.0.0.1:51947_kw_z c:collection1 s:shard2  x:collection1_shard2_replica_n61] o.a.s.s.IndexSchema Loaded schema test/1.6 with uniqueid field id
   [junit4]   2> 1522101 INFO  (qtp407050851-16740) [n:127.0.0.1:51947_kw_z c:collection1 s:shard2  x:collection1_shard2_replica_n61] o.a.s.c.CoreContainer Creating SolrCore 'collection1_shard2_replica_n61' using configuration from collection collection1, trusted=true
   [junit4]   2> 1522102 INFO  (qtp407050851-16740) [n:127.0.0.1:51947_kw_z c:collection1 s:shard2  x:collection1_shard2_replica_n61] o.a.s.m.r.SolrJmxReporter JMX monitoring for 'solr.core.collection1.shard2.replica_n61' (registry 'solr.core.collection1.shard2.replica_n61') enabled at server: com.sun.jmx.mbeanserver.JmxMBeanServer@6925413e
   [junit4]   2> 1522102 INFO  (qtp407050851-16740) [n:127.0.0.1:51947_kw_z c:collection1 s:shard2  x:collection1_shard2_replica_n61] o.a.s.c.SolrCore solr.RecoveryStrategy.Builder
   [junit4]   2> 1522102 INFO  (qtp407050851-16740) [n:127.0.0.1:51947_kw_z c:collection1 s:shard2  x:collection1_shard2_replica_n61] o.a.s.c.SolrCore [[collection1_shard2_replica_n61] ] Opening new SolrCore at [/Users/jenkins/workspace/Lucene-Solr-7.x-MacOSX/solr/build/solr-core/test/J1/temp/solr.cloud.FullSolrCloudDistribCmdsTest_2324542594E36A9E-001/shard-1-001/cores/collection1_shard2_replica_n61], dataDir=[/Users/jenkins/workspace/Lucene-Solr-7.x-MacOSX/solr/build/solr-core/test/J1/../../../../../../../../../Users/jenkins/workspace/Lucene-Solr-7.x-MacOSX/solr/build/solr-core/test/J1/temp/solr.cloud.FullSolrCloudDistribCmdsTest_2324542594E36A9E-001/shard-1-001/cores/collection1_shard2_replica_n61/data/]
   [junit4]   2> 1522104 INFO  (qtp407050851-16740) [n:127.0.0.1:51947_kw_z c:collection1 s:shard2  x:collection1_shard2_replica_n61] o.a.s.u.RandomMergePolicy RandomMergePolicy wrapping class org.apache.lucene.index.TieredMergePolicy: [TieredMergePolicy: maxMergeAtOnce=10, maxMergeAtOnceExplicit=34, maxMergedSegmentMB=87.537109375, floorSegmentMB=1.884765625, forceMergeDeletesPctAllowed=14.57583930032816, segmentsPerTier=48.0, maxCFSSegmentSizeMB=8.796093022207999E12, noCFSRatio=1.0
   [junit4]   2> 1522107 WARN  (qtp407050851-16740) [n:127.0.0.1:51947_kw_z c:collection1 s:shard2  x:collection1_shard2_replica_n61] o.a.s.c.RequestHandlers INVALID paramSet a in requestHandler {type = requestHandler,name = /dump,class = DumpRequestHandler,attributes = {initParams=a, name=/dump, class=DumpRequestHandler},args = {defaults={a=A,b=B}}}
   [junit4]   2> 1522179 INFO  (qtp407050851-16740) [n:127.0.0.1:51947_kw_z c:collection1 s:shard2  x:collection1_shard2_replica_n61] o.a.s.u.UpdateHandler Using UpdateLog implementation: org.apache.solr.update.UpdateLog
   [junit4]   2> 1522179 INFO  (qtp407050851-16740) [n:127.0.0.1:51947_kw_z c:collection1 s:shard2  x:collection1_shard2_replica_n61] o.a.s.u.UpdateLog Initializing UpdateLog: dataDir= defaultSyncLevel=FLUSH numRecordsToKeep=100 maxNumLogsToKeep=10 numVersionBuckets=65536
   [junit4]   2> 1522180 INFO  (qtp407050851-16740) [n:127.0.0.1:51947_kw_z c:collection1 s:shard2  x:collection1_shard2_replica_n61] o.a.s.u.CommitTracker Hard AutoCommit: disabled
   [junit4]   2> 1522180 INFO  (qtp407050851-16740) [n:127.0.0.1:51947_kw_z c:collection1 s:shard2  x:collection1_shard2_replica_n61] o.a.s.u.CommitTracker Soft AutoCommit: disabled
   [junit4]   2> 1522181 INFO  (qtp407050851-16740) [n:127.0.0.1:51947_kw_z c:collection1 s:shard2  x:collection1_shard2_replica_n61] o.a.s.u.RandomMergePolicy RandomMergePolicy wrapping class org.apache.lucene.index.TieredMergePolicy: [TieredMergePolicy: maxMergeAtOnce=14, maxMergeAtOnceExplicit=31, maxMergedSegmentMB=41.3359375, floorSegmentMB=1.6318359375, forceMergeDeletesPctAllowed=28.374413868387162, segmentsPerTier=34.0, maxCFSSegmentSizeMB=8.796093022207999E12, noCFSRatio=0.13088276496878573
   [junit4]   2> 1522182 INFO  (qtp407050851-16740) [n:127.0.0.1:51947_kw_z c:collection1 s:shard2  x:collection1_shard2_replica_n61] o.a.s.s.SolrIndexSearcher Opening [Searcher@362d567e[collection1_shard2_replica_n61] main]
   [junit4]   2> 1522183 INFO  (qtp407050851-16740) [n:127.0.0.1:51947_kw_z c:collection1 s:shard2  x:collection1_shard2_replica_n61] o.a.s.r.ManagedResourceStorage Configured ZooKeeperStorageIO with znodeBase: /configs/conf1
   [junit4]   2> 1522184 INFO  (qtp407050851-16740) [n:127.0.0.1:51947_kw_z c:collection1 s:shard2  x:collection1_shard2_replica_n61] o.a.s.r.ManagedResourceStorage Loaded null at path _rest_managed.json using ZooKeeperStorageIO:path=/configs/conf1
   [junit4]   2> 1522185 INFO  (qtp407050851-16740) [n:127.0.0.1:51947_kw_z c:collection1 s:shard2  x:collection1_shard2_replica_n61] o.a.s.h.ReplicationHandler Commits will be reserved for  10000
   [junit4]   2> 1522185 INFO  (qtp407050851-16740) [n:127.0.0.1:51947_kw_z c:collection1 s:shard2  x:collection1_shard2_replica_n61] o.a.s.u.UpdateLog Could not find max version in index or recent updates, using new clock 1575321101499629568
   [junit4]   2> 1522187 INFO  (searcherExecutor-6291-thread-1-processing-n:127.0.0.1:51947_kw_z x:collection1_shard2_replica_n61 s:shard2 c:collection1) [n:127.0.0.1:51947_kw_z c:collection1 s:shard2  x:collection1_shard2_replica_n61] o.a.s.c.SolrCore [collection1_shard2_replica_n61] Registered new searcher Searcher@362d567e[collection1_shard2_replica_n61] main{ExitableDirectoryReader(UninvertingDirectoryReader())}
   [junit4]   2> 1522194 INFO  (qtp407050851-16740) [n:127.0.0.1:51947_kw_z c:collection1 s:shard2  x:collection1_shard2_replica_n61] o.a.s.c.ShardLeaderElectionContext Enough replicas found to continue.
   [junit4]   2> 1522194 INFO  (qtp407050851-16740) [n:127.0.0.1:51947_kw_z c:collection1 s:shard2  x:collection1_shard2_replica_n61] o.a.s.c.ShardLeaderElectionContext I may be the new leader - try and sync
   [junit4]   2> 1522194 INFO  (qtp407050851-16740) [n:127.0.0.1:51947_kw_z c:collection1 s:shard2  x:collection1_shard2_replica_n61] o.a.s.c.SyncStrategy Sync replicas to http://127.0.0.1:51947/kw_z/collection1_shard2_replica_n61/
   [junit4]   2> 1522194 INFO  (qtp407050851-16740) [n:127.0.0.1:51947_kw_z c:collection1 s:shard2  x:collection1_shard2_replica_n61] o.a.s.c.SyncStrategy Sync Success - now sync replicas to me
   [junit4]   2> 1522194 INFO  (qtp407050851-16740) [n:127.0.0.1:51947_kw_z c:collection1 s:shard2  x:collection1_shard2_replica_n61] o.a.s.c.SyncStrategy http://127.0.0.1:51947/kw_z/collection1_shard2_replica_n61/ has no replicas
   [junit4]   2> 1522194 INFO  (qtp407050851-16740) [n:127.0.0.1:51947_kw_z c:collection1 s:shard2  x:collection1_shard2_replica_n61] o.a.s.c.ShardLeaderElectionContext Found all replicas participating in election, clear LIR
   [junit4]   2> 1522200 INFO  (qtp407050851-16740) [n:127.0.0.1:51947_kw_z c:collection1 s:shard2  x:collection1_shard2_replica_n61] o.a.s.c.ShardLeaderElectionContext I am the new leader: http://127.0.0.1:51947/kw_z/collection1_shard2_replica_n61/ shard2
   [junit4]   2> 1522358 INFO  (qtp407050851-16740) [n:127.0.0.1:51947_kw_z c:collection1 s:shard2  x:collection1_shard2_replica_n61] o.a.s.c.ZkController I am the leader, no recovery necessary
   [junit4]   2> 1522360 INFO  (qtp407050851-16740) [n:127.0.0.1:51947_kw_z c:collection1 s:shard2  x:collection1_shard2_replica_n61] o.a.s.s.HttpSolrCall [admin] webapp=null path=/admin/cores params={qt=/admin/cores&collection.configName=conf1&name=collection1_shard2_replica_n61&action=CREATE&collection=collection1&shard=shard2&wt=javabin&version=2&replicaType=NRT} status=0 QTime=1416
   [junit4]   2> 1522362 INFO  (qtp407050851-16739) [n:127.0.0.1:51947_kw_z    ] o.a.s.s.HttpSolrCall [admin] webapp=null path=/admin/collections params={node=127.0.0.1:51947_kw_z&action=ADDREPLICA&collection=collection1&shard=shard2&type=NRT&wt=javabin&version=2} status=0 QTime=1427
   [junit4]   2> 1522935 INFO  (TEST-FullSolrCloudDistribCmdsTest.test-seed#[2324542594E36A9E]) [    ] o.a.s.c.AbstractFullDistribZkTestBase create jetty 2 in directory /Users/jenkins/workspace/Lucene-Solr-7.x-MacOSX/solr/build/solr-core/test/J1/temp/solr.cloud.FullSolrCloudDistribCmdsTest_2324542594E36A9E-001/shard-2-001 of type NRT
   [junit4]   2> 1522936 INFO  (TEST-FullSolrCloudDistribCmdsTest.test-seed#[2324542594E36A9E]) [    ] o.e.j.s.Server jetty-9.3.14.v20161028
   [junit4]   2> 1522938 INFO  (TEST-FullSolrCloudDistribCmdsTest.test-seed#[2324542594E36A9E]) [    ] o.e.j.s.h.ContextHandler Started o.e.j.s.ServletContextHandler@48e42132{/kw_z,null,AVAILABLE}
   [junit4]   2> 1522939 INFO  (TEST-FullSolrCloudDistribCmdsTest.test-seed#[2324542594E36A9E]) [    ] o.e.j.s.AbstractConnector Started ServerConnector@4fd46632{HTTP/1.1,[http/1.1]}{127.0.0.1:51953}
   [junit4]   2> 1522939 INFO  (TEST-FullSolrCloudDistribCmdsTest.test-seed#[2324542594E36A9E]) [    ] o.e.j.s.Server Started @1526254ms
   [junit4]   2> 1522939 INFO  (TEST-FullSolrCloudDistribCmdsTest.test-seed#[2324542594E36A9E]) [    ] o.a.s.c.s.e.JettySolrRunner Jetty properties: {solr.data.dir=/Users/jenkins/workspace/Lucene-Solr-7.x-MacOSX/solr/build/solr-core/test/J1/temp/solr.cloud.FullSolrCloudDistribCmdsTest_2324542594E36A9E-001/tempDir-001/jetty2, solrconfig=solrconfig.xml, hostContext=/kw_z, hostPort=51953, coreRootDirectory=/Users/jenkins/workspace/Lucene-Solr-7.x-MacOSX/solr/build/solr-core/test/J1/temp/solr.cloud.FullSolrCloudDistribCmdsTest_2324542594E36A9E-001/shard-2-001/cores}
   [junit4]   2> 1522940 ERROR (TEST-FullSolrCloudDistribCmdsTest.test-seed#[2324542594E36A9E]) [    ] o.a.s.s.StartupLoggingUtils Missing Java Option solr.log.dir. Logging may be missing or incomplete.
   [junit4]   2> 1522940 INFO  (TEST-FullSolrCloudDistribCmdsTest.test-seed#[2324542594E36A9E]) [    ] o.a.s.s.SolrDispatchFilter  ___      _       Welcome to Apache Solr? version 7.1.0
   [junit4]   2> 1522940 INFO  (TEST-FullSolrCloudDistribCmdsTest.test-seed#[2324542594E36A9E]) [    ] o.a.s.s.SolrDispatchFilter / __| ___| |_ _   Starting in cloud mode on port null
   [junit4]   2> 1522940 INFO  (TEST-FullSolrCloudDistribCmdsTest.test-seed#[2324542594E36A9E]) [    ] o.a.s.s.SolrDispatchFilter \__ \/ _ \ | '_|  Install dir: null, Default config dir: null
   [junit4]   2> 1522940 INFO  (TEST-FullSolrCloudDistribCmdsTest.test-seed#[2324542594E36A9E]) [    ] o.a.s.s.SolrDispatchFilter |___/\___/_|_|    Start time: 2017-08-10T05:34:35.348Z
   [junit4]   2> 1522944 INFO  (TEST-FullSolrCloudDistribCmdsTest.test-seed#[2324542594E36A9E]) [    ] o.a.s.s.SolrDispatchFilter Loading solr.xml from SolrHome (not found in ZooKeeper)
   [junit4]   2> 1522944 INFO  (OverseerCollectionConfigSetProcessor-98457568434257924-127.0.0.1:51938_kw_z-n_0000000000) [n:127.0.0.1:51938_kw_z    ] o.a.s.c.OverseerTaskQueue Response ZK path: /overseer/collection-queue-work/qnr-0000000004 doesn't exist.  Requestor may have disconnected from ZooKeeper
   [junit4]   2> 1522944 INFO  (TEST-FullSolrCloudDistribCmdsTest.test-seed#[2324542594E36A9E]) [    ] o.a.s.c.SolrXmlConfig Loading container configuration from /Users/jenkins/workspace/Lucene-Solr-7.x-MacOSX/solr/build/solr-core/test/J1/temp/solr.cloud.FullSolrCloudDistribCmdsTest_2324542594E36A9E-001/shard-2-001/solr.xml
   [junit4]   2> 1522952 INFO  (TEST-FullSolrCloudDistribCmdsTest.test-seed#[2324542594E36A9E]) [    ] o.a.s.c.SolrXmlConfig MBean server found: com.sun.jmx.mbeanserver.JmxMBeanServer@6925413e, but no JMX reporters were configured - adding default JMX reporter.
   [junit4]   2> 1522961 INFO  (TEST-FullSolrCloudDistribCmdsTest.test-seed#[2324542594E36A9E]) [    ] o.a.s.c.ZkContainer Zookeeper client=127.0.0.1:51935/solr
   [junit4]   2> 1522979 INFO  (TEST-FullSolrCloudDistribCmdsTest.test-seed#[2324542594E36A9E]) [n:127.0.0.1:51953_kw_z    ] o.a.s.c.c.ZkStateReader Updated live nodes from ZooKeeper... (0) -> (2)
   [junit4]   2> 1522983 INFO  (TEST-FullSolrCloudDistribCmdsTest.test-seed#[2324542594E36A9E]) [n:127.0.0.1:51953_kw_z    ] o.a.s.c.Overseer Overseer (id=null) closing
   [junit4]   2> 1522987 INFO  (TEST-FullSolrCloudDistribCmdsTest.test-seed#[2324542594E36A9E]) [n:127.0.0.1:51953_kw_z    ] o.a.s.c.ZkController Register node as live in ZooKeeper:/live_nodes/127.0.0.1:51953_kw_z
   [junit4]   2> 1522989 INFO  (zkCallback-3033-thread-1-processing-n:127.0.0.1:51938_kw_z) [n:127.0.0.1:51938_kw_z    ] o.a.s.c.c.ZkStateReader Updated live nodes from ZooKeeper... (2) -> (3)
   [junit4]   2> 1522990 INFO  (zkCallback-3051-thread-1-processing-n:127.0.0.1:51953_kw_z) [n:127.0.0.1:51953_kw_z    ] o.a.s.c.c.ZkStateReader Updated live nodes from ZooKeeper... (2) -> (3)
   [junit4]   2> 1522989 INFO  (zkCallback-3045-thread-1-processing-n:127.0.0.1:51947_kw_z) [n:127.0.0.1:51947_kw_z    ] o.a.s.c.c.ZkStateReader Updated live nodes from ZooKeeper... (2) -> (3)
   [junit4]   2> 1522989 INFO  (zkCallback-3040-thread-1) [    ] o.a.s.c.c.ZkStateReader Updated live nodes from ZooKeeper... (2) -> (3)
   [junit4]   2> 1523102 INFO  (TEST-FullSolrCloudDistribCmdsTest.test-seed#[2324542594E36A9E]) [n:127.0.0.1:51953_kw_z    ] o.a.s.m.r.SolrJmxReporter JMX monitoring for 'solr.node' (registry 'solr.node') enabled at server: com.sun.jmx.mbeanserver.JmxMBeanServer@6925413e
   [junit4]   2> 1523110 INFO  (TEST-FullSolrCloudDistribCmdsTest.test-seed#[2324542594E36A9E]) [n:127.0.0.1:51953_kw_z    ] o.a.s.m.r.SolrJmxReporter JMX monitoring for 'solr.jvm' (registry 'solr.jvm') enabled at server: com.sun.jmx.mbeanserver.JmxMBeanServer@6925413e
   [junit4]   2> 1523110 INFO  (TEST-FullSolrCloudDistribCmdsTest.test-seed#[2324542594E36A9E]) [n:127.0.0.1:51953_kw_z    ] o.a.s.m.r.SolrJmxReporter JMX monitoring for 'solr.jetty' (registry 'solr.jetty') enabled at server: com.sun.jmx.mbeanserver.JmxMBeanServer@6925413e
   [junit4]   2> 1523113 INFO  (TEST-FullSolrCloudDistribCmdsTest.test-seed#[2324542594E36A9E]) [n:127.0.0.1:51953_kw_z    ] o.a.s.c.CorePropertiesLocator Found 0 core definitions underneath /Users/jenkins/workspace/Lucene-Solr-7.x-MacOSX/solr/build/solr-core/test/J1/temp/solr.cloud.FullSolrCloudDistribCmdsTest_2324542594E36A9E-001/shard-2-001/cores
   [junit4]   2> 1523180 INFO  (qtp407050851-16741) [n:127.0.0.1:51947_kw_z    ] o.a.s.h.a.CollectionsHandler Invoked Collection Action :addreplica with params node=127.0.0.1:51953_kw_z&action=ADDREPLICA&collection=collection1&shard=shard3&type=NRT&wt=javabin&version=2 and sendToOCPQueue=true
   [junit4]   2> 1523184 INFO  (OverseerThreadFactory-6277-thread-4-processing-n:127.0.0.1:51938_kw_z) [n:127.0.0.1:51938_kw_z    ] o.a.s.c.AddReplicaCmd Node Identified 127.0.0.1:51953_kw_z for creating new replica
   [junit4]   2> 1523188 INFO  (qtp1484663004-16769) [n:127.0.0.1:51953_kw_z    ] o.a.s.h.a.CoreAdminOperation core create command qt=/admin/cores&collection.configName=conf1&name=collection1_shard3_replica_n63&action=CREATE&collection=collection1&shard=shard3&wt=javabin&version=2&replicaType=NRT
   [junit4]   2> 1523188 INFO  (qtp1484663004-16769) [n:127.0.0.1:51953_kw_z    ] o.a.s.c.TransientSolrCoreCacheDefault Allocating transient cache for 4 transient cores
   [junit4]   2> 1524209 INFO  (qtp1484663004-16769) [n:127.0.0.1:51953_kw_z c:collection1 s:shard3  x:collection1_shard3_replica_n63] o.a.s.c.SolrConfig Using Lucene MatchVersion: 7.1.0
   [junit4]   2> 1524217 INFO  (qtp1484663004-16769) [n:127.0.0.1:51953_kw_z c:collection1 s:shard3  x:collection1_shard3_replica_n63] o.a.s.s.IndexSchema [collection1_shard3_replica_n63] Schema name=test
   [junit4]   2> 1524283 INFO  (qtp1484663004-16769) [n:127.0.0.1:51953_kw_z c:collection1 s:shard3  x:collection1_shard3_replica_n63] o.a.s.s.IndexSchema Loaded schema test/1.6 with uniqueid field id
   [junit4]   2> 1524306 INFO  (qtp1484663004-16769) [n:127.0.0.1:51953_kw_z c:collection1 s:shard3  x:collection1_shard3_replica_n63] o.a.s.c.CoreContainer Creating SolrCore 'collection1_shard3_replica_n63' using configuration from collection collection1, trusted=true
   [junit4]   2> 1524307 INFO  (qtp1484663004-16769) [n:127.0.0.1:51953_kw_z c:collection1 s:shard3  x:collection1_shard3_replica_n63] o.a.s.m.r.SolrJmxReporter JMX monitoring for 'solr.core.collection1.shard3.replica_n63' (registry 'solr.core.collection1.shard3.replica_n63') enabled at server: com.sun.jmx.mbeanserver.JmxMBeanServer@6925413e
   [junit4]   2> 1524307 INFO  (qtp1484663004-16769) [n:127.0.0.1:51953_kw_z c:collection1 s:shard3  x:collection1_shard3_replica_n63] o.a.s.c.SolrCore solr.RecoveryStrategy.Builder
   [junit4]   2> 1524307 INFO  (qtp1484663004-16769) [n:127.0.0.1:51953_kw_z c:collection1 s:shard3  x:collection1_shard3_replica_n63] o.a.s.c.SolrCore [[collection1_shard3_replica_n63] ] Opening new SolrCore at [/Users/jenkins/workspace/Lucene-Solr-7.x-MacOSX/solr/build/solr-core/test/J1/temp/solr.cloud.FullSolrCloudDistribCmdsTest_2324542594E36A9E-001/shard-2-001/cores/collection1_shard3_replica_n63], dataDir=[/Users/jenkins/workspace/Lucene-Solr-7.x-MacOSX/solr/build/solr-core/test/J1/temp/solr.cloud.FullSolrCloudDistribCmdsTest_2324542594E36A9E-001/shard-2-001/cores/collection1_shard3_replica_n63/data/]
   [junit4]   2> 1524309 INFO  (qtp1484663004-16769) [n:127.0.0.1:51953_kw_z c:collection1 s:shard3  x:collection1_shard3_replica_n63] o.a.s.u.RandomMergePolicy RandomMergePolicy wrapping class org.apache.lucene.index.TieredMergePolicy: [TieredMergePolicy: maxMergeAtOnce=10, maxMergeAtOnceExplicit=34, maxMergedSegmentMB=87.537109375, floorSegmentMB=1.884765625, forceMergeDeletesPctAllowed=14.57583930032816, segmentsPerTier=48.0, maxCFSSegmentSizeMB=8.796093022207999E12, noCFSRatio=1.0
   [junit4]   2> 1524313 WARN  (qtp1484663004-16769) [n:127.0.0.1:51953_kw_z c:collection1 s:shard3  x:collection1_shard3_replica_n63] o.a.s.c.RequestHandlers INVALID paramSet a in requestHandler {type = requestHandler,name = /dump,class = DumpRequestHandler,attributes = {initParams=a, name=/dump, class=DumpRequestHandler},args = {defaults={a=A,b=B}}}
   [junit4]   2> 1524395 INFO  (qtp1484663004-16769) [n:127.0.0.1:51953_kw_z c:collection1 s:shard3  x:collection1_shard3_replica_n63] o.a.s.u.UpdateHandler Using UpdateLog implementation: org.apache.solr.update.UpdateLog
   [junit4]   2> 1524395 INFO  (qtp1484663004-16769) [n:127.0.0.1:51953_kw_z c:collection1 s:shard3  x:collection1_shard3_replica_n63] o.a.s.u.UpdateLog Initializing UpdateLog: dataDir= defaultSyncLevel=FLUSH numRecordsToKeep=100 maxNumLogsToKeep=10 numVersionBuckets=65536
   [junit4]   2> 1524397 INFO  (qtp1484663004-16769) [n:127.0.0.1:51953_kw_z c:collection1 s:shard3  x:collection1_shard3_replica_n63] o.a.s.u.CommitTracker Hard AutoCommit: disabled
   [junit4]   2> 1524397 INFO  (qtp1484663004-16769) [n:127.0.0.1:51953_kw_z c:collection1 s:shard3  x:collection1_shard3_replica_n63] o.a.s.u.CommitTracker Soft AutoCommit: disabled
   [junit4]   2> 1524408 INFO  (qtp1484663004-16769) [n:127.0.0.1:51953_kw_z c:collection1 s:shard3  x:collection1_shard3_replica_n63] o.a.s.u.RandomMergePolicy RandomMergePolicy wrapping class org.apache.lucene.index.TieredMergePolicy: [TieredMergePolicy: maxMergeAtOnce=14, maxMergeAtOnceExplicit=31, maxMergedSegmentMB=41.3359375, floorSegmentMB=1.6318359375, forceMergeDeletesPctAllowed=28.374413868387162, segmentsPerTier=34.0, maxCFSSegmentSizeMB=8.796093022207999E12, noCFSRatio=0.13088276496878573
   [junit4]   2> 1524408 INFO  (qtp1484663004-16769) [n:127.0.0.1:51953_kw_z c:collection1 s:shard3  x:collection1_shard3_replica_n63] o.a.s.s.SolrIndexSearcher Opening [Searcher@c76712[collection1_shard3_replica_n63] main]
   [junit4]   2> 1524410 INFO  (qtp1484663004-16769) [n:127.0.0.1:51953_kw_z c:collection1 s:shard3  x:collection1_shard3_replica_n63] o.a.s.r.ManagedResourceStorage Configured ZooKeeperStorageIO with znodeBase: /configs/conf1
   [junit4]   2> 1524411 INFO  (qtp1484663004-16769) [n:127.0.0.1:51953_kw_z c:collection1 s:shard3  x:collection1_shard3_replica_n63] o.a.s.r.ManagedResourceStorage Loaded null at path _rest_managed.json using ZooKeeperStorageIO:path=/configs/conf1
   [junit4]   2> 1524412 INFO  (qtp1484663004-16769) [n:127.0.0.1:51953_kw_z c:collection1 s:shard3  x:collection1_shard3_replica_n63] o.a.s.h.ReplicationHandler Commits will be reserved for  10000
   [junit4]   2> 1524412 INFO  (qtp1484663004-16769) [n:127.0.0.1:51953_kw_z c:collection1 s:shard3  x:collection1_shard3_replica_n63] o.a.s.u.UpdateLog Could not find max version in index or recent updates, using new clock 1575321103834808320
   [junit4]   2> 1524413 INFO  (searcherExecutor-6302-thread-1-processing-n:127.0.0.1:51953_kw_z x:collection1_shard3_replica_n63 s:shard3 c:collection1) [n:127.0.0.1:51953_kw_z c:collection1 s:shard3  x:collection1_shard3_replica_n63] o.a.s.c.SolrCore [collection1_shard3_replica_n63] Registered new searcher Searcher@c76712[collection1_shard3_replica_n63] main{ExitableDirectoryReader(UninvertingDirectoryReader())}
   [junit4]   2> 1524423 INFO  (qtp1484663004-16769) [n:127.0.0.1:51953_kw_z c:collection1 s:shard3  x:collection1_shard3_replica_n63] o.a.s.c.ShardLeaderElectionContext Enough replicas found to continue.
   [junit4]   2> 1524423 INFO  (qtp1484663004-16769) [n:127.0.0.1:51953_kw_z c:collection1 s:shard3  x:collection1_shard3_replica_n63] o.a.s.c.ShardLeaderElectionContext I may be the new leader - try and sync
   [junit4]   2> 1524423 INFO  (qtp1484663004-16769) [n:127.0.0.1:51953_kw_z c:collection1 s:shard3  x:collection1_shard3_replica_n63] o.a.s.c.SyncStrategy Sync replicas to http://127.0.0.1:51953/kw_z/collection1_shard3_replica_n63/
   [junit4]   2> 1524423 INFO  (qtp1484663004-16769) [n:127.0.0.1:51953_kw_z c:collection1 s:shard3  x:collection1_shard3_replica_n63] o.a.s.c.SyncStrategy Sync Success - now sync replicas to me
   [junit4]   2> 1524423 INFO  (qtp1484663004-16769) [n:127.0.0.1:51953_kw_z c:collection1 s:shard3  x:collection1_shard3_replica_n63] o.a.s.c.SyncStrategy http://127.0.0.1:51953/kw_z/collection1_shard3_replica_n63/ has no replicas
   [junit4]   2> 1524423 INFO  (qtp1484663004-16769) [n:127.0.0.1:51953_kw_z c:collection1 s:shard3  x:collection1_shard3_replica_n63] o.a.s.c.ShardLeaderElectionContext Found all replicas participating in election, clear LIR
   [junit4]   2> 1524428 INFO  (qtp1484663004-16769) [n:127.0.0.1:51953_kw_z c:collection1 s:shard3  x:collection1_shard3_replica_n63] o.a.s.c.ShardLeaderElectionContext I am the new leader: http://127.0.0.1:51953/kw_z/collection1_shard3_replica_n63/ shard3
   [junit4]   2> 1524537 INFO  (qtp1484663004-16769) [n:127.0.0.1:51953_kw_z c:collection1 s:shard3  x:collection1_shard3_replica_n63] o.a.s.c.ZkController I am the leader, no recovery necessary
   [junit4]   2> 1524538 INFO  (qtp1484663004-16769) [n:127.0.0.1:51953_kw_z c:collection1 s:shard3  x:collection1_shard3_replica_n63] o.a.s.s.HttpSolrCall [admin] webapp=null path=/admin/cores params={qt=/admin/cores&collection.configName=conf1&name=collection1_shard3_replica_n63&action=CREATE&collection=collection1&shard=shard3&wt=javabin&version=2&replicaType=NRT} status=0 QTime=1350
   [junit4]   2> 1524544 INFO  (qtp407050851-16741) [n:127.0.0.1:51947_kw_z    ] o.a.s.s.HttpSolrCall [admin] webapp=null path=/admin/collections params={node=127.0.0.1:51953_kw_z&action=ADDREPLICA&collection=collection1&shard=shard3&type=NRT&wt=javabin&version=2} status=0 QTime=1364
   [junit4]   2> 1524937 INFO  (TEST-FullSolrCloudDistribCmdsTest.test-seed#[2324542594E36A9E]) [    ] o.a.s.c.AbstractFullDistribZkTestBase create jetty 3 in directory /Users/jenkins/workspace/Lucene-Solr-7.x-MacOSX/solr/build/solr-core/test/J1/temp/solr.cloud.FullSolrCloudDistribCmdsTest_2324542594E36A9E-001/shard-3-001 of type NRT
   [junit4]   2> 1524937 INFO  (TEST-FullSolrCloudDistribCmdsTest.test-seed#[2324542594E36A9E]) [    ] o.e.j.s.Server jetty-9.3.14.v20161028
   [junit4]   2> 1524939 INFO  (TEST-FullSolrCloudDistribCmdsTest.test-seed#[2324542594E36A9E]) [    ] o.e.j.s.h.ContextHandler Started o.e.j.s.ServletContextHandler@e5da861{/kw_z,null,AVAILABLE}
   [junit4]   2> 1524940 INFO  (TEST-FullSolrCloudDistribCmdsTest.test-seed#[2324542594E36A9E]) [    ] o.e.j.s.AbstractConnector Started ServerConnector@40626a39{HTTP/1.1,[http/1.1]}{127.0.0.1:51958}
   [junit4]   2> 1524940 INFO  (TEST-FullSolrCloudDistribCmdsTest.test-seed#[2324542594E36A9E]) [    ] o.e.j.s.Server Started @1528254ms
   [junit4]   2> 1524940 INFO  (TEST-FullSolrCloudDistribCmdsTest.test-seed#[2324542594E36A9E]) [    ] o.a.s.c.s.e.JettySolrRunner Jetty properties: {solr.data.dir=/Users/jenkins/workspace/Lucene-Solr-7.x-MacOSX/solr/build/solr-core/test/J1/temp/solr.cloud.FullSolrCloudDistribCmdsTest_2324542594E36A9E-001/tempDir-001/jetty3, solrconfig=solrconfig.xml, hostContext=/kw_z, hostPort=51958, coreRootDirectory=/Users/jenkins/workspace/Lucene-Solr-7.x-MacOSX/solr/build/solr-core/test/J1/temp/solr.cloud.FullSolrCloudDistribCmdsTest_2324542594E36A9E-001/shard-3-001/cores}
   [junit4]   2> 1524940 ERROR (TEST-FullSolrCloudDistribCmdsTest.test-seed#[2324542594E36A9E]) [    ] o.a.s.s.StartupLoggingUtils Missing Java Option solr.log.dir. Logging may be missing or incomplete.
   [junit4]   2> 1524941 INFO  (TEST-FullSolrCloudDistribCmdsTest.test-seed#[2324542594E36A9E]) [    ] o.a.s.s.SolrDispatchFilter  ___      _       Welcome to Apache Solr? version 7.1.0
   [junit4]   2> 1524941 INFO  (TEST-FullSolrCloudDistribCmdsTest.test-seed#[2324542594E36A9E]) [    ] o.a.s.s.SolrDispatchFilter / __| ___| |_ _   Starting in cloud mode on port null
   [junit4]   2> 1524941 INFO  (TEST-FullSolrCloudDistribCmdsTest.test-seed#[2324542594E36A9E]) [    ] o.a.s.s.SolrDispatchFilter \__ \/ _ \ | '_|  Install dir: null, Default config dir: null
   [junit4]   2> 1524941 INFO  (TEST-FullSolrCloudDistribCmdsTest.test-seed#[2324542594E36A9E]) [    ] o.a.s.s.SolrDispatchFilter |___/\___/_|_|    Start time: 2017-08-10T05:34:37.349Z
   [junit4]   2> 1524945 INFO  (TEST-FullSolrCloudDistribCmdsTest.test-seed#[2324542594E36A9E]) [    ] o.a.s.s.SolrDispatchFilter Loading solr.xml from SolrHome (not found in ZooKeeper)
   [junit4]   2> 1524945 INFO  (TEST-FullSolrCloudDistribCmdsTest.test-seed#[2324542594E36A9E]) [    ] o.a.s.c.SolrXmlConfig Loading container configuration from /Users/jenkins/workspace/Lucene-Solr-7.x-MacOSX/solr/build/solr-core/test/J1/temp/solr.cloud.FullSolrCloudDistribCmdsTest_2324542594E36A9E-001/shard-3-001/solr.xml
   [junit4]   2> 1524952 INFO  (TEST-FullSolrCloudDistribCmdsTest.test-seed#[2324542594E36A9E]) [    ] o.a.s.c.SolrXmlConfig MBean server found: com.sun.jmx.mbeanserver.JmxMBeanServer@6925413e, but no JMX reporters were configured - adding default JMX reporter.
   [junit4]   2> 1524957 INFO  (TEST-FullSolrCloudDistribCmdsTest.test-seed#[2324542594E36A9E]) [    ] o.a.s.c.ZkContainer Zookeeper client=127.0.0.1:51935/solr
   [junit4]   2> 1524973 INFO  (TEST-FullSolrCloudDistribCmdsTest.test-seed#[2324542594E36A9E]) [n:127.0.0.1:51958_kw_z    ] o.a.s.c.c.ZkStateReader Updated live nodes from ZooKeeper... (0) -> (3)
   [junit4]   2> 1524978 INFO  (TEST-FullSolrCloudDistribCmdsTest.test-seed#[2324542594E36A9E]) [n:127.0.0.1:51958_kw_z    ] o.a.s.c.Overseer Overseer (id=null) closing
   [junit4]   2> 1524982 INFO  (TEST-FullSolrCloudDistribCmdsTest.test-seed#[2324542594E36A9E]) [n:127.0.0.1:51958_kw_z    ] o.a.s.c.ZkController Register node as live in ZooKeeper:/live_nodes/127.0.0.1:51958_kw_z
   [junit4]   2> 1524985 INFO  (zkCallback-3051-thread-1-processing-n:127.0.0.1:51953_kw_z) [n:127.0.0.1:51953_kw_z    ] o.a.s.c.c.ZkStateReader Updated live nodes from ZooKeeper... (3) -> (4)
   [junit4]   2> 1524986 INFO  (zkCallback-3045-thread-1-processing-n:127.0.0.1:51947_kw_z) [n:127.0.0.1:51947_kw_z    ] o.a.s.c.c.ZkStateReader Updated live nodes from ZooKeeper... (3) -> (4)
   [junit4]   2> 1524985 INFO  (zkCallback-3040-thread-1) [    ] o.a.s.c.c.ZkStateReader Updated live nodes from ZooKeeper... (3) -> (4)
   [junit4]   2> 1524987 INFO  (zkCallback-3033-thread-1-processing-n:127.0.0.1:51938_kw_z) [n:127.0.0.1:51938_kw_z    ] o.a.s.c.c.ZkStateReader Updated live nodes from ZooKeeper... (3) -> (4)
   [junit4]   2> 1524987 INFO  (zkCallback-3057-thread-1-processing-n:127.0.0.1:51958_kw_z) [n:127.0.0.1:51958_kw_z    ] o.a.s.c.c.ZkStateReader Updated live nodes from ZooKeeper... (3) -> (4)
   [junit4]   2> 1525064 INFO  (TEST-FullSolrCloudDistribCmdsTest.test-seed#[2324542594E36A9E]) [n:127.0.0.1:51958_kw_z    ] o.a.s.m.r.SolrJmxReporter JMX monitoring for 'solr.node' (registry 'solr.node') enabled at server: com.sun.jmx.mbeanserver.JmxMBeanServer@6925413e
   [junit4]   2> 1525070 INFO  (TEST-FullSolrCloudDistribCmdsTest.test-seed#[2324542594E36A9E]) [n:127.0.0.1:51958_kw_z    ] o.a.s.m.r.SolrJmxReporter JMX monitoring for 'solr.jvm' (registry 'solr.jvm') enabled at server: com.sun.jmx.mbeanserver.JmxMBeanServer@6925413e
   [junit4]   2> 1525070 INFO  (TEST-FullSolrCloudDistribCmdsTest.test-seed#[2324542594E36A9E]) [n:127.0.0.1:51958_kw_z    ] o.a.s.m.r.SolrJmxReporter JMX monitoring for 'solr.jetty' (registry 'solr.jetty') enabled at server: com.sun.jmx.mbeanserver.JmxMBeanServer@6925413e
   [junit4]   2> 1525072 INFO  (TEST-FullSolrCloudDistribCmdsTest.test-seed#[2324542594E36A9E]) [n:127.0.0.1:51958_kw_z    ] o.a.s.c.CorePropertiesLocator Found 0 core definitions underneath /Users/jenkins/workspace/Lucene-Solr-7.x-MacOSX/solr/build/solr-core/test/J1/temp/solr.cloud.FullSolrCloudDistribCmdsTest_2324542594E36A9E-001/shard-3-001/cores
   [junit4]   2> 1525116 INFO  (qtp407050851-16742) [n:127.0.0.1:51947_kw_z    ] o.a.s.h.a.CollectionsHandler Invoked Collection Action :addreplica with params node=127.0.0.1:51958_kw_z&action=ADDREPLICA&collection=collection1&shard=shard1&type=NRT&wt=javabin&version=2 and sendToOCPQueue=true
   [junit4]   2> 1525119 INFO  (OverseerThreadFactory-6277-thread-5-processing-n:127.0.0.1:51938_kw_z) [n:127.0.0.1:51938_kw_z    ] o.a.s.c.AddReplicaCmd Node Identified 127.0.0.1:51958_kw_z for creating new replica
   [junit4]   2> 1525119 INFO  (OverseerCollectionConfigSetProcessor-98457568434257924-127.0.0.1:51938_kw_z-n_0000000000) [n:127.0.0.1:51938_kw_z    ] o.a.s.c.OverseerTaskQueue Response ZK path: /overseer/collection-queue-work/qnr-0000000006 doesn't exist.  Requestor may have disconnected from ZooKeeper
   [junit4]   2> 1525123 INFO  (qtp1221305829-16798) [n:127.0.0.1:51958_kw_z    ] o.a.s.h.a.CoreAdminOperation core create command qt=/admin/cores&collection.configName=conf1&name=collection1_shard1_replica_n65&action=CREATE&collection=collection1&shard=shard1&wt=javabin&version=2&replicaType=NRT
   [junit4]   2> 1525123 INFO  (qtp1221305829-16798) [n:127.0.0.1:51958_kw_z    ] o.a.s.c.TransientSolrCoreCacheDefault Allocating transient cache for 4 transient cores
   [junit4]   2> 1526161 INFO  (qtp1221305829-16798) [n:127.0.0.1:51958_kw_z c:collection1 s:shard1  x:collection1_shard1_replica_n65] o.a.s.c.SolrConfig Using Lucene MatchVersion: 7.1.0
   [junit4]   2> 1526175 INFO  (qtp1221305829-16798) [n:127.0.0.1:51958_kw_z c:collection1 s:shard1  x:collection1_shard1_replica_n65] o.a.s.s.IndexSchema [collection1_shard1_replica_n65] Schema name=test
   [junit4]   2> 1526279 INFO  (qtp1221305829-16798) [n:127.0.0.1:51958_kw_z c:collection1 s:shard1  x:collection1_shard1_replica_n65] o.a.s.s.IndexSchema Loaded schema test/1.6 with uniqueid field id
   [junit4]   2> 1526308 INFO  (qtp1221305829-16798) [n:127.0.0.1:51958_kw_z c:collection1 s:shard1  x:collection1_shard1_replica_n65] o.a.s.c.CoreContainer Creating SolrCore 'collection1_shard1_replica_n65' using configuration from collection collection1, trusted=true
   [junit4]   2> 1526308 INFO  (qtp1221305829-16798) [n:127.0.0.1:51958_kw_z c:collection1 s:shard1  x:collection1_shard1_replica_n65] o.a.s.m.r.SolrJmxReporter JMX monitoring for 'solr.core.collection1.shard1.replica_n65' (registry 'solr.core.collection1.shard1.replica_n65') enabled at server: com.sun.jmx.mbeanserver.JmxMBeanServer@6925413e
   [junit4]   2> 1526308 INFO  (qtp1221305829-16798) [n:127.0.0.1:51958_kw_z c:collection1 s:shard1  x:collection1_shard1_replica_n65] o.a.s.c.SolrCore solr.RecoveryStrategy.Builder
   [junit4]   2> 1526308 INFO  (qtp1221305829-16798) [n:127.0.0.1:51958_kw_z c:collection1 s:shard1  x:collection1_shard1_replica_n65] o.a.s.c.SolrCore [[collection1_shard1_replica_n65] ] Opening new SolrCore at [/Users/jenkins/workspace/Lucene-Solr-7.x-MacOSX/solr/build/solr-core/test/J1/temp/solr.cloud.FullSolrCloudDistribCmdsTest_2324542594E36A9E-001/shard-3-001/cores/collection1_shard1_replica_n65], dataDir=[/Users/jenkins/workspace/Lucene-Solr-7.x-MacOSX/solr/build/solr-core/test/J1/temp/solr.cloud.FullSolrCloudDistribCmdsTest_2324542594E36A9E-001/shard-3-001/cores/collection1_shard1_replica_n65/data/]
   [junit4]   2> 1526311 INFO  (qtp1221305829-16798) [n:127.0.0.1:51958_kw_z c:collection1 s:shard1  x:collection1_shard1_replica_n65] o.a.s.u.RandomMergePolicy RandomMergePolicy wrapping class org.apache.lucene.index.TieredMergePolicy: [TieredMergePolicy: maxMergeAtOnce=10, maxMergeAtOnceExplicit=34, maxMergedSegmentMB=87.537109375, floorSegmentMB=1.884765625, forceMergeDeletesPctAllowed=14.57583930032816, segmentsPerTier=48.0, maxCFSSegmentSizeMB=8.796093022207999E12, noCFSRatio=1.0
   [junit4]   2> 1526314 WARN  (qtp1221305829-16798) [n:127.0.0.1:51958_kw_z c:collection1 s:shard1  x:collection1_shard1_replica_n65] o.a.s.c.RequestHandlers INVALID paramSet a in requestHandler {type = requestHandler,name = /dump,class = DumpRequestHandler,attributes = {initParams=a, name=/dump, class=DumpRequestHandler},args = {defaults={a=A,b=B}}}
   [junit4]   2> 1526410 INFO  (qtp1221305829-16798) [n:127.0.0.1:51958_kw_z c:collection1 s:shard1  x:collection1_shard1_replica_n65] o.a.s.u.UpdateHandler Using UpdateLog implementation: org.apache.solr.update.UpdateLog
   [junit4]   2> 1526410 INFO  (qtp1221305829-16798) [n:127.0.0.1:51958_kw_z c:collection1 s:shard1  x:collection1_shard1_replica_n65] o.a.s.u.UpdateLog Initializing UpdateLog: dataDir= defaultSyncLevel=FLUSH numRecordsToKeep=100 maxNumLogsToKeep=10 numVersionBuckets=65536
   [junit4]   2> 1526411 INFO  (qtp1221305829-16798) [n:127.0.0.1:51958_kw_z c:collection1 s:shard1  x:collection1_shard1_replica_n65] o.a.s.u.CommitTracker Hard AutoCommit: disabled
   [junit4]   2> 1526411 INFO  (qtp1221305829-16798) [n:127.0.0.1:51958_kw_z c:collection1 s:shard1  x:collection1_shard1_replica_n65] o.a.s.u.CommitTracker Soft AutoCommit: disabled
   [junit4]   2> 1526412 INFO  (qtp1221305829-16798) [n:127.0.0.1:51958_kw_z c:collection1 s:shard1  x:collection1_shard1_replica_n65] o.a.s.u.RandomMergePolicy RandomMergePolicy wrapping class org.apache.lucene.index.TieredMergePolicy: [TieredMergePolicy: maxMergeAtOnce=14, maxMergeAtOnceExplicit=31, maxMergedSegmentMB=41.3359375, floorSegmentMB=1.6318359375, forceMergeDeletesPctAllowed=28.374413868387162, segmentsPerTier=34.0, maxCFSSegmentSizeMB=8.796093022207999E12, noCFSRatio=0.13088276496878573
   [junit4]   2> 1526413 INFO  (qtp1221305829-16798) [n:127.0.0.1:51958_kw_z c:collection1 s:shard1  x:collection1_shard1_replica_n65] o.a.s.s.SolrIndexSearcher Opening [Searcher@69910265[collection1_shard1_replica_n65] main]
   [junit4]   2> 1526414 INFO  (qtp1221305829-16798) [n:127.0.0.1:51958_kw_z c:collection1 s:shard1  x:collection1_shard1_replica_n65] o.a.s.r.ManagedResourceStorage Configured ZooKeeperStorageIO with znodeBase: /configs/conf1
   [junit4]   2> 1526415 INFO  (qtp1221305829-16798) [n:127.0.0.1:51958_kw_z c:collection1 s:shard1  x:collection1_shard1_replica_n65] o.a.s.r.ManagedResourceStorage Loaded null at path _rest_managed.json using ZooKeeperStorageIO:path=/configs/conf1
   [junit4]   2> 1526416 INFO  (qtp1221305829-16798) [n:127.0.0.1:51958_kw_z c:collection1 s:shard1  x:collection1_shard1_replica_n65] o.a.s.h.ReplicationHandler Commits will be reserved for  10000
   [junit4]   2> 1526418 INFO  (searcherExecutor-6313-thread-1-processing-n:127.0.0.1:51958_kw_z x:collection1_shard1_replica_n65 s:shard1 c:collection1) [n:127.0.0.1:51958_kw_z c:collection1 s:shard1  x:collection1_shard1_replica_n65] o.a.s.c.SolrCore [collection1_shard1_replica_n65] Registered new searcher Searcher@69910265[collection1_shard1_replica_n65] main{ExitableDirectoryReader(UninvertingDirectoryReader())}
   [junit4]   2> 1526418 INFO  (qtp1221305829-16798) [n:127.0.0.1:51958_kw_z c:collection1 s:shard1  x:collection1_shard1_replica_n65] o.a.s.u.UpdateLog Could not find max version in index or recent updates, using new clock 1575321105938251776
   [junit4]   2> 1526434 INFO  (qtp1221305829-16798) [n:127.0.0.1:51958_kw_z c:collection1 s:shard1  x:collection1_shard1_replica_n65] o.a.s.c.ShardLeaderElectionContext Enough replicas found to continue.
   [junit4]   2> 1526434 INFO  (qtp1221305829-16798) [n:127.0.0.1:51958_kw_z c:collection1 s:shard1  x:collection1_shard1_replica_n65] o.a.s.c.ShardLeaderElectionContext I may be the new leader - try and sync
   [junit4]   2> 1526434 INFO  (qtp1221305829-16798) [n:127.0.0.1:51958_kw_z c:collection1 s:shard1  x:collection1_shard1_replica_n65] o.a.s.c.SyncStrategy Sync replicas to http://127.0.0.1:51958/kw_z/collection1_shard1_replica_n65/
   [junit4]   2> 1526434 INFO  (qtp1221305829-16798) [n:127.0.0.1:51958_kw_z c:collection1 s:shard1  x:collection1_shard1_replica_n65] o.a.s.c.SyncStrategy Sync Success - now sync replicas to me
   [junit4]   2> 1526434 INFO  (qtp1221305829-16798) [n:127.0.0.1:51958_kw_z c:collection1 s:shard1  x:collection1_shard1_replica_n65] o.a.s.c.SyncStrategy http://127.0.0.1:51958/kw_z/collection1_shard1_replica_n65/ has no replicas
   [junit4]   2> 1526434 INFO  (qtp1221305829-16798) [n:127.0.0.1:51958_kw_z c:collection1 s:shard1  x:collection1_shard1_replica_n65] o.a.s.c.ShardLeaderElectionContext Found all replicas participating in election, clear LIR
   [junit4]   2> 1526442 INFO  (qtp1221305829-16798) [n:127.0.0.1:51958_kw_z c:collection1 s:shard1  x:collection1_shard1_replica_n65] o.a.s.c.ShardLeaderElectionContext I am the new leader: http://127.0.0.1:51958/kw_z/collection1_shard1_replica_n65/ shard1
   [junit4]   2> 1526565 INFO  (qtp1221305829-16798) [n:127.0.0.1:51958_kw_z c:collection1 s:shard1  x:collection1_shard1_replica_n65] o.a.s.c.ZkController I am the leader, no recovery necessary
   [junit4]   2> 1526568 INFO  (qtp1221305829-16798) [n:127.0.0.1:51958_kw_z c:collection1 s:shard1  x:collection1_shard1_replica_n65] o.a.s.s.HttpSolrCall [admin] webapp=null path=/admin/cores params={qt=/admin/cores&collection.configName=conf1&name=collection1_shard1_replica_n65&action=CREATE&collection=collection1&shard=shard1&wt=javabin&version=2&replicaType=NRT} status=0 QTime=1445
   [junit4]   2> 1526578 INFO  (qtp407050851-16742) [n:127.0.0.1:51947_kw_z    ] o.a.s.s.HttpSolrCall [admin] webapp=null path=/admin/collections params={node=127.0.0.1:51958_kw_z&action=ADDREPLICA&collection=collection1&shard=shard1&type=NRT&wt=javabin&version=2} status=0 QTime=1462
   [junit4]   2> 1527151 INFO  (OverseerCollectionConfigSetProcessor-98457568434257924-127.0.0.1:51938_kw_z-n_0000000000) [n:127.0.0.1:51938_kw_z    ] o.a.s.c.OverseerTaskQueue Response ZK path: /overseer/collection-queue-work/qnr-0000000008 doesn't exist.  Requestor may have disconnected from ZooKeeper
   [junit4]   2> 1527163 INFO  (TEST-FullSolrCloudDistribCmdsTest.test-seed#[2324542594E36A9E]) [    ] o.a.s.c.AbstractFullDistribZkTestBase create jetty 4 in directory /Users/jenkins/workspace/Lucene-Solr-7.x-MacOSX/solr/build/solr-core/test/J1/temp/solr.cloud.FullSolrCloudDistribCmdsTest_2324542594E36A9E-001/shard-4-001 of type NRT
   [junit4]   2> 1527164 INFO  (TEST-FullSolrCloudDistribCmdsTest.test-seed#[2324542594E36A9E]) [    ] o.e.j.s.Server jetty-9.3.14.v20161028
   [junit4]   2> 1527165 INFO  (TEST-FullSolrCloudDistribCmdsTest.test-seed#[2324542594E36A9E]) [    ] o.e.j.s.h.ContextHandler Started o.e.j.s.ServletContextHandler@7388a354{/kw_z,null,AVAILABLE}
   [junit4]   2> 1527165 INFO  (TEST-FullSolrCloudDistribCmdsTest.test-seed#[2324542594E36A9E]) [    ] o.e.j.s.AbstractConnector Started ServerConnector@284537d6{HTTP/1.1,[http/1.1]}{127.0.0.1:51963}
   [junit4]   2> 1527165 INFO  (TEST-FullSolrCloudDistribCmdsTest.test-seed#[2324542594E36A9E]) [    ] o.e.j.s.Server Started @1530480ms
   [junit4]   2> 1527165 INFO  (TEST-FullSolrCloudDistribCmdsTest.test-seed#[2324542594E36A9E]) [    ] o.a.s.c.s.e.JettySolrRunner Jetty properties: {solr.data.dir=/Users/jenkins/workspace/Lucene-Solr-7.x-MacOSX/solr/build/solr-core/test/J1/temp/solr.cloud.FullSolrCloudDistribCmdsTest_2324542594E36A9E-001/tempDir-001/jetty4, replicaType=NRT, solrconfig=solrconfig.xml, hostContext=/kw_z, hostPort=51963, coreRootDirectory=/Users/jenkins/workspace/Lucene-Solr-7.x-MacOSX/solr/build/solr-core/test/J1/../../../../../../../../../Users/jenkins/workspace/Lucene-Solr-7.x-MacOSX/solr/build/solr-core/test/J1/temp/solr.cloud.FullSolrCloudDistribCmdsTest_2324542594E36A9E-001/shard-4-001/cores}
   [junit4]   2> 1527167 ERROR (TEST-FullSolrCloudDistribCmdsTest.test-seed#[2324542594E36A9E]) [    ] o.a.s.s.StartupLoggingUtils Missing Java Option solr.log.dir. Logging may be missing or incomplete.
   [junit4]   2> 1527167 INFO  (TEST-FullSolrCloudDistribCmdsTest.test-seed#[2324542594E36A9E]) [    ] o.a.s.s.SolrDispatchFilter  ___      _       Welcome to Apache Solr? version 7.1.0
   [junit4]   2> 1527167 INFO  (TEST-FullSolrCloudDistribCmdsTest.test-seed#[2324542594E36A9E]) [    ] o.a.s.s.SolrDispatchFilter / __| ___| |_ _   Starting in cloud mode on port null
   [junit4]   2> 1527167 INFO  (TEST-FullSolrCloudDistribCmdsTest.test-seed#[2324542594E36A9E]) [    ] o.a.s.s.SolrDispatchFilter \__ \/ _ \ | '_|  Install dir: null, Default config dir: null
   [junit4]   2> 1527167 INFO  (TEST-FullSolrCloudDistribCmdsTest.test-seed#[2324542594E36A9E]) [    ] o.a.s.s.SolrDispatchFilter |___/\___/_|_|    Start time: 2017-08-10T05:34:39.575Z
   [junit4]   2> 1527175 INFO  (TEST-FullSolrCloudDistribCmdsTest.test-seed#[2324542594E36A9E]) [    ] o.a.s.s.SolrDispatchFilter Loading solr.xml from SolrHome (not found in ZooKeeper)
   [junit4]   2> 1527176 INFO  (TEST-FullSolrCloudDistribCmdsTest.test-seed#[2324542594E36A9E]) [    ] o.a.s.c.SolrXmlConfig Loading container configuration from /Users/jenkins/workspace/Lucene-Solr-7.x-MacOSX/solr/build/solr-core/test/J1/temp/solr.cloud.FullSolrCloudDistribCmdsTest_2324542594E36A9E-001/shard-4-001/solr.xml
   [junit4]   2> 1527182 INFO  (TEST-FullSolrCloudDistribCmdsTest.test-seed#[2324542594E36A9E]) [    ] o.a.s.c.SolrXmlConfig MBean server found: com.sun.jmx.mbeanserver.JmxMBeanServer@6925413e, but no JMX reporters were configured - adding default JMX reporter.
   [junit4]   2> 1527188 INFO  (TEST-FullSolrCloudDistribCmdsTest.test-seed#[2324542594E36A9E]) [    ] o.a.s.c.ZkContainer Zookeeper client=127.0.0.1:51935/solr
   [junit4]   2> 1527205 INFO  (TEST-FullSolrCloudDistribCmdsTest.test-seed#[2324542594E36A9E]) [n:127.0.0.1:51963_kw_z    ] o.a.s.c.c.ZkStateReader Updated live nodes from ZooKeeper... (0) -> (4)
   [junit4]   2> 1527212 INFO  (TEST-FullSolrCloudDistribCmdsTest.test-seed#[2324542594E36A9E]) [n:127.0.0.1:51963_kw_z    ] o.a.s.c.Overseer Overseer (id=null) closing
   [junit4]   2> 1527216 INFO  (TEST-FullSolrCloudDistribCmdsTest.test-seed#[2324542594E36A9E]) [n:127.0.0.1:51963_kw_z    ] o.a.s.c.ZkController Register node as live in ZooKeeper:/live_nodes/127.0.0.1:51963_kw_z
   [junit4]   2> 1527221 INFO  (zkCallback-3063-thread-1-processing-n:127.0.0.1:51963_kw_z) [n:127.0.0.1:51963_kw_z    ] o.a.s.c.c.ZkStateReader Updated live nodes from ZooKeeper... (4) -> (5)
   [junit4]   2> 1527221 INFO  (zkCallback-3057-thread-1-processing-n:127.0.0.1:51958_kw_z) [n:127.0.0.1:51958_kw_z    ] o.a.s.c.c.ZkStateReader Updated live nodes from ZooKeeper... (4) -> (5)
   [junit4]   2> 1527222 INFO  (zkCallback-3045-thread-1-processing-n:127.0.0.1:51947_kw_z) [n:127.0.0.1:51947_kw_z    ] o.a.s.c.c.ZkStateReader Updated live nodes from ZooKeeper... (4) -> (5)
   [junit4]   2> 1527222 INFO  (zkCallback-3040-thread-1) [    ] o.a.s.c.c.ZkStateReader Updated live nodes from ZooKeeper... (4) -> (5)
   [junit4]   2> 1527222 INFO  (zkCallback-3051-thread-1-processing-n:127.0.0.1:51953_kw_z) [n:127.0.0.1:51953_kw_z    ] o.a.s.c.c.ZkStateReader Updated live nodes from ZooKeeper... (4) -> (5)
   [junit4]   2> 1527223 INFO  (zkCallback-3033-thread-2-processing-n:127.0.0.1:51938_kw_z) [n:127.0.0.1:51938_kw_z    ] o.a.s.c.c.ZkStateReader Updated live nodes from ZooKeeper... (4) -> (5)
   [junit4]   2> 1527349 INFO  (TEST-FullSolrCloudDistribCmdsTest.test-seed#[2324542594E36A9E]) [n:127.0.0.1:51963_kw_z    ] o.a.s.m.r.SolrJmxReporter JMX monitoring for 'solr.node' (registry 'solr.node') enabled at server: com.sun.jmx.mbeanserver.JmxMBeanServer@6925413e
   [junit4]   2> 1527355 INFO  (TEST-FullSolrCloudDistribCmdsTest.test-seed#[2324542594E36A9E]) [n:127.0.0.1:51963_kw_z    ] o.a.s.m.r.SolrJmxReporter JMX monitoring for 'solr.jvm' (registry 'solr.jvm') enabled at server: com.sun.jmx.mbeanserver.JmxMBeanServer@6925413e
   [junit4]   2> 1527355 INFO  (TEST-FullSolrCloudDistribCmdsTest.test-seed#[2324542594E36A9E]) [n:127.0.0.1:51963_kw_z    ] o.a.s.m.r.SolrJmxReporter JMX monitoring for 'solr.jetty' (registry 'solr.jetty') enabled at server: com.sun.jmx.mbeanserver.JmxMBeanServer@6925413e
   [junit4]   2> 1527357 INFO  (TEST-FullSolrCloudDistribCmdsTest.test-seed#[2324542594E36A9E]) [n:127.0.0.1:51963_kw_z    ] o.a.s.c.CorePropertiesLocator Found 0 core definitions underneath /Users/jenkins/workspace/Lucene-Solr-7.x-MacOSX/solr/build/solr-core/test/J1/../../../../../../../../../Users/jenkins/workspace/Lucene-Solr-7.x-MacOSX/solr/build/solr-core/test/J1/temp/solr.cloud.FullSolrCloudDistribCmdsTest_2324542594E36A9E-001/shard-4-001/cores
   [junit4]   2> 1527438 INFO  (qtp407050851-16743) [n:127.0.0.1:51947_kw_z    ] o.a.s.h.a.Co

[...truncated too long message...]

,null,UNAVAILABLE}
   [junit4]   2> 2279411 WARN  (zkCallback-3802-thread-1-processing-n:127.0.0.1:53849_solr) [n:127.0.0.1:53849_solr    ] o.a.s.c.c.ZkStateReader ZooKeeper watch triggered, but Solr cannot talk to ZK: [KeeperErrorCode = Session expired for /live_nodes]
   [junit4]   2> 2279412 INFO  (jetty-closer-3778-thread-3) [    ] o.e.j.s.h.ContextHandler Stopped o.e.j.s.ServletContextHandler@18ffcb34{/solr,null,UNAVAILABLE}
   [junit4]   2> 2279429 WARN  (zkCallback-3803-thread-2-processing-n:127.0.0.1:53848_solr) [n:127.0.0.1:53848_solr    ] o.a.s.c.c.ZkStateReader ZooKeeper watch triggered, but Solr cannot talk to ZK: [KeeperErrorCode = Session expired for /live_nodes]
   [junit4]   2> 2279430 WARN  (zkCallback-3812-thread-3-processing-n:127.0.0.1:53847_solr) [n:127.0.0.1:53847_solr    ] o.a.s.c.c.ZkStateReader ZooKeeper watch triggered, but Solr cannot talk to ZK: [KeeperErrorCode = Session expired for /live_nodes]
   [junit4]   2> 2279430 INFO  (jetty-closer-3778-thread-5) [    ] o.e.j.s.h.ContextHandler Stopped o.e.j.s.ServletContextHandler@19a53036{/solr,null,UNAVAILABLE}
   [junit4]   2> 2279430 INFO  (jetty-closer-3778-thread-2) [    ] o.e.j.s.h.ContextHandler Stopped o.e.j.s.ServletContextHandler@389d5015{/solr,null,UNAVAILABLE}
   [junit4]   2> 2279434 INFO  (jetty-closer-3778-thread-4) [    ] o.e.j.s.h.ContextHandler Stopped o.e.j.s.ServletContextHandler@32f8a808{/solr,null,UNAVAILABLE}
   [junit4]   2> 2279435 ERROR (SUITE-ReplaceNodeTest-seed#[2324542594E36A9E]-worker) [    ] o.a.z.s.ZooKeeperServer ZKShutdownHandler is not registered, so ZooKeeper server won't take any action on ERROR or SHUTDOWN server state changes
   [junit4]   2> 2279435 INFO  (SUITE-ReplaceNodeTest-seed#[2324542594E36A9E]-worker) [    ] o.a.s.c.ZkTestServer connecting to 127.0.0.1:53845 53845
   [junit4]   2> 2279454 INFO  (Thread-4100) [    ] o.a.s.c.ZkTestServer connecting to 127.0.0.1:53845 53845
   [junit4]   2> 2279706 WARN  (Thread-4100) [    ] o.a.s.c.ZkTestServer Watch limit violations: 
   [junit4]   2> Maximum concurrent create/delete watches above limit:
   [junit4]   2> 
   [junit4]   2> 	7	/solr/aliases.json
   [junit4]   2> 	7	/solr/clusterprops.json
   [junit4]   2> 	6	/solr/security.json
   [junit4]   2> 	5	/solr/configs/conf1
   [junit4]   2> 
   [junit4]   2> Maximum concurrent data watches above limit:
   [junit4]   2> 
   [junit4]   2> 	58	/solr/collections/replacenodetest_coll/state.json
   [junit4]   2> 	7	/solr/clusterstate.json
   [junit4]   2> 	3	/solr/overseer_elect/election/98457616868048909-127.0.0.1:53849_solr-n_0000000001
   [junit4]   2> 	2	/solr/overseer_elect/election/98457616868048910-127.0.0.1:53848_solr-n_0000000000
   [junit4]   2> 
   [junit4]   2> Maximum concurrent children watches above limit:
   [junit4]   2> 
   [junit4]   2> 	7	/solr/live_nodes
   [junit4]   2> 	7	/solr/collections
   [junit4]   2> 
   [junit4]   2> NOTE: leaving temporary files on disk at: /Users/jenkins/workspace/Lucene-Solr-7.x-MacOSX/solr/build/solr-core/test/J1/temp/solr.cloud.ReplaceNodeTest_2324542594E36A9E-001
   [junit4]   2> NOTE: test params are: codec=Asserting(Lucene70): {}, docValues:{}, maxPointsInLeafNode=982, maxMBSortInHeap=6.426646814314432, sim=RandomSimilarity(queryNorm=false): {}, locale=ar, timezone=Etc/GMT-14
   [junit4]   2> NOTE: Mac OS X 10.11.6 x86_64/Oracle Corporation 1.8.0_144 (64-bit)/cpus=3,threads=1,free=184909112,total=518979584
   [junit4]   2> NOTE: All tests run in this JVM: [PolyFieldTest, TestSimpleTrackingShardHandler, TestZkChroot, TestRealTimeGet, TestShardHandlerFactory, TestInPlaceUpdatesStandalone, MBeansHandlerTest, BJQParserTest, SearchHandlerTest, TestCollationField, ConvertedLegacyTest, LukeRequestHandlerTest, TestCustomDocTransformer, TestRandomRequestDistribution, OverseerCollectionConfigSetProcessorTest, CachingDirectoryFactoryTest, DistributedQueryElevationComponentTest, TestRawResponseWriter, TestHdfsUpdateLog, QueryEqualityTest, TestFiltering, SolrRequestParserTest, SuggesterTSTTest, TestJettySolrRunner, ZkNodePropsTest, TestGeoJSONResponseWriter, TestSolrIndexConfig, BadComponentTest, PeerSyncWithIndexFingerprintCachingTest, TestDocBasedVersionConstraints, TestFreeTextSuggestions, CleanupOldIndexTest, TestFieldCollectionResource, LeaderElectionContextKeyTest, TermsComponentTest, HdfsChaosMonkeySafeLeaderTest, TestDocSet, BasicAuthIntegrationTest, ActionThrottleTest, HdfsBasicDistributedZkTest, ResponseHeaderTest, BigEndianAscendingWordSerializerTest, TestLuceneMatchVersion, SolrPluginUtilsTest, DistributedQueryComponentCustomSortTest, CollectionTooManyReplicasTest, TestMaxTokenLenTokenizer, BlobRepositoryCloudTest, TestFastWriter, TestSuggestSpellingConverter, TestSerializedLuceneMatchVersion, LeaderFailureAfterFreshStartTest, DocValuesMissingTest, DistribCursorPagingTest, SegmentsInfoRequestHandlerTest, TestTestInjection, TestExactStatsCache, SpellCheckComponentTest, TestClusterStateMutator, LeaderInitiatedRecoveryOnShardRestartTest, TestConfig, TestFieldCacheSort, TestUseDocValuesAsStored2, TestConfigSetsAPI, DistributedTermsComponentTest, PropertiesRequestHandlerTest, TestSolrQueryResponse, RestartWhileUpdatingTest, HdfsNNFailoverTest, TestLeaderElectionZkExpiry, TestPartialUpdateDeduplication, AnalyticsQueryTest, TestSolrDeletionPolicy1, HdfsRecoveryZkTest, TestSchemaNameResource, AtomicUpdateProcessorFactoryTest, IndexSchemaRuntimeFieldTest, TestJavabinTupleStreamParser, TestCrossCoreJoin, SynonymTokenizerTest, TestCloudSchemaless, TestRangeQuery, TestRequestStatusCollectionAPI, TestSubQueryTransformer, TestTolerantUpdateProcessorCloud, HLLSerializationTest, TestMiniSolrCloudClusterSSL, CollectionsAPISolrJTest, TestCloudDeleteByQuery, ExternalFileFieldSortTest, DistributedSuggestComponentTest, TestPolicyCloud, TestQueryUtils, UpdateRequestProcessorFactoryTest, CurrencyFieldTypeTest, TestReplicaProperties, TestOrdValues, SpellCheckCollatorWithCollapseTest, TestBlobHandler, TestPrepRecovery, TestFastLRUCache, SmileWriterTest, TestFieldCache, TestSizeLimitedDistributedMap, TestDistributedMissingSort, DistributedIntervalFacetingTest, TestNumericRangeQuery64, V2StandaloneTest, TestSolrJ, SolrMetricManagerTest, TestSolrConfigHandler, TestConfigsApi, TestSearcherReuse, TestLMJelinekMercerSimilarityFactory, InfixSuggestersTest, TestHashQParserPlugin, CloudMLTQParserTest, TestStressLucene, HdfsWriteToMultipleCollectionsTest, SharedFSAutoReplicaFailoverUtilsTest, HdfsTlogReplayBufferedWhileIndexingTest, BlockCacheTest, TestMissingGroups, TestManagedSchemaAPI, TestApiFramework, TestStressLiveNodes, TestBadConfig, PreAnalyzedFieldTest, ForceLeaderTest, TestPullReplicaErrorHandling, HdfsLockFactoryTest, TestSearchPerf, ParsingFieldUpdateProcessorsTest, LoggingHandlerTest, TestInfoStreamLogging, TestSlowCompositeReaderWrapper, TestNumericTerms64, CdcrUpdateLogTest, TestComplexPhraseLeadingWildcard, OverseerRolesTest, TermVectorComponentTest, TestBulkSchemaConcurrent, BasicFunctionalityTest, SolrCoreCheckLockOnStartupTest, LargeFieldTest, TestHdfsCloudBackupRestore, TestLocalFSCloudBackupRestore, SOLR749Test, TestConfigOverlay, OutOfBoxZkACLAndCredentialsProvidersTest, TestSegmentSorting, CacheHeaderTest, AutoCommitTest, LeaderElectionIntegrationTest, TestEmbeddedSolrServerConstructors, DeleteInactiveReplicaTest, TestPostingsSolrHighlighter, MoreLikeThisHandlerTest, SuggestComponentContextFilterQueryTest, TestNamedUpdateProcessors, SSLMigrationTest, DistributedFacetPivotSmallTest, TestFieldCacheVsDocValues, TestDownShardTolerantSearch, StatelessScriptUpdateProcessorFactoryTest, OpenExchangeRatesOrgProviderTest, BasicDistributedZk2Test, TestSystemIdResolver, TlogReplayBufferedWhileIndexingTest, TestSchemaSimilarityResource, DistributedFacetExistsSmallTest, DocumentAnalysisRequestHandlerTest, TestStandardQParsers, TestDeleteCollectionOnDownNodes, TestConfigSetProperties, TestPayloadCheckQParserPlugin, TestHttpShardHandlerFactory, RecoveryAfterSoftCommitTest, ChaosMonkeySafeLeaderTest, CollectionsAPIDistributedZkTest, SyncSliceTest, OpenCloseCoreStressTest, ShardRoutingTest, BasicZkTest, FullSolrCloudDistribCmdsTest, ClusterStateUpdateTest, TestRandomFaceting, LeaderElectionTest, ZkSolrClientTest, ShardRoutingCustomTest, TestDistributedGrouping, TestFaceting, TestRecovery, TermVectorComponentDistributedTest, TestReload, HardAutoCommitTest, SimpleFacetsTest, StatsComponentTest, TestIndexSearcher, TestCoreDiscovery, TestFoldingMultitermQuery, SuggesterTest, TestTrie, SpatialFilterTest, TestCSVLoader, SchemaVersionSpecificBehaviorTest, TestAtomicUpdateErrorCases, DirectUpdateHandlerOptimizeTest, TestRemoteStreaming, DistanceFunctionTest, TestWriterPerf, FileBasedSpellCheckerTest, TestValueSourceCache, TestSolrQueryParser, ReturnFieldsTest, TestAnalyzedSuggestions, BinaryUpdateRequestHandlerTest, CSVRequestHandlerTest, TestComponentsName, HighlighterConfigTest, TestQuerySenderListener, UpdateParamsTest, AlternateDirectoryTest, CopyFieldTest, ResponseLogComponentTest, SolrIndexConfigTest, TestMergePolicyConfig, TestSolrDeletionPolicy2, NumericFieldsTest, MinimalSchemaTest, TestFuzzyAnalyzedSuggestions, TestSolrCoreProperties, TestPhraseSuggestions, EchoParamsTest, TestSweetSpotSimilarityFactory, TestPerFieldSimilarity, TestLMDirichletSimilarityFactory, TestBM25SimilarityFactory, DateMathParserTest, DateFieldTest, SpellingQueryConverterTest, DOMUtilTest, TestLRUCache, TestUtils, TestDocumentBuilder, SliceStateTest, SystemInfoHandlerTest, FileUtilsTest, DistributedMLTComponentTest, TestRTGBase, SolrTestCaseJ4Test, TestHighlightDedupGrouping, TestTolerantSearch, AssignBackwardCompatibilityTest, AssignTest, ChaosMonkeyNothingIsSafeWithPullReplicasTest, ConfigSetsAPITest, ConnectionManagerTest, CreateCollectionCleanupTest, CustomCollectionTest, DistribJoinFromCollectionTest, DistributedVersionInfoTest, MultiThreadedOCPTest, RemoteQueryErrorTest, ReplaceNodeTest]
   [junit4] Completed [530/728 (3!)] on J1 in 24.75s, 1 test, 1 error <<< FAILURES!

[...truncated 43953 lines...]

Mime
View raw message