lucene-dev mailing list archives

Site index · List index
Message view « Date » · « Thread »
Top « Date » · « Thread »
From Apache Jenkins Server <jenk...@builds.apache.org>
Subject [JENKINS] Lucene-Solr-NightlyTests-master - Build # 1374 - Failure
Date Sun, 13 Aug 2017 21:17:32 GMT
Build: https://builds.apache.org/job/Lucene-Solr-NightlyTests-master/1374/

10 tests failed.
FAILED:  org.apache.solr.cloud.ChaosMonkeyNothingIsSafeWithPullReplicasTest.test

Error Message:
The Monkey ran for over 45 seconds and no jetties were stopped - this is worth investigating!

Stack Trace:
java.lang.AssertionError: The Monkey ran for over 45 seconds and no jetties were stopped - this is worth investigating!
	at __randomizedtesting.SeedInfo.seed([9489780A84D1153E:1CDD47D02A2D78C6]:0)
	at org.junit.Assert.fail(Assert.java:93)
	at org.apache.solr.cloud.ChaosMonkey.stopTheMonkey(ChaosMonkey.java:587)
	at org.apache.solr.cloud.ChaosMonkeyNothingIsSafeWithPullReplicasTest.test(ChaosMonkeyNothingIsSafeWithPullReplicasTest.java:222)
	at sun.reflect.NativeMethodAccessorImpl.invoke0(Native Method)
	at sun.reflect.NativeMethodAccessorImpl.invoke(NativeMethodAccessorImpl.java:62)
	at sun.reflect.DelegatingMethodAccessorImpl.invoke(DelegatingMethodAccessorImpl.java:43)
	at java.lang.reflect.Method.invoke(Method.java:498)
	at com.carrotsearch.randomizedtesting.RandomizedRunner.invoke(RandomizedRunner.java:1713)
	at com.carrotsearch.randomizedtesting.RandomizedRunner$8.evaluate(RandomizedRunner.java:907)
	at com.carrotsearch.randomizedtesting.RandomizedRunner$9.evaluate(RandomizedRunner.java:943)
	at com.carrotsearch.randomizedtesting.RandomizedRunner$10.evaluate(RandomizedRunner.java:957)
	at org.apache.solr.BaseDistributedSearchTestCase$ShardsRepeatRule$ShardsFixedStatement.callStatement(BaseDistributedSearchTestCase.java:993)
	at org.apache.solr.BaseDistributedSearchTestCase$ShardsRepeatRule$ShardsStatement.evaluate(BaseDistributedSearchTestCase.java:968)
	at com.carrotsearch.randomizedtesting.rules.SystemPropertiesRestoreRule$1.evaluate(SystemPropertiesRestoreRule.java:57)
	at org.apache.lucene.util.TestRuleSetupTeardownChained$1.evaluate(TestRuleSetupTeardownChained.java:49)
	at org.apache.lucene.util.AbstractBeforeAfterRule$1.evaluate(AbstractBeforeAfterRule.java:45)
	at org.apache.lucene.util.TestRuleThreadAndTestName$1.evaluate(TestRuleThreadAndTestName.java:48)
	at org.apache.lucene.util.TestRuleIgnoreAfterMaxFailures$1.evaluate(TestRuleIgnoreAfterMaxFailures.java:64)
	at org.apache.lucene.util.TestRuleMarkFailure$1.evaluate(TestRuleMarkFailure.java:47)
	at com.carrotsearch.randomizedtesting.rules.StatementAdapter.evaluate(StatementAdapter.java:36)
	at com.carrotsearch.randomizedtesting.ThreadLeakControl$StatementRunner.run(ThreadLeakControl.java:368)
	at com.carrotsearch.randomizedtesting.ThreadLeakControl.forkTimeoutingTask(ThreadLeakControl.java:817)
	at com.carrotsearch.randomizedtesting.ThreadLeakControl$3.evaluate(ThreadLeakControl.java:468)
	at com.carrotsearch.randomizedtesting.RandomizedRunner.runSingleTest(RandomizedRunner.java:916)
	at com.carrotsearch.randomizedtesting.RandomizedRunner$5.evaluate(RandomizedRunner.java:802)
	at com.carrotsearch.randomizedtesting.RandomizedRunner$6.evaluate(RandomizedRunner.java:852)
	at com.carrotsearch.randomizedtesting.RandomizedRunner$7.evaluate(RandomizedRunner.java:863)
	at com.carrotsearch.randomizedtesting.rules.StatementAdapter.evaluate(StatementAdapter.java:36)
	at com.carrotsearch.randomizedtesting.rules.SystemPropertiesRestoreRule$1.evaluate(SystemPropertiesRestoreRule.java:57)
	at org.apache.lucene.util.AbstractBeforeAfterRule$1.evaluate(AbstractBeforeAfterRule.java:45)
	at com.carrotsearch.randomizedtesting.rules.StatementAdapter.evaluate(StatementAdapter.java:36)
	at org.apache.lucene.util.TestRuleStoreClassName$1.evaluate(TestRuleStoreClassName.java:41)
	at com.carrotsearch.randomizedtesting.rules.NoShadowingOrOverridesOnMethodsRule$1.evaluate(NoShadowingOrOverridesOnMethodsRule.java:40)
	at com.carrotsearch.randomizedtesting.rules.NoShadowingOrOverridesOnMethodsRule$1.evaluate(NoShadowingOrOverridesOnMethodsRule.java:40)
	at com.carrotsearch.randomizedtesting.rules.StatementAdapter.evaluate(StatementAdapter.java:36)
	at com.carrotsearch.randomizedtesting.rules.StatementAdapter.evaluate(StatementAdapter.java:36)
	at com.carrotsearch.randomizedtesting.rules.StatementAdapter.evaluate(StatementAdapter.java:36)
	at org.apache.lucene.util.TestRuleAssertionsRequired$1.evaluate(TestRuleAssertionsRequired.java:53)
	at org.apache.lucene.util.TestRuleMarkFailure$1.evaluate(TestRuleMarkFailure.java:47)
	at org.apache.lucene.util.TestRuleIgnoreAfterMaxFailures$1.evaluate(TestRuleIgnoreAfterMaxFailures.java:64)
	at org.apache.lucene.util.TestRuleIgnoreTestSuites$1.evaluate(TestRuleIgnoreTestSuites.java:54)
	at com.carrotsearch.randomizedtesting.rules.StatementAdapter.evaluate(StatementAdapter.java:36)
	at com.carrotsearch.randomizedtesting.ThreadLeakControl$StatementRunner.run(ThreadLeakControl.java:368)
	at java.lang.Thread.run(Thread.java:748)


FAILED:  junit.framework.TestSuite.org.apache.solr.cloud.ChaosMonkeyNothingIsSafeWithPullReplicasTest

Error Message:
13 threads leaked from SUITE scope at org.apache.solr.cloud.ChaosMonkeyNothingIsSafeWithPullReplicasTest:     1) Thread[id=38369, name=StoppableIndexingThread, state=TIMED_WAITING, group=TGRP-ChaosMonkeyNothingIsSafeWithPullReplicasTest]         at java.lang.Thread.sleep(Native Method)         at org.apache.solr.cloud.StoppableIndexingThread.run(StoppableIndexingThread.java:135)    2) Thread[id=38370, name=StoppableIndexingThread, state=TIMED_WAITING, group=TGRP-ChaosMonkeyNothingIsSafeWithPullReplicasTest]         at java.lang.Thread.sleep(Native Method)         at org.apache.solr.cloud.StoppableIndexingThread.run(StoppableIndexingThread.java:135)    3) Thread[id=38260, name=TEST-ChaosMonkeyNothingIsSafeWithPullReplicasTest.test-seed#[9489780A84D1153E]-SendThread(127.0.0.1:54604), state=TIMED_WAITING, group=TGRP-ChaosMonkeyNothingIsSafeWithPullReplicasTest]         at java.lang.Thread.sleep(Native Method)         at org.apache.zookeeper.ClientCnxn$SendThread.run(ClientCnxn.java:1051)    4) Thread[id=38408, name=StoppableCommitThread-SendThread(127.0.0.1:54604), state=TIMED_WAITING, group=TGRP-ChaosMonkeyNothingIsSafeWithPullReplicasTest]         at java.lang.Thread.sleep(Native Method)         at org.apache.zookeeper.client.StaticHostProvider.next(StaticHostProvider.java:101)         at org.apache.zookeeper.ClientCnxn$SendThread.startConnect(ClientCnxn.java:997)         at org.apache.zookeeper.ClientCnxn$SendThread.run(ClientCnxn.java:1060)    5) Thread[id=38371, name=StoppableIndexingThread, state=TIMED_WAITING, group=TGRP-ChaosMonkeyNothingIsSafeWithPullReplicasTest]         at java.lang.Thread.sleep(Native Method)         at org.apache.solr.cloud.StoppableIndexingThread.run(StoppableIndexingThread.java:135)    6) Thread[id=38259, name=Connection evictor, state=TIMED_WAITING, group=TGRP-ChaosMonkeyNothingIsSafeWithPullReplicasTest]         at java.lang.Thread.sleep(Native Method)         at org.apache.http.impl.client.IdleConnectionEvictor$1.run(IdleConnectionEvictor.java:66)         at java.lang.Thread.run(Thread.java:748)    7) Thread[id=38372, name=StoppableSearchThread, state=TIMED_WAITING, group=TGRP-ChaosMonkeyNothingIsSafeWithPullReplicasTest]         at java.lang.Thread.sleep(Native Method)         at org.apache.solr.cloud.StoppableSearchThread.run(StoppableSearchThread.java:65)    8) Thread[id=38373, name=StoppableCommitThread, state=TIMED_WAITING, group=TGRP-ChaosMonkeyNothingIsSafeWithPullReplicasTest]         at java.lang.Thread.sleep(Native Method)         at org.apache.solr.cloud.StoppableCommitThread.run(StoppableCommitThread.java:55)    9) Thread[id=38261, name=TEST-ChaosMonkeyNothingIsSafeWithPullReplicasTest.test-seed#[9489780A84D1153E]-EventThread, state=WAITING, group=TGRP-ChaosMonkeyNothingIsSafeWithPullReplicasTest]         at sun.misc.Unsafe.park(Native Method)         at java.util.concurrent.locks.LockSupport.park(LockSupport.java:175)         at java.util.concurrent.locks.AbstractQueuedSynchronizer$ConditionObject.await(AbstractQueuedSynchronizer.java:2039)         at java.util.concurrent.LinkedBlockingQueue.take(LinkedBlockingQueue.java:442)         at org.apache.zookeeper.ClientCnxn$EventThread.run(ClientCnxn.java:501)   10) Thread[id=38409, name=StoppableCommitThread-EventThread, state=WAITING, group=TGRP-ChaosMonkeyNothingIsSafeWithPullReplicasTest]         at sun.misc.Unsafe.park(Native Method)         at java.util.concurrent.locks.LockSupport.park(LockSupport.java:175)         at java.util.concurrent.locks.AbstractQueuedSynchronizer$ConditionObject.await(AbstractQueuedSynchronizer.java:2039)         at java.util.concurrent.LinkedBlockingQueue.take(LinkedBlockingQueue.java:442)         at org.apache.zookeeper.ClientCnxn$EventThread.run(ClientCnxn.java:501)

Stack Trace:
com.carrotsearch.randomizedtesting.ThreadLeakError: 13 threads leaked from SUITE scope at org.apache.solr.cloud.ChaosMonkeyNothingIsSafeWithPullReplicasTest: 
   1) Thread[id=38369, name=StoppableIndexingThread, state=TIMED_WAITING, group=TGRP-ChaosMonkeyNothingIsSafeWithPullReplicasTest]
        at java.lang.Thread.sleep(Native Method)
        at org.apache.solr.cloud.StoppableIndexingThread.run(StoppableIndexingThread.java:135)
   2) Thread[id=38370, name=StoppableIndexingThread, state=TIMED_WAITING, group=TGRP-ChaosMonkeyNothingIsSafeWithPullReplicasTest]
        at java.lang.Thread.sleep(Native Method)
        at org.apache.solr.cloud.StoppableIndexingThread.run(StoppableIndexingThread.java:135)
   3) Thread[id=38260, name=TEST-ChaosMonkeyNothingIsSafeWithPullReplicasTest.test-seed#[9489780A84D1153E]-SendThread(127.0.0.1:54604), state=TIMED_WAITING, group=TGRP-ChaosMonkeyNothingIsSafeWithPullReplicasTest]
        at java.lang.Thread.sleep(Native Method)
        at org.apache.zookeeper.ClientCnxn$SendThread.run(ClientCnxn.java:1051)
   4) Thread[id=38408, name=StoppableCommitThread-SendThread(127.0.0.1:54604), state=TIMED_WAITING, group=TGRP-ChaosMonkeyNothingIsSafeWithPullReplicasTest]
        at java.lang.Thread.sleep(Native Method)
        at org.apache.zookeeper.client.StaticHostProvider.next(StaticHostProvider.java:101)
        at org.apache.zookeeper.ClientCnxn$SendThread.startConnect(ClientCnxn.java:997)
        at org.apache.zookeeper.ClientCnxn$SendThread.run(ClientCnxn.java:1060)
   5) Thread[id=38371, name=StoppableIndexingThread, state=TIMED_WAITING, group=TGRP-ChaosMonkeyNothingIsSafeWithPullReplicasTest]
        at java.lang.Thread.sleep(Native Method)
        at org.apache.solr.cloud.StoppableIndexingThread.run(StoppableIndexingThread.java:135)
   6) Thread[id=38259, name=Connection evictor, state=TIMED_WAITING, group=TGRP-ChaosMonkeyNothingIsSafeWithPullReplicasTest]
        at java.lang.Thread.sleep(Native Method)
        at org.apache.http.impl.client.IdleConnectionEvictor$1.run(IdleConnectionEvictor.java:66)
        at java.lang.Thread.run(Thread.java:748)
   7) Thread[id=38372, name=StoppableSearchThread, state=TIMED_WAITING, group=TGRP-ChaosMonkeyNothingIsSafeWithPullReplicasTest]
        at java.lang.Thread.sleep(Native Method)
        at org.apache.solr.cloud.StoppableSearchThread.run(StoppableSearchThread.java:65)
   8) Thread[id=38373, name=StoppableCommitThread, state=TIMED_WAITING, group=TGRP-ChaosMonkeyNothingIsSafeWithPullReplicasTest]
        at java.lang.Thread.sleep(Native Method)
        at org.apache.solr.cloud.StoppableCommitThread.run(StoppableCommitThread.java:55)
   9) Thread[id=38261, name=TEST-ChaosMonkeyNothingIsSafeWithPullReplicasTest.test-seed#[9489780A84D1153E]-EventThread, state=WAITING, group=TGRP-ChaosMonkeyNothingIsSafeWithPullReplicasTest]
        at sun.misc.Unsafe.park(Native Method)
        at java.util.concurrent.locks.LockSupport.park(LockSupport.java:175)
        at java.util.concurrent.locks.AbstractQueuedSynchronizer$ConditionObject.await(AbstractQueuedSynchronizer.java:2039)
        at java.util.concurrent.LinkedBlockingQueue.take(LinkedBlockingQueue.java:442)
        at org.apache.zookeeper.ClientCnxn$EventThread.run(ClientCnxn.java:501)
  10) Thread[id=38409, name=StoppableCommitThread-EventThread, state=WAITING, group=TGRP-ChaosMonkeyNothingIsSafeWithPullReplicasTest]
        at sun.misc.Unsafe.park(Native Method)
        at java.util.concurrent.locks.LockSupport.park(LockSupport.java:175)
        at java.util.concurrent.locks.AbstractQueuedSynchronizer$ConditionObject.await(AbstractQueuedSynchronizer.java:2039)
        at java.util.concurrent.LinkedBlockingQueue.take(LinkedBlockingQueue.java:442)
        at org.apache.zookeeper.ClientCnxn$EventThread.run(ClientCnxn.java:501)
	at __randomizedtesting.SeedInfo.seed([9489780A84D1153E]:0)


FAILED:  junit.framework.TestSuite.org.apache.solr.cloud.ChaosMonkeyNothingIsSafeWithPullReplicasTest

Error Message:
There are still zombie threads that couldn't be terminated:    1) Thread[id=38369, name=StoppableIndexingThread, state=RUNNABLE, group=TGRP-ChaosMonkeyNothingIsSafeWithPullReplicasTest]         at org.apache.solr.common.util.JavaBinCodec.writeExternString(JavaBinCodec.java:1072)         at org.apache.solr.common.util.JavaBinCodec.writeSolrInputDocument(JavaBinCodec.java:615)         at org.apache.solr.common.util.JavaBinCodec.writeKnownType(JavaBinCodec.java:355)         at org.apache.solr.common.util.JavaBinCodec.writeVal(JavaBinCodec.java:228)         at org.apache.solr.common.util.JavaBinCodec.writeMapEntry(JavaBinCodec.java:764)         at org.apache.solr.common.util.JavaBinCodec.writeKnownType(JavaBinCodec.java:383)         at org.apache.solr.common.util.JavaBinCodec.writeVal(JavaBinCodec.java:228)         at org.apache.solr.common.util.JavaBinCodec.writeIterator(JavaBinCodec.java:705)         at org.apache.solr.common.util.JavaBinCodec.writeKnownType(JavaBinCodec.java:367)         at org.apache.solr.common.util.JavaBinCodec.writeVal(JavaBinCodec.java:228)         at org.apache.solr.common.util.JavaBinCodec.writeNamedList(JavaBinCodec.java:223)         at org.apache.solr.common.util.JavaBinCodec.writeKnownType(JavaBinCodec.java:330)         at org.apache.solr.common.util.JavaBinCodec.writeVal(JavaBinCodec.java:228)         at org.apache.solr.common.util.JavaBinCodec.marshal(JavaBinCodec.java:155)         at org.apache.solr.client.solrj.request.JavaBinUpdateRequestCodec.marshal(JavaBinUpdateRequestCodec.java:91)         at org.apache.solr.client.solrj.impl.BinaryRequestWriter.getContentStream(BinaryRequestWriter.java:67)         at org.apache.solr.client.solrj.request.RequestWriter$LazyContentStream.getDelegate(RequestWriter.java:94)         at org.apache.solr.client.solrj.request.RequestWriter$LazyContentStream.getName(RequestWriter.java:104)         at org.apache.solr.client.solrj.impl.HttpSolrClient.createMethod(HttpSolrClient.java:382)         at org.apache.solr.client.solrj.impl.HttpSolrClient.request(HttpSolrClient.java:251)         at org.apache.solr.client.solrj.impl.HttpSolrClient.request(HttpSolrClient.java:242)         at org.apache.solr.client.solrj.SolrRequest.process(SolrRequest.java:178)         at org.apache.solr.client.solrj.SolrRequest.process(SolrRequest.java:195)         at org.apache.solr.cloud.StoppableIndexingThread.indexDocs(StoppableIndexingThread.java:176)         at org.apache.solr.cloud.StoppableIndexingThread.run(StoppableIndexingThread.java:115)    2) Thread[id=38370, name=StoppableIndexingThread, state=RUNNABLE, group=TGRP-ChaosMonkeyNothingIsSafeWithPullReplicasTest]         at org.apache.http.util.EntityUtils.toByteArray(EntityUtils.java:137)         at org.apache.http.entity.BufferedHttpEntity.<init>(BufferedHttpEntity.java:63)         at org.apache.solr.client.solrj.impl.Krb5HttpClientBuilder.lambda$new$3(Krb5HttpClientBuilder.java:154)         at org.apache.solr.client.solrj.impl.Krb5HttpClientBuilder$$Lambda$480/1844910317.process(Unknown Source)         at org.apache.solr.client.solrj.impl.HttpClientUtil$DynamicInterceptor$1.accept(HttpClientUtil.java:166)         at org.apache.solr.client.solrj.impl.HttpClientUtil$DynamicInterceptor$1.accept(HttpClientUtil.java:161)         at java.util.concurrent.CopyOnWriteArrayList.forEach(CopyOnWriteArrayList.java:890)         at org.apache.solr.client.solrj.impl.HttpClientUtil$DynamicInterceptor.process(HttpClientUtil.java:161)         at org.apache.http.protocol.ImmutableHttpProcessor.process(ImmutableHttpProcessor.java:132)         at org.apache.http.impl.execchain.ProtocolExec.execute(ProtocolExec.java:182)         at org.apache.http.impl.execchain.RetryExec.execute(RetryExec.java:88)         at org.apache.http.impl.execchain.RedirectExec.execute(RedirectExec.java:110)         at org.apache.http.impl.client.InternalHttpClient.doExecute(InternalHttpClient.java:184)         at org.apache.http.impl.client.CloseableHttpClient.execute(CloseableHttpClient.java:82)         at org.apache.http.impl.client.CloseableHttpClient.execute(CloseableHttpClient.java:55)         at org.apache.solr.client.solrj.impl.HttpSolrClient.executeMethod(HttpSolrClient.java:526)         at org.apache.solr.client.solrj.impl.HttpSolrClient.request(HttpSolrClient.java:253)         at org.apache.solr.client.solrj.impl.HttpSolrClient.request(HttpSolrClient.java:242)         at org.apache.solr.client.solrj.SolrRequest.process(SolrRequest.java:178)         at org.apache.solr.client.solrj.SolrRequest.process(SolrRequest.java:195)         at org.apache.solr.cloud.StoppableIndexingThread.indexDocs(StoppableIndexingThread.java:176)         at org.apache.solr.cloud.StoppableIndexingThread.run(StoppableIndexingThread.java:115)    3) Thread[id=38260, name=TEST-ChaosMonkeyNothingIsSafeWithPullReplicasTest.test-seed#[9489780A84D1153E]-SendThread(127.0.0.1:54604), state=TIMED_WAITING, group=TGRP-ChaosMonkeyNothingIsSafeWithPullReplicasTest]         at java.lang.Thread.sleep(Native Method)         at org.apache.zookeeper.client.StaticHostProvider.next(StaticHostProvider.java:101)         at org.apache.zookeeper.ClientCnxn$SendThread.startConnect(ClientCnxn.java:997)         at org.apache.zookeeper.ClientCnxn$SendThread.run(ClientCnxn.java:1060)    4) Thread[id=38408, name=StoppableCommitThread-SendThread(127.0.0.1:54604), state=TIMED_WAITING, group=TGRP-ChaosMonkeyNothingIsSafeWithPullReplicasTest]         at java.lang.Thread.sleep(Native Method)         at org.apache.zookeeper.client.StaticHostProvider.next(StaticHostProvider.java:101)         at org.apache.zookeeper.ClientCnxn$SendThread.startConnect(ClientCnxn.java:997)         at org.apache.zookeeper.ClientCnxn$SendThread.run(ClientCnxn.java:1060)    5) Thread[id=38371, name=StoppableIndexingThread, state=BLOCKED, group=TGRP-ChaosMonkeyNothingIsSafeWithPullReplicasTest]         at java.io.PrintStream.println(PrintStream.java:805)         at org.apache.solr.cloud.StoppableIndexingThread.run(StoppableIndexingThread.java:120)    6) Thread[id=38372, name=StoppableSearchThread, state=BLOCKED, group=TGRP-ChaosMonkeyNothingIsSafeWithPullReplicasTest]         at java.lang.Throwable.printStackTrace(Throwable.java:653)         at java.lang.Throwable.printStackTrace(Throwable.java:643)         at java.lang.Throwable.printStackTrace(Throwable.java:634)         at org.apache.solr.cloud.StoppableSearchThread.run(StoppableSearchThread.java:57)

Stack Trace:
com.carrotsearch.randomizedtesting.ThreadLeakError: There are still zombie threads that couldn't be terminated:
   1) Thread[id=38369, name=StoppableIndexingThread, state=RUNNABLE, group=TGRP-ChaosMonkeyNothingIsSafeWithPullReplicasTest]
        at org.apache.solr.common.util.JavaBinCodec.writeExternString(JavaBinCodec.java:1072)
        at org.apache.solr.common.util.JavaBinCodec.writeSolrInputDocument(JavaBinCodec.java:615)
        at org.apache.solr.common.util.JavaBinCodec.writeKnownType(JavaBinCodec.java:355)
        at org.apache.solr.common.util.JavaBinCodec.writeVal(JavaBinCodec.java:228)
        at org.apache.solr.common.util.JavaBinCodec.writeMapEntry(JavaBinCodec.java:764)
        at org.apache.solr.common.util.JavaBinCodec.writeKnownType(JavaBinCodec.java:383)
        at org.apache.solr.common.util.JavaBinCodec.writeVal(JavaBinCodec.java:228)
        at org.apache.solr.common.util.JavaBinCodec.writeIterator(JavaBinCodec.java:705)
        at org.apache.solr.common.util.JavaBinCodec.writeKnownType(JavaBinCodec.java:367)
        at org.apache.solr.common.util.JavaBinCodec.writeVal(JavaBinCodec.java:228)
        at org.apache.solr.common.util.JavaBinCodec.writeNamedList(JavaBinCodec.java:223)
        at org.apache.solr.common.util.JavaBinCodec.writeKnownType(JavaBinCodec.java:330)
        at org.apache.solr.common.util.JavaBinCodec.writeVal(JavaBinCodec.java:228)
        at org.apache.solr.common.util.JavaBinCodec.marshal(JavaBinCodec.java:155)
        at org.apache.solr.client.solrj.request.JavaBinUpdateRequestCodec.marshal(JavaBinUpdateRequestCodec.java:91)
        at org.apache.solr.client.solrj.impl.BinaryRequestWriter.getContentStream(BinaryRequestWriter.java:67)
        at org.apache.solr.client.solrj.request.RequestWriter$LazyContentStream.getDelegate(RequestWriter.java:94)
        at org.apache.solr.client.solrj.request.RequestWriter$LazyContentStream.getName(RequestWriter.java:104)
        at org.apache.solr.client.solrj.impl.HttpSolrClient.createMethod(HttpSolrClient.java:382)
        at org.apache.solr.client.solrj.impl.HttpSolrClient.request(HttpSolrClient.java:251)
        at org.apache.solr.client.solrj.impl.HttpSolrClient.request(HttpSolrClient.java:242)
        at org.apache.solr.client.solrj.SolrRequest.process(SolrRequest.java:178)
        at org.apache.solr.client.solrj.SolrRequest.process(SolrRequest.java:195)
        at org.apache.solr.cloud.StoppableIndexingThread.indexDocs(StoppableIndexingThread.java:176)
        at org.apache.solr.cloud.StoppableIndexingThread.run(StoppableIndexingThread.java:115)
   2) Thread[id=38370, name=StoppableIndexingThread, state=RUNNABLE, group=TGRP-ChaosMonkeyNothingIsSafeWithPullReplicasTest]
        at org.apache.http.util.EntityUtils.toByteArray(EntityUtils.java:137)
        at org.apache.http.entity.BufferedHttpEntity.<init>(BufferedHttpEntity.java:63)
        at org.apache.solr.client.solrj.impl.Krb5HttpClientBuilder.lambda$new$3(Krb5HttpClientBuilder.java:154)
        at org.apache.solr.client.solrj.impl.Krb5HttpClientBuilder$$Lambda$480/1844910317.process(Unknown Source)
        at org.apache.solr.client.solrj.impl.HttpClientUtil$DynamicInterceptor$1.accept(HttpClientUtil.java:166)
        at org.apache.solr.client.solrj.impl.HttpClientUtil$DynamicInterceptor$1.accept(HttpClientUtil.java:161)
        at java.util.concurrent.CopyOnWriteArrayList.forEach(CopyOnWriteArrayList.java:890)
        at org.apache.solr.client.solrj.impl.HttpClientUtil$DynamicInterceptor.process(HttpClientUtil.java:161)
        at org.apache.http.protocol.ImmutableHttpProcessor.process(ImmutableHttpProcessor.java:132)
        at org.apache.http.impl.execchain.ProtocolExec.execute(ProtocolExec.java:182)
        at org.apache.http.impl.execchain.RetryExec.execute(RetryExec.java:88)
        at org.apache.http.impl.execchain.RedirectExec.execute(RedirectExec.java:110)
        at org.apache.http.impl.client.InternalHttpClient.doExecute(InternalHttpClient.java:184)
        at org.apache.http.impl.client.CloseableHttpClient.execute(CloseableHttpClient.java:82)
        at org.apache.http.impl.client.CloseableHttpClient.execute(CloseableHttpClient.java:55)
        at org.apache.solr.client.solrj.impl.HttpSolrClient.executeMethod(HttpSolrClient.java:526)
        at org.apache.solr.client.solrj.impl.HttpSolrClient.request(HttpSolrClient.java:253)
        at org.apache.solr.client.solrj.impl.HttpSolrClient.request(HttpSolrClient.java:242)
        at org.apache.solr.client.solrj.SolrRequest.process(SolrRequest.java:178)
        at org.apache.solr.client.solrj.SolrRequest.process(SolrRequest.java:195)
        at org.apache.solr.cloud.StoppableIndexingThread.indexDocs(StoppableIndexingThread.java:176)
        at org.apache.solr.cloud.StoppableIndexingThread.run(StoppableIndexingThread.java:115)
   3) Thread[id=38260, name=TEST-ChaosMonkeyNothingIsSafeWithPullReplicasTest.test-seed#[9489780A84D1153E]-SendThread(127.0.0.1:54604), state=TIMED_WAITING, group=TGRP-ChaosMonkeyNothingIsSafeWithPullReplicasTest]
        at java.lang.Thread.sleep(Native Method)
        at org.apache.zookeeper.client.StaticHostProvider.next(StaticHostProvider.java:101)
        at org.apache.zookeeper.ClientCnxn$SendThread.startConnect(ClientCnxn.java:997)
        at org.apache.zookeeper.ClientCnxn$SendThread.run(ClientCnxn.java:1060)
   4) Thread[id=38408, name=StoppableCommitThread-SendThread(127.0.0.1:54604), state=TIMED_WAITING, group=TGRP-ChaosMonkeyNothingIsSafeWithPullReplicasTest]
        at java.lang.Thread.sleep(Native Method)
        at org.apache.zookeeper.client.StaticHostProvider.next(StaticHostProvider.java:101)
        at org.apache.zookeeper.ClientCnxn$SendThread.startConnect(ClientCnxn.java:997)
        at org.apache.zookeeper.ClientCnxn$SendThread.run(ClientCnxn.java:1060)
   5) Thread[id=38371, name=StoppableIndexingThread, state=BLOCKED, group=TGRP-ChaosMonkeyNothingIsSafeWithPullReplicasTest]
        at java.io.PrintStream.println(PrintStream.java:805)
        at org.apache.solr.cloud.StoppableIndexingThread.run(StoppableIndexingThread.java:120)
   6) Thread[id=38372, name=StoppableSearchThread, state=BLOCKED, group=TGRP-ChaosMonkeyNothingIsSafeWithPullReplicasTest]
        at java.lang.Throwable.printStackTrace(Throwable.java:653)
        at java.lang.Throwable.printStackTrace(Throwable.java:643)
        at java.lang.Throwable.printStackTrace(Throwable.java:634)
        at org.apache.solr.cloud.StoppableSearchThread.run(StoppableSearchThread.java:57)
	at __randomizedtesting.SeedInfo.seed([9489780A84D1153E]:0)


FAILED:  org.apache.solr.cloud.ChaosMonkeySafeLeaderTest.test

Error Message:
The Monkey ran for over 45 seconds and no jetties were stopped - this is worth investigating!

Stack Trace:
java.lang.AssertionError: The Monkey ran for over 45 seconds and no jetties were stopped - this is worth investigating!
	at __randomizedtesting.SeedInfo.seed([9489780A84D1153E:1CDD47D02A2D78C6]:0)
	at org.junit.Assert.fail(Assert.java:93)
	at org.apache.solr.cloud.ChaosMonkey.stopTheMonkey(ChaosMonkey.java:587)
	at org.apache.solr.cloud.ChaosMonkeySafeLeaderTest.test(ChaosMonkeySafeLeaderTest.java:133)
	at sun.reflect.NativeMethodAccessorImpl.invoke0(Native Method)
	at sun.reflect.NativeMethodAccessorImpl.invoke(NativeMethodAccessorImpl.java:62)
	at sun.reflect.DelegatingMethodAccessorImpl.invoke(DelegatingMethodAccessorImpl.java:43)
	at java.lang.reflect.Method.invoke(Method.java:498)
	at com.carrotsearch.randomizedtesting.RandomizedRunner.invoke(RandomizedRunner.java:1713)
	at com.carrotsearch.randomizedtesting.RandomizedRunner$8.evaluate(RandomizedRunner.java:907)
	at com.carrotsearch.randomizedtesting.RandomizedRunner$9.evaluate(RandomizedRunner.java:943)
	at com.carrotsearch.randomizedtesting.RandomizedRunner$10.evaluate(RandomizedRunner.java:957)
	at org.apache.solr.BaseDistributedSearchTestCase$ShardsRepeatRule$ShardsFixedStatement.callStatement(BaseDistributedSearchTestCase.java:993)
	at org.apache.solr.BaseDistributedSearchTestCase$ShardsRepeatRule$ShardsStatement.evaluate(BaseDistributedSearchTestCase.java:968)
	at com.carrotsearch.randomizedtesting.rules.SystemPropertiesRestoreRule$1.evaluate(SystemPropertiesRestoreRule.java:57)
	at org.apache.lucene.util.TestRuleSetupTeardownChained$1.evaluate(TestRuleSetupTeardownChained.java:49)
	at org.apache.lucene.util.AbstractBeforeAfterRule$1.evaluate(AbstractBeforeAfterRule.java:45)
	at org.apache.lucene.util.TestRuleThreadAndTestName$1.evaluate(TestRuleThreadAndTestName.java:48)
	at org.apache.lucene.util.TestRuleIgnoreAfterMaxFailures$1.evaluate(TestRuleIgnoreAfterMaxFailures.java:64)
	at org.apache.lucene.util.TestRuleMarkFailure$1.evaluate(TestRuleMarkFailure.java:47)
	at com.carrotsearch.randomizedtesting.rules.StatementAdapter.evaluate(StatementAdapter.java:36)
	at com.carrotsearch.randomizedtesting.ThreadLeakControl$StatementRunner.run(ThreadLeakControl.java:368)
	at com.carrotsearch.randomizedtesting.ThreadLeakControl.forkTimeoutingTask(ThreadLeakControl.java:817)
	at com.carrotsearch.randomizedtesting.ThreadLeakControl$3.evaluate(ThreadLeakControl.java:468)
	at com.carrotsearch.randomizedtesting.RandomizedRunner.runSingleTest(RandomizedRunner.java:916)
	at com.carrotsearch.randomizedtesting.RandomizedRunner$5.evaluate(RandomizedRunner.java:802)
	at com.carrotsearch.randomizedtesting.RandomizedRunner$6.evaluate(RandomizedRunner.java:852)
	at com.carrotsearch.randomizedtesting.RandomizedRunner$7.evaluate(RandomizedRunner.java:863)
	at com.carrotsearch.randomizedtesting.rules.StatementAdapter.evaluate(StatementAdapter.java:36)
	at com.carrotsearch.randomizedtesting.rules.SystemPropertiesRestoreRule$1.evaluate(SystemPropertiesRestoreRule.java:57)
	at org.apache.lucene.util.AbstractBeforeAfterRule$1.evaluate(AbstractBeforeAfterRule.java:45)
	at com.carrotsearch.randomizedtesting.rules.StatementAdapter.evaluate(StatementAdapter.java:36)
	at org.apache.lucene.util.TestRuleStoreClassName$1.evaluate(TestRuleStoreClassName.java:41)
	at com.carrotsearch.randomizedtesting.rules.NoShadowingOrOverridesOnMethodsRule$1.evaluate(NoShadowingOrOverridesOnMethodsRule.java:40)
	at com.carrotsearch.randomizedtesting.rules.NoShadowingOrOverridesOnMethodsRule$1.evaluate(NoShadowingOrOverridesOnMethodsRule.java:40)
	at com.carrotsearch.randomizedtesting.rules.StatementAdapter.evaluate(StatementAdapter.java:36)
	at com.carrotsearch.randomizedtesting.rules.StatementAdapter.evaluate(StatementAdapter.java:36)
	at com.carrotsearch.randomizedtesting.rules.StatementAdapter.evaluate(StatementAdapter.java:36)
	at org.apache.lucene.util.TestRuleAssertionsRequired$1.evaluate(TestRuleAssertionsRequired.java:53)
	at org.apache.lucene.util.TestRuleMarkFailure$1.evaluate(TestRuleMarkFailure.java:47)
	at org.apache.lucene.util.TestRuleIgnoreAfterMaxFailures$1.evaluate(TestRuleIgnoreAfterMaxFailures.java:64)
	at org.apache.lucene.util.TestRuleIgnoreTestSuites$1.evaluate(TestRuleIgnoreTestSuites.java:54)
	at com.carrotsearch.randomizedtesting.rules.StatementAdapter.evaluate(StatementAdapter.java:36)
	at com.carrotsearch.randomizedtesting.ThreadLeakControl$StatementRunner.run(ThreadLeakControl.java:368)
	at java.lang.Thread.run(Thread.java:748)


FAILED:  org.apache.solr.cloud.ChaosMonkeySafeLeaderWithPullReplicasTest.test

Error Message:
The Monkey ran for over 45 seconds and no jetties were stopped - this is worth investigating!

Stack Trace:
java.lang.AssertionError: The Monkey ran for over 45 seconds and no jetties were stopped - this is worth investigating!
	at __randomizedtesting.SeedInfo.seed([9489780A84D1153E:1CDD47D02A2D78C6]:0)
	at org.junit.Assert.fail(Assert.java:93)
	at org.apache.solr.cloud.ChaosMonkey.stopTheMonkey(ChaosMonkey.java:587)
	at org.apache.solr.cloud.ChaosMonkeySafeLeaderWithPullReplicasTest.test(ChaosMonkeySafeLeaderWithPullReplicasTest.java:174)
	at sun.reflect.NativeMethodAccessorImpl.invoke0(Native Method)
	at sun.reflect.NativeMethodAccessorImpl.invoke(NativeMethodAccessorImpl.java:62)
	at sun.reflect.DelegatingMethodAccessorImpl.invoke(DelegatingMethodAccessorImpl.java:43)
	at java.lang.reflect.Method.invoke(Method.java:498)
	at com.carrotsearch.randomizedtesting.RandomizedRunner.invoke(RandomizedRunner.java:1713)
	at com.carrotsearch.randomizedtesting.RandomizedRunner$8.evaluate(RandomizedRunner.java:907)
	at com.carrotsearch.randomizedtesting.RandomizedRunner$9.evaluate(RandomizedRunner.java:943)
	at com.carrotsearch.randomizedtesting.RandomizedRunner$10.evaluate(RandomizedRunner.java:957)
	at org.apache.solr.BaseDistributedSearchTestCase$ShardsRepeatRule$ShardsFixedStatement.callStatement(BaseDistributedSearchTestCase.java:993)
	at org.apache.solr.BaseDistributedSearchTestCase$ShardsRepeatRule$ShardsStatement.evaluate(BaseDistributedSearchTestCase.java:968)
	at com.carrotsearch.randomizedtesting.rules.SystemPropertiesRestoreRule$1.evaluate(SystemPropertiesRestoreRule.java:57)
	at org.apache.lucene.util.TestRuleSetupTeardownChained$1.evaluate(TestRuleSetupTeardownChained.java:49)
	at org.apache.lucene.util.AbstractBeforeAfterRule$1.evaluate(AbstractBeforeAfterRule.java:45)
	at org.apache.lucene.util.TestRuleThreadAndTestName$1.evaluate(TestRuleThreadAndTestName.java:48)
	at org.apache.lucene.util.TestRuleIgnoreAfterMaxFailures$1.evaluate(TestRuleIgnoreAfterMaxFailures.java:64)
	at org.apache.lucene.util.TestRuleMarkFailure$1.evaluate(TestRuleMarkFailure.java:47)
	at com.carrotsearch.randomizedtesting.rules.StatementAdapter.evaluate(StatementAdapter.java:36)
	at com.carrotsearch.randomizedtesting.ThreadLeakControl$StatementRunner.run(ThreadLeakControl.java:368)
	at com.carrotsearch.randomizedtesting.ThreadLeakControl.forkTimeoutingTask(ThreadLeakControl.java:817)
	at com.carrotsearch.randomizedtesting.ThreadLeakControl$3.evaluate(ThreadLeakControl.java:468)
	at com.carrotsearch.randomizedtesting.RandomizedRunner.runSingleTest(RandomizedRunner.java:916)
	at com.carrotsearch.randomizedtesting.RandomizedRunner$5.evaluate(RandomizedRunner.java:802)
	at com.carrotsearch.randomizedtesting.RandomizedRunner$6.evaluate(RandomizedRunner.java:852)
	at com.carrotsearch.randomizedtesting.RandomizedRunner$7.evaluate(RandomizedRunner.java:863)
	at com.carrotsearch.randomizedtesting.rules.StatementAdapter.evaluate(StatementAdapter.java:36)
	at com.carrotsearch.randomizedtesting.rules.SystemPropertiesRestoreRule$1.evaluate(SystemPropertiesRestoreRule.java:57)
	at org.apache.lucene.util.AbstractBeforeAfterRule$1.evaluate(AbstractBeforeAfterRule.java:45)
	at com.carrotsearch.randomizedtesting.rules.StatementAdapter.evaluate(StatementAdapter.java:36)
	at org.apache.lucene.util.TestRuleStoreClassName$1.evaluate(TestRuleStoreClassName.java:41)
	at com.carrotsearch.randomizedtesting.rules.NoShadowingOrOverridesOnMethodsRule$1.evaluate(NoShadowingOrOverridesOnMethodsRule.java:40)
	at com.carrotsearch.randomizedtesting.rules.NoShadowingOrOverridesOnMethodsRule$1.evaluate(NoShadowingOrOverridesOnMethodsRule.java:40)
	at com.carrotsearch.randomizedtesting.rules.StatementAdapter.evaluate(StatementAdapter.java:36)
	at com.carrotsearch.randomizedtesting.rules.StatementAdapter.evaluate(StatementAdapter.java:36)
	at com.carrotsearch.randomizedtesting.rules.StatementAdapter.evaluate(StatementAdapter.java:36)
	at org.apache.lucene.util.TestRuleAssertionsRequired$1.evaluate(TestRuleAssertionsRequired.java:53)
	at org.apache.lucene.util.TestRuleMarkFailure$1.evaluate(TestRuleMarkFailure.java:47)
	at org.apache.lucene.util.TestRuleIgnoreAfterMaxFailures$1.evaluate(TestRuleIgnoreAfterMaxFailures.java:64)
	at org.apache.lucene.util.TestRuleIgnoreTestSuites$1.evaluate(TestRuleIgnoreTestSuites.java:54)
	at com.carrotsearch.randomizedtesting.rules.StatementAdapter.evaluate(StatementAdapter.java:36)
	at com.carrotsearch.randomizedtesting.ThreadLeakControl$StatementRunner.run(ThreadLeakControl.java:368)
	at java.lang.Thread.run(Thread.java:748)


FAILED:  junit.framework.TestSuite.org.apache.solr.cloud.ChaosMonkeySafeLeaderWithPullReplicasTest

Error Message:
5 threads leaked from SUITE scope at org.apache.solr.cloud.ChaosMonkeySafeLeaderWithPullReplicasTest:     1) Thread[id=30747, name=StoppableIndexingThread, state=TIMED_WAITING, group=TGRP-ChaosMonkeySafeLeaderWithPullReplicasTest]         at java.lang.Thread.sleep(Native Method)         at org.apache.solr.cloud.StoppableIndexingThread.run(StoppableIndexingThread.java:135)    2) Thread[id=30779, name=StoppableCommitThread-EventThread, state=WAITING, group=TGRP-ChaosMonkeySafeLeaderWithPullReplicasTest]         at sun.misc.Unsafe.park(Native Method)         at java.util.concurrent.locks.LockSupport.park(LockSupport.java:175)         at java.util.concurrent.locks.AbstractQueuedSynchronizer$ConditionObject.await(AbstractQueuedSynchronizer.java:2039)         at java.util.concurrent.LinkedBlockingQueue.take(LinkedBlockingQueue.java:442)         at org.apache.zookeeper.ClientCnxn$EventThread.run(ClientCnxn.java:501)    3) Thread[id=30748, name=StoppableIndexingThread, state=TIMED_WAITING, group=TGRP-ChaosMonkeySafeLeaderWithPullReplicasTest]         at java.lang.Thread.sleep(Native Method)         at org.apache.solr.cloud.StoppableIndexingThread.run(StoppableIndexingThread.java:135)    4) Thread[id=30749, name=StoppableCommitThread, state=TIMED_WAITING, group=TGRP-ChaosMonkeySafeLeaderWithPullReplicasTest]         at java.lang.Object.wait(Native Method)         at org.apache.solr.common.cloud.ConnectionManager.waitForConnected(ConnectionManager.java:225)         at org.apache.solr.common.cloud.SolrZkClient.<init>(SolrZkClient.java:175)         at org.apache.solr.common.cloud.SolrZkClient.<init>(SolrZkClient.java:117)         at org.apache.solr.common.cloud.SolrZkClient.<init>(SolrZkClient.java:107)         at org.apache.solr.common.cloud.ZkStateReader.<init>(ZkStateReader.java:235)         at org.apache.solr.client.solrj.impl.ZkClientClusterStateProvider.connect(ZkClientClusterStateProvider.java:140)         at org.apache.solr.client.solrj.impl.CloudSolrClient.connect(CloudSolrClient.java:383)         at org.apache.solr.client.solrj.impl.CloudSolrClient.requestWithRetryOnStaleState(CloudSolrClient.java:805)         at org.apache.solr.client.solrj.impl.CloudSolrClient.request(CloudSolrClient.java:793)         at org.apache.solr.client.solrj.SolrRequest.process(SolrRequest.java:178)         at org.apache.solr.client.solrj.SolrClient.commit(SolrClient.java:524)         at org.apache.solr.client.solrj.SolrClient.commit(SolrClient.java:544)         at org.apache.solr.cloud.StoppableCommitThread.run(StoppableCommitThread.java:49)    5) Thread[id=30778, name=StoppableCommitThread-SendThread(127.0.0.1:37915), state=TIMED_WAITING, group=TGRP-ChaosMonkeySafeLeaderWithPullReplicasTest]         at java.lang.Thread.sleep(Native Method)         at org.apache.zookeeper.client.StaticHostProvider.next(StaticHostProvider.java:101)         at org.apache.zookeeper.ClientCnxn$SendThread.startConnect(ClientCnxn.java:997)         at org.apache.zookeeper.ClientCnxn$SendThread.run(ClientCnxn.java:1060)

Stack Trace:
com.carrotsearch.randomizedtesting.ThreadLeakError: 5 threads leaked from SUITE scope at org.apache.solr.cloud.ChaosMonkeySafeLeaderWithPullReplicasTest: 
   1) Thread[id=30747, name=StoppableIndexingThread, state=TIMED_WAITING, group=TGRP-ChaosMonkeySafeLeaderWithPullReplicasTest]
        at java.lang.Thread.sleep(Native Method)
        at org.apache.solr.cloud.StoppableIndexingThread.run(StoppableIndexingThread.java:135)
   2) Thread[id=30779, name=StoppableCommitThread-EventThread, state=WAITING, group=TGRP-ChaosMonkeySafeLeaderWithPullReplicasTest]
        at sun.misc.Unsafe.park(Native Method)
        at java.util.concurrent.locks.LockSupport.park(LockSupport.java:175)
        at java.util.concurrent.locks.AbstractQueuedSynchronizer$ConditionObject.await(AbstractQueuedSynchronizer.java:2039)
        at java.util.concurrent.LinkedBlockingQueue.take(LinkedBlockingQueue.java:442)
        at org.apache.zookeeper.ClientCnxn$EventThread.run(ClientCnxn.java:501)
   3) Thread[id=30748, name=StoppableIndexingThread, state=TIMED_WAITING, group=TGRP-ChaosMonkeySafeLeaderWithPullReplicasTest]
        at java.lang.Thread.sleep(Native Method)
        at org.apache.solr.cloud.StoppableIndexingThread.run(StoppableIndexingThread.java:135)
   4) Thread[id=30749, name=StoppableCommitThread, state=TIMED_WAITING, group=TGRP-ChaosMonkeySafeLeaderWithPullReplicasTest]
        at java.lang.Object.wait(Native Method)
        at org.apache.solr.common.cloud.ConnectionManager.waitForConnected(ConnectionManager.java:225)
        at org.apache.solr.common.cloud.SolrZkClient.<init>(SolrZkClient.java:175)
        at org.apache.solr.common.cloud.SolrZkClient.<init>(SolrZkClient.java:117)
        at org.apache.solr.common.cloud.SolrZkClient.<init>(SolrZkClient.java:107)
        at org.apache.solr.common.cloud.ZkStateReader.<init>(ZkStateReader.java:235)
        at org.apache.solr.client.solrj.impl.ZkClientClusterStateProvider.connect(ZkClientClusterStateProvider.java:140)
        at org.apache.solr.client.solrj.impl.CloudSolrClient.connect(CloudSolrClient.java:383)
        at org.apache.solr.client.solrj.impl.CloudSolrClient.requestWithRetryOnStaleState(CloudSolrClient.java:805)
        at org.apache.solr.client.solrj.impl.CloudSolrClient.request(CloudSolrClient.java:793)
        at org.apache.solr.client.solrj.SolrRequest.process(SolrRequest.java:178)
        at org.apache.solr.client.solrj.SolrClient.commit(SolrClient.java:524)
        at org.apache.solr.client.solrj.SolrClient.commit(SolrClient.java:544)
        at org.apache.solr.cloud.StoppableCommitThread.run(StoppableCommitThread.java:49)
   5) Thread[id=30778, name=StoppableCommitThread-SendThread(127.0.0.1:37915), state=TIMED_WAITING, group=TGRP-ChaosMonkeySafeLeaderWithPullReplicasTest]
        at java.lang.Thread.sleep(Native Method)
        at org.apache.zookeeper.client.StaticHostProvider.next(StaticHostProvider.java:101)
        at org.apache.zookeeper.ClientCnxn$SendThread.startConnect(ClientCnxn.java:997)
        at org.apache.zookeeper.ClientCnxn$SendThread.run(ClientCnxn.java:1060)
	at __randomizedtesting.SeedInfo.seed([9489780A84D1153E]:0)


FAILED:  junit.framework.TestSuite.org.apache.solr.cloud.ChaosMonkeySafeLeaderWithPullReplicasTest

Error Message:
There are still zombie threads that couldn't be terminated:    1) Thread[id=30747, name=StoppableIndexingThread, state=RUNNABLE, group=TGRP-ChaosMonkeySafeLeaderWithPullReplicasTest]         at org.apache.solr.common.util.JavaBinCodec.writeSolrInputDocument(JavaBinCodec.java:612)         at org.apache.solr.common.util.JavaBinCodec.writeKnownType(JavaBinCodec.java:355)         at org.apache.solr.common.util.JavaBinCodec.writeVal(JavaBinCodec.java:228)         at org.apache.solr.common.util.JavaBinCodec.writeMapEntry(JavaBinCodec.java:764)         at org.apache.solr.common.util.JavaBinCodec.writeKnownType(JavaBinCodec.java:383)         at org.apache.solr.common.util.JavaBinCodec.writeVal(JavaBinCodec.java:228)         at org.apache.solr.common.util.JavaBinCodec.writeIterator(JavaBinCodec.java:705)         at org.apache.solr.common.util.JavaBinCodec.writeKnownType(JavaBinCodec.java:367)         at org.apache.solr.common.util.JavaBinCodec.writeVal(JavaBinCodec.java:228)         at org.apache.solr.common.util.JavaBinCodec.writeNamedList(JavaBinCodec.java:223)         at org.apache.solr.common.util.JavaBinCodec.writeKnownType(JavaBinCodec.java:330)         at org.apache.solr.common.util.JavaBinCodec.writeVal(JavaBinCodec.java:228)         at org.apache.solr.common.util.JavaBinCodec.marshal(JavaBinCodec.java:155)         at org.apache.solr.client.solrj.request.JavaBinUpdateRequestCodec.marshal(JavaBinUpdateRequestCodec.java:91)         at org.apache.solr.client.solrj.impl.BinaryRequestWriter.getContentStream(BinaryRequestWriter.java:67)         at org.apache.solr.client.solrj.request.RequestWriter$LazyContentStream.getDelegate(RequestWriter.java:94)         at org.apache.solr.client.solrj.request.RequestWriter$LazyContentStream.getName(RequestWriter.java:104)         at org.apache.solr.client.solrj.impl.HttpSolrClient.createMethod(HttpSolrClient.java:382)         at org.apache.solr.client.solrj.impl.HttpSolrClient.request(HttpSolrClient.java:251)         at org.apache.solr.client.solrj.impl.HttpSolrClient.request(HttpSolrClient.java:242)         at org.apache.solr.client.solrj.SolrRequest.process(SolrRequest.java:178)         at org.apache.solr.client.solrj.SolrRequest.process(SolrRequest.java:195)         at org.apache.solr.cloud.StoppableIndexingThread.indexDocs(StoppableIndexingThread.java:176)         at org.apache.solr.cloud.StoppableIndexingThread.run(StoppableIndexingThread.java:115)    2) Thread[id=30748, name=StoppableIndexingThread, state=RUNNABLE, group=TGRP-ChaosMonkeySafeLeaderWithPullReplicasTest]         at org.apache.solr.common.util.JavaBinCodec.writeKnownType(JavaBinCodec.java:328)         at org.apache.solr.common.util.JavaBinCodec.writeVal(JavaBinCodec.java:228)         at org.apache.solr.common.util.JavaBinCodec.writeMapEntry(JavaBinCodec.java:764)         at org.apache.solr.common.util.JavaBinCodec.writeKnownType(JavaBinCodec.java:383)         at org.apache.solr.common.util.JavaBinCodec.writeVal(JavaBinCodec.java:228)         at org.apache.solr.common.util.JavaBinCodec.writeIterator(JavaBinCodec.java:705)         at org.apache.solr.common.util.JavaBinCodec.writeKnownType(JavaBinCodec.java:367)         at org.apache.solr.common.util.JavaBinCodec.writeVal(JavaBinCodec.java:228)         at org.apache.solr.common.util.JavaBinCodec.writeNamedList(JavaBinCodec.java:223)         at org.apache.solr.common.util.JavaBinCodec.writeKnownType(JavaBinCodec.java:330)         at org.apache.solr.common.util.JavaBinCodec.writeVal(JavaBinCodec.java:228)         at org.apache.solr.common.util.JavaBinCodec.marshal(JavaBinCodec.java:155)         at org.apache.solr.client.solrj.request.JavaBinUpdateRequestCodec.marshal(JavaBinUpdateRequestCodec.java:91)         at org.apache.solr.client.solrj.impl.BinaryRequestWriter.getContentStream(BinaryRequestWriter.java:67)         at org.apache.solr.client.solrj.request.RequestWriter$LazyContentStream.getDelegate(RequestWriter.java:94)         at org.apache.solr.client.solrj.request.RequestWriter$LazyContentStream.getName(RequestWriter.java:104)         at org.apache.solr.client.solrj.impl.HttpSolrClient.createMethod(HttpSolrClient.java:382)         at org.apache.solr.client.solrj.impl.HttpSolrClient.request(HttpSolrClient.java:251)         at org.apache.solr.client.solrj.impl.HttpSolrClient.request(HttpSolrClient.java:242)         at org.apache.solr.client.solrj.SolrRequest.process(SolrRequest.java:178)         at org.apache.solr.client.solrj.SolrRequest.process(SolrRequest.java:195)         at org.apache.solr.cloud.StoppableIndexingThread.indexDocs(StoppableIndexingThread.java:176)         at org.apache.solr.cloud.StoppableIndexingThread.run(StoppableIndexingThread.java:115)

Stack Trace:
com.carrotsearch.randomizedtesting.ThreadLeakError: There are still zombie threads that couldn't be terminated:
   1) Thread[id=30747, name=StoppableIndexingThread, state=RUNNABLE, group=TGRP-ChaosMonkeySafeLeaderWithPullReplicasTest]
        at org.apache.solr.common.util.JavaBinCodec.writeSolrInputDocument(JavaBinCodec.java:612)
        at org.apache.solr.common.util.JavaBinCodec.writeKnownType(JavaBinCodec.java:355)
        at org.apache.solr.common.util.JavaBinCodec.writeVal(JavaBinCodec.java:228)
        at org.apache.solr.common.util.JavaBinCodec.writeMapEntry(JavaBinCodec.java:764)
        at org.apache.solr.common.util.JavaBinCodec.writeKnownType(JavaBinCodec.java:383)
        at org.apache.solr.common.util.JavaBinCodec.writeVal(JavaBinCodec.java:228)
        at org.apache.solr.common.util.JavaBinCodec.writeIterator(JavaBinCodec.java:705)
        at org.apache.solr.common.util.JavaBinCodec.writeKnownType(JavaBinCodec.java:367)
        at org.apache.solr.common.util.JavaBinCodec.writeVal(JavaBinCodec.java:228)
        at org.apache.solr.common.util.JavaBinCodec.writeNamedList(JavaBinCodec.java:223)
        at org.apache.solr.common.util.JavaBinCodec.writeKnownType(JavaBinCodec.java:330)
        at org.apache.solr.common.util.JavaBinCodec.writeVal(JavaBinCodec.java:228)
        at org.apache.solr.common.util.JavaBinCodec.marshal(JavaBinCodec.java:155)
        at org.apache.solr.client.solrj.request.JavaBinUpdateRequestCodec.marshal(JavaBinUpdateRequestCodec.java:91)
        at org.apache.solr.client.solrj.impl.BinaryRequestWriter.getContentStream(BinaryRequestWriter.java:67)
        at org.apache.solr.client.solrj.request.RequestWriter$LazyContentStream.getDelegate(RequestWriter.java:94)
        at org.apache.solr.client.solrj.request.RequestWriter$LazyContentStream.getName(RequestWriter.java:104)
        at org.apache.solr.client.solrj.impl.HttpSolrClient.createMethod(HttpSolrClient.java:382)
        at org.apache.solr.client.solrj.impl.HttpSolrClient.request(HttpSolrClient.java:251)
        at org.apache.solr.client.solrj.impl.HttpSolrClient.request(HttpSolrClient.java:242)
        at org.apache.solr.client.solrj.SolrRequest.process(SolrRequest.java:178)
        at org.apache.solr.client.solrj.SolrRequest.process(SolrRequest.java:195)
        at org.apache.solr.cloud.StoppableIndexingThread.indexDocs(StoppableIndexingThread.java:176)
        at org.apache.solr.cloud.StoppableIndexingThread.run(StoppableIndexingThread.java:115)
   2) Thread[id=30748, name=StoppableIndexingThread, state=RUNNABLE, group=TGRP-ChaosMonkeySafeLeaderWithPullReplicasTest]
        at org.apache.solr.common.util.JavaBinCodec.writeKnownType(JavaBinCodec.java:328)
        at org.apache.solr.common.util.JavaBinCodec.writeVal(JavaBinCodec.java:228)
        at org.apache.solr.common.util.JavaBinCodec.writeMapEntry(JavaBinCodec.java:764)
        at org.apache.solr.common.util.JavaBinCodec.writeKnownType(JavaBinCodec.java:383)
        at org.apache.solr.common.util.JavaBinCodec.writeVal(JavaBinCodec.java:228)
        at org.apache.solr.common.util.JavaBinCodec.writeIterator(JavaBinCodec.java:705)
        at org.apache.solr.common.util.JavaBinCodec.writeKnownType(JavaBinCodec.java:367)
        at org.apache.solr.common.util.JavaBinCodec.writeVal(JavaBinCodec.java:228)
        at org.apache.solr.common.util.JavaBinCodec.writeNamedList(JavaBinCodec.java:223)
        at org.apache.solr.common.util.JavaBinCodec.writeKnownType(JavaBinCodec.java:330)
        at org.apache.solr.common.util.JavaBinCodec.writeVal(JavaBinCodec.java:228)
        at org.apache.solr.common.util.JavaBinCodec.marshal(JavaBinCodec.java:155)
        at org.apache.solr.client.solrj.request.JavaBinUpdateRequestCodec.marshal(JavaBinUpdateRequestCodec.java:91)
        at org.apache.solr.client.solrj.impl.BinaryRequestWriter.getContentStream(BinaryRequestWriter.java:67)
        at org.apache.solr.client.solrj.request.RequestWriter$LazyContentStream.getDelegate(RequestWriter.java:94)
        at org.apache.solr.client.solrj.request.RequestWriter$LazyContentStream.getName(RequestWriter.java:104)
        at org.apache.solr.client.solrj.impl.HttpSolrClient.createMethod(HttpSolrClient.java:382)
        at org.apache.solr.client.solrj.impl.HttpSolrClient.request(HttpSolrClient.java:251)
        at org.apache.solr.client.solrj.impl.HttpSolrClient.request(HttpSolrClient.java:242)
        at org.apache.solr.client.solrj.SolrRequest.process(SolrRequest.java:178)
        at org.apache.solr.client.solrj.SolrRequest.process(SolrRequest.java:195)
        at org.apache.solr.cloud.StoppableIndexingThread.indexDocs(StoppableIndexingThread.java:176)
        at org.apache.solr.cloud.StoppableIndexingThread.run(StoppableIndexingThread.java:115)
	at __randomizedtesting.SeedInfo.seed([9489780A84D1153E]:0)


FAILED:  org.apache.solr.cloud.HttpPartitionTest.test

Error Message:
Doc with id=994 not found in http://127.0.0.1:49306/gj/as/c8n_1x2 due to: Path not found: /id; rsp={doc=null}

Stack Trace:
java.lang.AssertionError: Doc with id=994 not found in http://127.0.0.1:49306/gj/as/c8n_1x2 due to: Path not found: /id; rsp={doc=null}
	at __randomizedtesting.SeedInfo.seed([9489780A84D1153E:1CDD47D02A2D78C6]:0)
	at org.junit.Assert.fail(Assert.java:93)
	at org.junit.Assert.assertTrue(Assert.java:43)
	at org.apache.solr.cloud.HttpPartitionTest.assertDocExists(HttpPartitionTest.java:603)
	at org.apache.solr.cloud.HttpPartitionTest.assertDocsExistInAllReplicas(HttpPartitionTest.java:558)
	at org.apache.solr.cloud.HttpPartitionTest.testRf2(HttpPartitionTest.java:379)
	at org.apache.solr.cloud.HttpPartitionTest.test(HttpPartitionTest.java:132)
	at sun.reflect.NativeMethodAccessorImpl.invoke0(Native Method)
	at sun.reflect.NativeMethodAccessorImpl.invoke(NativeMethodAccessorImpl.java:62)
	at sun.reflect.DelegatingMethodAccessorImpl.invoke(DelegatingMethodAccessorImpl.java:43)
	at java.lang.reflect.Method.invoke(Method.java:498)
	at com.carrotsearch.randomizedtesting.RandomizedRunner.invoke(RandomizedRunner.java:1713)
	at com.carrotsearch.randomizedtesting.RandomizedRunner$8.evaluate(RandomizedRunner.java:907)
	at com.carrotsearch.randomizedtesting.RandomizedRunner$9.evaluate(RandomizedRunner.java:943)
	at com.carrotsearch.randomizedtesting.RandomizedRunner$10.evaluate(RandomizedRunner.java:957)
	at org.apache.solr.BaseDistributedSearchTestCase$ShardsRepeatRule$ShardsFixedStatement.callStatement(BaseDistributedSearchTestCase.java:993)
	at org.apache.solr.BaseDistributedSearchTestCase$ShardsRepeatRule$ShardsStatement.evaluate(BaseDistributedSearchTestCase.java:968)
	at com.carrotsearch.randomizedtesting.rules.SystemPropertiesRestoreRule$1.evaluate(SystemPropertiesRestoreRule.java:57)
	at org.apache.lucene.util.TestRuleSetupTeardownChained$1.evaluate(TestRuleSetupTeardownChained.java:49)
	at org.apache.lucene.util.AbstractBeforeAfterRule$1.evaluate(AbstractBeforeAfterRule.java:45)
	at org.apache.lucene.util.TestRuleThreadAndTestName$1.evaluate(TestRuleThreadAndTestName.java:48)
	at org.apache.lucene.util.TestRuleIgnoreAfterMaxFailures$1.evaluate(TestRuleIgnoreAfterMaxFailures.java:64)
	at org.apache.lucene.util.TestRuleMarkFailure$1.evaluate(TestRuleMarkFailure.java:47)
	at com.carrotsearch.randomizedtesting.rules.StatementAdapter.evaluate(StatementAdapter.java:36)
	at com.carrotsearch.randomizedtesting.ThreadLeakControl$StatementRunner.run(ThreadLeakControl.java:368)
	at com.carrotsearch.randomizedtesting.ThreadLeakControl.forkTimeoutingTask(ThreadLeakControl.java:817)
	at com.carrotsearch.randomizedtesting.ThreadLeakControl$3.evaluate(ThreadLeakControl.java:468)
	at com.carrotsearch.randomizedtesting.RandomizedRunner.runSingleTest(RandomizedRunner.java:916)
	at com.carrotsearch.randomizedtesting.RandomizedRunner$5.evaluate(RandomizedRunner.java:802)
	at com.carrotsearch.randomizedtesting.RandomizedRunner$6.evaluate(RandomizedRunner.java:852)
	at com.carrotsearch.randomizedtesting.RandomizedRunner$7.evaluate(RandomizedRunner.java:863)
	at com.carrotsearch.randomizedtesting.rules.StatementAdapter.evaluate(StatementAdapter.java:36)
	at com.carrotsearch.randomizedtesting.rules.SystemPropertiesRestoreRule$1.evaluate(SystemPropertiesRestoreRule.java:57)
	at org.apache.lucene.util.AbstractBeforeAfterRule$1.evaluate(AbstractBeforeAfterRule.java:45)
	at com.carrotsearch.randomizedtesting.rules.StatementAdapter.evaluate(StatementAdapter.java:36)
	at org.apache.lucene.util.TestRuleStoreClassName$1.evaluate(TestRuleStoreClassName.java:41)
	at com.carrotsearch.randomizedtesting.rules.NoShadowingOrOverridesOnMethodsRule$1.evaluate(NoShadowingOrOverridesOnMethodsRule.java:40)
	at com.carrotsearch.randomizedtesting.rules.NoShadowingOrOverridesOnMethodsRule$1.evaluate(NoShadowingOrOverridesOnMethodsRule.java:40)
	at com.carrotsearch.randomizedtesting.rules.StatementAdapter.evaluate(StatementAdapter.java:36)
	at com.carrotsearch.randomizedtesting.rules.StatementAdapter.evaluate(StatementAdapter.java:36)
	at com.carrotsearch.randomizedtesting.rules.StatementAdapter.evaluate(StatementAdapter.java:36)
	at org.apache.lucene.util.TestRuleAssertionsRequired$1.evaluate(TestRuleAssertionsRequired.java:53)
	at org.apache.lucene.util.TestRuleMarkFailure$1.evaluate(TestRuleMarkFailure.java:47)
	at org.apache.lucene.util.TestRuleIgnoreAfterMaxFailures$1.evaluate(TestRuleIgnoreAfterMaxFailures.java:64)
	at org.apache.lucene.util.TestRuleIgnoreTestSuites$1.evaluate(TestRuleIgnoreTestSuites.java:54)
	at com.carrotsearch.randomizedtesting.rules.StatementAdapter.evaluate(StatementAdapter.java:36)
	at com.carrotsearch.randomizedtesting.ThreadLeakControl$StatementRunner.run(ThreadLeakControl.java:368)
	at java.lang.Thread.run(Thread.java:748)


FAILED:  org.apache.solr.core.TestJmxIntegration.testJmxRegistration

Error Message:
org.apache.lucene.store.AlreadyClosedException: this Directory is closed

Stack Trace:
javax.management.RuntimeMBeanException: org.apache.lucene.store.AlreadyClosedException: this Directory is closed
	at __randomizedtesting.SeedInfo.seed([9489780A84D1153E:1A581C30E9904D5B]:0)
	at com.sun.jmx.interceptor.DefaultMBeanServerInterceptor.rethrow(DefaultMBeanServerInterceptor.java:839)
	at com.sun.jmx.interceptor.DefaultMBeanServerInterceptor.rethrowMaybeMBeanException(DefaultMBeanServerInterceptor.java:852)
	at com.sun.jmx.interceptor.DefaultMBeanServerInterceptor.getAttribute(DefaultMBeanServerInterceptor.java:651)
	at com.sun.jmx.mbeanserver.JmxMBeanServer.getAttribute(JmxMBeanServer.java:678)
	at org.apache.solr.core.TestJmxIntegration.testJmxRegistration(TestJmxIntegration.java:120)
	at sun.reflect.NativeMethodAccessorImpl.invoke0(Native Method)
	at sun.reflect.NativeMethodAccessorImpl.invoke(NativeMethodAccessorImpl.java:62)
	at sun.reflect.DelegatingMethodAccessorImpl.invoke(DelegatingMethodAccessorImpl.java:43)
	at java.lang.reflect.Method.invoke(Method.java:498)
	at com.carrotsearch.randomizedtesting.RandomizedRunner.invoke(RandomizedRunner.java:1713)
	at com.carrotsearch.randomizedtesting.RandomizedRunner$8.evaluate(RandomizedRunner.java:907)
	at com.carrotsearch.randomizedtesting.RandomizedRunner$9.evaluate(RandomizedRunner.java:943)
	at com.carrotsearch.randomizedtesting.RandomizedRunner$10.evaluate(RandomizedRunner.java:957)
	at com.carrotsearch.randomizedtesting.rules.SystemPropertiesRestoreRule$1.evaluate(SystemPropertiesRestoreRule.java:57)
	at org.apache.lucene.util.TestRuleSetupTeardownChained$1.evaluate(TestRuleSetupTeardownChained.java:49)
	at org.apache.lucene.util.AbstractBeforeAfterRule$1.evaluate(AbstractBeforeAfterRule.java:45)
	at org.apache.lucene.util.TestRuleThreadAndTestName$1.evaluate(TestRuleThreadAndTestName.java:48)
	at org.apache.lucene.util.TestRuleIgnoreAfterMaxFailures$1.evaluate(TestRuleIgnoreAfterMaxFailures.java:64)
	at org.apache.lucene.util.TestRuleMarkFailure$1.evaluate(TestRuleMarkFailure.java:47)
	at com.carrotsearch.randomizedtesting.rules.StatementAdapter.evaluate(StatementAdapter.java:36)
	at com.carrotsearch.randomizedtesting.ThreadLeakControl$StatementRunner.run(ThreadLeakControl.java:368)
	at com.carrotsearch.randomizedtesting.ThreadLeakControl.forkTimeoutingTask(ThreadLeakControl.java:817)
	at com.carrotsearch.randomizedtesting.ThreadLeakControl$3.evaluate(ThreadLeakControl.java:468)
	at com.carrotsearch.randomizedtesting.RandomizedRunner.runSingleTest(RandomizedRunner.java:916)
	at com.carrotsearch.randomizedtesting.RandomizedRunner$5.evaluate(RandomizedRunner.java:802)
	at com.carrotsearch.randomizedtesting.RandomizedRunner$6.evaluate(RandomizedRunner.java:852)
	at com.carrotsearch.randomizedtesting.RandomizedRunner$7.evaluate(RandomizedRunner.java:863)
	at com.carrotsearch.randomizedtesting.rules.StatementAdapter.evaluate(StatementAdapter.java:36)
	at com.carrotsearch.randomizedtesting.rules.SystemPropertiesRestoreRule$1.evaluate(SystemPropertiesRestoreRule.java:57)
	at org.apache.lucene.util.AbstractBeforeAfterRule$1.evaluate(AbstractBeforeAfterRule.java:45)
	at com.carrotsearch.randomizedtesting.rules.StatementAdapter.evaluate(StatementAdapter.java:36)
	at org.apache.lucene.util.TestRuleStoreClassName$1.evaluate(TestRuleStoreClassName.java:41)
	at com.carrotsearch.randomizedtesting.rules.NoShadowingOrOverridesOnMethodsRule$1.evaluate(NoShadowingOrOverridesOnMethodsRule.java:40)
	at com.carrotsearch.randomizedtesting.rules.NoShadowingOrOverridesOnMethodsRule$1.evaluate(NoShadowingOrOverridesOnMethodsRule.java:40)
	at com.carrotsearch.randomizedtesting.rules.StatementAdapter.evaluate(StatementAdapter.java:36)
	at com.carrotsearch.randomizedtesting.rules.StatementAdapter.evaluate(StatementAdapter.java:36)
	at com.carrotsearch.randomizedtesting.rules.StatementAdapter.evaluate(StatementAdapter.java:36)
	at org.apache.lucene.util.TestRuleAssertionsRequired$1.evaluate(TestRuleAssertionsRequired.java:53)
	at org.apache.lucene.util.TestRuleMarkFailure$1.evaluate(TestRuleMarkFailure.java:47)
	at org.apache.lucene.util.TestRuleIgnoreAfterMaxFailures$1.evaluate(TestRuleIgnoreAfterMaxFailures.java:64)
	at org.apache.lucene.util.TestRuleIgnoreTestSuites$1.evaluate(TestRuleIgnoreTestSuites.java:54)
	at com.carrotsearch.randomizedtesting.rules.StatementAdapter.evaluate(StatementAdapter.java:36)
	at com.carrotsearch.randomizedtesting.ThreadLeakControl$StatementRunner.run(ThreadLeakControl.java:368)
	at java.lang.Thread.run(Thread.java:748)
Caused by: org.apache.lucene.store.AlreadyClosedException: this Directory is closed
	at org.apache.lucene.store.BaseDirectory.ensureOpen(BaseDirectory.java:51)
	at org.apache.lucene.store.FSDirectory.listAll(FSDirectory.java:233)
	at org.apache.solr.core.DirectoryFactory.sizeOfDirectory(DirectoryFactory.java:269)
	at org.apache.solr.core.SolrCore.getIndexSize(SolrCore.java:407)
	at org.apache.solr.handler.ReplicationHandler.lambda$initializeMetrics$2(ReplicationHandler.java:867)
	at com.codahale.metrics.JmxReporter$JmxGauge.getValue(JmxReporter.java:188)
	at sun.reflect.GeneratedMethodAccessor156.invoke(Unknown Source)
	at sun.reflect.DelegatingMethodAccessorImpl.invoke(DelegatingMethodAccessorImpl.java:43)
	at java.lang.reflect.Method.invoke(Method.java:498)
	at sun.reflect.misc.Trampoline.invoke(MethodUtil.java:71)
	at sun.reflect.GeneratedMethodAccessor149.invoke(Unknown Source)
	at sun.reflect.DelegatingMethodAccessorImpl.invoke(DelegatingMethodAccessorImpl.java:43)
	at java.lang.reflect.Method.invoke(Method.java:498)
	at sun.reflect.misc.MethodUtil.invoke(MethodUtil.java:275)
	at com.sun.jmx.mbeanserver.StandardMBeanIntrospector.invokeM2(StandardMBeanIntrospector.java:112)
	at com.sun.jmx.mbeanserver.StandardMBeanIntrospector.invokeM2(StandardMBeanIntrospector.java:46)
	at com.sun.jmx.mbeanserver.MBeanIntrospector.invokeM(MBeanIntrospector.java:237)
	at com.sun.jmx.mbeanserver.PerInterface.getAttribute(PerInterface.java:83)
	at com.sun.jmx.mbeanserver.MBeanSupport.getAttribute(MBeanSupport.java:206)
	at com.sun.jmx.interceptor.DefaultMBeanServerInterceptor.getAttribute(DefaultMBeanServerInterceptor.java:647)
	... 41 more


FAILED:  org.apache.solr.update.HardAutoCommitTest.testCommitWithin

Error Message:
Exception during query

Stack Trace:
java.lang.RuntimeException: Exception during query
	at __randomizedtesting.SeedInfo.seed([9489780A84D1153E:2E5B177207FFFB2B]:0)
	at org.apache.solr.SolrTestCaseJ4.assertQ(SolrTestCaseJ4.java:886)
	at org.apache.solr.update.HardAutoCommitTest.testCommitWithin(HardAutoCommitTest.java:100)
	at sun.reflect.NativeMethodAccessorImpl.invoke0(Native Method)
	at sun.reflect.NativeMethodAccessorImpl.invoke(NativeMethodAccessorImpl.java:62)
	at sun.reflect.DelegatingMethodAccessorImpl.invoke(DelegatingMethodAccessorImpl.java:43)
	at java.lang.reflect.Method.invoke(Method.java:498)
	at com.carrotsearch.randomizedtesting.RandomizedRunner.invoke(RandomizedRunner.java:1713)
	at com.carrotsearch.randomizedtesting.RandomizedRunner$8.evaluate(RandomizedRunner.java:907)
	at com.carrotsearch.randomizedtesting.RandomizedRunner$9.evaluate(RandomizedRunner.java:943)
	at com.carrotsearch.randomizedtesting.RandomizedRunner$10.evaluate(RandomizedRunner.java:957)
	at com.carrotsearch.randomizedtesting.rules.SystemPropertiesRestoreRule$1.evaluate(SystemPropertiesRestoreRule.java:57)
	at org.apache.lucene.util.TestRuleSetupTeardownChained$1.evaluate(TestRuleSetupTeardownChained.java:49)
	at org.apache.lucene.util.AbstractBeforeAfterRule$1.evaluate(AbstractBeforeAfterRule.java:45)
	at org.apache.lucene.util.TestRuleThreadAndTestName$1.evaluate(TestRuleThreadAndTestName.java:48)
	at org.apache.lucene.util.TestRuleIgnoreAfterMaxFailures$1.evaluate(TestRuleIgnoreAfterMaxFailures.java:64)
	at org.apache.lucene.util.TestRuleMarkFailure$1.evaluate(TestRuleMarkFailure.java:47)
	at com.carrotsearch.randomizedtesting.rules.StatementAdapter.evaluate(StatementAdapter.java:36)
	at com.carrotsearch.randomizedtesting.ThreadLeakControl$StatementRunner.run(ThreadLeakControl.java:368)
	at com.carrotsearch.randomizedtesting.ThreadLeakControl.forkTimeoutingTask(ThreadLeakControl.java:817)
	at com.carrotsearch.randomizedtesting.ThreadLeakControl$3.evaluate(ThreadLeakControl.java:468)
	at com.carrotsearch.randomizedtesting.RandomizedRunner.runSingleTest(RandomizedRunner.java:916)
	at com.carrotsearch.randomizedtesting.RandomizedRunner$5.evaluate(RandomizedRunner.java:802)
	at com.carrotsearch.randomizedtesting.RandomizedRunner$6.evaluate(RandomizedRunner.java:852)
	at com.carrotsearch.randomizedtesting.RandomizedRunner$7.evaluate(RandomizedRunner.java:863)
	at com.carrotsearch.randomizedtesting.rules.StatementAdapter.evaluate(StatementAdapter.java:36)
	at com.carrotsearch.randomizedtesting.rules.SystemPropertiesRestoreRule$1.evaluate(SystemPropertiesRestoreRule.java:57)
	at org.apache.lucene.util.AbstractBeforeAfterRule$1.evaluate(AbstractBeforeAfterRule.java:45)
	at com.carrotsearch.randomizedtesting.rules.StatementAdapter.evaluate(StatementAdapter.java:36)
	at org.apache.lucene.util.TestRuleStoreClassName$1.evaluate(TestRuleStoreClassName.java:41)
	at com.carrotsearch.randomizedtesting.rules.NoShadowingOrOverridesOnMethodsRule$1.evaluate(NoShadowingOrOverridesOnMethodsRule.java:40)
	at com.carrotsearch.randomizedtesting.rules.NoShadowingOrOverridesOnMethodsRule$1.evaluate(NoShadowingOrOverridesOnMethodsRule.java:40)
	at com.carrotsearch.randomizedtesting.rules.StatementAdapter.evaluate(StatementAdapter.java:36)
	at com.carrotsearch.randomizedtesting.rules.StatementAdapter.evaluate(StatementAdapter.java:36)
	at com.carrotsearch.randomizedtesting.rules.StatementAdapter.evaluate(StatementAdapter.java:36)
	at org.apache.lucene.util.TestRuleAssertionsRequired$1.evaluate(TestRuleAssertionsRequired.java:53)
	at org.apache.lucene.util.TestRuleMarkFailure$1.evaluate(TestRuleMarkFailure.java:47)
	at org.apache.lucene.util.TestRuleIgnoreAfterMaxFailures$1.evaluate(TestRuleIgnoreAfterMaxFailures.java:64)
	at org.apache.lucene.util.TestRuleIgnoreTestSuites$1.evaluate(TestRuleIgnoreTestSuites.java:54)
	at com.carrotsearch.randomizedtesting.rules.StatementAdapter.evaluate(StatementAdapter.java:36)
	at com.carrotsearch.randomizedtesting.ThreadLeakControl$StatementRunner.run(ThreadLeakControl.java:368)
	at java.lang.Thread.run(Thread.java:748)
Caused by: java.lang.RuntimeException: REQUEST FAILED: xpath=//result[@numFound=1]
	xml response was: <?xml version="1.0" encoding="UTF-8"?>
<response>
<lst name="responseHeader"><int name="status">0</int><int name="QTime">0</int></lst><result name="response" numFound="0" start="0"></result>
</response>

	request was:q=id:529&qt=&start=0&rows=20&version=2.2
	at org.apache.solr.SolrTestCaseJ4.assertQ(SolrTestCaseJ4.java:879)
	... 40 more




Build Log:
[...truncated 11697 lines...]
   [junit4] Suite: org.apache.solr.cloud.HttpPartitionTest
   [junit4]   2> 727326 INFO  (SUITE-HttpPartitionTest-seed#[9489780A84D1153E]-worker) [    ] o.a.s.SolrTestCaseJ4 SecureRandom sanity checks: test.solr.allowed.securerandom=null & java.security.egd=file:/dev/./urandom
   [junit4]   2> Creating dataDir: /x1/jenkins/jenkins-slave/workspace/Lucene-Solr-NightlyTests-master/checkout/solr/build/solr-core/test/J2/temp/solr.cloud.HttpPartitionTest_9489780A84D1153E-001/init-core-data-001
   [junit4]   2> 727326 WARN  (SUITE-HttpPartitionTest-seed#[9489780A84D1153E]-worker) [    ] o.a.s.SolrTestCaseJ4 startTrackingSearchers: numOpens=4 numCloses=4
   [junit4]   2> 727326 INFO  (SUITE-HttpPartitionTest-seed#[9489780A84D1153E]-worker) [    ] o.a.s.SolrTestCaseJ4 Using TrieFields (NUMERIC_POINTS_SYSPROP=false) w/NUMERIC_DOCVALUES_SYSPROP=false
   [junit4]   2> 727328 INFO  (SUITE-HttpPartitionTest-seed#[9489780A84D1153E]-worker) [    ] o.a.s.SolrTestCaseJ4 Randomized ssl (false) and clientAuth (false) via: @org.apache.solr.SolrTestCaseJ4$SuppressSSL(bugUrl=https://issues.apache.org/jira/browse/SOLR-5776)
   [junit4]   2> 727328 INFO  (SUITE-HttpPartitionTest-seed#[9489780A84D1153E]-worker) [    ] o.a.s.BaseDistributedSearchTestCase Setting hostContext system property: /gj/as
   [junit4]   2> 727344 INFO  (TEST-HttpPartitionTest.test-seed#[9489780A84D1153E]) [    ] o.a.s.c.ZkTestServer STARTING ZK TEST SERVER
   [junit4]   2> 727352 INFO  (Thread-1014) [    ] o.a.s.c.ZkTestServer client port:0.0.0.0/0.0.0.0:0
   [junit4]   2> 727352 INFO  (Thread-1014) [    ] o.a.s.c.ZkTestServer Starting server
   [junit4]   2> 727370 ERROR (Thread-1014) [    ] o.a.z.s.ZooKeeperServer ZKShutdownHandler is not registered, so ZooKeeper server won't take any action on ERROR or SHUTDOWN server state changes
   [junit4]   2> 727452 INFO  (TEST-HttpPartitionTest.test-seed#[9489780A84D1153E]) [    ] o.a.s.c.ZkTestServer start zk server on port:41031
   [junit4]   2> 727484 INFO  (TEST-HttpPartitionTest.test-seed#[9489780A84D1153E]) [    ] o.a.s.c.AbstractZkTestCase put /x1/jenkins/jenkins-slave/workspace/Lucene-Solr-NightlyTests-master/checkout/solr/core/src/test-files/solr/collection1/conf/solrconfig-tlog.xml to /configs/conf1/solrconfig.xml
   [junit4]   2> 727485 INFO  (TEST-HttpPartitionTest.test-seed#[9489780A84D1153E]) [    ] o.a.s.c.AbstractZkTestCase put /x1/jenkins/jenkins-slave/workspace/Lucene-Solr-NightlyTests-master/checkout/solr/core/src/test-files/solr/collection1/conf/schema.xml to /configs/conf1/schema.xml
   [junit4]   2> 727487 INFO  (TEST-HttpPartitionTest.test-seed#[9489780A84D1153E]) [    ] o.a.s.c.AbstractZkTestCase put /x1/jenkins/jenkins-slave/workspace/Lucene-Solr-NightlyTests-master/checkout/solr/core/src/test-files/solr/collection1/conf/solrconfig.snippet.randomindexconfig.xml to /configs/conf1/solrconfig.snippet.randomindexconfig.xml
   [junit4]   2> 727487 INFO  (TEST-HttpPartitionTest.test-seed#[9489780A84D1153E]) [    ] o.a.s.c.AbstractZkTestCase put /x1/jenkins/jenkins-slave/workspace/Lucene-Solr-NightlyTests-master/checkout/solr/core/src/test-files/solr/collection1/conf/stopwords.txt to /configs/conf1/stopwords.txt
   [junit4]   2> 727488 INFO  (TEST-HttpPartitionTest.test-seed#[9489780A84D1153E]) [    ] o.a.s.c.AbstractZkTestCase put /x1/jenkins/jenkins-slave/workspace/Lucene-Solr-NightlyTests-master/checkout/solr/core/src/test-files/solr/collection1/conf/protwords.txt to /configs/conf1/protwords.txt
   [junit4]   2> 727489 INFO  (TEST-HttpPartitionTest.test-seed#[9489780A84D1153E]) [    ] o.a.s.c.AbstractZkTestCase put /x1/jenkins/jenkins-slave/workspace/Lucene-Solr-NightlyTests-master/checkout/solr/core/src/test-files/solr/collection1/conf/currency.xml to /configs/conf1/currency.xml
   [junit4]   2> 727490 INFO  (TEST-HttpPartitionTest.test-seed#[9489780A84D1153E]) [    ] o.a.s.c.AbstractZkTestCase put /x1/jenkins/jenkins-slave/workspace/Lucene-Solr-NightlyTests-master/checkout/solr/core/src/test-files/solr/collection1/conf/enumsConfig.xml to /configs/conf1/enumsConfig.xml
   [junit4]   2> 727490 INFO  (TEST-HttpPartitionTest.test-seed#[9489780A84D1153E]) [    ] o.a.s.c.AbstractZkTestCase put /x1/jenkins/jenkins-slave/workspace/Lucene-Solr-NightlyTests-master/checkout/solr/core/src/test-files/solr/collection1/conf/open-exchange-rates.json to /configs/conf1/open-exchange-rates.json
   [junit4]   2> 727491 INFO  (TEST-HttpPartitionTest.test-seed#[9489780A84D1153E]) [    ] o.a.s.c.AbstractZkTestCase put /x1/jenkins/jenkins-slave/workspace/Lucene-Solr-NightlyTests-master/checkout/solr/core/src/test-files/solr/collection1/conf/mapping-ISOLatin1Accent.txt to /configs/conf1/mapping-ISOLatin1Accent.txt
   [junit4]   2> 727492 INFO  (TEST-HttpPartitionTest.test-seed#[9489780A84D1153E]) [    ] o.a.s.c.AbstractZkTestCase put /x1/jenkins/jenkins-slave/workspace/Lucene-Solr-NightlyTests-master/checkout/solr/core/src/test-files/solr/collection1/conf/old_synonyms.txt to /configs/conf1/old_synonyms.txt
   [junit4]   2> 727492 INFO  (TEST-HttpPartitionTest.test-seed#[9489780A84D1153E]) [    ] o.a.s.c.AbstractZkTestCase put /x1/jenkins/jenkins-slave/workspace/Lucene-Solr-NightlyTests-master/checkout/solr/core/src/test-files/solr/collection1/conf/synonyms.txt to /configs/conf1/synonyms.txt
   [junit4]   2> 727494 INFO  (TEST-HttpPartitionTest.test-seed#[9489780A84D1153E]) [    ] o.a.s.c.AbstractFullDistribZkTestBase Will use TLOG replicas unless explicitly asked otherwise
   [junit4]   2> 727576 INFO  (TEST-HttpPartitionTest.test-seed#[9489780A84D1153E]) [    ] o.e.j.s.Server jetty-9.3.14.v20161028
   [junit4]   2> 727577 INFO  (TEST-HttpPartitionTest.test-seed#[9489780A84D1153E]) [    ] o.e.j.s.h.ContextHandler Started o.e.j.s.ServletContextHandler@7eeb0ec7{/gj/as,null,AVAILABLE}
   [junit4]   2> 727577 INFO  (TEST-HttpPartitionTest.test-seed#[9489780A84D1153E]) [    ] o.e.j.s.AbstractConnector Started ServerConnector@64b55cff{HTTP/1.1,[http/1.1]}{127.0.0.1:33511}
   [junit4]   2> 727577 INFO  (TEST-HttpPartitionTest.test-seed#[9489780A84D1153E]) [    ] o.e.j.s.Server Started @731443ms
   [junit4]   2> 727577 INFO  (TEST-HttpPartitionTest.test-seed#[9489780A84D1153E]) [    ] o.a.s.c.s.e.JettySolrRunner Jetty properties: {solr.data.dir=/x1/jenkins/jenkins-slave/workspace/Lucene-Solr-NightlyTests-master/checkout/solr/build/solr-core/test/J2/temp/solr.cloud.HttpPartitionTest_9489780A84D1153E-001/tempDir-001/control/data, replicaType=NRT, hostContext=/gj/as, hostPort=48127, coreRootDirectory=/x1/jenkins/jenkins-slave/workspace/Lucene-Solr-NightlyTests-master/checkout/solr/build/solr-core/test/J2/temp/solr.cloud.HttpPartitionTest_9489780A84D1153E-001/control-001/cores}
   [junit4]   2> 727577 ERROR (TEST-HttpPartitionTest.test-seed#[9489780A84D1153E]) [    ] o.a.s.s.StartupLoggingUtils Missing Java Option solr.log.dir. Logging may be missing or incomplete.
   [junit4]   2> 727577 INFO  (TEST-HttpPartitionTest.test-seed#[9489780A84D1153E]) [    ] o.a.s.s.SolrDispatchFilter  ___      _       Welcome to Apache Solr™ version 8.0.0
   [junit4]   2> 727577 INFO  (TEST-HttpPartitionTest.test-seed#[9489780A84D1153E]) [    ] o.a.s.s.SolrDispatchFilter / __| ___| |_ _   Starting in cloud mode on port null
   [junit4]   2> 727577 INFO  (TEST-HttpPartitionTest.test-seed#[9489780A84D1153E]) [    ] o.a.s.s.SolrDispatchFilter \__ \/ _ \ | '_|  Install dir: null, Default config dir: null
   [junit4]   2> 727577 INFO  (TEST-HttpPartitionTest.test-seed#[9489780A84D1153E]) [    ] o.a.s.s.SolrDispatchFilter |___/\___/_|_|    Start time: 2017-08-13T20:28:04.408Z
   [junit4]   2> 727581 INFO  (TEST-HttpPartitionTest.test-seed#[9489780A84D1153E]) [    ] o.a.s.s.SolrDispatchFilter Loading solr.xml from SolrHome (not found in ZooKeeper)
   [junit4]   2> 727581 INFO  (TEST-HttpPartitionTest.test-seed#[9489780A84D1153E]) [    ] o.a.s.c.SolrXmlConfig Loading container configuration from /x1/jenkins/jenkins-slave/workspace/Lucene-Solr-NightlyTests-master/checkout/solr/build/solr-core/test/J2/temp/solr.cloud.HttpPartitionTest_9489780A84D1153E-001/control-001/solr.xml
   [junit4]   2> 727585 INFO  (TEST-HttpPartitionTest.test-seed#[9489780A84D1153E]) [    ] o.a.s.c.SolrXmlConfig MBean server found: com.sun.jmx.mbeanserver.JmxMBeanServer@359e1abe, but no JMX reporters were configured - adding default JMX reporter.
   [junit4]   2> 727590 INFO  (TEST-HttpPartitionTest.test-seed#[9489780A84D1153E]) [    ] o.a.s.c.ZkContainer Zookeeper client=127.0.0.1:41031/solr
   [junit4]   2> 727642 INFO  (TEST-HttpPartitionTest.test-seed#[9489780A84D1153E]) [n:127.0.0.1:48127_gj%2Fas    ] o.a.s.c.Overseer Overseer (id=null) closing
   [junit4]   2> 727643 INFO  (TEST-HttpPartitionTest.test-seed#[9489780A84D1153E]) [n:127.0.0.1:48127_gj%2Fas    ] o.a.s.c.OverseerElectionContext I am going to be the leader 127.0.0.1:48127_gj%2Fas
   [junit4]   2> 727643 INFO  (TEST-HttpPartitionTest.test-seed#[9489780A84D1153E]) [n:127.0.0.1:48127_gj%2Fas    ] o.a.s.c.Overseer Overseer (id=98478069133082628-127.0.0.1:48127_gj%2Fas-n_0000000000) starting
   [junit4]   2> 727649 INFO  (TEST-HttpPartitionTest.test-seed#[9489780A84D1153E]) [n:127.0.0.1:48127_gj%2Fas    ] o.a.s.c.ZkController Register node as live in ZooKeeper:/live_nodes/127.0.0.1:48127_gj%2Fas
   [junit4]   2> 727650 INFO  (zkCallback-2632-thread-1-processing-n:127.0.0.1:48127_gj%2Fas) [n:127.0.0.1:48127_gj%2Fas    ] o.a.s.c.c.ZkStateReader Updated live nodes from ZooKeeper... (0) -> (1)
   [junit4]   2> 727703 INFO  (TEST-HttpPartitionTest.test-seed#[9489780A84D1153E]) [n:127.0.0.1:48127_gj%2Fas    ] o.a.s.m.r.SolrJmxReporter JMX monitoring for 'solr.node' (registry 'solr.node') enabled at server: com.sun.jmx.mbeanserver.JmxMBeanServer@359e1abe
   [junit4]   2> 727707 INFO  (TEST-HttpPartitionTest.test-seed#[9489780A84D1153E]) [n:127.0.0.1:48127_gj%2Fas    ] o.a.s.m.r.SolrJmxReporter JMX monitoring for 'solr.jvm' (registry 'solr.jvm') enabled at server: com.sun.jmx.mbeanserver.JmxMBeanServer@359e1abe
   [junit4]   2> 727707 INFO  (TEST-HttpPartitionTest.test-seed#[9489780A84D1153E]) [n:127.0.0.1:48127_gj%2Fas    ] o.a.s.m.r.SolrJmxReporter JMX monitoring for 'solr.jetty' (registry 'solr.jetty') enabled at server: com.sun.jmx.mbeanserver.JmxMBeanServer@359e1abe
   [junit4]   2> 727708 INFO  (TEST-HttpPartitionTest.test-seed#[9489780A84D1153E]) [n:127.0.0.1:48127_gj%2Fas    ] o.a.s.c.CorePropertiesLocator Found 0 core definitions underneath /x1/jenkins/jenkins-slave/workspace/Lucene-Solr-NightlyTests-master/checkout/solr/build/solr-core/test/J2/temp/solr.cloud.HttpPartitionTest_9489780A84D1153E-001/control-001/cores
   [junit4]   2> 727722 INFO  (TEST-HttpPartitionTest.test-seed#[9489780A84D1153E]) [    ] o.a.s.c.c.ZkStateReader Updated live nodes from ZooKeeper... (0) -> (1)
   [junit4]   2> 727722 INFO  (TEST-HttpPartitionTest.test-seed#[9489780A84D1153E]) [    ] o.a.s.c.s.i.ZkClientClusterStateProvider Cluster at 127.0.0.1:41031/solr ready
   [junit4]   2> 727723 INFO  (SocketProxy-Acceptor-48127) [    ] o.a.s.c.SocketProxy accepted Socket[addr=/127.0.0.1,port=47961,localport=48127], receiveBufferSize:531000
   [junit4]   2> 727731 INFO  (SocketProxy-Acceptor-48127) [    ] o.a.s.c.SocketProxy proxy connection Socket[addr=/127.0.0.1,port=33511,localport=44936], receiveBufferSize=530904
   [junit4]   2> 727732 INFO  (qtp940789852-7916) [n:127.0.0.1:48127_gj%2Fas    ] o.a.s.h.a.CollectionsHandler Invoked Collection Action :create with params replicationFactor=1&collection.configName=conf1&name=control_collection&nrtReplicas=1&action=CREATE&numShards=1&createNodeSet=127.0.0.1:48127_gj%252Fas&wt=javabin&version=2 and sendToOCPQueue=true
   [junit4]   2> 727734 INFO  (OverseerThreadFactory-2352-thread-1-processing-n:127.0.0.1:48127_gj%2Fas) [n:127.0.0.1:48127_gj%2Fas    ] o.a.s.c.CreateCollectionCmd Create collection control_collection
   [junit4]   2> 727838 INFO  (SocketProxy-Acceptor-48127) [    ] o.a.s.c.SocketProxy accepted Socket[addr=/127.0.0.1,port=47963,localport=48127], receiveBufferSize:531000
   [junit4]   2> 727838 INFO  (SocketProxy-Acceptor-48127) [    ] o.a.s.c.SocketProxy proxy connection Socket[addr=/127.0.0.1,port=33511,localport=44938], receiveBufferSize=530904
   [junit4]   2> 727845 INFO  (qtp940789852-7918) [n:127.0.0.1:48127_gj%2Fas    ] o.a.s.h.a.CoreAdminOperation core create command qt=/admin/cores&collection.configName=conf1&newCollection=true&name=control_collection_shard1_replica_n1&action=CREATE&numShards=1&collection=control_collection&shard=shard1&wt=javabin&version=2&replicaType=NRT
   [junit4]   2> 727846 INFO  (qtp940789852-7918) [n:127.0.0.1:48127_gj%2Fas    ] o.a.s.c.TransientSolrCoreCacheDefault Allocating transient cache for 4 transient cores
   [junit4]   2> 727952 INFO  (zkCallback-2632-thread-1-processing-n:127.0.0.1:48127_gj%2Fas) [n:127.0.0.1:48127_gj%2Fas    ] o.a.s.c.c.ZkStateReader A cluster state change: [WatchedEvent state:SyncConnected type:NodeDataChanged path:/collections/control_collection/state.json] for collection [control_collection] has occurred - updating... (live nodes size: [1])
   [junit4]   2> 728861 INFO  (qtp940789852-7918) [n:127.0.0.1:48127_gj%2Fas c:control_collection s:shard1  x:control_collection_shard1_replica_n1] o.a.s.c.SolrConfig Using Lucene MatchVersion: 8.0.0
   [junit4]   2> 728872 INFO  (qtp940789852-7918) [n:127.0.0.1:48127_gj%2Fas c:control_collection s:shard1  x:control_collection_shard1_replica_n1] o.a.s.s.IndexSchema [control_collection_shard1_replica_n1] Schema name=test
   [junit4]   2> 728954 INFO  (qtp940789852-7918) [n:127.0.0.1:48127_gj%2Fas c:control_collection s:shard1  x:control_collection_shard1_replica_n1] o.a.s.s.IndexSchema Loaded schema test/1.0 with uniqueid field id
   [junit4]   2> 728967 INFO  (qtp940789852-7918) [n:127.0.0.1:48127_gj%2Fas c:control_collection s:shard1  x:control_collection_shard1_replica_n1] o.a.s.c.CoreContainer Creating SolrCore 'control_collection_shard1_replica_n1' using configuration from collection control_collection, trusted=true
   [junit4]   2> 728967 INFO  (qtp940789852-7918) [n:127.0.0.1:48127_gj%2Fas c:control_collection s:shard1  x:control_collection_shard1_replica_n1] o.a.s.m.r.SolrJmxReporter JMX monitoring for 'solr.core.control_collection.shard1.replica_n1' (registry 'solr.core.control_collection.shard1.replica_n1') enabled at server: com.sun.jmx.mbeanserver.JmxMBeanServer@359e1abe
   [junit4]   2> 728967 INFO  (qtp940789852-7918) [n:127.0.0.1:48127_gj%2Fas c:control_collection s:shard1  x:control_collection_shard1_replica_n1] o.a.s.c.SolrCore solr.RecoveryStrategy.Builder
   [junit4]   2> 728967 INFO  (qtp940789852-7918) [n:127.0.0.1:48127_gj%2Fas c:control_collection s:shard1  x:control_collection_shard1_replica_n1] o.a.s.c.SolrCore [[control_collection_shard1_replica_n1] ] Opening new SolrCore at [/x1/jenkins/jenkins-slave/workspace/Lucene-Solr-NightlyTests-master/checkout/solr/build/solr-core/test/J2/temp/solr.cloud.HttpPartitionTest_9489780A84D1153E-001/control-001/cores/control_collection_shard1_replica_n1], dataDir=[/x1/jenkins/jenkins-slave/workspace/Lucene-Solr-NightlyTests-master/checkout/solr/build/solr-core/test/J2/temp/solr.cloud.HttpPartitionTest_9489780A84D1153E-001/control-001/cores/control_collection_shard1_replica_n1/data/]
   [junit4]   2> 728969 INFO  (qtp940789852-7918) [n:127.0.0.1:48127_gj%2Fas c:control_collection s:shard1  x:control_collection_shard1_replica_n1] o.a.s.u.RandomMergePolicy RandomMergePolicy wrapping class org.apache.lucene.index.MockRandomMergePolicy: org.apache.lucene.index.MockRandomMergePolicy@53ea4f4c
   [junit4]   2> 728971 WARN  (qtp940789852-7918) [n:127.0.0.1:48127_gj%2Fas c:control_collection s:shard1  x:control_collection_shard1_replica_n1] o.a.s.c.RequestHandlers INVALID paramSet a in requestHandler {type = requestHandler,name = /dump,class = DumpRequestHandler,attributes = {initParams=a, name=/dump, class=DumpRequestHandler},args = {defaults={a=A,b=B}}}
   [junit4]   2> 729013 INFO  (qtp940789852-7918) [n:127.0.0.1:48127_gj%2Fas c:control_collection s:shard1  x:control_collection_shard1_replica_n1] o.a.s.u.UpdateHandler Using UpdateLog implementation: org.apache.solr.update.UpdateLog
   [junit4]   2> 729013 INFO  (qtp940789852-7918) [n:127.0.0.1:48127_gj%2Fas c:control_collection s:shard1  x:control_collection_shard1_replica_n1] o.a.s.u.UpdateLog Initializing UpdateLog: dataDir= defaultSyncLevel=FLUSH numRecordsToKeep=100 maxNumLogsToKeep=10 numVersionBuckets=65536
   [junit4]   2> 729014 INFO  (qtp940789852-7918) [n:127.0.0.1:48127_gj%2Fas c:control_collection s:shard1  x:control_collection_shard1_replica_n1] o.a.s.u.CommitTracker Hard AutoCommit: disabled
   [junit4]   2> 729014 INFO  (qtp940789852-7918) [n:127.0.0.1:48127_gj%2Fas c:control_collection s:shard1  x:control_collection_shard1_replica_n1] o.a.s.u.CommitTracker Soft AutoCommit: disabled
   [junit4]   2> 729014 INFO  (qtp940789852-7918) [n:127.0.0.1:48127_gj%2Fas c:control_collection s:shard1  x:control_collection_shard1_replica_n1] o.a.s.u.RandomMergePolicy RandomMergePolicy wrapping class org.apache.lucene.index.MockRandomMergePolicy: org.apache.lucene.index.MockRandomMergePolicy@41290d9f
   [junit4]   2> 729015 INFO  (qtp940789852-7918) [n:127.0.0.1:48127_gj%2Fas c:control_collection s:shard1  x:control_collection_shard1_replica_n1] o.a.s.s.SolrIndexSearcher Opening [Searcher@7d90efa0[control_collection_shard1_replica_n1] main]
   [junit4]   2> 729016 INFO  (qtp940789852-7918) [n:127.0.0.1:48127_gj%2Fas c:control_collection s:shard1  x:control_collection_shard1_replica_n1] o.a.s.r.ManagedResourceStorage Configured ZooKeeperStorageIO with znodeBase: /configs/conf1
   [junit4]   2> 729016 INFO  (qtp940789852-7918) [n:127.0.0.1:48127_gj%2Fas c:control_collection s:shard1  x:control_collection_shard1_replica_n1] o.a.s.r.ManagedResourceStorage Loaded null at path _rest_managed.json using ZooKeeperStorageIO:path=/configs/conf1
   [junit4]   2> 729020 INFO  (qtp940789852-7918) [n:127.0.0.1:48127_gj%2Fas c:control_collection s:shard1  x:control_collection_shard1_replica_n1] o.a.s.h.ReplicationHandler Commits will be reserved for  10000
   [junit4]   2> 729021 INFO  (qtp940789852-7918) [n:127.0.0.1:48127_gj%2Fas c:control_collection s:shard1  x:control_collection_shard1_replica_n1] o.a.s.u.UpdateLog Could not find max version in index or recent updates, using new clock 1575649107878346752
   [junit4]   2> 729021 INFO  (searcherExecutor-2355-thread-1-processing-n:127.0.0.1:48127_gj%2Fas x:control_collection_shard1_replica_n1 s:shard1 c:control_collection) [n:127.0.0.1:48127_gj%2Fas c:control_collection s:shard1  x:control_collection_shard1_replica_n1] o.a.s.c.SolrCore [control_collection_shard1_replica_n1] Registered new searcher Searcher@7d90efa0[control_collection_shard1_replica_n1] main{ExitableDirectoryReader(UninvertingDirectoryReader())}
   [junit4]   2> 729027 INFO  (qtp940789852-7918) [n:127.0.0.1:48127_gj%2Fas c:control_collection s:shard1  x:control_collection_shard1_replica_n1] o.a.s.c.ShardLeaderElectionContext Enough replicas found to continue.
   [junit4]   2> 729027 INFO  (qtp940789852-7918) [n:127.0.0.1:48127_gj%2Fas c:control_collection s:shard1  x:control_collection_shard1_replica_n1] o.a.s.c.ShardLeaderElectionContext I may be the new leader - try and sync
   [junit4]   2> 729027 INFO  (qtp940789852-7918) [n:127.0.0.1:48127_gj%2Fas c:control_collection s:shard1  x:control_collection_shard1_replica_n1] o.a.s.c.SyncStrategy Sync replicas to http://127.0.0.1:48127/gj/as/control_collection_shard1_replica_n1/
   [junit4]   2> 729028 INFO  (qtp940789852-7918) [n:127.0.0.1:48127_gj%2Fas c:control_collection s:shard1  x:control_collection_shard1_replica_n1] o.a.s.c.SyncStrategy Sync Success - now sync replicas to me
   [junit4]   2> 729028 INFO  (qtp940789852-7918) [n:127.0.0.1:48127_gj%2Fas c:control_collection s:shard1  x:control_collection_shard1_replica_n1] o.a.s.c.SyncStrategy http://127.0.0.1:48127/gj/as/control_collection_shard1_replica_n1/ has no replicas
   [junit4]   2> 729028 INFO  (qtp940789852-7918) [n:127.0.0.1:48127_gj%2Fas c:control_collection s:shard1  x:control_collection_shard1_replica_n1] o.a.s.c.ShardLeaderElectionContext Found all replicas participating in election, clear LIR
   [junit4]   2> 729032 INFO  (qtp940789852-7918) [n:127.0.0.1:48127_gj%2Fas c:control_collection s:shard1  x:control_collection_shard1_replica_n1] o.a.s.c.ShardLeaderElectionContext I am the new leader: http://127.0.0.1:48127/gj/as/control_collection_shard1_replica_n1/ shard1
   [junit4]   2> 729133 INFO  (zkCallback-2632-thread-1-processing-n:127.0.0.1:48127_gj%2Fas) [n:127.0.0.1:48127_gj%2Fas    ] o.a.s.c.c.ZkStateReader A cluster state change: [WatchedEvent state:SyncConnected type:NodeDataChanged path:/collections/control_collection/state.json] for collection [control_collection] has occurred - updating... (live nodes size: [1])
   [junit4]   2> 729182 INFO  (qtp940789852-7918) [n:127.0.0.1:48127_gj%2Fas c:control_collection s:shard1  x:control_collection_shard1_replica_n1] o.a.s.c.ZkController I am the leader, no recovery necessary
   [junit4]   2> 729184 INFO  (qtp940789852-7918) [n:127.0.0.1:48127_gj%2Fas c:control_collection s:shard1  x:control_collection_shard1_replica_n1] o.a.s.s.HttpSolrCall [admin] webapp=null path=/admin/cores params={qt=/admin/cores&collection.configName=conf1&newCollection=true&name=control_collection_shard1_replica_n1&action=CREATE&numShards=1&collection=control_collection&shard=shard1&wt=javabin&version=2&replicaType=NRT} status=0 QTime=1339
   [junit4]   2> 729194 INFO  (qtp940789852-7916) [n:127.0.0.1:48127_gj%2Fas    ] o.a.s.h.a.CollectionsHandler Wait for new collection to be active for at most 30 seconds. Check all shard replicas
   [junit4]   2> 729293 INFO  (zkCallback-2632-thread-1-processing-n:127.0.0.1:48127_gj%2Fas) [n:127.0.0.1:48127_gj%2Fas    ] o.a.s.c.c.ZkStateReader A cluster state change: [WatchedEvent state:SyncConnected type:NodeDataChanged path:/collections/control_collection/state.json] for collection [control_collection] has occurred - updating... (live nodes size: [1])
   [junit4]   2> 729736 INFO  (OverseerCollectionConfigSetProcessor-98478069133082628-127.0.0.1:48127_gj%2Fas-n_0000000000) [n:127.0.0.1:48127_gj%2Fas    ] o.a.s.c.OverseerTaskQueue Response ZK path: /overseer/collection-queue-work/qnr-0000000000 doesn't exist.  Requestor may have disconnected from ZooKeeper
   [junit4]   2> 730194 INFO  (qtp940789852-7916) [n:127.0.0.1:48127_gj%2Fas    ] o.a.s.s.HttpSolrCall [admin] webapp=null path=/admin/collections params={replicationFactor=1&collection.configName=conf1&name=control_collection&nrtReplicas=1&action=CREATE&numShards=1&createNodeSet=127.0.0.1:48127_gj%252Fas&wt=javabin&version=2} status=0 QTime=2461
   [junit4]   2> 730197 WARN  (NIOServerCxn.Factory:0.0.0.0/0.0.0.0:0) [    ] o.a.z.s.NIOServerCnxn caught end of stream exception
   [junit4]   2> EndOfStreamException: Unable to read additional data from client sessionid 0x15ddd4838d80005, likely client has closed socket
   [junit4]   2> 	at org.apache.zookeeper.server.NIOServerCnxn.doIO(NIOServerCnxn.java:239)
   [junit4]   2> 	at org.apache.zookeeper.server.NIOServerCnxnFactory.run(NIOServerCnxnFactory.java:203)
   [junit4]   2> 	at jav

[...truncated too long message...]

nterceptors-admin-2.0.0-M15.jar:/x1/jenkins/jenkins-slave/workspace/Lucene-Solr-NightlyTests-master/checkout/solr/core/test-lib/apacheds-interceptors-authn-2.0.0-M15.jar:/x1/jenkins/jenkins-slave/workspace/Lucene-Solr-NightlyTests-master/checkout/solr/core/test-lib/apacheds-interceptors-authz-2.0.0-M15.jar:/x1/jenkins/jenkins-slave/workspace/Lucene-Solr-NightlyTests-master/checkout/solr/core/test-lib/apacheds-interceptors-changelog-2.0.0-M15.jar:/x1/jenkins/jenkins-slave/workspace/Lucene-Solr-NightlyTests-master/checkout/solr/core/test-lib/apacheds-interceptors-collective-2.0.0-M15.jar:/x1/jenkins/jenkins-slave/workspace/Lucene-Solr-NightlyTests-master/checkout/solr/core/test-lib/apacheds-interceptors-event-2.0.0-M15.jar:/x1/jenkins/jenkins-slave/workspace/Lucene-Solr-NightlyTests-master/checkout/solr/core/test-lib/apacheds-interceptors-exception-2.0.0-M15.jar:/x1/jenkins/jenkins-slave/workspace/Lucene-Solr-NightlyTests-master/checkout/solr/core/test-lib/apacheds-interceptors-journal-2.0.0-M15.jar:/x1/jenkins/jenkins-slave/workspace/Lucene-Solr-NightlyTests-master/checkout/solr/core/test-lib/apacheds-interceptors-normalization-2.0.0-M15.jar:/x1/jenkins/jenkins-slave/workspace/Lucene-Solr-NightlyTests-master/checkout/solr/core/test-lib/apacheds-interceptors-operational-2.0.0-M15.jar:/x1/jenkins/jenkins-slave/workspace/Lucene-Solr-NightlyTests-master/checkout/solr/core/test-lib/apacheds-interceptors-referral-2.0.0-M15.jar:/x1/jenkins/jenkins-slave/workspace/Lucene-Solr-NightlyTests-master/checkout/solr/core/test-lib/apacheds-interceptors-schema-2.0.0-M15.jar:/x1/jenkins/jenkins-slave/workspace/Lucene-Solr-NightlyTests-master/checkout/solr/core/test-lib/apacheds-interceptors-subtree-2.0.0-M15.jar:/x1/jenkins/jenkins-slave/workspace/Lucene-Solr-NightlyTests-master/checkout/solr/core/test-lib/apacheds-interceptors-trigger-2.0.0-M15.jar:/x1/jenkins/jenkins-slave/workspace/Lucene-Solr-NightlyTests-master/checkout/solr/core/test-lib/apacheds-jdbm-partition-2.0.0-M15.jar:/x1/jenkins/jenkins-slave/workspace/Lucene-Solr-NightlyTests-master/checkout/solr/core/test-lib/apacheds-jdbm1-2.0.0-M2.jar:/x1/jenkins/jenkins-slave/workspace/Lucene-Solr-NightlyTests-master/checkout/solr/core/test-lib/apacheds-kerberos-codec-2.0.0-M15.jar:/x1/jenkins/jenkins-slave/workspace/Lucene-Solr-NightlyTests-master/checkout/solr/core/test-lib/apacheds-ldif-partition-2.0.0-M15.jar:/x1/jenkins/jenkins-slave/workspace/Lucene-Solr-NightlyTests-master/checkout/solr/core/test-lib/apacheds-mavibot-partition-2.0.0-M15.jar:/x1/jenkins/jenkins-slave/workspace/Lucene-Solr-NightlyTests-master/checkout/solr/core/test-lib/apacheds-protocol-kerberos-2.0.0-M15.jar:/x1/jenkins/jenkins-slave/workspace/Lucene-Solr-NightlyTests-master/checkout/solr/core/test-lib/apacheds-protocol-ldap-2.0.0-M15.jar:/x1/jenkins/jenkins-slave/workspace/Lucene-Solr-NightlyTests-master/checkout/solr/core/test-lib/apacheds-protocol-shared-2.0.0-M15.jar:/x1/jenkins/jenkins-slave/workspace/Lucene-Solr-NightlyTests-master/checkout/solr/core/test-lib/apacheds-xdbm-partition-2.0.0-M15.jar:/x1/jenkins/jenkins-slave/workspace/Lucene-Solr-NightlyTests-master/checkout/solr/core/test-lib/api-all-1.0.0-M20.jar:/x1/jenkins/jenkins-slave/workspace/Lucene-Solr-NightlyTests-master/checkout/solr/core/test-lib/bcprov-jdk15-1.45.jar:/x1/jenkins/jenkins-slave/workspace/Lucene-Solr-NightlyTests-master/checkout/solr/core/test-lib/byte-buddy-1.6.2.jar:/x1/jenkins/jenkins-slave/workspace/Lucene-Solr-NightlyTests-master/checkout/solr/core/test-lib/commons-collections-3.2.2.jar:/x1/jenkins/jenkins-slave/workspace/Lucene-Solr-NightlyTests-master/checkout/solr/core/test-lib/commons-math3-3.4.1.jar:/x1/jenkins/jenkins-slave/workspace/Lucene-Solr-NightlyTests-master/checkout/solr/core/test-lib/ehcache-core-2.4.4.jar:/x1/jenkins/jenkins-slave/workspace/Lucene-Solr-NightlyTests-master/checkout/solr/core/test-lib/hadoop-common-2.7.2-tests.jar:/x1/jenkins/jenkins-slave/workspace/Lucene-Solr-NightlyTests-master/checkout/solr/core/test-lib/hadoop-hdfs-2.7.2-tests.jar:/x1/jenkins/jenkins-slave/workspace/Lucene-Solr-NightlyTests-master/checkout/solr/core/test-lib/hadoop-minikdc-2.7.2.jar:/x1/jenkins/jenkins-slave/workspace/Lucene-Solr-NightlyTests-master/checkout/solr/core/test-lib/htrace-core-3.2.0-incubating.jar:/x1/jenkins/jenkins-slave/workspace/Lucene-Solr-NightlyTests-master/checkout/solr/core/test-lib/jersey-core-1.9.jar:/x1/jenkins/jenkins-slave/workspace/Lucene-Solr-NightlyTests-master/checkout/solr/core/test-lib/jersey-server-1.9.jar:/x1/jenkins/jenkins-slave/workspace/Lucene-Solr-NightlyTests-master/checkout/solr/core/test-lib/jetty-6.1.26.jar:/x1/jenkins/jenkins-slave/workspace/Lucene-Solr-NightlyTests-master/checkout/solr/core/test-lib/jetty-util-6.1.26.jar:/x1/jenkins/jenkins-slave/workspace/Lucene-Solr-NightlyTests-master/checkout/solr/core/test-lib/mina-core-2.0.0-M5.jar:/x1/jenkins/jenkins-slave/workspace/Lucene-Solr-NightlyTests-master/checkout/solr/core/test-lib/mockito-core-2.6.2.jar:/x1/jenkins/jenkins-slave/workspace/Lucene-Solr-NightlyTests-master/checkout/solr/core/test-lib/netty-all-4.0.36.Final.jar:/x1/jenkins/jenkins-slave/workspace/Lucene-Solr-NightlyTests-master/checkout/solr/core/test-lib/objenesis-2.5.jar:/x1/jenkins/jenkins-slave/workspace/Lucene-Solr-NightlyTests-master/checkout/lucene/build/analysis/icu/lucene-analyzers-icu-8.0.0-SNAPSHOT.jar:/x1/jenkins/jenkins-slave/workspace/Lucene-Solr-NightlyTests-master/checkout/solr/build/contrib/solr-analysis-extras/classes/java:/x1/jenkins/jenkins-slave/workspace/Lucene-Solr-NightlyTests-master/checkout/lucene/build/queryparser/classes/test:/x1/jenkins/jenkins-slave/workspace/Lucene-Solr-NightlyTests-master/checkout/solr/contrib/analysis-extras/lib/icu4j-59.1.jar:/home/jenkins/tools/ant/apache-ant-1.8.4/lib/ant-launcher.jar:/x1/jenkins/.ant/lib/ivy-2.3.0.jar:/home/jenkins/tools/ant/apache-ant-1.8.4/lib/ant-junit.jar:/home/jenkins/tools/ant/apache-ant-1.8.4/lib/ant-apache-log4j.jar:/home/jenkins/tools/ant/apache-ant-1.8.4/lib/ant-junit4.jar:/home/jenkins/tools/ant/apache-ant-1.8.4/lib/ant-jai.jar:/home/jenkins/tools/ant/apache-ant-1.8.4/lib/ant-javamail.jar:/home/jenkins/tools/ant/apache-ant-1.8.4/lib/ant-apache-bsf.jar:/home/jenkins/tools/ant/apache-ant-1.8.4/lib/ant-commons-net.jar:/home/jenkins/tools/ant/apache-ant-1.8.4/lib/ant-antlr.jar:/home/jenkins/tools/ant/apache-ant-1.8.4/lib/ant-jsch.jar:/home/jenkins/tools/ant/apache-ant-1.8.4/lib/ant-apache-oro.jar:/home/jenkins/tools/ant/apache-ant-1.8.4/lib/ant-commons-logging.jar:/home/jenkins/tools/ant/apache-ant-1.8.4/lib/ant.jar:/home/jenkins/tools/ant/apache-ant-1.8.4/lib/ant-netrexx.jar:/home/jenkins/tools/ant/apache-ant-1.8.4/lib/ant-testutil.jar:/home/jenkins/tools/ant/apache-ant-1.8.4/lib/ant-jdepend.jar:/home/jenkins/tools/ant/apache-ant-1.8.4/lib/ant-apache-bcel.jar:/home/jenkins/tools/ant/apache-ant-1.8.4/lib/ant-apache-xalan2.jar:/home/jenkins/tools/ant/apache-ant-1.8.4/lib/ant-apache-resolver.jar:/home/jenkins/tools/ant/apache-ant-1.8.4/lib/ant-jmf.jar:/home/jenkins/tools/ant/apache-ant-1.8.4/lib/ant-apache-regexp.jar:/home/jenkins/tools/ant/apache-ant-1.8.4/lib/ant-swing.jar:/usr/local/asfpackages/java/jdk1.8.0_144/lib/tools.jar:/x1/jenkins/.ivy2/cache/com.carrotsearch.randomizedtesting/junit4-ant/jars/junit4-ant-2.5.2.jar com.carrotsearch.ant.tasks.junit4.slave.SlaveMainSafe -eventsfile /x1/jenkins/jenkins-slave/workspace/Lucene-Solr-NightlyTests-master/checkout/solr/build/solr-core/test/temp/junit4-J0-20170813_201552_8868951633876611811223.events @/x1/jenkins/jenkins-slave/workspace/Lucene-Solr-NightlyTests-master/checkout/solr/build/solr-core/test/temp/junit4-J0-20170813_201552_8861465906933436060321.suites -stdin
   [junit4] ERROR: JVM J0 ended with an exception: Quit event not received from the forked process? This may indicate JVM crash or runner bugs.
   [junit4] 	at com.carrotsearch.ant.tasks.junit4.JUnit4.executeSlave(JUnit4.java:1540)
   [junit4] 	at com.carrotsearch.ant.tasks.junit4.JUnit4.access$000(JUnit4.java:126)
   [junit4] 	at com.carrotsearch.ant.tasks.junit4.JUnit4$2.call(JUnit4.java:982)
   [junit4] 	at com.carrotsearch.ant.tasks.junit4.JUnit4$2.call(JUnit4.java:979)
   [junit4] 	at java.util.concurrent.FutureTask.run(FutureTask.java:266)
   [junit4] 	at java.util.concurrent.ThreadPoolExecutor.runWorker(ThreadPoolExecutor.java:1149)
   [junit4] 	at java.util.concurrent.ThreadPoolExecutor$Worker.run(ThreadPoolExecutor.java:624)
   [junit4] 	at java.lang.Thread.run(Thread.java:748)

BUILD FAILED
/x1/jenkins/jenkins-slave/workspace/Lucene-Solr-NightlyTests-master/checkout/build.xml:818: The following error occurred while executing this line:
/x1/jenkins/jenkins-slave/workspace/Lucene-Solr-NightlyTests-master/checkout/build.xml:754: The following error occurred while executing this line:
/x1/jenkins/jenkins-slave/workspace/Lucene-Solr-NightlyTests-master/checkout/build.xml:59: The following error occurred while executing this line:
/x1/jenkins/jenkins-slave/workspace/Lucene-Solr-NightlyTests-master/checkout/solr/build.xml:267: The following error occurred while executing this line:
/x1/jenkins/jenkins-slave/workspace/Lucene-Solr-NightlyTests-master/checkout/solr/common-build.xml:549: The following error occurred while executing this line:
/x1/jenkins/jenkins-slave/workspace/Lucene-Solr-NightlyTests-master/checkout/lucene/common-build.xml:1458: The following error occurred while executing this line:
/x1/jenkins/jenkins-slave/workspace/Lucene-Solr-NightlyTests-master/checkout/lucene/common-build.xml:985: At least one slave process threw an exception, first: Quit event not received from the forked process? This may indicate JVM crash or runner bugs.

Total time: 231 minutes 7 seconds
Build step 'Invoke Ant' marked build as failure
Archiving artifacts
[Fast Archiver] No artifacts from Lucene-Solr-NightlyTests-master #1373 to compare, so performing full copy of artifacts
Recording test results
Email was triggered for: Failure - Any
Sending email for trigger: Failure - Any

Mime
View raw message