lucene-dev mailing list archives

Site index · List index
Message view « Date » · « Thread »
Top « Date » · « Thread »
From Policeman Jenkins Server <jenk...@thetaphi.de>
Subject [JENKINS-EA] Lucene-Solr-master-Windows (64bit/jdk-9-ea+181) - Build # 6821 - Still Unstable!
Date Mon, 14 Aug 2017 03:45:39 GMT
Build: https://jenkins.thetaphi.de/job/Lucene-Solr-master-Windows/6821/
Java: 64bit/jdk-9-ea+181 -XX:-UseCompressedOops -XX:+UseConcMarkSweepGC --illegal-access=deny

2 tests failed.
FAILED:  org.apache.solr.cloud.TestAuthenticationFramework.testBasics

Error Message:
Error from server at http://127.0.0.1:60862/solr/testcollection_shard1_replica_n2: Expected mime type application/octet-stream but got text/html. <html> <head> <meta http-equiv="Content-Type" content="text/html;charset=ISO-8859-1"/> <title>Error 404 </title> </head> <body> <h2>HTTP ERROR: 404</h2> <p>Problem accessing /solr/testcollection_shard1_replica_n2/update. Reason: <pre>    Can not find: /solr/testcollection_shard1_replica_n2/update</pre></p> <hr /><a href="http://eclipse.org/jetty">Powered by Jetty:// 9.3.14.v20161028</a><hr/> </body> </html> 

Stack Trace:
org.apache.solr.client.solrj.impl.CloudSolrClient$RouteException: Error from server at http://127.0.0.1:60862/solr/testcollection_shard1_replica_n2: Expected mime type application/octet-stream but got text/html. <html>
<head>
<meta http-equiv="Content-Type" content="text/html;charset=ISO-8859-1"/>
<title>Error 404 </title>
</head>
<body>
<h2>HTTP ERROR: 404</h2>
<p>Problem accessing /solr/testcollection_shard1_replica_n2/update. Reason:
<pre>    Can not find: /solr/testcollection_shard1_replica_n2/update</pre></p>
<hr /><a href="http://eclipse.org/jetty">Powered by Jetty:// 9.3.14.v20161028</a><hr/>
</body>
</html>

	at __randomizedtesting.SeedInfo.seed([6E0B4B59FBAA5993:53D3E575C34407E3]:0)
	at org.apache.solr.client.solrj.impl.CloudSolrClient.directUpdate(CloudSolrClient.java:539)
	at org.apache.solr.client.solrj.impl.CloudSolrClient.sendRequest(CloudSolrClient.java:993)
	at org.apache.solr.client.solrj.impl.CloudSolrClient.requestWithRetryOnStaleState(CloudSolrClient.java:862)
	at org.apache.solr.client.solrj.impl.CloudSolrClient.request(CloudSolrClient.java:793)
	at org.apache.solr.client.solrj.SolrRequest.process(SolrRequest.java:178)
	at org.apache.solr.client.solrj.request.UpdateRequest.commit(UpdateRequest.java:233)
	at org.apache.solr.cloud.TestAuthenticationFramework.collectionCreateSearchDeleteTwice(TestAuthenticationFramework.java:126)
	at org.apache.solr.cloud.TestAuthenticationFramework.testBasics(TestAuthenticationFramework.java:74)
	at java.base/jdk.internal.reflect.NativeMethodAccessorImpl.invoke0(Native Method)
	at java.base/jdk.internal.reflect.NativeMethodAccessorImpl.invoke(NativeMethodAccessorImpl.java:62)
	at java.base/jdk.internal.reflect.DelegatingMethodAccessorImpl.invoke(DelegatingMethodAccessorImpl.java:43)
	at java.base/java.lang.reflect.Method.invoke(Method.java:564)
	at com.carrotsearch.randomizedtesting.RandomizedRunner.invoke(RandomizedRunner.java:1713)
	at com.carrotsearch.randomizedtesting.RandomizedRunner$8.evaluate(RandomizedRunner.java:907)
	at com.carrotsearch.randomizedtesting.RandomizedRunner$9.evaluate(RandomizedRunner.java:943)
	at com.carrotsearch.randomizedtesting.RandomizedRunner$10.evaluate(RandomizedRunner.java:957)
	at com.carrotsearch.randomizedtesting.rules.SystemPropertiesRestoreRule$1.evaluate(SystemPropertiesRestoreRule.java:57)
	at org.apache.lucene.util.TestRuleSetupTeardownChained$1.evaluate(TestRuleSetupTeardownChained.java:49)
	at org.apache.lucene.util.AbstractBeforeAfterRule$1.evaluate(AbstractBeforeAfterRule.java:45)
	at org.apache.lucene.util.TestRuleThreadAndTestName$1.evaluate(TestRuleThreadAndTestName.java:48)
	at org.apache.lucene.util.TestRuleIgnoreAfterMaxFailures$1.evaluate(TestRuleIgnoreAfterMaxFailures.java:64)
	at org.apache.lucene.util.TestRuleMarkFailure$1.evaluate(TestRuleMarkFailure.java:47)
	at com.carrotsearch.randomizedtesting.rules.StatementAdapter.evaluate(StatementAdapter.java:36)
	at com.carrotsearch.randomizedtesting.ThreadLeakControl$StatementRunner.run(ThreadLeakControl.java:368)
	at com.carrotsearch.randomizedtesting.ThreadLeakControl.forkTimeoutingTask(ThreadLeakControl.java:817)
	at com.carrotsearch.randomizedtesting.ThreadLeakControl$3.evaluate(ThreadLeakControl.java:468)
	at com.carrotsearch.randomizedtesting.RandomizedRunner.runSingleTest(RandomizedRunner.java:916)
	at com.carrotsearch.randomizedtesting.RandomizedRunner$5.evaluate(RandomizedRunner.java:802)
	at com.carrotsearch.randomizedtesting.RandomizedRunner$6.evaluate(RandomizedRunner.java:852)
	at com.carrotsearch.randomizedtesting.RandomizedRunner$7.evaluate(RandomizedRunner.java:863)
	at com.carrotsearch.randomizedtesting.rules.StatementAdapter.evaluate(StatementAdapter.java:36)
	at com.carrotsearch.randomizedtesting.rules.SystemPropertiesRestoreRule$1.evaluate(SystemPropertiesRestoreRule.java:57)
	at org.apache.lucene.util.AbstractBeforeAfterRule$1.evaluate(AbstractBeforeAfterRule.java:45)
	at com.carrotsearch.randomizedtesting.rules.StatementAdapter.evaluate(StatementAdapter.java:36)
	at org.apache.lucene.util.TestRuleStoreClassName$1.evaluate(TestRuleStoreClassName.java:41)
	at com.carrotsearch.randomizedtesting.rules.NoShadowingOrOverridesOnMethodsRule$1.evaluate(NoShadowingOrOverridesOnMethodsRule.java:40)
	at com.carrotsearch.randomizedtesting.rules.NoShadowingOrOverridesOnMethodsRule$1.evaluate(NoShadowingOrOverridesOnMethodsRule.java:40)
	at com.carrotsearch.randomizedtesting.rules.StatementAdapter.evaluate(StatementAdapter.java:36)
	at com.carrotsearch.randomizedtesting.rules.StatementAdapter.evaluate(StatementAdapter.java:36)
	at org.apache.lucene.util.TestRuleAssertionsRequired$1.evaluate(TestRuleAssertionsRequired.java:53)
	at org.apache.lucene.util.TestRuleMarkFailure$1.evaluate(TestRuleMarkFailure.java:47)
	at org.apache.lucene.util.TestRuleIgnoreAfterMaxFailures$1.evaluate(TestRuleIgnoreAfterMaxFailures.java:64)
	at org.apache.lucene.util.TestRuleIgnoreTestSuites$1.evaluate(TestRuleIgnoreTestSuites.java:54)
	at com.carrotsearch.randomizedtesting.rules.StatementAdapter.evaluate(StatementAdapter.java:36)
	at com.carrotsearch.randomizedtesting.ThreadLeakControl$StatementRunner.run(ThreadLeakControl.java:368)
	at java.base/java.lang.Thread.run(Thread.java:844)
Caused by: org.apache.solr.client.solrj.impl.HttpSolrClient$RemoteSolrException: Error from server at http://127.0.0.1:60862/solr/testcollection_shard1_replica_n2: Expected mime type application/octet-stream but got text/html. <html>
<head>
<meta http-equiv="Content-Type" content="text/html;charset=ISO-8859-1"/>
<title>Error 404 </title>
</head>
<body>
<h2>HTTP ERROR: 404</h2>
<p>Problem accessing /solr/testcollection_shard1_replica_n2/update. Reason:
<pre>    Can not find: /solr/testcollection_shard1_replica_n2/update</pre></p>
<hr /><a href="http://eclipse.org/jetty">Powered by Jetty:// 9.3.14.v20161028</a><hr/>
</body>
</html>

	at org.apache.solr.client.solrj.impl.HttpSolrClient.executeMethod(HttpSolrClient.java:591)
	at org.apache.solr.client.solrj.impl.HttpSolrClient.request(HttpSolrClient.java:253)
	at org.apache.solr.client.solrj.impl.HttpSolrClient.request(HttpSolrClient.java:242)
	at org.apache.solr.client.solrj.impl.LBHttpSolrClient.doRequest(LBHttpSolrClient.java:483)
	at org.apache.solr.client.solrj.impl.LBHttpSolrClient.request(LBHttpSolrClient.java:413)
	at org.apache.solr.client.solrj.impl.CloudSolrClient.lambda$directUpdate$0(CloudSolrClient.java:516)
	at java.base/java.util.concurrent.FutureTask.run(FutureTask.java:264)
	at org.apache.solr.common.util.ExecutorUtil$MDCAwareThreadPoolExecutor.lambda$execute$0(ExecutorUtil.java:188)
	at java.base/java.util.concurrent.ThreadPoolExecutor.runWorker(ThreadPoolExecutor.java:1167)
	at java.base/java.util.concurrent.ThreadPoolExecutor$Worker.run(ThreadPoolExecutor.java:641)
	... 1 more


FAILED:  junit.framework.TestSuite.org.apache.solr.client.solrj.SolrExceptionTest

Error Message:
The test or suite printed 10352 bytes to stdout and stderr, even though the limit was set to 8192 bytes. Increase the limit with @Limit, ignore it completely with @SuppressSysoutChecks or run with -Dtests.verbose=true

Stack Trace:
java.lang.AssertionError: The test or suite printed 10352 bytes to stdout and stderr, even though the limit was set to 8192 bytes. Increase the limit with @Limit, ignore it completely with @SuppressSysoutChecks or run with -Dtests.verbose=true
	at __randomizedtesting.SeedInfo.seed([2F1A85A3BAE96670]:0)
	at org.apache.lucene.util.TestRuleLimitSysouts.afterIfSuccessful(TestRuleLimitSysouts.java:211)
	at com.carrotsearch.randomizedtesting.rules.TestRuleAdapter$1.afterIfSuccessful(TestRuleAdapter.java:36)
	at com.carrotsearch.randomizedtesting.rules.StatementAdapter.evaluate(StatementAdapter.java:37)
	at org.apache.lucene.util.TestRuleAssertionsRequired$1.evaluate(TestRuleAssertionsRequired.java:53)
	at org.apache.lucene.util.TestRuleMarkFailure$1.evaluate(TestRuleMarkFailure.java:47)
	at org.apache.lucene.util.TestRuleIgnoreAfterMaxFailures$1.evaluate(TestRuleIgnoreAfterMaxFailures.java:64)
	at org.apache.lucene.util.TestRuleIgnoreTestSuites$1.evaluate(TestRuleIgnoreTestSuites.java:54)
	at com.carrotsearch.randomizedtesting.rules.StatementAdapter.evaluate(StatementAdapter.java:36)
	at com.carrotsearch.randomizedtesting.ThreadLeakControl$StatementRunner.run(ThreadLeakControl.java:368)
	at java.base/java.lang.Thread.run(Thread.java:844)




Build Log:
[...truncated 1716 lines...]
   [junit4] JVM J1: stderr was not empty, see: C:\Users\jenkins\workspace\Lucene-Solr-master-Windows\lucene\build\core\test\temp\junit4-J1-20170814_021038_7104292229564139069153.syserr
   [junit4] >>> JVM J1 emitted unexpected output (verbatim) ----
   [junit4] Java HotSpot(TM) 64-Bit Server VM warning: Option UseConcMarkSweepGC was deprecated in version 9.0 and will likely be removed in a future release.
   [junit4] <<< JVM J1: EOF ----

[...truncated 3 lines...]
   [junit4] JVM J0: stderr was not empty, see: C:\Users\jenkins\workspace\Lucene-Solr-master-Windows\lucene\build\core\test\temp\junit4-J0-20170814_021038_7134879879969604959486.syserr
   [junit4] >>> JVM J0 emitted unexpected output (verbatim) ----
   [junit4] Java HotSpot(TM) 64-Bit Server VM warning: Option UseConcMarkSweepGC was deprecated in version 9.0 and will likely be removed in a future release.
   [junit4] <<< JVM J0: EOF ----

[...truncated 304 lines...]
   [junit4] JVM J1: stderr was not empty, see: C:\Users\jenkins\workspace\Lucene-Solr-master-Windows\lucene\build\test-framework\test\temp\junit4-J1-20170814_021539_09215476035976913177239.syserr
   [junit4] JVM J0: stderr was not empty, see: C:\Users\jenkins\workspace\Lucene-Solr-master-Windows\lucene\build\test-framework\test\temp\junit4-J0-20170814_021539_09215288740287526434713.syserr
   [junit4] >>> JVM J0 emitted unexpected output (verbatim) ----
   [junit4] Java HotSpot(TM) 64-Bit Server VM warning: Option UseConcMarkSweepGC was deprecated in version 9.0 and will likely be removed in a future release.
   [junit4] <<< JVM J0: EOF ----

[...truncated 1037 lines...]
   [junit4] JVM J1: stderr was not empty, see: C:\Users\jenkins\workspace\Lucene-Solr-master-Windows\lucene\build\analysis\common\test\temp\junit4-J1-20170814_021635_5418903629254942519833.syserr
   [junit4] >>> JVM J1 emitted unexpected output (verbatim) ----
   [junit4] Java HotSpot(TM) 64-Bit Server VM warning: Option UseConcMarkSweepGC was deprecated in version 9.0 and will likely be removed in a future release.
   [junit4] <<< JVM J1: EOF ----

[...truncated 3 lines...]
   [junit4] JVM J0: stderr was not empty, see: C:\Users\jenkins\workspace\Lucene-Solr-master-Windows\lucene\build\analysis\common\test\temp\junit4-J0-20170814_021635_54111944258541979883626.syserr
   [junit4] >>> JVM J0 emitted unexpected output (verbatim) ----
   [junit4] Java HotSpot(TM) 64-Bit Server VM warning: Option UseConcMarkSweepGC was deprecated in version 9.0 and will likely be removed in a future release.
   [junit4] <<< JVM J0: EOF ----

[...truncated 220 lines...]
   [junit4] JVM J1: stderr was not empty, see: C:\Users\jenkins\workspace\Lucene-Solr-master-Windows\lucene\build\analysis\icu\test\temp\junit4-J1-20170814_021841_668432873514478007445.syserr
   [junit4] >>> JVM J1 emitted unexpected output (verbatim) ----
   [junit4] Java HotSpot(TM) 64-Bit Server VM warning: Option UseConcMarkSweepGC was deprecated in version 9.0 and will likely be removed in a future release.
   [junit4] <<< JVM J1: EOF ----

   [junit4] JVM J0: stderr was not empty, see: C:\Users\jenkins\workspace\Lucene-Solr-master-Windows\lucene\build\analysis\icu\test\temp\junit4-J0-20170814_021841_6685874948682379890931.syserr
   [junit4] >>> JVM J0 emitted unexpected output (verbatim) ----
   [junit4] Java HotSpot(TM) 64-Bit Server VM warning: Option UseConcMarkSweepGC was deprecated in version 9.0 and will likely be removed in a future release.
   [junit4] <<< JVM J0: EOF ----

[...truncated 238 lines...]
   [junit4] JVM J0: stderr was not empty, see: C:\Users\jenkins\workspace\Lucene-Solr-master-Windows\lucene\build\analysis\kuromoji\test\temp\junit4-J0-20170814_021853_41511006772407907749832.syserr
   [junit4] >>> JVM J0 emitted unexpected output (verbatim) ----
   [junit4] Java HotSpot(TM) 64-Bit Server VM warning: Option UseConcMarkSweepGC was deprecated in version 9.0 and will likely be removed in a future release.
   [junit4] <<< JVM J0: EOF ----

[...truncated 3 lines...]
   [junit4] JVM J1: stderr was not empty, see: C:\Users\jenkins\workspace\Lucene-Solr-master-Windows\lucene\build\analysis\kuromoji\test\temp\junit4-J1-20170814_021853_4159855660853514197813.syserr
   [junit4] >>> JVM J1 emitted unexpected output (verbatim) ----
   [junit4] Java HotSpot(TM) 64-Bit Server VM warning: Option UseConcMarkSweepGC was deprecated in version 9.0 and will likely be removed in a future release.
   [junit4] <<< JVM J1: EOF ----

[...truncated 147 lines...]
   [junit4] JVM J0: stderr was not empty, see: C:\Users\jenkins\workspace\Lucene-Solr-master-Windows\lucene\build\analysis\morfologik\test\temp\junit4-J0-20170814_021920_6338772710864396173596.syserr
   [junit4] >>> JVM J0 emitted unexpected output (verbatim) ----
   [junit4] Java HotSpot(TM) 64-Bit Server VM warning: Option UseConcMarkSweepGC was deprecated in version 9.0 and will likely be removed in a future release.
   [junit4] <<< JVM J0: EOF ----

[...truncated 3 lines...]
   [junit4] JVM J1: stderr was not empty, see: C:\Users\jenkins\workspace\Lucene-Solr-master-Windows\lucene\build\analysis\morfologik\test\temp\junit4-J1-20170814_021920_6333611477943139087780.syserr
   [junit4] >>> JVM J1 emitted unexpected output (verbatim) ----
   [junit4] Java HotSpot(TM) 64-Bit Server VM warning: Option UseConcMarkSweepGC was deprecated in version 9.0 and will likely be removed in a future release.
   [junit4] <<< JVM J1: EOF ----

[...truncated 159 lines...]
   [junit4] JVM J1: stderr was not empty, see: C:\Users\jenkins\workspace\Lucene-Solr-master-Windows\lucene\build\analysis\phonetic\test\temp\junit4-J1-20170814_021924_50111716674036314046614.syserr
   [junit4] >>> JVM J1 emitted unexpected output (verbatim) ----
   [junit4] Java HotSpot(TM) 64-Bit Server VM warning: Option UseConcMarkSweepGC was deprecated in version 9.0 and will likely be removed in a future release.
   [junit4] <<< JVM J1: EOF ----

[...truncated 3 lines...]
   [junit4] JVM J0: stderr was not empty, see: C:\Users\jenkins\workspace\Lucene-Solr-master-Windows\lucene\build\analysis\phonetic\test\temp\junit4-J0-20170814_021924_5015450210987259238437.syserr
   [junit4] >>> JVM J0 emitted unexpected output (verbatim) ----
   [junit4] Java HotSpot(TM) 64-Bit Server VM warning: Option UseConcMarkSweepGC was deprecated in version 9.0 and will likely be removed in a future release.
   [junit4] <<< JVM J0: EOF ----

[...truncated 144 lines...]
   [junit4] JVM J1: stderr was not empty, see: C:\Users\jenkins\workspace\Lucene-Solr-master-Windows\lucene\build\analysis\smartcn\test\temp\junit4-J1-20170814_021934_88468939911612261173.syserr
   [junit4] >>> JVM J1 emitted unexpected output (verbatim) ----
   [junit4] Java HotSpot(TM) 64-Bit Server VM warning: Option UseConcMarkSweepGC was deprecated in version 9.0 and will likely be removed in a future release.
   [junit4] <<< JVM J1: EOF ----

[...truncated 3 lines...]
   [junit4] JVM J0: stderr was not empty, see: C:\Users\jenkins\workspace\Lucene-Solr-master-Windows\lucene\build\analysis\smartcn\test\temp\junit4-J0-20170814_021934_88418336228863333776502.syserr
   [junit4] >>> JVM J0 emitted unexpected output (verbatim) ----
   [junit4] Java HotSpot(TM) 64-Bit Server VM warning: Option UseConcMarkSweepGC was deprecated in version 9.0 and will likely be removed in a future release.
   [junit4] <<< JVM J0: EOF ----

[...truncated 149 lines...]
   [junit4] JVM J1: stderr was not empty, see: C:\Users\jenkins\workspace\Lucene-Solr-master-Windows\lucene\build\analysis\stempel\test\temp\junit4-J1-20170814_021942_2135776122759531463018.syserr
   [junit4] >>> JVM J1 emitted unexpected output (verbatim) ----
   [junit4] Java HotSpot(TM) 64-Bit Server VM warning: Option UseConcMarkSweepGC was deprecated in version 9.0 and will likely be removed in a future release.
   [junit4] <<< JVM J1: EOF ----

[...truncated 3 lines...]
   [junit4] JVM J0: stderr was not empty, see: C:\Users\jenkins\workspace\Lucene-Solr-master-Windows\lucene\build\analysis\stempel\test\temp\junit4-J0-20170814_021942_213604858563713868906.syserr
   [junit4] >>> JVM J0 emitted unexpected output (verbatim) ----
   [junit4] Java HotSpot(TM) 64-Bit Server VM warning: Option UseConcMarkSweepGC was deprecated in version 9.0 and will likely be removed in a future release.
   [junit4] <<< JVM J0: EOF ----

[...truncated 160 lines...]
   [junit4] JVM J0: stderr was not empty, see: C:\Users\jenkins\workspace\Lucene-Solr-master-Windows\lucene\build\analysis\uima\test\temp\junit4-J0-20170814_021945_59714409102967117889137.syserr
   [junit4] >>> JVM J0 emitted unexpected output (verbatim) ----
   [junit4] Java HotSpot(TM) 64-Bit Server VM warning: Option UseConcMarkSweepGC was deprecated in version 9.0 and will likely be removed in a future release.
   [junit4] <<< JVM J0: EOF ----

[...truncated 145 lines...]
   [junit4] JVM J1: stderr was not empty, see: C:\Users\jenkins\workspace\Lucene-Solr-master-Windows\lucene\build\backward-codecs\test\temp\junit4-J1-20170814_022002_88510998710904234228219.syserr
   [junit4] >>> JVM J1 emitted unexpected output (verbatim) ----
   [junit4] Java HotSpot(TM) 64-Bit Server VM warning: Option UseConcMarkSweepGC was deprecated in version 9.0 and will likely be removed in a future release.
   [junit4] <<< JVM J1: EOF ----

[...truncated 25 lines...]
   [junit4] JVM J0: stderr was not empty, see: C:\Users\jenkins\workspace\Lucene-Solr-master-Windows\lucene\build\backward-codecs\test\temp\junit4-J0-20170814_022002_88513109673456808855964.syserr
   [junit4] >>> JVM J0 emitted unexpected output (verbatim) ----
   [junit4] Java HotSpot(TM) 64-Bit Server VM warning: Option UseConcMarkSweepGC was deprecated in version 9.0 and will likely be removed in a future release.
   [junit4] <<< JVM J0: EOF ----

[...truncated 1220 lines...]
   [junit4] JVM J0: stderr was not empty, see: C:\Users\jenkins\workspace\Lucene-Solr-master-Windows\lucene\build\benchmark\test\temp\junit4-J0-20170814_022015_5898399669492612487101.syserr
   [junit4] >>> JVM J0 emitted unexpected output (verbatim) ----
   [junit4] Java HotSpot(TM) 64-Bit Server VM warning: Option UseConcMarkSweepGC was deprecated in version 9.0 and will likely be removed in a future release.
   [junit4] <<< JVM J0: EOF ----

   [junit4] JVM J1: stderr was not empty, see: C:\Users\jenkins\workspace\Lucene-Solr-master-Windows\lucene\build\benchmark\test\temp\junit4-J1-20170814_022015_58711462843951488440272.syserr
   [junit4] >>> JVM J1 emitted unexpected output (verbatim) ----
   [junit4] Java HotSpot(TM) 64-Bit Server VM warning: Option UseConcMarkSweepGC was deprecated in version 9.0 and will likely be removed in a future release.
   [junit4] <<< JVM J1: EOF ----

[...truncated 219 lines...]
   [junit4] JVM J1: stderr was not empty, see: C:\Users\jenkins\workspace\Lucene-Solr-master-Windows\lucene\build\classification\test\temp\junit4-J1-20170814_022025_9558539858314692119895.syserr
   [junit4] >>> JVM J1 emitted unexpected output (verbatim) ----
   [junit4] Java HotSpot(TM) 64-Bit Server VM warning: Option UseConcMarkSweepGC was deprecated in version 9.0 and will likely be removed in a future release.
   [junit4] <<< JVM J1: EOF ----

[...truncated 6 lines...]
   [junit4] JVM J0: stderr was not empty, see: C:\Users\jenkins\workspace\Lucene-Solr-master-Windows\lucene\build\classification\test\temp\junit4-J0-20170814_022025_955779210561321201489.syserr
   [junit4] >>> JVM J0 emitted unexpected output (verbatim) ----
   [junit4] Java HotSpot(TM) 64-Bit Server VM warning: Option UseConcMarkSweepGC was deprecated in version 9.0 and will likely be removed in a future release.
   [junit4] <<< JVM J0: EOF ----

[...truncated 252 lines...]
   [junit4] JVM J0: stderr was not empty, see: C:\Users\jenkins\workspace\Lucene-Solr-master-Windows\lucene\build\codecs\test\temp\junit4-J0-20170814_022042_84815030355988694470607.syserr
   [junit4] >>> JVM J0 emitted unexpected output (verbatim) ----
   [junit4] Java HotSpot(TM) 64-Bit Server VM warning: Option UseConcMarkSweepGC was deprecated in version 9.0 and will likely be removed in a future release.
   [junit4] <<< JVM J0: EOF ----

[...truncated 3 lines...]
   [junit4] JVM J1: stderr was not empty, see: C:\Users\jenkins\workspace\Lucene-Solr-master-Windows\lucene\build\codecs\test\temp\junit4-J1-20170814_022042_84818120719375832360235.syserr
   [junit4] >>> JVM J1 emitted unexpected output (verbatim) ----
   [junit4] Java HotSpot(TM) 64-Bit Server VM warning: Option UseConcMarkSweepGC was deprecated in version 9.0 and will likely be removed in a future release.
   [junit4] <<< JVM J1: EOF ----

[...truncated 226 lines...]
   [junit4] JVM J0: stderr was not empty, see: C:\Users\jenkins\workspace\Lucene-Solr-master-Windows\lucene\build\demo\test\temp\junit4-J0-20170814_022218_58417125024962492650746.syserr
   [junit4] >>> JVM J0 emitted unexpected output (verbatim) ----
   [junit4] Java HotSpot(TM) 64-Bit Server VM warning: Option UseConcMarkSweepGC was deprecated in version 9.0 and will likely be removed in a future release.
   [junit4] <<< JVM J0: EOF ----

[...truncated 3 lines...]
   [junit4] JVM J1: stderr was not empty, see: C:\Users\jenkins\workspace\Lucene-Solr-master-Windows\lucene\build\demo\test\temp\junit4-J1-20170814_022218_5849097344387740550272.syserr
   [junit4] >>> JVM J1 emitted unexpected output (verbatim) ----
   [junit4] Java HotSpot(TM) 64-Bit Server VM warning: Option UseConcMarkSweepGC was deprecated in version 9.0 and will likely be removed in a future release.
   [junit4] <<< JVM J1: EOF ----

[...truncated 166 lines...]
   [junit4] JVM J0: stderr was not empty, see: C:\Users\jenkins\workspace\Lucene-Solr-master-Windows\lucene\build\expressions\test\temp\junit4-J0-20170814_022223_5971292863026253851353.syserr
   [junit4] >>> JVM J0 emitted unexpected output (verbatim) ----
   [junit4] Java HotSpot(TM) 64-Bit Server VM warning: Option UseConcMarkSweepGC was deprecated in version 9.0 and will likely be removed in a future release.
   [junit4] <<< JVM J0: EOF ----

   [junit4] JVM J1: stderr was not empty, see: C:\Users\jenkins\workspace\Lucene-Solr-master-Windows\lucene\build\expressions\test\temp\junit4-J1-20170814_022223_5996136700157280681314.syserr
   [junit4] >>> JVM J1 emitted unexpected output (verbatim) ----
   [junit4] Java HotSpot(TM) 64-Bit Server VM warning: Option UseConcMarkSweepGC was deprecated in version 9.0 and will likely be removed in a future release.
   [junit4] <<< JVM J1: EOF ----

[...truncated 211 lines...]
   [junit4] JVM J0: stderr was not empty, see: C:\Users\jenkins\workspace\Lucene-Solr-master-Windows\lucene\build\facet\test\temp\junit4-J0-20170814_022230_29717093286965753990050.syserr
   [junit4] >>> JVM J0 emitted unexpected output (verbatim) ----
   [junit4] Java HotSpot(TM) 64-Bit Server VM warning: Option UseConcMarkSweepGC was deprecated in version 9.0 and will likely be removed in a future release.
   [junit4] <<< JVM J0: EOF ----

   [junit4] JVM J1: stderr was not empty, see: C:\Users\jenkins\workspace\Lucene-Solr-master-Windows\lucene\build\facet\test\temp\junit4-J1-20170814_022230_297290203677744739657.syserr
   [junit4] >>> JVM J1 emitted unexpected output (verbatim) ----
   [junit4] Java HotSpot(TM) 64-Bit Server VM warning: Option UseConcMarkSweepGC was deprecated in version 9.0 and will likely be removed in a future release.
   [junit4] <<< JVM J1: EOF ----

[...truncated 172 lines...]
   [junit4] JVM J0: stderr was not empty, see: C:\Users\jenkins\workspace\Lucene-Solr-master-Windows\lucene\build\grouping\test\temp\junit4-J0-20170814_022301_3117594398724643346416.syserr
   [junit4] >>> JVM J0 emitted unexpected output (verbatim) ----
   [junit4] Java HotSpot(TM) 64-Bit Server VM warning: Option UseConcMarkSweepGC was deprecated in version 9.0 and will likely be removed in a future release.
   [junit4] <<< JVM J0: EOF ----

[...truncated 3 lines...]
   [junit4] JVM J1: stderr was not empty, see: C:\Users\jenkins\workspace\Lucene-Solr-master-Windows\lucene\build\grouping\test\temp\junit4-J1-20170814_022301_3116600454436495940987.syserr
   [junit4] >>> JVM J1 emitted unexpected output (verbatim) ----
   [junit4] Java HotSpot(TM) 64-Bit Server VM warning: Option UseConcMarkSweepGC was deprecated in version 9.0 and will likely be removed in a future release.
   [junit4] <<< JVM J1: EOF ----

[...truncated 236 lines...]
   [junit4] JVM J1: stderr was not empty, see: C:\Users\jenkins\workspace\Lucene-Solr-master-Windows\lucene\build\highlighter\test\temp\junit4-J1-20170814_022312_833965472068277254675.syserr
   [junit4] >>> JVM J1 emitted unexpected output (verbatim) ----
   [junit4] Java HotSpot(TM) 64-Bit Server VM warning: Option UseConcMarkSweepGC was deprecated in version 9.0 and will likely be removed in a future release.
   [junit4] <<< JVM J1: EOF ----

[...truncated 3 lines...]
   [junit4] JVM J0: stderr was not empty, see: C:\Users\jenkins\workspace\Lucene-Solr-master-Windows\lucene\build\highlighter\test\temp\junit4-J0-20170814_022312_83316132085977129014295.syserr
   [junit4] >>> JVM J0 emitted unexpected output (verbatim) ----
   [junit4] Java HotSpot(TM) 64-Bit Server VM warning: Option UseConcMarkSweepGC was deprecated in version 9.0 and will likely be removed in a future release.
   [junit4] <<< JVM J0: EOF ----

[...truncated 153 lines...]
   [junit4] JVM J1: stderr was not empty, see: C:\Users\jenkins\workspace\Lucene-Solr-master-Windows\lucene\build\join\test\temp\junit4-J1-20170814_022330_184555375787896006566.syserr
   [junit4] >>> JVM J1 emitted unexpected output (verbatim) ----
   [junit4] Java HotSpot(TM) 64-Bit Server VM warning: Option UseConcMarkSweepGC was deprecated in version 9.0 and will likely be removed in a future release.
   [junit4] <<< JVM J1: EOF ----

[...truncated 6 lines...]
   [junit4] JVM J0: stderr was not empty, see: C:\Users\jenkins\workspace\Lucene-Solr-master-Windows\lucene\build\join\test\temp\junit4-J0-20170814_022330_1844230797827254472033.syserr
   [junit4] >>> JVM J0 emitted unexpected output (verbatim) ----
   [junit4] Java HotSpot(TM) 64-Bit Server VM warning: Option UseConcMarkSweepGC was deprecated in version 9.0 and will likely be removed in a future release.
   [junit4] <<< JVM J0: EOF ----

[...truncated 140 lines...]
   [junit4] JVM J0: stderr was not empty, see: C:\Users\jenkins\workspace\Lucene-Solr-master-Windows\lucene\build\memory\test\temp\junit4-J0-20170814_022345_74615937872511350751695.syserr
   [junit4] >>> JVM J0 emitted unexpected output (verbatim) ----
   [junit4] Java HotSpot(TM) 64-Bit Server VM warning: Option UseConcMarkSweepGC was deprecated in version 9.0 and will likely be removed in a future release.
   [junit4] <<< JVM J0: EOF ----

[...truncated 3 lines...]
   [junit4] JVM J1: stderr was not empty, see: C:\Users\jenkins\workspace\Lucene-Solr-master-Windows\lucene\build\memory\test\temp\junit4-J1-20170814_022345_7487023295042035135689.syserr
   [junit4] >>> JVM J1 emitted unexpected output (verbatim) ----
   [junit4] Java HotSpot(TM) 64-Bit Server VM warning: Option UseConcMarkSweepGC was deprecated in version 9.0 and will likely be removed in a future release.
   [junit4] <<< JVM J1: EOF ----

[...truncated 174 lines...]
   [junit4] JVM J0: stderr was not empty, see: C:\Users\jenkins\workspace\Lucene-Solr-master-Windows\lucene\build\misc\test\temp\junit4-J0-20170814_022353_59015870399746791771880.syserr
   [junit4] >>> JVM J0 emitted unexpected output (verbatim) ----
   [junit4] Java HotSpot(TM) 64-Bit Server VM warning: Option UseConcMarkSweepGC was deprecated in version 9.0 and will likely be removed in a future release.
   [junit4] <<< JVM J0: EOF ----

[...truncated 6 lines...]
   [junit4] JVM J1: stderr was not empty, see: C:\Users\jenkins\workspace\Lucene-Solr-master-Windows\lucene\build\misc\test\temp\junit4-J1-20170814_022353_5901641189021943038876.syserr
   [junit4] >>> JVM J1 emitted unexpected output (verbatim) ----
   [junit4] Java HotSpot(TM) 64-Bit Server VM warning: Option UseConcMarkSweepGC was deprecated in version 9.0 and will likely be removed in a future release.
   [junit4] <<< JVM J1: EOF ----

[...truncated 305 lines...]
   [junit4] JVM J1: stderr was not empty, see: C:\Users\jenkins\workspace\Lucene-Solr-master-Windows\lucene\build\queries\test\temp\junit4-J1-20170814_022414_3246864015236729818626.syserr
   [junit4] >>> JVM J1 emitted unexpected output (verbatim) ----
   [junit4] Java HotSpot(TM) 64-Bit Server VM warning: Option UseConcMarkSweepGC was deprecated in version 9.0 and will likely be removed in a future release.
   [junit4] <<< JVM J1: EOF ----

[...truncated 3 lines...]
   [junit4] JVM J0: stderr was not empty, see: C:\Users\jenkins\workspace\Lucene-Solr-master-Windows\lucene\build\queries\test\temp\junit4-J0-20170814_022414_3248499128973686390452.syserr
   [junit4] >>> JVM J0 emitted unexpected output (verbatim) ----
   [junit4] Java HotSpot(TM) 64-Bit Server VM warning: Option UseConcMarkSweepGC was deprecated in version 9.0 and will likely be removed in a future release.
   [junit4] <<< JVM J0: EOF ----

[...truncated 217 lines...]
   [junit4] JVM J0: stderr was not empty, see: C:\Users\jenkins\workspace\Lucene-Solr-master-Windows\lucene\build\queryparser\test\temp\junit4-J0-20170814_022425_9429044765619687306254.syserr
   [junit4] >>> JVM J0 emitted unexpected output (verbatim) ----
   [junit4] Java HotSpot(TM) 64-Bit Server VM warning: Option UseConcMarkSweepGC was deprecated in version 9.0 and will likely be removed in a future release.
   [junit4] <<< JVM J0: EOF ----

[...truncated 3 lines...]
   [junit4] JVM J1: stderr was not empty, see: C:\Users\jenkins\workspace\Lucene-Solr-master-Windows\lucene\build\queryparser\test\temp\junit4-J1-20170814_022425_94218114743996859448273.syserr
   [junit4] >>> JVM J1 emitted unexpected output (verbatim) ----
   [junit4] Java HotSpot(TM) 64-Bit Server VM warning: Option UseConcMarkSweepGC was deprecated in version 9.0 and will likely be removed in a future release.
   [junit4] <<< JVM J1: EOF ----

[...truncated 197 lines...]
   [junit4] JVM J1: stderr was not empty, see: C:\Users\jenkins\workspace\Lucene-Solr-master-Windows\lucene\build\replicator\test\temp\junit4-J1-20170814_022436_6488459410867713866906.syserr
   [junit4] >>> JVM J1 emitted unexpected output (verbatim) ----
   [junit4] Java HotSpot(TM) 64-Bit Server VM warning: Option UseConcMarkSweepGC was deprecated in version 9.0 and will likely be removed in a future release.
   [junit4] <<< JVM J1: EOF ----

[...truncated 6 lines...]
   [junit4] JVM J0: stderr was not empty, see: C:\Users\jenkins\workspace\Lucene-Solr-master-Windows\lucene\build\replicator\test\temp\junit4-J0-20170814_022436_6483295859987720354909.syserr
   [junit4] >>> JVM J0 emitted unexpected output (verbatim) ----
   [junit4] Java HotSpot(TM) 64-Bit Server VM warning: Option UseConcMarkSweepGC was deprecated in version 9.0 and will likely be removed in a future release.
   [junit4] <<< JVM J0: EOF ----

[...truncated 198 lines...]
   [junit4] JVM J0: stderr was not empty, see: C:\Users\jenkins\workspace\Lucene-Solr-master-Windows\lucene\build\sandbox\test\temp\junit4-J0-20170814_022456_5216003652067953715230.syserr
   [junit4] >>> JVM J0 emitted unexpected output (verbatim) ----
   [junit4] Java HotSpot(TM) 64-Bit Server VM warning: Option UseConcMarkSweepGC was deprecated in version 9.0 and will likely be removed in a future release.
   [junit4] <<< JVM J0: EOF ----

[...truncated 7 lines...]
   [junit4] JVM J1: stderr was not empty, see: C:\Users\jenkins\workspace\Lucene-Solr-master-Windows\lucene\build\sandbox\test\temp\junit4-J1-20170814_022456_5219658299962697221791.syserr
   [junit4] >>> JVM J1 emitted unexpected output (verbatim) ----
   [junit4] Java HotSpot(TM) 64-Bit Server VM warning: Option UseConcMarkSweepGC was deprecated in version 9.0 and will likely be removed in a future release.
   [junit4] <<< JVM J1: EOF ----

[...truncated 211 lines...]
   [junit4] JVM J1: stderr was not empty, see: C:\Users\jenkins\workspace\Lucene-Solr-master-Windows\lucene\build\spatial-extras\test\temp\junit4-J1-20170814_022524_3079392807097566434981.syserr
   [junit4] >>> JVM J1 emitted unexpected output (verbatim) ----
   [junit4] Java HotSpot(TM) 64-Bit Server VM warning: Option UseConcMarkSweepGC was deprecated in version 9.0 and will likely be removed in a future release.
   [junit4] <<< JVM J1: EOF ----

   [junit4] JVM J0: stderr was not empty, see: C:\Users\jenkins\workspace\Lucene-Solr-master-Windows\lucene\build\spatial-extras\test\temp\junit4-J0-20170814_022524_30711399252397215569943.syserr
   [junit4] >>> JVM J0 emitted unexpected output (verbatim) ----
   [junit4] Java HotSpot(TM) 64-Bit Server VM warning: Option UseConcMarkSweepGC was deprecated in version 9.0 and will likely be removed in a future release.
   [junit4] <<< JVM J0: EOF ----

[...truncated 172 lines...]
   [junit4] JVM J1: stderr was not empty, see: C:\Users\jenkins\workspace\Lucene-Solr-master-Windows\lucene\build\spatial3d\test\temp\junit4-J1-20170814_022539_5353575686002710336793.syserr
   [junit4] >>> JVM J1 emitted unexpected output (verbatim) ----
   [junit4] Java HotSpot(TM) 64-Bit Server VM warning: Option UseConcMarkSweepGC was deprecated in version 9.0 and will likely be removed in a future release.
   [junit4] <<< JVM J1: EOF ----

[...truncated 5 lines...]
   [junit4] JVM J0: stderr was not empty, see: C:\Users\jenkins\workspace\Lucene-Solr-master-Windows\lucene\build\spatial3d\test\temp\junit4-J0-20170814_022539_53513804524839260083442.syserr
   [junit4] >>> JVM J0 emitted unexpected output (verbatim) ----
   [junit4] Java HotSpot(TM) 64-Bit Server VM warning: Option UseConcMarkSweepGC was deprecated in version 9.0 and will likely be removed in a future release.
   [junit4] <<< JVM J0: EOF ----

[...truncated 139 lines...]
   [junit4] JVM J0: stderr was not empty, see: C:\Users\jenkins\workspace\Lucene-Solr-master-Windows\lucene\build\spatial\test\temp\junit4-J0-20170814_022559_01415132119324842755779.syserr
   [junit4] >>> JVM J0 emitted unexpected output (verbatim) ----
   [junit4] Java HotSpot(TM) 64-Bit Server VM warning: Option UseConcMarkSweepGC was deprecated in version 9.0 and will likely be removed in a future release.
   [junit4] <<< JVM J0: EOF ----

[...truncated 237 lines...]
   [junit4] JVM J0: stderr was not empty, see: C:\Users\jenkins\workspace\Lucene-Solr-master-Windows\lucene\build\suggest\test\temp\junit4-J0-20170814_022602_8746106610764691218550.syserr
   [junit4] >>> JVM J0 emitted unexpected output (verbatim) ----
   [junit4] Java HotSpot(TM) 64-Bit Server VM warning: Option UseConcMarkSweepGC was deprecated in version 9.0 and will likely be removed in a future release.
   [junit4] <<< JVM J0: EOF ----

[...truncated 3 lines...]
   [junit4] JVM J1: stderr was not empty, see: C:\Users\jenkins\workspace\Lucene-Solr-master-Windows\lucene\build\suggest\test\temp\junit4-J1-20170814_022602_87410363812398841457814.syserr
   [junit4] >>> JVM J1 emitted unexpected output (verbatim) ----
   [junit4] Java HotSpot(TM) 64-Bit Server VM warning: Option UseConcMarkSweepGC was deprecated in version 9.0 and will likely be removed in a future release.
   [junit4] <<< JVM J1: EOF ----

[...truncated 3175 lines...]
   [junit4] Suite: org.apache.solr.cloud.TestAuthenticationFramework
   [junit4]   2> 2246243 INFO  (SUITE-TestAuthenticationFramework-seed#[6E0B4B59FBAA5993]-worker) [    ] o.a.s.SolrTestCaseJ4 SecureRandom sanity checks: test.solr.allowed.securerandom=null & java.security.egd=file:/dev/./urandom
   [junit4]   2> Creating dataDir: C:\Users\jenkins\workspace\Lucene-Solr-master-Windows\solr\build\solr-core\test\J0\temp\solr.cloud.TestAuthenticationFramework_6E0B4B59FBAA5993-001\init-core-data-001
   [junit4]   2> 2246249 INFO  (SUITE-TestAuthenticationFramework-seed#[6E0B4B59FBAA5993]-worker) [    ] o.a.s.SolrTestCaseJ4 Using PointFields (NUMERIC_POINTS_SYSPROP=true) w/NUMERIC_DOCVALUES_SYSPROP=true
   [junit4]   2> 2246251 INFO  (SUITE-TestAuthenticationFramework-seed#[6E0B4B59FBAA5993]-worker) [    ] o.a.s.SolrTestCaseJ4 Randomized ssl (false) and clientAuth (false) via: @org.apache.solr.util.RandomizeSSL(reason="", value=0.0/0.0, ssl=0.0/0.0, clientAuth=0.0/0.0)
   [junit4]   2> 2246270 INFO  (TEST-TestAuthenticationFramework.testBasics-seed#[6E0B4B59FBAA5993]) [    ] o.a.s.c.MiniSolrCloudCluster Starting cluster of 2 servers in C:\Users\jenkins\workspace\Lucene-Solr-master-Windows\solr\build\solr-core\test\J0\temp\solr.cloud.TestAuthenticationFramework_6E0B4B59FBAA5993-001\tempDir-001
   [junit4]   2> 2246271 INFO  (TEST-TestAuthenticationFramework.testBasics-seed#[6E0B4B59FBAA5993]) [    ] o.a.s.c.ZkTestServer STARTING ZK TEST SERVER
   [junit4]   2> 2246271 INFO  (Thread-3676) [    ] o.a.s.c.ZkTestServer client port:0.0.0.0/0.0.0.0:0
   [junit4]   2> 2246271 INFO  (Thread-3676) [    ] o.a.s.c.ZkTestServer Starting server
   [junit4]   2> 2246289 ERROR (Thread-3676) [    ] o.a.z.s.ZooKeeperServer ZKShutdownHandler is not registered, so ZooKeeper server won't take any action on ERROR or SHUTDOWN server state changes
   [junit4]   2> 2246374 INFO  (TEST-TestAuthenticationFramework.testBasics-seed#[6E0B4B59FBAA5993]) [    ] o.a.s.c.ZkTestServer start zk server on port:60858
   [junit4]   2> 2246537 INFO  (jetty-launcher-3062-thread-1) [    ] o.e.j.s.Server jetty-9.3.14.v20161028
   [junit4]   2> 2246537 INFO  (jetty-launcher-3062-thread-1) [    ] o.e.j.s.h.ContextHandler Started o.e.j.s.ServletContextHandler@53edc915{/solr,null,AVAILABLE}
   [junit4]   2> 2246537 INFO  (jetty-launcher-3062-thread-2) [    ] o.e.j.s.Server jetty-9.3.14.v20161028
   [junit4]   2> 2246537 INFO  (jetty-launcher-3062-thread-2) [    ] o.e.j.s.h.ContextHandler Started o.e.j.s.ServletContextHandler@725e9749{/solr,null,AVAILABLE}
   [junit4]   2> 2246537 INFO  (jetty-launcher-3062-thread-2) [    ] o.e.j.s.AbstractConnector Started ServerConnector@6d335019{HTTP/1.1,[http/1.1]}{127.0.0.1:60863}
   [junit4]   2> 2246537 INFO  (jetty-launcher-3062-thread-2) [    ] o.e.j.s.Server Started @2248390ms
   [junit4]   2> 2246537 INFO  (jetty-launcher-3062-thread-2) [    ] o.a.s.c.s.e.JettySolrRunner Jetty properties: {hostContext=/solr, hostPort=60863}
   [junit4]   2> 2246537 ERROR (jetty-launcher-3062-thread-2) [    ] o.a.s.s.StartupLoggingUtils Missing Java Option solr.log.dir. Logging may be missing or incomplete.
   [junit4]   2> 2246537 INFO  (jetty-launcher-3062-thread-2) [    ] o.a.s.s.SolrDispatchFilter  ___      _       Welcome to Apache Solr? version 8.0.0
   [junit4]   2> 2246537 INFO  (jetty-launcher-3062-thread-2) [    ] o.a.s.s.SolrDispatchFilter / __| ___| |_ _   Starting in cloud mode on port null
   [junit4]   2> 2246537 INFO  (jetty-launcher-3062-thread-2) [    ] o.a.s.s.SolrDispatchFilter \__ \/ _ \ | '_|  Install dir: null, Default config dir: null
   [junit4]   2> 2246537 INFO  (jetty-launcher-3062-thread-2) [    ] o.a.s.s.SolrDispatchFilter |___/\___/_|_|    Start time: 2017-08-14T03:04:55.441926500Z
   [junit4]   2> 2246537 INFO  (jetty-launcher-3062-thread-1) [    ] o.e.j.s.AbstractConnector Started ServerConnector@6b0c6beb{HTTP/1.1,[http/1.1]}{127.0.0.1:60862}
   [junit4]   2> 2246537 INFO  (jetty-launcher-3062-thread-1) [    ] o.e.j.s.Server Started @2248393ms
   [junit4]   2> 2246537 INFO  (jetty-launcher-3062-thread-1) [    ] o.a.s.c.s.e.JettySolrRunner Jetty properties: {hostContext=/solr, hostPort=60862}
   [junit4]   2> 2246537 ERROR (jetty-launcher-3062-thread-1) [    ] o.a.s.s.StartupLoggingUtils Missing Java Option solr.log.dir. Logging may be missing or incomplete.
   [junit4]   2> 2246649 INFO  (jetty-launcher-3062-thread-1) [    ] o.a.s.s.SolrDispatchFilter  ___      _       Welcome to Apache Solr? version 8.0.0
   [junit4]   2> 2246649 INFO  (jetty-launcher-3062-thread-1) [    ] o.a.s.s.SolrDispatchFilter / __| ___| |_ _   Starting in cloud mode on port null
   [junit4]   2> 2246649 INFO  (jetty-launcher-3062-thread-1) [    ] o.a.s.s.SolrDispatchFilter \__ \/ _ \ | '_|  Install dir: null, Default config dir: null
   [junit4]   2> 2246649 INFO  (jetty-launcher-3062-thread-1) [    ] o.a.s.s.SolrDispatchFilter |___/\___/_|_|    Start time: 2017-08-14T03:04:55.553481400Z
   [junit4]   2> 2246663 INFO  (jetty-launcher-3062-thread-2) [    ] o.a.s.s.SolrDispatchFilter solr.xml found in ZooKeeper. Loading...
   [junit4]   2> 2246663 INFO  (jetty-launcher-3062-thread-1) [    ] o.a.s.s.SolrDispatchFilter solr.xml found in ZooKeeper. Loading...
   [junit4]   2> 2246690 WARN  (NIOServerCxn.Factory:0.0.0.0/0.0.0.0:0) [    ] o.a.z.s.NIOServerCnxn caught end of stream exception
   [junit4]   2> EndOfStreamException: Unable to read additional data from client sessionid 0x15ddeb38c990001, likely client has closed socket
   [junit4]   2> 	at org.apache.zookeeper.server.NIOServerCnxn.doIO(NIOServerCnxn.java:239)
   [junit4]   2> 	at org.apache.zookeeper.server.NIOServerCnxnFactory.run(NIOServerCnxnFactory.java:203)
   [junit4]   2> 	at java.base/java.lang.Thread.run(Thread.java:844)
   [junit4]   2> 2246692 INFO  (jetty-launcher-3062-thread-2) [    ] o.a.s.c.ZkContainer Zookeeper client=127.0.0.1:60858/solr
   [junit4]   2> 2246692 INFO  (jetty-launcher-3062-thread-1) [    ] o.a.s.c.ZkContainer Zookeeper client=127.0.0.1:60858/solr
   [junit4]   2> 2248196 INFO  (jetty-launcher-3062-thread-2) [    ] o.a.s.c.Overseer Overseer (id=null) closing
   [junit4]   2> 2248196 INFO  (jetty-launcher-3062-thread-2) [    ] o.a.s.c.OverseerElectionContext I am going to be the leader 127.0.0.1:60863_solr
   [junit4]   2> 2248196 INFO  (jetty-launcher-3062-thread-2) [    ] o.a.s.c.Overseer Overseer (id=98479629611368454-127.0.0.1:60863_solr-n_0000000000) starting
   [junit4]   2> 2248280 INFO  (jetty-launcher-3062-thread-2) [    ] o.a.s.c.ZkController Register node as live in ZooKeeper:/live_nodes/127.0.0.1:60863_solr
   [junit4]   2> 2248342 INFO  (jetty-launcher-3062-thread-2) [    ] o.a.s.c.CoreContainer Initializing authentication plugin: org.apache.solr.cloud.TestAuthenticationFramework$MockAuthenticationPlugin
   [junit4]   2> 2248369 INFO  (zkCallback-3074-thread-1) [    ] o.a.s.c.c.ZkStateReader Updated live nodes from ZooKeeper... (0) -> (1)
   [junit4]   2> 2248525 INFO  (jetty-launcher-3062-thread-1) [    ] o.a.s.c.c.ZkStateReader Updated live nodes from ZooKeeper... (0) -> (1)
   [junit4]   2> 2248542 INFO  (jetty-launcher-3062-thread-1) [    ] o.a.s.c.Overseer Overseer (id=null) closing
   [junit4]   2> 2248554 INFO  (jetty-launcher-3062-thread-1) [    ] o.a.s.c.ZkController Register node as live in ZooKeeper:/live_nodes/127.0.0.1:60862_solr
   [junit4]   2> 2248556 INFO  (zkCallback-3074-thread-1) [    ] o.a.s.c.c.ZkStateReader Updated live nodes from ZooKeeper... (1) -> (2)
   [junit4]   2> 2248604 INFO  (zkCallback-3073-thread-1) [    ] o.a.s.c.c.ZkStateReader Updated live nodes from ZooKeeper... (1) -> (2)
   [junit4]   2> 2248640 INFO  (jetty-launcher-3062-thread-2) [    ] o.a.s.m.r.SolrJmxReporter JMX monitoring for 'solr_60863.solr.node' (registry 'solr.node') enabled at server: com.sun.jmx.mbeanserver.JmxMBeanServer@10160e09
   [junit4]   2> 2248640 INFO  (jetty-launcher-3062-thread-2) [    ] o.a.s.m.r.SolrJmxReporter JMX monitoring for 'solr_60863.solr.jvm' (registry 'solr.jvm') enabled at server: com.sun.jmx.mbeanserver.JmxMBeanServer@10160e09
   [junit4]   2> 2248640 INFO  (jetty-launcher-3062-thread-2) [    ] o.a.s.m.r.SolrJmxReporter JMX monitoring for 'solr_60863.solr.jetty' (registry 'solr.jetty') enabled at server: com.sun.jmx.mbeanserver.JmxMBeanServer@10160e09
   [junit4]   2> 2248669 INFO  (jetty-launcher-3062-thread-2) [    ] o.a.s.c.CorePropertiesLocator Found 0 core definitions underneath C:\Users\jenkins\workspace\Lucene-Solr-master-Windows\solr\build\solr-core\test\J0\temp\solr.cloud.TestAuthenticationFramework_6E0B4B59FBAA5993-001\tempDir-001\node2\.
   [junit4]   2> 2248748 INFO  (jetty-launcher-3062-thread-1) [    ] o.a.s.c.CoreContainer Initializing authentication plugin: org.apache.solr.cloud.TestAuthenticationFramework$MockAuthenticationPlugin
   [junit4]   2> 2248886 INFO  (jetty-launcher-3062-thread-1) [    ] o.a.s.m.r.SolrJmxReporter JMX monitoring for 'solr_60862.solr.node' (registry 'solr.node') enabled at server: com.sun.jmx.mbeanserver.JmxMBeanServer@10160e09
   [junit4]   2> 2248890 INFO  (jetty-launcher-3062-thread-1) [    ] o.a.s.m.r.SolrJmxReporter JMX monitoring for 'solr_60862.solr.jvm' (registry 'solr.jvm') enabled at server: com.sun.jmx.mbeanserver.JmxMBeanServer@10160e09
   [junit4]   2> 2248890 INFO  (jetty-launcher-3062-thread-1) [    ] o.a.s.m.r.SolrJmxReporter JMX monitoring for 'solr_60862.solr.jetty' (registry 'solr.jetty') enabled at server: com.sun.jmx.mbeanserver.JmxMBeanServer@10160e09
   [junit4]   2> 2248891 INFO  (jetty-launcher-3062-thread-1) [    ] o.a.s.c.CorePropertiesLocator Found 0 core definitions underneath C:\Users\jenkins\workspace\Lucene-Solr-master-Windows\solr\build\solr-core\test\J0\temp\solr.cloud.TestAuthenticationFramework_6E0B4B59FBAA5993-001\tempDir-001\node1\.
   [junit4]   2> 2248978 INFO  (TEST-TestAuthenticationFramework.testBasics-seed#[6E0B4B59FBAA5993]) [    ] o.a.s.c.c.ZkStateReader Updated live nodes from ZooKeeper... (0) -> (2)
   [junit4]   2> 2248979 INFO  (TEST-TestAuthenticationFramework.testBasics-seed#[6E0B4B59FBAA5993]) [    ] o.a.s.c.s.i.ZkClientClusterStateProvider Cluster at 127.0.0.1:60858/solr ready
   [junit4]   2> 2248987 INFO  (TEST-TestAuthenticationFramework.testBasics-seed#[6E0B4B59FBAA5993]) [    ] o.a.s.SolrTestCaseJ4 ###Starting testBasics
   [junit4]   2> 2249005 INFO  (qtp132410550-20676) [    ] o.a.s.h.a.CollectionsHandler Invoked Collection Action :create with params async=279077d4-ce89-4730-9d99-b7ed3be8fd2e&replicationFactor=2&collection.configName=solrCloudCollectionConfig&maxShardsPerNode=2&name=testcollection&nrtReplicas=2&action=CREATE&numShards=2&wt=javabin&version=2 and sendToOCPQueue=true
   [junit4]   2> 2249025 INFO  (qtp132410550-20676) [    ] o.a.s.s.HttpSolrCall [admin] webapp=null path=/admin/collections params={async=279077d4-ce89-4730-9d99-b7ed3be8fd2e&replicationFactor=2&collection.configName=solrCloudCollectionConfig&maxShardsPerNode=2&name=testcollection&nrtReplicas=2&action=CREATE&numShards=2&wt=javabin&version=2} status=0 QTime=20
   [junit4]   2> 2249026 INFO  (qtp132410550-20676) [    ] o.a.s.h.a.CollectionsHandler Invoked Collection Action :requeststatus with params requestid=279077d4-ce89-4730-9d99-b7ed3be8fd2e&action=REQUESTSTATUS&wt=javabin&version=2 and sendToOCPQueue=true
   [junit4]   2> 2249029 INFO  (qtp132410550-20676) [    ] o.a.s.s.HttpSolrCall [admin] webapp=null path=/admin/collections params={requestid=279077d4-ce89-4730-9d99-b7ed3be8fd2e&action=REQUESTSTATUS&wt=javabin&version=2} status=0 QTime=2
   [junit4]   2> 2249041 INFO  (OverseerThreadFactory-6585-thread-1) [    ] o.a.s.c.CreateCollectionCmd Create collection testcollection
   [junit4]   2> 2249170 INFO  (OverseerStateUpdate-98479629611368454-127.0.0.1:60863_solr-n_0000000000) [    ] o.a.s.c.o.SliceMutator createReplica() {
   [junit4]   2>   "operation":"ADDREPLICA",
   [junit4]   2>   "collection":"testcollection",
   [junit4]   2>   "shard":"shard1",
   [junit4]   2>   "core":"testcollection_shard1_replica_n1",
   [junit4]   2>   "state":"down",
   [junit4]   2>   "base_url":"http://127.0.0.1:60863/solr",
   [junit4]   2>   "type":"NRT"} 
   [junit4]   2> 2249197 INFO  (OverseerStateUpdate-98479629611368454-127.0.0.1:60863_solr-n_0000000000) [    ] o.a.s.c.o.SliceMutator createReplica() {
   [junit4]   2>   "operation":"ADDREPLICA",
   [junit4]   2>   "collection":"testcollection",
   [junit4]   2>   "shard":"shard1",
   [junit4]   2>   "core":"testcollection_shard1_replica_n2",
   [junit4]   2>   "state":"down",
   [junit4]   2>   "base_url":"http://127.0.0.1:60862/solr",
   [junit4]   2>   "type":"NRT"} 
   [junit4]   2> 2249211 INFO  (OverseerStateUpdate-98479629611368454-127.0.0.1:60863_solr-n_0000000000) [    ] o.a.s.c.o.SliceMutator createReplica() {
   [junit4]   2>   "operation":"ADDREPLICA",
   [junit4]   2>   "collection":"testcollection",
   [junit4]   2>   "shard":"shard2",
   [junit4]   2>   "core":"testcollection_shard2_replica_n4",
   [junit4]   2>   "state":"down",
   [junit4]   2>   "base_url":"http://127.0.0.1:60863/solr",
   [junit4]   2>   "type":"NRT"} 
   [junit4]   2> 2249261 INFO  (OverseerStateUpdate-98479629611368454-127.0.0.1:60863_solr-n_0000000000) [    ] o.a.s.c.o.SliceMutator createReplica() {
   [junit4]   2>   "operation":"ADDREPLICA",
   [junit4]   2>   "collection":"testcollection",
   [junit4]   2>   "shard":"shard2",
   [junit4]   2>   "core":"testcollection_shard2_replica_n6",
   [junit4]   2>   "state":"down",
   [junit4]   2>   "base_url":"http://127.0.0.1:60862/solr",
   [junit4]   2>   "type":"NRT"} 
   [junit4]   2> 2249445 INFO  (qtp1887918083-20671) [    ] o.a.s.s.HttpSolrCall [admin] webapp=null path=/admin/cores params={qt=/admin/cores&collection.configName=solrCloudCollectionConfig&newCollection=true&collection=testcollection&version=2&replicaType=NRT&async=279077d4-ce89-4730-9d99-b7ed3be8fd2e394918883739558&coreNodeName=core_node5&name=testcollection_shard1_replica_n2&action=CREATE&numShards=2&shard=shard1&wt=javabin} status=0 QTime=0
   [junit4]   2> 2249451 INFO  (parallelCoreAdminExecutor-6588-thread-1) [    ] o.a.s.h.a.CoreAdminOperation core create command qt=/admin/cores&collection.configName=solrCloudCollectionConfig&newCollection=true&collection=testcollection&version=2&replicaType=NRT&async=279077d4-ce89-4730-9d99-b7ed3be8fd2e394918883739558&coreNodeName=core_node5&name=testcollection_shard1_replica_n2&action=CREATE&numShards=2&shard=shard1&wt=javabin
   [junit4]   2> 2249451 INFO  (parallelCoreAdminExecutor-6588-thread-1) [    ] o.a.s.c.TransientSolrCoreCacheDefault Allocating transient cache for 2147483647 transient cores
   [junit4]   2> 2249452 INFO  (qtp132410550-20675) [    ] o.a.s.s.HttpSolrCall [admin] webapp=null path=/admin/cores params={qt=/admin/cores&collection.configName=solrCloudCollectionConfig&newCollection=true&collection=testcollection&version=2&replicaType=NRT&async=279077d4-ce89-4730-9d99-b7ed3be8fd2e394918868528033&coreNodeName=core_node3&name=testcollection_shard1_replica_n1&action=CREATE&numShards=2&shard=shard1&wt=javabin} status=0 QTime=0
   [junit4]   2> 2249452 INFO  (qtp132410550-20675) [    ] o.a.s.s.HttpSolrCall [admin] webapp=null path=/admin/cores params={qt=/admin/cores&collection.configName=solrCloudCollectionConfig&newCollection=true&collection=testcollection&version=2&replicaType=NRT&async=279077d4-ce89-4730-9d99-b7ed3be8fd2e394918895559650&coreNodeName=core_node7&name=testcollection_shard2_replica_n4&action=CREATE&numShards=2&shard=shard2&wt=javabin} status=0 QTime=0
   [junit4]   2> 2249491 INFO  (parallelCoreAdminExecutor-6586-thread-2) [    ] o.a.s.h.a.CoreAdminOperation core create command qt=/admin/cores&collection.configName=solrCloudCollectionConfig&newCollection=true&collection=testcollection&version=2&replicaType=NRT&async=279077d4-ce89-4730-9d99-b7ed3be8fd2e394918895559650&coreNodeName=core_node7&name=testcollection_shard2_replica_n4&action=CREATE&numShards=2&shard=shard2&wt=javabin
   [junit4]   2> 2249491 INFO  (parallelCoreAdminExecutor-6586-thread-2) [    ] o.a.s.c.TransientSolrCoreCacheDefault Allocating transient cache for 2147483647 transient cores
   [junit4]   2> 2249492 INFO  (parallelCoreAdminExecutor-6586-thread-1) [    ] o.a.s.h.a.CoreAdminOperation core create command qt=/admin/cores&collection.configName=solrCloudCollectionConfig&newCollection=true&collection=testcollection&version=2&replicaType=NRT&async=279077d4-ce89-4730-9d99-b7ed3be8fd2e394918868528033&coreNodeName=core_node3&name=testcollection_shard1_replica_n1&action=CREATE&numShards=2&shard=shard1&wt=javabin
   [junit4]   2> 2249497 INFO  (qtp1887918083-20669) [    ] o.a.s.s.HttpSolrCall [admin] webapp=null path=/admin/cores params={qt=/admin/cores&collection.configName=solrCloudCollectionConfig&newCollection=true&collection=testcollection&version=2&replicaType=NRT&async=279077d4-ce89-4730-9d99-b7ed3be8fd2e394918900450958&coreNodeName=core_node8&name=testcollection_shard2_replica_n6&action=CREATE&numShards=2&shard=shard2&wt=javabin} status=0 QTime=0
   [junit4]   2> 2249501 INFO  (qtp132410550-20675) [    ] o.a.s.h.a.CoreAdminOperation Checking request status for : 279077d4-ce89-4730-9d99-b7ed3be8fd2e394918895559650
   [junit4]   2> 2249502 INFO  (qtp132410550-20675) [    ] o.a.s.s.HttpSolrCall [admin] webapp=null path=/admin/cores params={qt=/admin/cores&requestid=279077d4-ce89-4730-9d99-b7ed3be8fd2e394918895559650&action=REQUESTSTATUS&wt=javabin&version=2} status=0 QTime=0
   [junit4]   2> 2249505 INFO  (parallelCoreAdminExecutor-6588-thread-2) [    ] o.a.s.h.a.CoreAdminOperation core create command qt=/admin/cores&collection.configName=solrCloudCollectionConfig&newCollection=true&collection=testcollection&version=2&replicaType=NRT&async=279077d4-ce89-4730-9d99-b7ed3be8fd2e394918900450958&coreNodeName=core_node8&name=testcollection_shard2_replica_n6&action=CREATE&numShards=2&shard=shard2&wt=javabin
   [junit4]   2> 2249667 INFO  (zkCallback-3073-thread-1) [    ] o.a.s.c.c.ZkStateReader A cluster state change: [WatchedEvent state:SyncConnected type:NodeDataChanged path:/collections/testcollection/state.json] for collection [testcollection] has occurred - updating... (live nodes size: [2])
   [junit4]   2> 2249667 INFO  (zkCallback-3074-thread-1) [    ] o.a.s.c.c.ZkStateReader A cluster state change: [WatchedEvent state:SyncConnected type:NodeDataChanged path:/collections/testcollection/state.json] for collection [testcollection] has occurred - updating... (live nodes size: [2])
   [junit4]   2> 2249669 INFO  (zkCallback-3073-thread-2) [    ] o.a.s.c.c.ZkStateReader A cluster state change: [WatchedEvent state:SyncConnected type:NodeDataChanged path:/collections/testcollection/state.json] for collection [testcollection] has occurred - updating... (live nodes size: [2])
   [junit4]   2> 2249669 INFO  (zkCallback-3074-thread-2) [    ] o.a.s.c.c.ZkStateReader A cluster state change: [WatchedEvent state:SyncConnected type:NodeDataChanged path:/collections/testcollection/state.json] for collection [testcollection] has occurred - updating... (live nodes size: [2])
   [junit4]   2> 2250033 INFO  (qtp132410550-20675) [    ] o.a.s.h.a.CollectionsHandler Invoked Collection Action :requeststatus with params requestid=279077d4-ce89-4730-9d99-b7ed3be8fd2e&action=REQUESTSTATUS&wt=javabin&version=2 and sendToOCPQueue=true
   [junit4]   2> 2250034 INFO  (qtp132410550-20675) [    ] o.a.s.s.HttpSolrCall [admin] webapp=null path=/admin/collections params={requestid=279077d4-ce89-4730-9d99-b7ed3be8fd2e&action=REQUESTSTATUS&wt=javabin&version=2} status=0 QTime=1
   [junit4]   2> 2250503 INFO  (qtp132410550-20678) [    ] o.a.s.h.a.CoreAdminOperation Checking request status for : 279077d4-ce89-4730-9d99-b7ed3be8fd2e394918895559650
   [junit4]   2> 2250503 INFO  (qtp132410550-20678) [    ] o.a.s.s.HttpSolrCall [admin] webapp=null path=/admin/cores params={qt=/admin/cores&requestid=279077d4-ce89-4730-9d99-b7ed3be8fd2e394918895559650&action=REQUESTSTATUS&wt=javabin&version=2} status=0 QTime=0
   [junit4]   2> 2250526 INFO  (parallelCoreAdminExecutor-6588-thread-1) [    ] o.a.s.c.SolrConfig Using Lucene MatchVersion: 8.0.0
   [junit4]   2> 2250600 INFO  (parallelCoreAdminExecutor-6586-thread-2) [    ] o.a.s.c.SolrConfig Using Lucene MatchVersion: 8.0.0
   [junit4]   2> 2250605 INFO  (parallelCoreAdminExecutor-6588-thread-1) [    ] o.a.s.s.IndexSchema [testcollection_shard1_replica_n2] Schema name=minimal
   [junit4]   2> 2250605 INFO  (parallelCoreAdminExecutor-6588-thread-1) [    ] o.a.s.s.IndexSchema Loaded schema minimal/1.1 with uniqueid field id
   [junit4]   2> 2250605 INFO  (parallelCoreAdminExecutor-6588-thread-1) [    ] o.a.s.c.CoreContainer Creating SolrCore 'testcollection_shard1_replica_n2' using configuration from collection testcollection, trusted=true
   [junit4]   2> 2250605 INFO  (parallelCoreAdminExecutor-6588-thread-1) [    ] o.a.s.m.r.SolrJmxReporter JMX monitoring for 'solr_60862.solr.core.testcollection.shard1.replica_n2' (registry 'solr.core.testcollection.shard1.replica_n2') enabled at server: com.sun.jmx.mbeanserver.JmxMBeanServer@10160e09
   [junit4]   2> 2250609 INFO  (parallelCoreAdminExecutor-6588-thread-1) [    ] o.a.s.c.SolrCore solr.RecoveryStrategy.Builder
   [junit4]   2> 2250609 INFO  (parallelCoreAdminExecutor-6588-thread-1) [    ] o.a.s.c.SolrCore [[testcollection_shard1_replica_n2] ] Opening new SolrCore at [C:\Users\jenkins\workspace\Lucene-Solr-master-Windows\solr\build\solr-core\test\J0\temp\solr.cloud.TestAuthenticationFramework_6E0B4B59FBAA5993-001\tempDir-001\node1\testcollection_shard1_replica_n2], dataDir=[C:\Users\jenkins\workspace\Lucene-Solr-master-Windows\solr\build\solr-core\test\J0\temp\solr.cloud.TestAuthenticationFramework_6E0B4B59FBAA5993-001\tempDir-001\node1\.\testcollection_shard1_replica_n2\data\]
   [junit4]   2> 2250614 INFO  (parallelCoreAdminExecutor-6586-thread-2) [    ] o.a.s.s.IndexSchema [testcollection_shard2_replica_n4] Schema name=minimal
   [junit4]   2> 2250616 INFO  (parallelCoreAdminExecutor-6586-thread-2) [    ] o.a.s.s.IndexSchema Loaded schema minimal/1.1 with uniqueid field id
   [junit4]   2> 2250616 INFO  (parallelCoreAdminExecutor-6586-thread-2) [    ] o.a.s.c.CoreContainer Creating SolrCore 'testcollection_shard2_replica_n4' using configuration from collection testcollection, trusted=true
   [junit4]   2> 2250625 INFO  (parallelCoreAdminExecutor-6586-thread-2) [    ] o.a.s.m.r.SolrJmxReporter JMX monitoring for 'solr_60863.solr.core.testcollection.shard2.replica_n4' (registry 'solr.core.testcollection.shard2.replica_n4') enabled at server: com.sun.jmx.mbeanserver.JmxMBeanServer@10160e09
   [junit4]   2> 2250625 INFO  (parallelCoreAdminExecutor-6586-thread-2) [    ] o.a.s.c.SolrCore solr.RecoveryStrategy.Builder
   [junit4]   2> 2250626 INFO  (parallelCoreAdminExecutor-6586-thread-2) [    ] o.a.s.c.SolrCore [[testcollection_shard2_replica_n4] ] Opening new SolrCore at [C:\Users\jenkins\workspace\Lucene-Solr-master-Windows\solr\build\solr-core\test\J0\temp\solr.cloud.TestAuthenticationFramework_6E0B4B59FBAA5993-001\tempDir-001\node2\testcollection_shard2_replica_n4], dataDir=[C:\Users\jenkins\workspace\Lucene-Solr-master-Windows\solr\build\solr-core\test\J0\temp\solr.cloud.TestAuthenticationFramework_6E0B4B59FBAA5993-001\tempDir-001\node2\.\testcollection_shard2_replica_n4\data\]
   [junit4]   2> 2250629 INFO  (parallelCoreAdminExecutor-6586-thread-1) [    ] o.a.s.c.SolrConfig Using Lucene MatchVersion: 8.0.0
   [junit4]   2> 2250635 INFO  (parallelCoreAdminExecutor-6588-thread-2) [    ] o.a.s.c.SolrConfig Using Lucene MatchVersion: 8.0.0
   [junit4]   2> 2250667 INFO  (parallelCoreAdminExecutor-6586-thread-1) [    ] o.a.s.s.IndexSchema [testcollection_shard1_replica_n1] Schema name=minimal
   [junit4]   2> 2250670 INFO  (parallelCoreAdminExecutor-6586-thread-1) [    ] o.a.s.s.IndexSchema Loaded schema minimal/1.1 with uniqueid field id
   [junit4]   2> 2250670 INFO  (parallelCoreAdminExecutor-6586-thread-1) [    ] o.a.s.c.CoreContainer Creating SolrCore 'testcollection_shard1_replica_n1' using configuration from collection testcollection, trusted=true
   [junit4]   2> 2250670 INFO  (parallelCoreAdminExecutor-6586-thread-1) [    ] o.a.s.m.r.SolrJmxReporter JMX monitoring for 'solr_60863.solr.core.testcollection.shard1.replica_n1' (registry 'solr.core.testcollection.shard1.replica_n1') enabled at server: com.sun.jmx.mbeanserver.JmxMBeanServer@10160e09
   [junit4]   2> 2250671 INFO  (parallelCoreAdminExecutor-6586-thread-1) [    ] o.a.s.c.SolrCore solr.RecoveryStrategy.Builder
   [junit4]   2> 2250671 INFO  (parallelCoreAdminExecutor-6586-thread-1) [    ] o.a.s.c.SolrCore [[testcollection_shard1_replica_n1] ] Opening new SolrCore at [C:\Users\jenkins\workspace\Lucene-Solr-master-Windows\solr\build\solr-core\test\J0\temp\solr.cloud.TestAuthenticationFramework_6E0B4B59FBAA5993-001\tempDir-001\node2\testcollection_shard1_replica_n1], dataDir=[C:\Users\jenkins\workspace\Lucene-Solr-master-Windows\solr\build\solr-core\test\J0\temp\solr.cloud.TestAuthenticationFramework_6E0B4B59FBAA5993-001\tempDir-001\node2\.\testcollection_shard1_replica_n1\data\]
   [junit4]   2> 2250679 INFO  (parallelCoreAdminExecutor-6588-thread-2) [    ] o.a.s.s.IndexSchema [testcollection_shard2_replica_n6] Schema name=minimal
   [junit4]   2> 2250682 INFO  (parallelCoreAdminExecutor-6588-thread-2) [    ] o.a.s.s.IndexSchema Loaded schema minimal/1.1 with uniqueid field id
   [junit4]   2> 2250682 INFO  (parallelCoreAdminExecutor-6588-thread-2) [    ] o.a.s.c.CoreContainer Creating SolrCore 'testcollection_shard2_replica_n6' using configuration from collection testcollection, trusted=true
   [junit4]   2> 2250682 INFO  (parallelCoreAdminExecutor-6588-thread-2) [    ] o.a.s.m.r.SolrJmxReporter JMX monitoring for 'solr_60862.solr.core.testcollection.shard2.replica_n6' (registry 'solr.core.testcollection.shard2.replica_n6') enabled at server: com.sun.jmx.mbeanserver.JmxMBeanServer@10160e09
   [junit4]   2> 2250682 INFO  (parallelCoreAdminExecutor-6588-thread-2) [    ] o.a.s.c.SolrCore solr.RecoveryStrategy.Builder
   [junit4]   2> 2250683 INFO  (parallelCoreAdminExecutor-6588-thread-2) [    ] o.a.s.c.SolrCore [[testcollection_shard2_replica_n6] ] Opening new SolrCore at [C:\Users\jenkins\workspace\Lucene-Solr-master-Windows\solr\build\solr-core\test\J0\temp\solr.cloud.TestAuthenticationFramework_6E0B4B59FBAA5993-001\tempDir-001\node1\testcollection_shard2_replica_n6], dataDir=[C:\Users\jenkins\workspace\Lucene-Solr-master-Windows\solr\build\solr-core\test\J0\temp\solr.cloud.TestAuthenticationFramework_6E0B4B59FBAA5993-001\tempDir-001\node1\.\testcollection_shard2_replica_n6\data\]
   [junit4]   2> 2250760 INFO  (parallelCoreAdminExecutor-6588-thread-1) [    ] o.a.s.u.UpdateHandler Using UpdateLog implementation: org.apache.solr.update.UpdateLog
   [junit4]   2> 2250760 INFO  (parallelCoreAdminExecutor-6588-thread-1) [    ] o.a.s.u.UpdateLog Initializing UpdateLog: dataDir=null defaultSyncLevel=FLUSH numRecordsToKeep=100 maxNumLogsToKeep=10 numVersionBuckets=65536
   [junit4]   2> 2250763 INFO  (parallelCoreAdminExecutor-6588-thread-1) [    ] o.a.s.u.CommitTracker Hard AutoCommit: disabled
   [junit4]   2> 2250763 INFO  (parallelCoreAdminExecutor-6588-thread-1) [    ] o.a.s.u.CommitTracker Soft AutoCommit: disabled
   [junit4]   2> 2250852 INFO  (parallelCoreAdminExecutor-6588-thread-1) [    ] o.a.s.s.SolrIndexSearcher Opening [Searcher@4b323619[testcollection_shard1_replica_n2] main]
   [junit4]   2> 2250878 INFO  (parallelCoreAdminExecutor-6586-thread-1) [    ] o.a.s.u.UpdateHandler Using UpdateLog implementation: org.apache.solr.update.UpdateLog
   [junit4]   2> 2250878 INFO  (parallelCoreAdminExecutor-6586-thread-1) [    ] o.a.s.u.UpdateLog Initializing UpdateLog: dataDir=null defaultSyncLevel=FLUSH numRecordsToKeep=100 maxNumLogsToKeep=10 numVersionBuckets=65536
   [junit4]   2> 2250884 INFO  (parallelCoreAdminExecutor-6586-thread-1) [    ] o.a.s.u.CommitTracker Hard AutoCommit: disabled
   [junit4]   2> 2250884 INFO  (parallelCoreAdminExecutor-6586-thread-1) [    ] o.a.s.u.CommitTracker Soft AutoCommit: disabled
   [junit4]   2> 2250889 INFO  (parallelCoreAdminExecutor-6588-thread-2) [    ] o.a.s.u.UpdateHandler Using UpdateLog implementation: org.apache.solr.update.UpdateLog
   [junit4]   2> 2250889 INFO  (parallelCoreAdminExecutor-6588-thread-2) [    ] o.a.s.u.UpdateLog Initializing UpdateLog: dataDir=null defaultSyncLevel=FLUSH numRecordsToKeep=100 maxNumLogsToKeep=10 numVersionBuckets=65536
   [junit4]   2> 2250891 INFO  (parallelCoreAdminExecutor-6588-thread-2) [    ] o.a.s.u.CommitTracker Hard AutoCommit: disabled
   [junit4]   2> 2250891 INFO  (parallelCoreAdminExecutor-6588-thread-2) [    ] o.a.s.u.CommitTracker Soft AutoCommit: disabled
   [junit4]   2> 2250897 INFO  (parallelCoreAdminExecutor-6588-thread-1) [    ] o.a.s.r.ManagedResourceStorage Configured ZooKeeperStorageIO with znodeBase: /configs/solrCloudCollectionConfig
   [junit4]   2> 2250898 INFO  (parallelCoreAdminExecutor-6588-thread-1) [    ] o.a.s.r.ManagedResourceStorage Loaded null at path _rest_managed.json using ZooKeeperStorageIO:path=/configs/solrCloudCollectionConfig
   [junit4]   2> 2250899 INFO  (parallelCoreAdminExecutor-6588-thread-1) [    ] o.a.s.h.ReplicationHandler Commits will be reserved for  10000
   [junit4]   2> 2250904 INFO  (parallelCoreAdminExecutor-6588-thread-1) [    ] o.a.s.u.UpdateLog Could not find max version in index or recent updates, using new clock 1575674078620024832
   [junit4]   2> 2250906 INFO  (searcherExecutor-6590-thread-1) [    ] o.a.s.c.SolrCore [testcollection_shard1_replica_n2] Registered new searcher Searcher@4b323619[testcollection_shard1_replica_n2] main{ExitableDirectoryReader(UninvertingDirectoryReader())}
   [junit4]   2> 2250912 INFO  (parallelCoreAdminExecutor-6586-thread-2) [    ] o.a.s.u.UpdateHandler Using UpdateLog implementation: org.apache.solr.update.UpdateLog
   [junit4]   2> 2250912 INFO  (parallelCoreAdminExecutor-6586-thread-2) [    ] o.a.s.u.UpdateLog Initializing UpdateLog: dataDir=null defaultSyncLevel=FLUSH numRecordsToKeep=100 maxNumLogsToKeep=10 numVersionBuckets=65536
   [junit4]   2> 2250916 INFO  (parallelCoreAdminExecutor-6586-thread-2) [    ] o.a.s.u.CommitTracker Hard AutoCommit: disabled
   [junit4]   2> 2250916 INFO  (parallelCoreAdminExecutor-6586-thread-2) [    ] o.a.s.u.CommitTracker Soft AutoCommit: disabled
   [junit4]   2> 2250917 INFO  (parallelCoreAdminExecutor-6588-thread-1) [    ] o.a.s.c.ShardLeaderElectionContext Waiting until we see more replicas up for shard shard1: total=2 found=1 timeoutin=9999ms
   [junit4]   2> 2250917 INFO  (parallelCoreAdminExecutor-6586-thread-1) [    ] o.a.s.s.SolrIndexSearcher Opening [Searcher@498b0a11[testcollection_shard1_replica_n1] main]
   [junit4]   2> 2250917 INFO  (parallelCoreAdminExecutor-6588-thread-2) [    ] o.a.s.s.SolrIndexSearcher Opening [Searcher@261bb24[testcollection_shard2_replica_n6] main]
   [junit4]   2> 2250917 INFO  (parallelCoreAdminExecutor-6586-thread-2) [    ] o.a.s.s.SolrIndexSearcher Opening [Searcher@5c4a38d6[testcollection_shard2_replica_n4] main]
   [junit4]   2> 2250927 INFO  (parallelCoreAdminExecutor-6588-thread-2) [    ] o.a.s.r.ManagedResourceStorage Configured ZooKeeperStorageIO with znodeBase: /configs/solrCloudCollectionConfig
   [junit4]   2> 2250928 INFO  (parallelCoreAdminExecutor-6588-thread-2) [    ] o.a.s.r.ManagedResourceStorage Loaded null at path _rest_managed.json using ZooKeeperStorageIO:path=/configs/solrCloudCollectionConfig
   [junit4]   2> 2250929 INFO  (parallelCoreAdminExecutor-6588-thread-2) [    ] o.a.s.h.ReplicationHandler Commits will be reserved for  10000
   [junit4]   2> 2250932 INFO  (parallelCoreAdminExecutor-6588-thread-2) [    ] o.a.s.u.UpdateLog Could not find max version in index or recent updates, using new clock 1575674078650433536
   [junit4]   2> 2250934 INFO  (searcherExecutor-6593-thread-1) [    ] o.a.s.c.SolrCore [testcollection_shard2_replica_n6] Registered new searcher Searcher@261bb24[testcollection_shard2_replica_n6] main{ExitableDirectoryReader(UninvertingDirectoryReader())}
   [junit4]   2> 2250942 INFO  (parallelCoreAdminExecutor-6586-thread-2) [    ] o.a.s.r.ManagedResourceStorage Configured ZooKeeperStorageIO with znodeBase: /configs/solrCloudCollectionConfig
   [junit4]   2> 2250942 INFO  (parallelCoreAdminExecutor-6586-thread-1) [    ] o.a.s.r.ManagedResourceStorage Configured ZooKeeperStorageIO with znodeBase: /configs/solrCloudCollectionConfig
   [junit4]   2> 2250946 INFO  (parallelCoreAdminExecutor-6586-thread-2) [    ] o.a.s.r.ManagedResourceStorage Loaded null at path _rest_managed.json using ZooKeeperStorageIO:path=/configs/solrCloudCollectionConfig
   [junit4]   2> 2250946 INFO  (parallelCoreAdminExecutor-6586-thread-2) [    ] o.a.s.h.ReplicationHandler Commits will be reserved for  10000
   [junit4]   2> 2250946 INFO  (parallelCoreAdminExecutor-6586-thread-2) [    ] o.a.s.u.UpdateLog Could not find max version in index or recent updates, using new clock 1575674078665113600
   [junit4]   2> 2250946 INFO  (parallelCoreAdminExecutor-6586-thread-1) [    ] o.a.s.r.ManagedResourceStorage Loaded null at path _rest_managed.json using ZooKeeperStorageIO:path=/configs/solrCloudCollectionConfig
   [junit4]   2> 2250946 INFO  (parallelCoreAdminExecutor-6586-thread-1) [    ] o.a.s.h.ReplicationHandler Commits will be reserved for  10000
   [junit4]   2> 2250946 INFO  (parallelCoreAdminExecutor-6586-thread-1) [    ] o.a.s.u.UpdateLog Could not find max version in index or recent updates, using new clock 1575674078665113600
   [junit4]   2> 2250946 INFO  (searcherExecutor-6591-thread-1) [    ] o.a.s.c.SolrCore [testcollection_shard2_replica_n4] Registered new searcher Searcher@5c4a38d6[testcollection_shard2_replica_n4] main{ExitableDirectoryReader(UninvertingDirectoryReader())}
   [junit4]   2> 2250946 INFO  (searcherExecutor-6592-thread-1) [    ] o.a.s.c.SolrCore [testcollection_shard1_replica_n1] Registered new searcher Searcher@498b0a11[testcollection_shard1_replica_n1] main{ExitableDirectoryReader(UninvertingDirectoryReader())}
   [junit4]   2> 2250982 INFO  (parallelCoreAdminExecutor-6588-thread-2) [    ] o.a.s.c.ShardLeaderElectionContext Enough replicas found to continue.
   [junit4]   2> 2250982 INFO  (parallelCoreAdminExecutor-6588-thread-2) [    ] o.a.s.c.ShardLeaderElectionContext I may be the new leader - try and sync
   [junit4]   2> 2250982 INFO  (parallelCoreAdminExecutor-6588-thread-2) [    ] o.a.s.c.SyncStrategy Sync replicas to http://127.0.0.1:60862/solr/testcollection_shard2_replica_n6/
   [junit4]   2> 2250983 INFO  (parallelCoreAdminExecutor-6588-thread-2) [    ] o.a.s.u.PeerSync PeerSync: core=testcollection_shard2_replica_n6 url=http://127.0.0.1:60862/solr START replicas=[http://127.0.0.1:60863/solr/testcollection_shard2_replica_n4/] nUpdates=100
   [junit4]   2> 2251009 INFO  (qtp132410550-20678) [    ] o.a.s.c.S.Request [testcollection_shard2_replica_n4]  webapp=/solr path=/get params={distrib=false&qt=/get&fingerprint=false&getVersions=100&wt=javabin&version=2} status=0 QTime=7
   [junit4]   2> 2251037 INFO  (qtp132410550-20686) [    ] o.a.s.h.a.CollectionsHandler Invoked Collection Action :requeststatus with params requestid=279077d4-ce89-4730-9d99-b7ed3be8fd2e&action=REQUESTSTATUS&wt=javabin&version=2 and sendToOCPQueue=true
   [junit4]   2> 2251038 INFO  (qtp132410550-20686) [    ] o.a.s.s.HttpSolrCall [admin] webapp=null path=/admin/collections params={requestid=279077d4-ce89-4730-9d99-b7ed3be8fd2e&action=REQUESTSTATUS&wt=javabin&version=2} status=0 QTime=1
   [junit4]   2> 2251086 INFO  (zkCallback-3074-thread-2) [    ] o.a.s.c.c.ZkStateReader A cluster state change: [WatchedEvent state:SyncConnected type:NodeDataChanged path:/collections/testcollection/state.json] for collection [testcollection] has occurred - updating... (live nodes size: [2])
   [junit4]   2> 2251086 INFO  (zkCallback-3074-thread-1) [    ] o.a.s.c.c.ZkStateReader A cluster state change: [WatchedEvent state:SyncConnected type:NodeDataChanged path:/collections/testcollection/state.json] for collection [testcollection] has occurred - updating... (live nodes size: [2])
   [junit4]   2> 2251087 INFO  (zkCallback-3073-thread-2) [    ] o.a.s.c.c.ZkStateReader A cluster state change: [WatchedEvent state:SyncConnected type:NodeDataChanged path:/collections/testcollection/state.json] for collection [testcollection] has occurred - updating... (live nodes size: [2])
   [junit4]   2> 2251087 INFO  (zkCallback-3073-thread-1) [    ] o.a.s.c.c.ZkStateReader A cluster state change: [WatchedEvent state:SyncConnected type:NodeDataChanged path:/collections/testcollection/state.json] for collection [testcollection] has occurred - updating... (live nodes size: [2])
   [junit4]   2> 2251285 INFO  (parallelCoreAdminExecutor-6588-thread-2) [    ] o.a.s.u.PeerSync PeerSync: core=testcollection_shard2_replica_n6 url=http://127.0.0.1:60862/solr DONE.  We have no versions.  sync failed.
   [junit4]   2> 2251285 INFO  (parallelCoreAdminExecutor-6588-thread-2) [    ] o.a.s.c.SyncStrategy Leader's attempt to sync with shard failed, moving to the next candidate
   [junit4]   2> 2251285 INFO  (parallelCoreAdminExecutor-6588-thread-2) [    ] o.a.s.c.ShardLeaderElectionContext We failed sync, but we have no versions - we can't sync in that case - we were active before, so become leader anyway
   [junit4]   2> 2251285 INFO  (parallelCoreAdminExecutor-6588-thread-2) [    ] o.a.s.c.ShardLeaderElectionContext Found all replicas participating in election, clear LIR
   [junit4]   2> 2251290 INFO  (parallelCoreAdminExecutor-6588-thread-2) [    ] o.a.s.c.ShardLeaderElectionContext I am the new leader: http://127.0.0.1:60862/solr/testcollection_shard2_replica_n6/ shard2
   [junit4]   2> 2251394 INFO  (zkCallback-3074-thread-1) [    ] o.a.s.c.c.ZkStateReader A cluster state change: [WatchedEvent state:SyncConnected type:NodeDataChanged path:/collections/testcollection/state.json] for collection [testcollection] has occurred - updating... (live nodes size: [2])
   [junit4]   2> 2251394 INFO  (zkCallback-3074-thread-2) [    ] o.a.s.c.c.ZkStateReader A cluster state change: [WatchedEvent state:SyncConnected type:NodeDataChanged path:/collections/testcollection/state.json] for collection [testcollection] has occurred - updating... (live nodes size: [2])
   [junit4]   2> 2251395 INFO  (zkCallback-3073-thread-1) [    ] o.a.s.c.c.ZkStateReader A cluster state change: [WatchedEvent state:SyncConnected type:NodeDataChanged path:/collections/testcollection/state.json] for collection [testcollection] has occurred - updating... (live nodes size: [2])
   [junit4]   2> 2251395 INFO  (zkCallback-3073-thread-2) [    ] o.a.s.c.c.ZkStateReader A cluster state change: [WatchedEvent state:SyncConnected type:NodeDataChanged path:/collections/testcollection/state.json] for collection [testcollection] has occurred - updating... (live nodes size: [2])
   [junit4]   2> 2251417 INFO  (parallelCoreAdminExecutor-6588-thread-1) [    ] o.a.s.c.ShardLeaderElectionContext Enough replicas found to continue.
   [junit4]   2> 2251417 INFO  (parallelCoreAdminExecutor-6588-thread-1) [    ] o.a.s.c.ShardLeaderElectionContext I may be the new leader - try and sync
   [junit4]   2> 2251417 INFO  (parallelCoreAdminExecutor-6588-thread-1) [    ] o.a.s.c.SyncStrategy Sync replicas to http://127.0.0.1:60862/solr/testcollection_shard1_replica_n2/
   [junit4]   2> 2251417 INFO  (parallelCoreAdminExecutor-6588-thread-1) [    ] o.a.s.u.PeerSync PeerSync: core=testcollection_shard1_replica_n2 url=http://127.0.0.1:60862/solr START replicas=[http://127.0.0.1:60863/solr/testcollection_shard1_replica_n1/] nUpdates=100
   [junit4]   2> 2251432 INFO  (qtp132410550-20688) [    ] o.a.s.c.S.Request [testcollection_shard1_replica_n1]  webapp=/solr path=/get params={distrib=false&qt=/get&fingerprint=false&getVersions=100&wt=javabin&version=2} status=0 QTime=7
   [junit4]   2> 2251444 INFO  (parallelCoreAdminExecutor-6588-thread-2) [    ] o.a.s.c.ZkController I am the leader, no recovery necessary
   [junit4]   2> 2251530 INFO  (qtp132410550-20680) [    ] o.a.s.h.a.CoreAdminOperation Checking request status for : 279077d4-ce89-4730-9d99-b7ed3be8fd2e394918895559650
   [junit4]   2> 2251530 INFO  (qtp132410550-20680) [    ] o.a.s.s.HttpSolrCall [admin] webapp=null path=/admin/cores params={qt=/admin/cores&requestid=279077d4-ce89-4730-9d99-b7ed3be8fd2e394918895559650&action=REQUESTSTATUS&wt=javabin&version=2} status=0 QTime=0
   [junit4]   2> 2251552 INFO  (zkCallback-3074-thread-2) [    ] o.a.s.c.c.ZkStateReader A cluster state change: [WatchedEvent state:SyncConnected type:NodeDataChanged path:/collections/testcollection/state.json] for collection [testcollection] has occurred - updating... (live nodes size: [2])
   [junit4]   2> 2251553 INFO  (zkCallback-3074-thread-1) [    ] o.a.s.c.c.ZkStateReader A cluster state change: [WatchedEvent state:SyncConnected type:NodeDataChanged path:/collections/testcollection/state.json] for collection [testcollection] has occurred - updating... (live nodes size: [2])
   [junit4]   2> 2251553 INFO  (zkCallback-3073-thread-2) [    ] o.a.s.c.c.ZkStateReader A cluster state change: [WatchedEvent state:SyncConnected type:NodeDataChanged path:/collections/testcollection/state.json] for collection [testcollection] has occurred - updating... (live nodes size: [2])
   [junit4]   2> 2251553 INFO  (zkCallback-3073-thread-1) [    ] o.a.s.c.c.ZkStateReader A cluster state change: [WatchedEvent state:SyncConnected type:NodeDataChanged path:/collections/testcollection/state.json] for collection [testcollection] has occurred - updating... (live nodes size: [2])
   [junit4]   2> 2251726 INFO  (parallelCoreAdminExecutor-6588-thread-1) [    ] o.a.s.u.PeerSync PeerSync: core=testcollection_shard1_replica_n2 url=http://127.0.0.1:60862/solr DONE.  We have no versions.  sync failed.
   [junit4]   2> 2251726 INFO  (parallelCoreAdminExecutor-6588-thread-1) [    ] o.a.s.c.SyncStrategy Leader's attempt to sync with shard failed, moving to the next candidate
   [junit4]   2> 2251726 INFO  (parallelCoreAdminExecutor-6588-thread-1) [    ] o.a.s.c.ShardLeaderElectionContext We failed sync, but we have no versions - we can't sync in that case - we were active before, so become leader anyway
   [junit4]   2> 2251726 INFO  (parallelCoreAdminExecutor-6588-thread-1) [    ] o.a.s.c.ShardLeaderElectionContext Found all replicas participating in election, clear LIR
   [junit4]   2> 2251734 INFO  (parallelCoreAdminExecutor-6588-thread-1) [    ] o.a.s.c.ShardLeaderElectionContext I am the new leader: http://127.0.0.1:60862/solr/testcollection_shard1_replica_n2/ shard1
   [junit4]   2> 2251838 INFO  (zkCallback-3074-thread-1) [    ] o.a.s.c.c.ZkStateReader A cluster state change: [WatchedEvent state:SyncConnected type:NodeDataChanged path:/collections/testcollection/state.json] for collection [testcollection] has occurred - updating... (live nodes size: [2])
   [junit4]   2> 2251838 INFO  (zkCallback-3074-thread-2) [    ] o.a.s.c.c.ZkStateReader A cluster state change: [WatchedEvent state:SyncConnected type:NodeDataChanged path:/collections/testcollection/state.json] for collection [testcollection] has occurred - updating... (live nodes size: [2])
   [junit4]   2> 2251838 INFO  (zkCallback-3073-thread-1) [    ] o.a.s.c.c.ZkStateReader A cluster state change: [WatchedEvent state:SyncConnected type:NodeDataChanged path:/collections/testcollection/state.json] for collection [testcollection] has occurred - updating... (live nodes size: [2])
   [junit4]   2> 2251839 INFO  (zkCallback-3073-thread-2) [    ] o.a.s.c.c.ZkStateReader A cluster state change: [WatchedEvent state:SyncConnected type:NodeDataChanged path:/collections/testcollection/state.json] for collection [testcollection] has occurred - updating... (live nodes size: [2])
   [junit4]   2> 2251841 INFO  (parallelCoreAdminExecutor-6588-thread-1) [    ] o.a.s.c.ZkController I am the leader, no recovery necessary
   [junit4]   2> 2251960 INFO  (zkCallback-3073-thread-2) [    ] o.a.s.c.c.ZkStateReader A cluster state change: [WatchedEvent state:SyncConnected type:NodeDataChanged path:/collections/testcollection/state.json] for collection [testcollection] has occurred - updating... (live nodes size: [2])
   [junit4]   2> 2251960 INFO  (zkCallback-3073-thread-1) [    ] o.a.s.c.c.ZkStateReader A cluster state change: [WatchedEvent state:SyncConnected type:NodeDataChanged path:/collections/testcollection/state.json] for collection [testcollection] has occurred - updating... (live nodes size: [2])
   [junit4]   2> 2251961 INFO  (zkCallback-3074-thread-2) [    ] o.a.s.c.c.ZkStateReader A cluster state change: [WatchedEvent state:SyncConnected type:NodeDataChanged path:/collections/testcollection/state.json] for collection [testcollection] has occurred - updating... (live nodes size: [2])
   [junit4]   2> 2251961 INFO  (zkCallback-3074-thread-1) [    ] o.a.s.c.c.ZkStateReader A cluster state change: [WatchedEvent state:SyncConnected type:NodeDataChanged path:/collections/testcollection/state.json] for collection [testcollection] has occurred - updating... (live nodes size: [2])
   [junit4]   2> 2252042 INFO  (qtp132410550-20680) [    ] o.a.s.h.a.CollectionsHandler Invoked Collection Action :requeststatus with params requestid=279077d4-ce89-4730-9d99-b7ed3be8fd2e&action=REQUESTSTATUS&wt=javabin&version=2 and sendToOCPQueue=true
   [junit4]   2> 2252044 INFO  (qtp132410550-20680) [    ] o.a.s.s.HttpSolrCall [admin] webapp=null path=/admin/collections params={requestid=279077d4-ce89-4730-9d99-b7ed3be8fd2e&action=REQUESTSTATUS&wt=javabin&version=2} status=0 QTime=2
   [junit4]   2> 2252094 INFO  (zkCallback-3074-thread-1) [    ] o.a.s.c.c.ZkStateReader A cluster state change: [WatchedEvent state:SyncConnected type:NodeDataChanged path:/collections/testcollection/state.json] for collection [testcollection] has occurred - updating... (live nodes size: [2])
   [junit4]   2> 2252094 INFO  (zkCallback-3074-thread-2) [    ] o.a.s.c.c.ZkStateReader A cluster state change: [WatchedEvent state:SyncConnected type:NodeDataChanged path:/collections/testcollection/state.json] for collection [testcollection] has occurred - updating... (live nodes size: [2])
   [junit4]   2> 2252095 INFO  (zkCallback-3073-thread-1) [    ] o.a.s.c.c.ZkStateReader A cluster state change: [WatchedEvent state:SyncConnected type:NodeDataChanged path:/collections/testcollection/state.json] for collection [testcollection] has occurred - updating... (live nodes size: [2])
   [junit4]   2> 2252095 INFO  (zkCallback-3073-thread-2) [    ] o.a.s.c.c.ZkStateReader A cluster state change: [WatchedEvent state:SyncConnected type:NodeDataChanged path:/collections/testcollection/state.json] for collection [testcollection] has occurred - updating... (live nodes size: [2])
   [junit4]   2> 2252567 INFO  (qtp132410550-20674) [    ] o.a.s.h.a.CoreAdminOperation Checking request status for : 279077d4-ce89-4730-9d99-b7ed3be8fd2e394918895559650
   [junit4]   2> 2252567 INFO  (qtp132410550-20674) [    ] o.a.s.s.HttpSolrCall [admin] webapp=null path=/admin/cores params={qt=/admin/cores&requestid=279077d4-ce89-4730-9d99-b7ed3be8fd2e394918895559650&action=REQUESTSTATUS&wt=javabin&version=2} status=0 QTime=0
   [junit4]   2> 2252596 INFO  (qtp1887918083-20669) [    ] o.a.s.h.a.CoreAdminOperation Checking request status for : 279077d4-ce89-4730-9d99-b7ed3be8fd2e394918900450958
   [junit4]   2> 2252596 INFO  (qtp1887918083-20669) [    ] o.a.s.s.HttpSolrCall [admin] webapp=null path=/admin/cores params={qt=/admin/cores&requestid=279077d4-ce89-4730-9d99-b7ed3be8fd2e394918900450958&action=REQUESTSTATUS&wt=javabin&version=2} status=0 QTime=0
   [junit4]   2> 2252603 INFO  (OverseerThreadFactory-6585-thread-1) [    ] o.a.s.c.OverseerTaskQueue Response ZK path: /overseer/collection-queue-work/qnr-0000000000 doesn't exist.  Requestor may have disconnected from ZooKeeper
   [junit4]   2> 2253045 INFO  (qtp132410550-20674) [    ] o.a.s.h.a.CollectionsHandler Invoked Collection Action :requeststatus with params requestid=279077d4-ce89-4730-9d99-b7ed3be8fd2e&action=REQUESTSTATUS&wt=javabin&version=2 and sendToOCPQueue=true
   [junit4]   2> 2253046 INFO  (qtp132410550-20674) [    ] o.a.s.s.HttpSolrCall [admin] webapp=null path=/admin/collections params={requestid=279077d4-ce89-4730-9d99-b7ed3be8fd2e&action=REQUESTSTATUS&wt=javabin&version=2} status=0 QTime=1
   [junit4]   2> 2253047 INFO  (qtp132410550-20675) [    ] o.a.s.h.a.CollectionsHandler Invoked Collection Action :deletestatus with params requestid=279077d4-ce89-4730-9d99-b7ed3be8fd2e&action=DELETESTATUS&wt=javabin&version=2 and sendToOCPQueue=true
   [junit4]   2> 2253048 INFO  (qtp132410550-20675) [    ] o.a.s.s.HttpSolrCall [admin] webapp=null path=/admin/collections params={requestid=279077d4-ce89-4730-9d99-b7ed3be8fd2e&action=DELETESTATUS&wt=javabin&version=2} status=0 QTime=0
   [junit4]   2> 2253048 INFO  (TEST-TestAuthenticationFramework.testBasics-seed#[6E0B4B59FBAA5993]) [    ] o.a.s.c.AbstractDistribZkTestBase Wait for recoveries to finish - collection: testcollection failOnTimeout:true timeout (sec):330
   [junit4]   1> -
   [junit4]   1> replica:core_node3 rstate:active live:true
   [junit4]   1> replica:core_node5 rstate:active live:true
   [junit4]   1> replica:core_node7 rstate:active live:true
   [junit4]   1> replica:core_node8 rstate:active live:true
   [junit4]   1> no one is recoverying
   [junit4]   2> 2253049 INFO  (TEST-TestAuthenticationFramework.testBasics-seed#[6E0B4B59FBAA5993]) [    ] o.a.s.c.AbstractDistribZkTestBase Recoveries finished - collection: testcollection
   [junit4]   2> 2253052 INFO  (qtp132410550-20687) [    ] o.a.s.c.S.Request [testcollection_shard2_replica_n4]  webapp=/solr path=/select params={df=text&distrib=false&_stateVer_=testcollection:8&fl=id&fl=score&shards.purpose=4&start=0&fsv=true&shard.url=http://127.0.0.1:60863/solr/testcollection_shard2_replica_n4/|http://127.0.0.1:60862/solr/testcollection_shard2_replica_n6/&rows=10&version=2&q=*:*&NOW=1502679901954&isShard=true&wt=javabin} hits=0 status=0 QTime=0
   [junit4]   2> 2253056 INFO  (OverseerCollectionConfigSetProcessor-98479629611368454-127.0.0.1:60863_solr-n_0000000000) [    ] o.a.s.c.OverseerTaskQueue Response ZK path: /overseer/collection-queue-work/qnr-0000000000 doesn't exist.  Requestor may have disconnected from ZooKeeper
   [junit4]   2> 2253060 INFO  (qtp1887918083-20666) [    ] o.a.s.c.S.Request [testcollection_shard1_replica_n2]  webapp=/solr path=/select params={df=text&distrib=false&_stateVer_=testcollection:8&fl=id&fl=score&shards.purpose=4&start=0&fsv=true&shard.url=http://127.0.0.1:60862/solr/testcollection_shard1_replica_n2/|http://127.0.0.1:60863/solr/testcollection_shard1_replica_n1/&rows=10&version=2&q=*:*&NOW=1502679901954&isShard=true&wt=javabin} hits=0 status=0 QTime=0
   [junit4]   2> 2253061 INFO  (qtp1887918083-20667) [    ] o.a.s.c.S.Request [testcollection_shard1_replica_n2]  webapp=/solr path=/select params={q=*:*&_stateVer_=testcollection:8&wt=javabin&version=2} hits=0 status=0 QTime=10
   [junit4]   2> 2253078 INFO  (qtp132410550-20687) [    ] o.a.s.u.p.LogUpdateProcessorFactory [testcollection_shard1_replica_n1]  webapp=/solr path=/update params={update.distrib=FROMLEADER&distrib.from=http://127.0.0.1:60862/solr/testcollection_shard1_replica_n2/&wt=javabin&version=2}{add=[1 (1575674080883900416)]} 0 12
   [junit4]   2> 2253078 INFO  (qtp1887918083-20666) [    ] o.a.s.u.p.LogUpdateProcessorFactory [testcollection_shard1_replica_n2]  webapp=/solr path=/update params={_stateVer_=testcollection:8&wt=javabin&version=2}{add=[1 (1575674080883900416)]} 0 16
   [junit4]   2> 2253080 INFO  (qtp132410550-20686) [    ] o.a.s.u.DirectUpdateHandler2 start commit{_version_=1575674080902774784,optimize=false,openSearcher=true,waitSearcher=true,expungeDeletes=false,softCommit=false,prepareCommit=false}
   [junit4]   2> 2253081 INFO  (qtp132410550-20686) [    ] o.a.s.u.SolrIndexWriter Calling setCommitData with IW:org.apache.solr.update.SolrIndexWriter@665e83ab commitCommandVersion:1575674080902774784
   [junit4]   2> 2253083 INFO  (qtp1887918083-20668) [    ] o.a.s.u.DirectUpdateHandler2 start commit{_version_=1575674080905920512,optimize=false,openSearcher=true,waitSearcher=true,expungeDeletes=false,softCommit=false,prepareCommit=false}
   [junit4]   2> 2253083 INFO  (qtp1887918083-20668) [    ] o.a.s.u.SolrIndexWriter Calling setCommitData with IW:org.apache.solr.update.SolrIndexWriter@474e2808 commitCommandVersion:1575674080905920512
   [junit4]   2> 2253085 INFO  (qtp132410550-20688) [    ] o.a.s.u.DirectUpdateHandler2 start commit{_version_=1575674080908017664,optimize=false,openSearcher=true,waitSearcher=true,expungeDeletes=false,softCommit=false,prepareCommit=false}
   [junit4]   2> 2253085 INFO  (qtp132410550-20688) [    ] o.a.s.u.DirectUpdateHandler2 No uncommitted changes. 

[...truncated too long message...]

a HotSpot(TM) 64-Bit Server VM warning: Option UseConcMarkSweepGC was deprecated in version 9.0 and will likely be removed in a future release.
   [junit4] <<< JVM J0: EOF ----

[...truncated 21 lines...]
   [junit4] JVM J1: stderr was not empty, see: C:\Users\jenkins\workspace\Lucene-Solr-master-Windows\solr\build\solr-solrj\test\temp\junit4-J1-20170814_032315_77213045793425063851476.syserr
   [junit4] >>> JVM J1 emitted unexpected output (verbatim) ----
   [junit4] Java HotSpot(TM) 64-Bit Server VM warning: Option UseConcMarkSweepGC was deprecated in version 9.0 and will likely be removed in a future release.
   [junit4] <<< JVM J1: EOF ----

[...truncated 1243 lines...]
   [junit4] JVM J1: stderr was not empty, see: C:\Users\jenkins\workspace\Lucene-Solr-master-Windows\solr\build\contrib\solr-analysis-extras\test\temp\junit4-J1-20170814_032724_6176716400318901579496.syserr
   [junit4] >>> JVM J1 emitted unexpected output (verbatim) ----
   [junit4] Java HotSpot(TM) 64-Bit Server VM warning: Option UseConcMarkSweepGC was deprecated in version 9.0 and will likely be removed in a future release.
   [junit4] <<< JVM J1: EOF ----

[...truncated 3 lines...]
   [junit4] JVM J0: stderr was not empty, see: C:\Users\jenkins\workspace\Lucene-Solr-master-Windows\solr\build\contrib\solr-analysis-extras\test\temp\junit4-J0-20170814_032724_6171374979136766294126.syserr
   [junit4] >>> JVM J0 emitted unexpected output (verbatim) ----
   [junit4] Java HotSpot(TM) 64-Bit Server VM warning: Option UseConcMarkSweepGC was deprecated in version 9.0 and will likely be removed in a future release.
   [junit4] <<< JVM J0: EOF ----

[...truncated 548 lines...]
   [junit4] JVM J0: stderr was not empty, see: C:\Users\jenkins\workspace\Lucene-Solr-master-Windows\solr\build\contrib\solr-analytics\test\temp\junit4-J0-20170814_032753_24812424713378240569384.syserr
   [junit4] >>> JVM J0 emitted unexpected output (verbatim) ----
   [junit4] Java HotSpot(TM) 64-Bit Server VM warning: Option UseConcMarkSweepGC was deprecated in version 9.0 and will likely be removed in a future release.
   [junit4] <<< JVM J0: EOF ----

[...truncated 3 lines...]
   [junit4] JVM J1: stderr was not empty, see: C:\Users\jenkins\workspace\Lucene-Solr-master-Windows\solr\build\contrib\solr-analytics\test\temp\junit4-J1-20170814_032753_248391509270669835381.syserr
   [junit4] >>> JVM J1 emitted unexpected output (verbatim) ----
   [junit4] Java HotSpot(TM) 64-Bit Server VM warning: Option UseConcMarkSweepGC was deprecated in version 9.0 and will likely be removed in a future release.
   [junit4] <<< JVM J1: EOF ----

[...truncated 500 lines...]
   [junit4] JVM J1: stderr was not empty, see: C:\Users\jenkins\workspace\Lucene-Solr-master-Windows\solr\build\contrib\solr-clustering\test\temp\junit4-J1-20170814_032855_09612009046018467469528.syserr
   [junit4] >>> JVM J1 emitted unexpected output (verbatim) ----
   [junit4] Java HotSpot(TM) 64-Bit Server VM warning: Option UseConcMarkSweepGC was deprecated in version 9.0 and will likely be removed in a future release.
   [junit4] <<< JVM J1: EOF ----

[...truncated 3 lines...]
   [junit4] JVM J0: stderr was not empty, see: C:\Users\jenkins\workspace\Lucene-Solr-master-Windows\solr\build\contrib\solr-clustering\test\temp\junit4-J0-20170814_032855_09610700194625179621605.syserr
   [junit4] >>> JVM J0 emitted unexpected output (verbatim) ----
   [junit4] Java HotSpot(TM) 64-Bit Server VM warning: Option UseConcMarkSweepGC was deprecated in version 9.0 and will likely be removed in a future release.
   [junit4] <<< JVM J0: EOF ----

[...truncated 1130 lines...]
   [junit4] JVM J1: stderr was not empty, see: C:\Users\jenkins\workspace\Lucene-Solr-master-Windows\solr\build\contrib\solr-dataimporthandler-extras\test\temp\junit4-J1-20170814_032934_1689673047144999316576.syserr
   [junit4] >>> JVM J1 emitted unexpected output (verbatim) ----
   [junit4] Java HotSpot(TM) 64-Bit Server VM warning: Option UseConcMarkSweepGC was deprecated in version 9.0 and will likely be removed in a future release.
   [junit4] <<< JVM J1: EOF ----

[...truncated 3 lines...]
   [junit4] JVM J0: stderr was not empty, see: C:\Users\jenkins\workspace\Lucene-Solr-master-Windows\solr\build\contrib\solr-dataimporthandler-extras\test\temp\junit4-J0-20170814_032934_1683233707141507278643.syserr
   [junit4] >>> JVM J0 emitted unexpected output (verbatim) ----
   [junit4] Java HotSpot(TM) 64-Bit Server VM warning: Option UseConcMarkSweepGC was deprecated in version 9.0 and will likely be removed in a future release.
   [junit4] <<< JVM J0: EOF ----

[...truncated 593 lines...]
   [junit4] JVM J1: stderr was not empty, see: C:\Users\jenkins\workspace\Lucene-Solr-master-Windows\solr\build\contrib\solr-dataimporthandler\test\temp\junit4-J1-20170814_032953_75610812157105389716829.syserr
   [junit4] >>> JVM J1 emitted unexpected output (verbatim) ----
   [junit4] Java HotSpot(TM) 64-Bit Server VM warning: Option UseConcMarkSweepGC was deprecated in version 9.0 and will likely be removed in a future release.
   [junit4] <<< JVM J1: EOF ----

[...truncated 3 lines...]
   [junit4] JVM J0: stderr was not empty, see: C:\Users\jenkins\workspace\Lucene-Solr-master-Windows\solr\build\contrib\solr-dataimporthandler\test\temp\junit4-J0-20170814_032953_7569968236565701299867.syserr
   [junit4] >>> JVM J0 emitted unexpected output (verbatim) ----
   [junit4] Java HotSpot(TM) 64-Bit Server VM warning: Option UseConcMarkSweepGC was deprecated in version 9.0 and will likely be removed in a future release.
   [junit4] <<< JVM J0: EOF ----

[...truncated 501 lines...]
   [junit4] JVM J1: stderr was not empty, see: C:\Users\jenkins\workspace\Lucene-Solr-master-Windows\solr\build\contrib\solr-cell\test\temp\junit4-J1-20170814_033045_2975512088647937926129.syserr
   [junit4] >>> JVM J1 emitted unexpected output (verbatim) ----
   [junit4] Java HotSpot(TM) 64-Bit Server VM warning: Option UseConcMarkSweepGC was deprecated in version 9.0 and will likely be removed in a future release.
   [junit4] <<< JVM J1: EOF ----

[...truncated 6 lines...]
   [junit4] JVM J0: stderr was not empty, see: C:\Users\jenkins\workspace\Lucene-Solr-master-Windows\solr\build\contrib\solr-cell\test\temp\junit4-J0-20170814_033045_2974273361909553782403.syserr
   [junit4] >>> JVM J0 emitted unexpected output (verbatim) ----
   [junit4] Java HotSpot(TM) 64-Bit Server VM warning: Option UseConcMarkSweepGC was deprecated in version 9.0 and will likely be removed in a future release.
   [junit4] <<< JVM J0: EOF ----

[...truncated 506 lines...]
   [junit4] JVM J0: stderr was not empty, see: C:\Users\jenkins\workspace\Lucene-Solr-master-Windows\solr\build\contrib\solr-langid\test\temp\junit4-J0-20170814_033110_705536983780677471784.syserr
   [junit4] >>> JVM J0 emitted unexpected output (verbatim) ----
   [junit4] Java HotSpot(TM) 64-Bit Server VM warning: Option UseConcMarkSweepGC was deprecated in version 9.0 and will likely be removed in a future release.
   [junit4] <<< JVM J0: EOF ----

   [junit4] JVM J1: stderr was not empty, see: C:\Users\jenkins\workspace\Lucene-Solr-master-Windows\solr\build\contrib\solr-langid\test\temp\junit4-J1-20170814_033110_7056506875894524747339.syserr
   [junit4] >>> JVM J1 emitted unexpected output (verbatim) ----
   [junit4] Java HotSpot(TM) 64-Bit Server VM warning: Option UseConcMarkSweepGC was deprecated in version 9.0 and will likely be removed in a future release.
   [junit4] <<< JVM J1: EOF ----

[...truncated 595 lines...]
   [junit4] JVM J0: stderr was not empty, see: C:\Users\jenkins\workspace\Lucene-Solr-master-Windows\solr\build\contrib\solr-ltr\test\temp\junit4-J0-20170814_033133_02114936524606739575956.syserr
   [junit4] >>> JVM J0 emitted unexpected output (verbatim) ----
   [junit4] Java HotSpot(TM) 64-Bit Server VM warning: Option UseConcMarkSweepGC was deprecated in version 9.0 and will likely be removed in a future release.
   [junit4] <<< JVM J0: EOF ----

[...truncated 3 lines...]
   [junit4] JVM J1: stderr was not empty, see: C:\Users\jenkins\workspace\Lucene-Solr-master-Windows\solr\build\contrib\solr-ltr\test\temp\junit4-J1-20170814_033133_02114485596261355618515.syserr
   [junit4] >>> JVM J1 emitted unexpected output (verbatim) ----
   [junit4] Java HotSpot(TM) 64-Bit Server VM warning: Option UseConcMarkSweepGC was deprecated in version 9.0 and will likely be removed in a future release.
   [junit4] <<< JVM J1: EOF ----

[...truncated 538 lines...]
   [junit4] JVM J1: stderr was not empty, see: C:\Users\jenkins\workspace\Lucene-Solr-master-Windows\solr\build\contrib\solr-uima\test\temp\junit4-J1-20170814_033226_9481345498419179713218.syserr
   [junit4] >>> JVM J1 emitted unexpected output (verbatim) ----
   [junit4] Java HotSpot(TM) 64-Bit Server VM warning: Option UseConcMarkSweepGC was deprecated in version 9.0 and will likely be removed in a future release.
   [junit4] <<< JVM J1: EOF ----

[...truncated 3 lines...]
   [junit4] JVM J0: stderr was not empty, see: C:\Users\jenkins\workspace\Lucene-Solr-master-Windows\solr\build\contrib\solr-uima\test\temp\junit4-J0-20170814_033226_9485872799122180437572.syserr
   [junit4] >>> JVM J0 emitted unexpected output (verbatim) ----
   [junit4] Java HotSpot(TM) 64-Bit Server VM warning: Option UseConcMarkSweepGC was deprecated in version 9.0 and will likely be removed in a future release.
   [junit4] <<< JVM J0: EOF ----

[...truncated 495 lines...]
   [junit4] JVM J0: stderr was not empty, see: C:\Users\jenkins\workspace\Lucene-Solr-master-Windows\solr\build\contrib\solr-velocity\test\temp\junit4-J0-20170814_033254_3073261508167017166503.syserr
   [junit4] >>> JVM J0 emitted unexpected output (verbatim) ----
   [junit4] Java HotSpot(TM) 64-Bit Server VM warning: Option UseConcMarkSweepGC was deprecated in version 9.0 and will likely be removed in a future release.
   [junit4] <<< JVM J0: EOF ----

[...truncated 28963 lines...]

Mime
View raw message