lucene-dev mailing list archives

Site index · List index
Message view « Date » · « Thread »
Top « Date » · « Thread »
From Policeman Jenkins Server <jenk...@thetaphi.de>
Subject [JENKINS-EA] Lucene-Solr-master-Linux (32bit/jdk-9-ea+178) - Build # 20262 - Failure!
Date Sat, 05 Aug 2017 07:38:21 GMT
Build: https://jenkins.thetaphi.de/job/Lucene-Solr-master-Linux/20262/
Java: 32bit/jdk-9-ea+178 -server -XX:+UseConcMarkSweepGC --illegal-access=deny

1 tests failed.
FAILED:  org.apache.solr.TestDistributedSearch.test

Error Message:
Error from server at http://127.0.0.1:41183/b_r/x/collection1: ERROR: [doc=1] Error adding field 'severity'='Not Available' msg=EnumFieldType requires docValues="true".

Stack Trace:
org.apache.solr.client.solrj.impl.HttpSolrClient$RemoteSolrException: Error from server at http://127.0.0.1:41183/b_r/x/collection1: ERROR: [doc=1] Error adding field 'severity'='Not Available' msg=EnumFieldType requires docValues="true".
	at __randomizedtesting.SeedInfo.seed([5FA99E14ACD87BE9:D7FDA1CE02241611]:0)
	at org.apache.solr.client.solrj.impl.HttpSolrClient.executeMethod(HttpSolrClient.java:627)
	at org.apache.solr.client.solrj.impl.HttpSolrClient.request(HttpSolrClient.java:253)
	at org.apache.solr.client.solrj.impl.HttpSolrClient.request(HttpSolrClient.java:242)
	at org.apache.solr.client.solrj.SolrRequest.process(SolrRequest.java:178)
	at org.apache.solr.client.solrj.SolrClient.add(SolrClient.java:173)
	at org.apache.solr.client.solrj.SolrClient.add(SolrClient.java:138)
	at org.apache.solr.client.solrj.SolrClient.add(SolrClient.java:152)
	at org.apache.solr.BaseDistributedSearchTestCase.indexDoc(BaseDistributedSearchTestCase.java:483)
	at org.apache.solr.BaseDistributedSearchTestCase.indexr(BaseDistributedSearchTestCase.java:465)
	at org.apache.solr.TestDistributedSearch.test(TestDistributedSearch.java:1052)
	at java.base/jdk.internal.reflect.NativeMethodAccessorImpl.invoke0(Native Method)
	at java.base/jdk.internal.reflect.NativeMethodAccessorImpl.invoke(NativeMethodAccessorImpl.java:62)
	at java.base/jdk.internal.reflect.DelegatingMethodAccessorImpl.invoke(DelegatingMethodAccessorImpl.java:43)
	at java.base/java.lang.reflect.Method.invoke(Method.java:564)
	at com.carrotsearch.randomizedtesting.RandomizedRunner.invoke(RandomizedRunner.java:1713)
	at com.carrotsearch.randomizedtesting.RandomizedRunner$8.evaluate(RandomizedRunner.java:907)
	at com.carrotsearch.randomizedtesting.RandomizedRunner$9.evaluate(RandomizedRunner.java:943)
	at com.carrotsearch.randomizedtesting.RandomizedRunner$10.evaluate(RandomizedRunner.java:957)
	at org.apache.solr.BaseDistributedSearchTestCase$ShardsRepeatRule$ShardsRepeatStatement.callStatement(BaseDistributedSearchTestCase.java:1019)
	at org.apache.solr.BaseDistributedSearchTestCase$ShardsRepeatRule$ShardsStatement.evaluate(BaseDistributedSearchTestCase.java:968)
	at com.carrotsearch.randomizedtesting.rules.SystemPropertiesRestoreRule$1.evaluate(SystemPropertiesRestoreRule.java:57)
	at org.apache.lucene.util.TestRuleSetupTeardownChained$1.evaluate(TestRuleSetupTeardownChained.java:49)
	at org.apache.lucene.util.AbstractBeforeAfterRule$1.evaluate(AbstractBeforeAfterRule.java:45)
	at org.apache.lucene.util.TestRuleThreadAndTestName$1.evaluate(TestRuleThreadAndTestName.java:48)
	at org.apache.lucene.util.TestRuleIgnoreAfterMaxFailures$1.evaluate(TestRuleIgnoreAfterMaxFailures.java:64)
	at org.apache.lucene.util.TestRuleMarkFailure$1.evaluate(TestRuleMarkFailure.java:47)
	at com.carrotsearch.randomizedtesting.rules.StatementAdapter.evaluate(StatementAdapter.java:36)
	at com.carrotsearch.randomizedtesting.ThreadLeakControl$StatementRunner.run(ThreadLeakControl.java:368)
	at com.carrotsearch.randomizedtesting.ThreadLeakControl.forkTimeoutingTask(ThreadLeakControl.java:817)
	at com.carrotsearch.randomizedtesting.ThreadLeakControl$3.evaluate(ThreadLeakControl.java:468)
	at com.carrotsearch.randomizedtesting.RandomizedRunner.runSingleTest(RandomizedRunner.java:916)
	at com.carrotsearch.randomizedtesting.RandomizedRunner$5.evaluate(RandomizedRunner.java:802)
	at com.carrotsearch.randomizedtesting.RandomizedRunner$6.evaluate(RandomizedRunner.java:852)
	at com.carrotsearch.randomizedtesting.RandomizedRunner$7.evaluate(RandomizedRunner.java:863)
	at com.carrotsearch.randomizedtesting.rules.StatementAdapter.evaluate(StatementAdapter.java:36)
	at com.carrotsearch.randomizedtesting.rules.SystemPropertiesRestoreRule$1.evaluate(SystemPropertiesRestoreRule.java:57)
	at org.apache.lucene.util.AbstractBeforeAfterRule$1.evaluate(AbstractBeforeAfterRule.java:45)
	at com.carrotsearch.randomizedtesting.rules.StatementAdapter.evaluate(StatementAdapter.java:36)
	at org.apache.lucene.util.TestRuleStoreClassName$1.evaluate(TestRuleStoreClassName.java:41)
	at com.carrotsearch.randomizedtesting.rules.NoShadowingOrOverridesOnMethodsRule$1.evaluate(NoShadowingOrOverridesOnMethodsRule.java:40)
	at com.carrotsearch.randomizedtesting.rules.NoShadowingOrOverridesOnMethodsRule$1.evaluate(NoShadowingOrOverridesOnMethodsRule.java:40)
	at com.carrotsearch.randomizedtesting.rules.StatementAdapter.evaluate(StatementAdapter.java:36)
	at com.carrotsearch.randomizedtesting.rules.StatementAdapter.evaluate(StatementAdapter.java:36)
	at org.apache.lucene.util.TestRuleAssertionsRequired$1.evaluate(TestRuleAssertionsRequired.java:53)
	at org.apache.lucene.util.TestRuleMarkFailure$1.evaluate(TestRuleMarkFailure.java:47)
	at org.apache.lucene.util.TestRuleIgnoreAfterMaxFailures$1.evaluate(TestRuleIgnoreAfterMaxFailures.java:64)
	at org.apache.lucene.util.TestRuleIgnoreTestSuites$1.evaluate(TestRuleIgnoreTestSuites.java:54)
	at com.carrotsearch.randomizedtesting.rules.StatementAdapter.evaluate(StatementAdapter.java:36)
	at com.carrotsearch.randomizedtesting.ThreadLeakControl$StatementRunner.run(ThreadLeakControl.java:368)
	at java.base/java.lang.Thread.run(Thread.java:844)




Build Log:
[...truncated 1697 lines...]
   [junit4] JVM J0: stderr was not empty, see: /home/jenkins/workspace/Lucene-Solr-master-Linux/lucene/build/core/test/temp/junit4-J0-20170805_063116_81917277312841478166815.syserr
   [junit4] >>> JVM J0 emitted unexpected output (verbatim) ----
   [junit4] Java HotSpot(TM) Server VM warning: Option UseConcMarkSweepGC was deprecated in version 9.0 and will likely be removed in a future release.
   [junit4] <<< JVM J0: EOF ----

[...truncated 3 lines...]
   [junit4] JVM J2: stderr was not empty, see: /home/jenkins/workspace/Lucene-Solr-master-Linux/lucene/build/core/test/temp/junit4-J2-20170805_063116_81918114852030050949952.syserr
   [junit4] >>> JVM J2 emitted unexpected output (verbatim) ----
   [junit4] Java HotSpot(TM) Server VM warning: Option UseConcMarkSweepGC was deprecated in version 9.0 and will likely be removed in a future release.
   [junit4] <<< JVM J2: EOF ----

[...truncated 11 lines...]
   [junit4] JVM J1: stderr was not empty, see: /home/jenkins/workspace/Lucene-Solr-master-Linux/lucene/build/core/test/temp/junit4-J1-20170805_063116_8194003703507046940702.syserr
   [junit4] >>> JVM J1 emitted unexpected output (verbatim) ----
   [junit4] Java HotSpot(TM) Server VM warning: Option UseConcMarkSweepGC was deprecated in version 9.0 and will likely be removed in a future release.
   [junit4] <<< JVM J1: EOF ----

[...truncated 288 lines...]
   [junit4] JVM J0: stderr was not empty, see: /home/jenkins/workspace/Lucene-Solr-master-Linux/lucene/build/test-framework/test/temp/junit4-J0-20170805_064451_267485762952561738325.syserr
   [junit4] >>> JVM J0 emitted unexpected output (verbatim) ----
   [junit4] Java HotSpot(TM) Server VM warning: Option UseConcMarkSweepGC was deprecated in version 9.0 and will likely be removed in a future release.
   [junit4] <<< JVM J0: EOF ----

[...truncated 3 lines...]
   [junit4] JVM J1: stderr was not empty, see: /home/jenkins/workspace/Lucene-Solr-master-Linux/lucene/build/test-framework/test/temp/junit4-J1-20170805_064451_2671596090039772844387.syserr
   [junit4] >>> JVM J1 emitted unexpected output (verbatim) ----
   [junit4] Java HotSpot(TM) Server VM warning: Option UseConcMarkSweepGC was deprecated in version 9.0 and will likely be removed in a future release.
   [junit4] <<< JVM J1: EOF ----

[...truncated 3 lines...]
   [junit4] JVM J2: stderr was not empty, see: /home/jenkins/workspace/Lucene-Solr-master-Linux/lucene/build/test-framework/test/temp/junit4-J2-20170805_064451_2679483665432914770392.syserr
   [junit4] >>> JVM J2 emitted unexpected output (verbatim) ----
   [junit4] Java HotSpot(TM) Server VM warning: Option UseConcMarkSweepGC was deprecated in version 9.0 and will likely be removed in a future release.
   [junit4] <<< JVM J2: EOF ----

[...truncated 1051 lines...]
   [junit4] JVM J0: stderr was not empty, see: /home/jenkins/workspace/Lucene-Solr-master-Linux/lucene/build/analysis/common/test/temp/junit4-J0-20170805_064559_6925610565119769124099.syserr
   [junit4] >>> JVM J0 emitted unexpected output (verbatim) ----
   [junit4] Java HotSpot(TM) Server VM warning: Option UseConcMarkSweepGC was deprecated in version 9.0 and will likely be removed in a future release.
   [junit4] <<< JVM J0: EOF ----

[...truncated 3 lines...]
   [junit4] JVM J2: stderr was not empty, see: /home/jenkins/workspace/Lucene-Solr-master-Linux/lucene/build/analysis/common/test/temp/junit4-J2-20170805_064559_6922186324297633668615.syserr
   [junit4] >>> JVM J2 emitted unexpected output (verbatim) ----
   [junit4] Java HotSpot(TM) Server VM warning: Option UseConcMarkSweepGC was deprecated in version 9.0 and will likely be removed in a future release.
   [junit4] <<< JVM J2: EOF ----

[...truncated 3 lines...]
   [junit4] JVM J1: stderr was not empty, see: /home/jenkins/workspace/Lucene-Solr-master-Linux/lucene/build/analysis/common/test/temp/junit4-J1-20170805_064559_6922653203536545616606.syserr
   [junit4] >>> JVM J1 emitted unexpected output (verbatim) ----
   [junit4] Java HotSpot(TM) Server VM warning: Option UseConcMarkSweepGC was deprecated in version 9.0 and will likely be removed in a future release.
   [junit4] <<< JVM J1: EOF ----

[...truncated 218 lines...]
   [junit4] JVM J0: stderr was not empty, see: /home/jenkins/workspace/Lucene-Solr-master-Linux/lucene/build/analysis/icu/test/temp/junit4-J0-20170805_064736_96212907395900423461343.syserr
   [junit4] >>> JVM J0 emitted unexpected output (verbatim) ----
   [junit4] Java HotSpot(TM) Server VM warning: Option UseConcMarkSweepGC was deprecated in version 9.0 and will likely be removed in a future release.
   [junit4] <<< JVM J0: EOF ----

   [junit4] JVM J2: stderr was not empty, see: /home/jenkins/workspace/Lucene-Solr-master-Linux/lucene/build/analysis/icu/test/temp/junit4-J2-20170805_064736_9636875275605356365244.syserr
   [junit4] >>> JVM J2 emitted unexpected output (verbatim) ----
   [junit4] Java HotSpot(TM) Server VM warning: Option UseConcMarkSweepGC was deprecated in version 9.0 and will likely be removed in a future release.
   [junit4] <<< JVM J2: EOF ----

[...truncated 3 lines...]
   [junit4] JVM J1: stderr was not empty, see: /home/jenkins/workspace/Lucene-Solr-master-Linux/lucene/build/analysis/icu/test/temp/junit4-J1-20170805_064736_96213043134966151839787.syserr
   [junit4] >>> JVM J1 emitted unexpected output (verbatim) ----
   [junit4] Java HotSpot(TM) Server VM warning: Option UseConcMarkSweepGC was deprecated in version 9.0 and will likely be removed in a future release.
   [junit4] <<< JVM J1: EOF ----

[...truncated 237 lines...]
   [junit4] JVM J2: stderr was not empty, see: /home/jenkins/workspace/Lucene-Solr-master-Linux/lucene/build/analysis/kuromoji/test/temp/junit4-J2-20170805_064753_6772494479908368448229.syserr
   [junit4] >>> JVM J2 emitted unexpected output (verbatim) ----
   [junit4] Java HotSpot(TM) Server VM warning: Option UseConcMarkSweepGC was deprecated in version 9.0 and will likely be removed in a future release.
   [junit4] <<< JVM J2: EOF ----

   [junit4] JVM J0: stderr was not empty, see: /home/jenkins/workspace/Lucene-Solr-master-Linux/lucene/build/analysis/kuromoji/test/temp/junit4-J0-20170805_064753_67713042304104797357283.syserr
   [junit4] >>> JVM J0 emitted unexpected output (verbatim) ----
   [junit4] Java HotSpot(TM) Server VM warning: Option UseConcMarkSweepGC was deprecated in version 9.0 and will likely be removed in a future release.
   [junit4] <<< JVM J0: EOF ----

[...truncated 6 lines...]
   [junit4] JVM J1: stderr was not empty, see: /home/jenkins/workspace/Lucene-Solr-master-Linux/lucene/build/analysis/kuromoji/test/temp/junit4-J1-20170805_064753_67713600163400282610203.syserr
   [junit4] >>> JVM J1 emitted unexpected output (verbatim) ----
   [junit4] Java HotSpot(TM) Server VM warning: Option UseConcMarkSweepGC was deprecated in version 9.0 and will likely be removed in a future release.
   [junit4] <<< JVM J1: EOF ----

[...truncated 146 lines...]
   [junit4] JVM J1: stderr was not empty, see: /home/jenkins/workspace/Lucene-Solr-master-Linux/lucene/build/analysis/morfologik/test/temp/junit4-J1-20170805_064817_8437410870030273080552.syserr
   [junit4] >>> JVM J1 emitted unexpected output (verbatim) ----
   [junit4] Java HotSpot(TM) Server VM warning: Option UseConcMarkSweepGC was deprecated in version 9.0 and will likely be removed in a future release.
   [junit4] <<< JVM J1: EOF ----

[...truncated 3 lines...]
   [junit4] JVM J2: stderr was not empty, see: /home/jenkins/workspace/Lucene-Solr-master-Linux/lucene/build/analysis/morfologik/test/temp/junit4-J2-20170805_064817_8433222519974840027427.syserr
   [junit4] >>> JVM J2 emitted unexpected output (verbatim) ----
   [junit4] Java HotSpot(TM) Server VM warning: Option UseConcMarkSweepGC was deprecated in version 9.0 and will likely be removed in a future release.
   [junit4] <<< JVM J2: EOF ----

[...truncated 3 lines...]
   [junit4] JVM J0: stderr was not empty, see: /home/jenkins/workspace/Lucene-Solr-master-Linux/lucene/build/analysis/morfologik/test/temp/junit4-J0-20170805_064817_8431709135274587220265.syserr
   [junit4] >>> JVM J0 emitted unexpected output (verbatim) ----
   [junit4] Java HotSpot(TM) Server VM warning: Option UseConcMarkSweepGC was deprecated in version 9.0 and will likely be removed in a future release.
   [junit4] <<< JVM J0: EOF ----

[...truncated 158 lines...]
   [junit4] JVM J2: stderr was not empty, see: /home/jenkins/workspace/Lucene-Solr-master-Linux/lucene/build/analysis/phonetic/test/temp/junit4-J2-20170805_064821_681126721626190785470.syserr
   [junit4] >>> JVM J2 emitted unexpected output (verbatim) ----
   [junit4] Java HotSpot(TM) Server VM warning: Option UseConcMarkSweepGC was deprecated in version 9.0 and will likely be removed in a future release.
   [junit4] <<< JVM J2: EOF ----

[...truncated 3 lines...]
   [junit4] JVM J0: stderr was not empty, see: /home/jenkins/workspace/Lucene-Solr-master-Linux/lucene/build/analysis/phonetic/test/temp/junit4-J0-20170805_064821_68112459921514492747780.syserr
   [junit4] >>> JVM J0 emitted unexpected output (verbatim) ----
   [junit4] Java HotSpot(TM) Server VM warning: Option UseConcMarkSweepGC was deprecated in version 9.0 and will likely be removed in a future release.
   [junit4] <<< JVM J0: EOF ----

[...truncated 3 lines...]
   [junit4] JVM J1: stderr was not empty, see: /home/jenkins/workspace/Lucene-Solr-master-Linux/lucene/build/analysis/phonetic/test/temp/junit4-J1-20170805_064821_681935557986312756317.syserr
   [junit4] >>> JVM J1 emitted unexpected output (verbatim) ----
   [junit4] Java HotSpot(TM) Server VM warning: Option UseConcMarkSweepGC was deprecated in version 9.0 and will likely be removed in a future release.
   [junit4] <<< JVM J1: EOF ----

[...truncated 145 lines...]
   [junit4] JVM J1: stderr was not empty, see: /home/jenkins/workspace/Lucene-Solr-master-Linux/lucene/build/analysis/smartcn/test/temp/junit4-J1-20170805_064830_1406692025420199097211.syserr
   [junit4] >>> JVM J1 emitted unexpected output (verbatim) ----
   [junit4] Java HotSpot(TM) Server VM warning: Option UseConcMarkSweepGC was deprecated in version 9.0 and will likely be removed in a future release.
   [junit4] <<< JVM J1: EOF ----

[...truncated 3 lines...]
   [junit4] JVM J0: stderr was not empty, see: /home/jenkins/workspace/Lucene-Solr-master-Linux/lucene/build/analysis/smartcn/test/temp/junit4-J0-20170805_064830_140849598823523078159.syserr
   [junit4] >>> JVM J0 emitted unexpected output (verbatim) ----
   [junit4] Java HotSpot(TM) Server VM warning: Option UseConcMarkSweepGC was deprecated in version 9.0 and will likely be removed in a future release.
   [junit4] <<< JVM J0: EOF ----

[...truncated 152 lines...]
   [junit4] JVM J2: stderr was not empty, see: /home/jenkins/workspace/Lucene-Solr-master-Linux/lucene/build/analysis/stempel/test/temp/junit4-J2-20170805_064839_22216127001381530441832.syserr
   [junit4] >>> JVM J2 emitted unexpected output (verbatim) ----
   [junit4] Java HotSpot(TM) Server VM warning: Option UseConcMarkSweepGC was deprecated in version 9.0 and will likely be removed in a future release.
   [junit4] <<< JVM J2: EOF ----

   [junit4] JVM J0: stderr was not empty, see: /home/jenkins/workspace/Lucene-Solr-master-Linux/lucene/build/analysis/stempel/test/temp/junit4-J0-20170805_064839_22210778542858846647747.syserr
   [junit4] >>> JVM J0 emitted unexpected output (verbatim) ----
   [junit4] Java HotSpot(TM) Server VM warning: Option UseConcMarkSweepGC was deprecated in version 9.0 and will likely be removed in a future release.
   [junit4] <<< JVM J0: EOF ----

   [junit4] JVM J1: stderr was not empty, see: /home/jenkins/workspace/Lucene-Solr-master-Linux/lucene/build/analysis/stempel/test/temp/junit4-J1-20170805_064839_2227167746972515949666.syserr
   [junit4] >>> JVM J1 emitted unexpected output (verbatim) ----
   [junit4] Java HotSpot(TM) Server VM warning: Option UseConcMarkSweepGC was deprecated in version 9.0 and will likely be removed in a future release.
   [junit4] <<< JVM J1: EOF ----

[...truncated 161 lines...]
   [junit4] JVM J0: stderr was not empty, see: /home/jenkins/workspace/Lucene-Solr-master-Linux/lucene/build/analysis/uima/test/temp/junit4-J0-20170805_064841_3533781953021808973760.syserr
   [junit4] >>> JVM J0 emitted unexpected output (verbatim) ----
   [junit4] Java HotSpot(TM) Server VM warning: Option UseConcMarkSweepGC was deprecated in version 9.0 and will likely be removed in a future release.
   [junit4] <<< JVM J0: EOF ----

[...truncated 145 lines...]
   [junit4] JVM J1: stderr was not empty, see: /home/jenkins/workspace/Lucene-Solr-master-Linux/lucene/build/backward-codecs/test/temp/junit4-J1-20170805_064848_48528076532788834683.syserr
   [junit4] >>> JVM J1 emitted unexpected output (verbatim) ----
   [junit4] Java HotSpot(TM) Server VM warning: Option UseConcMarkSweepGC was deprecated in version 9.0 and will likely be removed in a future release.
   [junit4] <<< JVM J1: EOF ----

   [junit4] JVM J2: stderr was not empty, see: /home/jenkins/workspace/Lucene-Solr-master-Linux/lucene/build/backward-codecs/test/temp/junit4-J2-20170805_064848_4854406682202224373008.syserr
   [junit4] >>> JVM J2 emitted unexpected output (verbatim) ----
   [junit4] Java HotSpot(TM) Server VM warning: Option UseConcMarkSweepGC was deprecated in version 9.0 and will likely be removed in a future release.
   [junit4] <<< JVM J2: EOF ----

[...truncated 25 lines...]
   [junit4] JVM J0: stderr was not empty, see: /home/jenkins/workspace/Lucene-Solr-master-Linux/lucene/build/backward-codecs/test/temp/junit4-J0-20170805_064848_4845458040220067397555.syserr
   [junit4] >>> JVM J0 emitted unexpected output (verbatim) ----
   [junit4] Java HotSpot(TM) Server VM warning: Option UseConcMarkSweepGC was deprecated in version 9.0 and will likely be removed in a future release.
   [junit4] <<< JVM J0: EOF ----

[...truncated 1209 lines...]
   [junit4] JVM J2: stderr was not empty, see: /home/jenkins/workspace/Lucene-Solr-master-Linux/lucene/build/benchmark/test/temp/junit4-J2-20170805_064858_5663196008072545624926.syserr
   [junit4] >>> JVM J2 emitted unexpected output (verbatim) ----
   [junit4] Java HotSpot(TM) Server VM warning: Option UseConcMarkSweepGC was deprecated in version 9.0 and will likely be removed in a future release.
   [junit4] <<< JVM J2: EOF ----

   [junit4] JVM J1: stderr was not empty, see: /home/jenkins/workspace/Lucene-Solr-master-Linux/lucene/build/benchmark/test/temp/junit4-J1-20170805_064858_5666721955767533220378.syserr
   [junit4] >>> JVM J1 emitted unexpected output (verbatim) ----
   [junit4] Java HotSpot(TM) Server VM warning: Option UseConcMarkSweepGC was deprecated in version 9.0 and will likely be removed in a future release.
   [junit4] <<< JVM J1: EOF ----

[...truncated 3 lines...]
   [junit4] JVM J0: stderr was not empty, see: /home/jenkins/workspace/Lucene-Solr-master-Linux/lucene/build/benchmark/test/temp/junit4-J0-20170805_064858_56614362204549467196438.syserr
   [junit4] >>> JVM J0 emitted unexpected output (verbatim) ----
   [junit4] Java HotSpot(TM) Server VM warning: Option UseConcMarkSweepGC was deprecated in version 9.0 and will likely be removed in a future release.
   [junit4] <<< JVM J0: EOF ----

[...truncated 223 lines...]
   [junit4] JVM J0: stderr was not empty, see: /home/jenkins/workspace/Lucene-Solr-master-Linux/lucene/build/classification/test/temp/junit4-J0-20170805_064905_07314409012811676861067.syserr
   [junit4] >>> JVM J0 emitted unexpected output (verbatim) ----
   [junit4] Java HotSpot(TM) Server VM warning: Option UseConcMarkSweepGC was deprecated in version 9.0 and will likely be removed in a future release.
   [junit4] <<< JVM J0: EOF ----

   [junit4] JVM J1: stderr was not empty, see: /home/jenkins/workspace/Lucene-Solr-master-Linux/lucene/build/classification/test/temp/junit4-J1-20170805_064905_0732268035474368492462.syserr
   [junit4] >>> JVM J1 emitted unexpected output (verbatim) ----
   [junit4] Java HotSpot(TM) Server VM warning: Option UseConcMarkSweepGC was deprecated in version 9.0 and will likely be removed in a future release.
   [junit4] <<< JVM J1: EOF ----

[...truncated 3 lines...]
   [junit4] JVM J2: stderr was not empty, see: /home/jenkins/workspace/Lucene-Solr-master-Linux/lucene/build/classification/test/temp/junit4-J2-20170805_064905_0731900831411918908648.syserr
   [junit4] >>> JVM J2 emitted unexpected output (verbatim) ----
   [junit4] Java HotSpot(TM) Server VM warning: Option UseConcMarkSweepGC was deprecated in version 9.0 and will likely be removed in a future release.
   [junit4] <<< JVM J2: EOF ----

[...truncated 247 lines...]
   [junit4] JVM J2: stderr was not empty, see: /home/jenkins/workspace/Lucene-Solr-master-Linux/lucene/build/codecs/test/temp/junit4-J2-20170805_064913_36914680222303249691557.syserr
   [junit4] >>> JVM J2 emitted unexpected output (verbatim) ----
   [junit4] Java HotSpot(TM) Server VM warning: Option UseConcMarkSweepGC was deprecated in version 9.0 and will likely be removed in a future release.
   [junit4] <<< JVM J2: EOF ----

[...truncated 4 lines...]
   [junit4] JVM J1: stderr was not empty, see: /home/jenkins/workspace/Lucene-Solr-master-Linux/lucene/build/codecs/test/temp/junit4-J1-20170805_064913_36911263962605779654200.syserr
   [junit4] >>> JVM J1 emitted unexpected output (verbatim) ----
   [junit4] Java HotSpot(TM) Server VM warning: Option UseConcMarkSweepGC was deprecated in version 9.0 and will likely be removed in a future release.
   [junit4] <<< JVM J1: EOF ----

[...truncated 7 lines...]
   [junit4] JVM J0: stderr was not empty, see: /home/jenkins/workspace/Lucene-Solr-master-Linux/lucene/build/codecs/test/temp/junit4-J0-20170805_064913_369731756457954985667.syserr
   [junit4] >>> JVM J0 emitted unexpected output (verbatim) ----
   [junit4] Java HotSpot(TM) Server VM warning: Option UseConcMarkSweepGC was deprecated in version 9.0 and will likely be removed in a future release.
   [junit4] <<< JVM J0: EOF ----

[...truncated 229 lines...]
   [junit4] JVM J0: stderr was not empty, see: /home/jenkins/workspace/Lucene-Solr-master-Linux/lucene/build/demo/test/temp/junit4-J0-20170805_065114_4822165170813917441509.syserr
   [junit4] >>> JVM J0 emitted unexpected output (verbatim) ----
   [junit4] JVM J1: stderr was not empty, see: /home/jenkins/workspace/Lucene-Solr-master-Linux/lucene/build/demo/test/temp/junit4-J1-20170805_065114_4824309276370308352845.syserr
   [junit4] Java HotSpot(TM) Server VM warning: Option UseConcMarkSweepGC was deprecated in version 9.0 and will likely be removed in a future release.
   [junit4] <<< JVM J0: EOF ----

[...truncated 3 lines...]
   [junit4] JVM J2: stderr was not empty, see: /home/jenkins/workspace/Lucene-Solr-master-Linux/lucene/build/demo/test/temp/junit4-J2-20170805_065114_48213816702070609969505.syserr
   [junit4] >>> JVM J2 emitted unexpected output (verbatim) ----
   [junit4] Java HotSpot(TM) Server VM warning: Option UseConcMarkSweepGC was deprecated in version 9.0 and will likely be removed in a future release.
   [junit4] <<< JVM J2: EOF ----

[...truncated 162 lines...]
   [junit4] JVM J2: stderr was not empty, see: /home/jenkins/workspace/Lucene-Solr-master-Linux/lucene/build/expressions/test/temp/junit4-J2-20170805_065116_85216012894400599874842.syserr
   [junit4] >>> JVM J2 emitted unexpected output (verbatim) ----
   [junit4] Java HotSpot(TM) Server VM warning: Option UseConcMarkSweepGC was deprecated in version 9.0 and will likely be removed in a future release.
   [junit4] <<< JVM J2: EOF ----

   [junit4] JVM J1: stderr was not empty, see: /home/jenkins/workspace/Lucene-Solr-master-Linux/lucene/build/expressions/test/temp/junit4-J1-20170805_065116_85216944307625482349063.syserr
   [junit4] >>> JVM J1 emitted unexpected output (verbatim) ----
   [junit4] Java HotSpot(TM) Server VM warning: Option UseConcMarkSweepGC was deprecated in version 9.0 and will likely be removed in a future release.
   [junit4] <<< JVM J1: EOF ----

[...truncated 6 lines...]
   [junit4] JVM J0: stderr was not empty, see: /home/jenkins/workspace/Lucene-Solr-master-Linux/lucene/build/expressions/test/temp/junit4-J0-20170805_065116_85217328191646900210337.syserr
   [junit4] >>> JVM J0 emitted unexpected output (verbatim) ----
   [junit4] Java HotSpot(TM) Server VM warning: Option UseConcMarkSweepGC was deprecated in version 9.0 and will likely be removed in a future release.
   [junit4] <<< JVM J0: EOF ----

[...truncated 204 lines...]
   [junit4] JVM J2: stderr was not empty, see: /home/jenkins/workspace/Lucene-Solr-master-Linux/lucene/build/facet/test/temp/junit4-J2-20170805_065122_5414810448604694354933.syserr
   [junit4] >>> JVM J2 emitted unexpected output (verbatim) ----
   [junit4] Java HotSpot(TM) Server VM warning: Option UseConcMarkSweepGC was deprecated in version 9.0 and will likely be removed in a future release.
   [junit4] <<< JVM J2: EOF ----

[...truncated 3 lines...]
   [junit4] JVM J0: stderr was not empty, see: /home/jenkins/workspace/Lucene-Solr-master-Linux/lucene/build/facet/test/temp/junit4-J0-20170805_065122_5419257775041422050693.syserr
   [junit4] >>> JVM J0 emitted unexpected output (verbatim) ----
   [junit4] Java HotSpot(TM) Server VM warning: Option UseConcMarkSweepGC was deprecated in version 9.0 and will likely be removed in a future release.
   [junit4] <<< JVM J0: EOF ----

[...truncated 6 lines...]
   [junit4] JVM J1: stderr was not empty, see: /home/jenkins/workspace/Lucene-Solr-master-Linux/lucene/build/facet/test/temp/junit4-J1-20170805_065122_5417501431783362509209.syserr
   [junit4] >>> JVM J1 emitted unexpected output (verbatim) ----
   [junit4] Java HotSpot(TM) Server VM warning: Option UseConcMarkSweepGC was deprecated in version 9.0 and will likely be removed in a future release.
   [junit4] <<< JVM J1: EOF ----

[...truncated 171 lines...]
   [junit4] JVM J2: stderr was not empty, see: /home/jenkins/workspace/Lucene-Solr-master-Linux/lucene/build/grouping/test/temp/junit4-J2-20170805_065151_37111120415936944901903.syserr
   [junit4] >>> JVM J2 emitted unexpected output (verbatim) ----
   [junit4] Java HotSpot(TM) Server VM warning: Option UseConcMarkSweepGC was deprecated in version 9.0 and will likely be removed in a future release.
   [junit4] <<< JVM J2: EOF ----

[...truncated 3 lines...]
   [junit4] JVM J1: stderr was not empty, see: /home/jenkins/workspace/Lucene-Solr-master-Linux/lucene/build/grouping/test/temp/junit4-J1-20170805_065151_3711433928333503917916.syserr
   [junit4] >>> JVM J1 emitted unexpected output (verbatim) ----
   [junit4] Java HotSpot(TM) Server VM warning: Option UseConcMarkSweepGC was deprecated in version 9.0 and will likely be removed in a future release.
   [junit4] <<< JVM J1: EOF ----

[...truncated 3 lines...]
   [junit4] JVM J0: stderr was not empty, see: /home/jenkins/workspace/Lucene-Solr-master-Linux/lucene/build/grouping/test/temp/junit4-J0-20170805_065151_37117222746944158045079.syserr
   [junit4] >>> JVM J0 emitted unexpected output (verbatim) ----
   [junit4] Java HotSpot(TM) Server VM warning: Option UseConcMarkSweepGC was deprecated in version 9.0 and will likely be removed in a future release.
   [junit4] <<< JVM J0: EOF ----

[...truncated 235 lines...]
   [junit4] JVM J2: stderr was not empty, see: /home/jenkins/workspace/Lucene-Solr-master-Linux/lucene/build/highlighter/test/temp/junit4-J2-20170805_065207_91811801489839921993412.syserr
   [junit4] >>> JVM J2 emitted unexpected output (verbatim) ----
   [junit4] Java HotSpot(TM) Server VM warning: Option UseConcMarkSweepGC was deprecated in version 9.0 and will likely be removed in a future release.
   [junit4] <<< JVM J2: EOF ----

[...truncated 3 lines...]
   [junit4] JVM J0: stderr was not empty, see: /home/jenkins/workspace/Lucene-Solr-master-Linux/lucene/build/highlighter/test/temp/junit4-J0-20170805_065207_91812873319530828245327.syserr
   [junit4] >>> JVM J0 emitted unexpected output (verbatim) ----
   [junit4] Java HotSpot(TM) Server VM warning: Option UseConcMarkSweepGC was deprecated in version 9.0 and will likely be removed in a future release.
   [junit4] <<< JVM J0: EOF ----

[...truncated 3 lines...]
   [junit4] JVM J1: stderr was not empty, see: /home/jenkins/workspace/Lucene-Solr-master-Linux/lucene/build/highlighter/test/temp/junit4-J1-20170805_065207_9185605240415874729164.syserr
   [junit4] >>> JVM J1 emitted unexpected output (verbatim) ----
   [junit4] Java HotSpot(TM) Server VM warning: Option UseConcMarkSweepGC was deprecated in version 9.0 and will likely be removed in a future release.
   [junit4] <<< JVM J1: EOF ----

[...truncated 155 lines...]
   [junit4] JVM J1: stderr was not empty, see: /home/jenkins/workspace/Lucene-Solr-master-Linux/lucene/build/join/test/temp/junit4-J1-20170805_065230_6919782296500722671217.syserr
   [junit4] >>> JVM J1 emitted unexpected output (verbatim) ----
   [junit4] Java HotSpot(TM) Server VM warning: Option UseConcMarkSweepGC was deprecated in version 9.0 and will likely be removed in a future release.
   [junit4] <<< JVM J1: EOF ----

[...truncated 3 lines...]
   [junit4] JVM J0: stderr was not empty, see: /home/jenkins/workspace/Lucene-Solr-master-Linux/lucene/build/join/test/temp/junit4-J0-20170805_065230_691744326534886673171.syserr
   [junit4] >>> JVM J0 emitted unexpected output (verbatim) ----
   [junit4] Java HotSpot(TM) Server VM warning: Option UseConcMarkSweepGC was deprecated in version 9.0 and will likely be removed in a future release.
   [junit4] <<< JVM J0: EOF ----

[...truncated 3 lines...]
   [junit4] JVM J2: stderr was not empty, see: /home/jenkins/workspace/Lucene-Solr-master-Linux/lucene/build/join/test/temp/junit4-J2-20170805_065230_69118426048572161709885.syserr
   [junit4] >>> JVM J2 emitted unexpected output (verbatim) ----
   [junit4] Java HotSpot(TM) Server VM warning: Option UseConcMarkSweepGC was deprecated in version 9.0 and will likely be removed in a future release.
   [junit4] <<< JVM J2: EOF ----

[...truncated 141 lines...]
   [junit4] JVM J0: stderr was not empty, see: /home/jenkins/workspace/Lucene-Solr-master-Linux/lucene/build/memory/test/temp/junit4-J0-20170805_065244_05514721994851959220753.syserr
   [junit4] >>> JVM J0 emitted unexpected output (verbatim) ----
   [junit4] Java HotSpot(TM) Server VM warning: Option UseConcMarkSweepGC was deprecated in version 9.0 and will likely be removed in a future release.
   [junit4] <<< JVM J0: EOF ----

[...truncated 3 lines...]
   [junit4] JVM J1: stderr was not empty, see: /home/jenkins/workspace/Lucene-Solr-master-Linux/lucene/build/memory/test/temp/junit4-J1-20170805_065244_05510679033900622161442.syserr
   [junit4] >>> JVM J1 emitted unexpected output (verbatim) ----
   [junit4] Java HotSpot(TM) Server VM warning: Option UseConcMarkSweepGC was deprecated in version 9.0 and will likely be removed in a future release.
   [junit4] <<< JVM J1: EOF ----

[...truncated 172 lines...]
   [junit4] JVM J2: stderr was not empty, see: /home/jenkins/workspace/Lucene-Solr-master-Linux/lucene/build/misc/test/temp/junit4-J2-20170805_065253_24913028445021971291331.syserr
   [junit4] >>> JVM J2 emitted unexpected output (verbatim) ----
   [junit4] Java HotSpot(TM) Server VM warning: Option UseConcMarkSweepGC was deprecated in version 9.0 and will likely be removed in a future release.
   [junit4] <<< JVM J2: EOF ----

[...truncated 3 lines...]
   [junit4] JVM J1: stderr was not empty, see: /home/jenkins/workspace/Lucene-Solr-master-Linux/lucene/build/misc/test/temp/junit4-J1-20170805_065253_2493220373182856553332.syserr
   [junit4] >>> JVM J1 emitted unexpected output (verbatim) ----
   [junit4] Java HotSpot(TM) Server VM warning: Option UseConcMarkSweepGC was deprecated in version 9.0 and will likely be removed in a future release.
   [junit4] <<< JVM J1: EOF ----

[...truncated 3 lines...]
   [junit4] JVM J0: stderr was not empty, see: /home/jenkins/workspace/Lucene-Solr-master-Linux/lucene/build/misc/test/temp/junit4-J0-20170805_065253_24917390526295281074894.syserr
   [junit4] >>> JVM J0 emitted unexpected output (verbatim) ----
   [junit4] Java HotSpot(TM) Server VM warning: Option UseConcMarkSweepGC was deprecated in version 9.0 and will likely be removed in a future release.
   [junit4] <<< JVM J0: EOF ----

[...truncated 310 lines...]
   [junit4] JVM J0: stderr was not empty, see: /home/jenkins/workspace/Lucene-Solr-master-Linux/lucene/build/queries/test/temp/junit4-J0-20170805_065304_69711814285591917574601.syserr
   [junit4] >>> JVM J0 emitted unexpected output (verbatim) ----
   [junit4] Java HotSpot(TM) Server VM warning: Option UseConcMarkSweepGC was deprecated in version 9.0 and will likely be removed in a future release.
   [junit4] <<< JVM J0: EOF ----

   [junit4] JVM J2: stderr was not empty, see: /home/jenkins/workspace/Lucene-Solr-master-Linux/lucene/build/queries/test/temp/junit4-J2-20170805_065304_69710108592342238471636.syserr
   [junit4] >>> JVM J2 emitted unexpected output (verbatim) ----
   [junit4] Java HotSpot(TM) Server VM warning: Option UseConcMarkSweepGC was deprecated in version 9.0 and will likely be removed in a future release.
   [junit4] <<< JVM J2: EOF ----

   [junit4] JVM J1: stderr was not empty, see: /home/jenkins/workspace/Lucene-Solr-master-Linux/lucene/build/queries/test/temp/junit4-J1-20170805_065304_69713401302933560448061.syserr
   [junit4] >>> JVM J1 emitted unexpected output (verbatim) ----
   [junit4] Java HotSpot(TM) Server VM warning: Option UseConcMarkSweepGC was deprecated in version 9.0 and will likely be removed in a future release.
   [junit4] <<< JVM J1: EOF ----

[...truncated 222 lines...]
   [junit4] JVM J1: stderr was not empty, see: /home/jenkins/workspace/Lucene-Solr-master-Linux/lucene/build/queryparser/test/temp/junit4-J1-20170805_065310_05712798508393932522865.syserr
   [junit4] >>> JVM J1 emitted unexpected output (verbatim) ----
   [junit4] Java HotSpot(TM) Server VM warning: Option UseConcMarkSweepGC was deprecated in version 9.0 and will likely be removed in a future release.
   [junit4] <<< JVM J1: EOF ----

   [junit4] JVM J2: stderr was not empty, see: /home/jenkins/workspace/Lucene-Solr-master-Linux/lucene/build/queryparser/test/temp/junit4-J2-20170805_065310_0579026527578927766909.syserr
   [junit4] >>> JVM J2 emitted unexpected output (verbatim) ----
   [junit4] Java HotSpot(TM) Server VM warning: Option UseConcMarkSweepGC was deprecated in version 9.0 and will likely be removed in a future release.
   [junit4] <<< JVM J2: EOF ----

   [junit4] JVM J0: stderr was not empty, see: /home/jenkins/workspace/Lucene-Solr-master-Linux/lucene/build/queryparser/test/temp/junit4-J0-20170805_065310_0573107250382069549866.syserr
   [junit4] >>> JVM J0 emitted unexpected output (verbatim) ----
   [junit4] Java HotSpot(TM) Server VM warning: Option UseConcMarkSweepGC was deprecated in version 9.0 and will likely be removed in a future release.
   [junit4] <<< JVM J0: EOF ----

[...truncated 199 lines...]
   [junit4] JVM J1: stderr was not empty, see: /home/jenkins/workspace/Lucene-Solr-master-Linux/lucene/build/replicator/test/temp/junit4-J1-20170805_065315_3772826619924136239573.syserr
   [junit4] >>> JVM J1 emitted unexpected output (verbatim) ----
   [junit4] Java HotSpot(TM) Server VM warning: Option UseConcMarkSweepGC was deprecated in version 9.0 and will likely be removed in a future release.
   [junit4] <<< JVM J1: EOF ----

[...truncated 3 lines...]
   [junit4] JVM J0: stderr was not empty, see: /home/jenkins/workspace/Lucene-Solr-master-Linux/lucene/build/replicator/test/temp/junit4-J0-20170805_065315_3772126325017608398023.syserr
   [junit4] >>> JVM J0 emitted unexpected output (verbatim) ----
   [junit4] Java HotSpot(TM) Server VM warning: Option UseConcMarkSweepGC was deprecated in version 9.0 and will likely be removed in a future release.
   [junit4] <<< JVM J0: EOF ----

[...truncated 3 lines...]
   [junit4] JVM J2: stderr was not empty, see: /home/jenkins/workspace/Lucene-Solr-master-Linux/lucene/build/replicator/test/temp/junit4-J2-20170805_065315_37711054913346296554826.syserr
   [junit4] >>> JVM J2 emitted unexpected output (verbatim) ----
   [junit4] Java HotSpot(TM) Server VM warning: Option UseConcMarkSweepGC was deprecated in version 9.0 and will likely be removed in a future release.
   [junit4] <<< JVM J2: EOF ----

[...truncated 173 lines...]
   [junit4] JVM J2: stderr was not empty, see: /home/jenkins/workspace/Lucene-Solr-master-Linux/lucene/build/sandbox/test/temp/junit4-J2-20170805_065326_28113713194538120147544.syserr
   [junit4] >>> JVM J2 emitted unexpected output (verbatim) ----
   [junit4] Java HotSpot(TM) Server VM warning: Option UseConcMarkSweepGC was deprecated in version 9.0 and will likely be removed in a future release.
   [junit4] <<< JVM J2: EOF ----

[...truncated 31 lines...]
   [junit4] JVM J1: stderr was not empty, see: /home/jenkins/workspace/Lucene-Solr-master-Linux/lucene/build/sandbox/test/temp/junit4-J1-20170805_065326_28117824406723908431499.syserr
   [junit4] >>> JVM J1 emitted unexpected output (verbatim) ----
   [junit4] Java HotSpot(TM) Server VM warning: Option UseConcMarkSweepGC was deprecated in version 9.0 and will likely be removed in a future release.
   [junit4] <<< JVM J1: EOF ----

[...truncated 3 lines...]
   [junit4] JVM J0: stderr was not empty, see: /home/jenkins/workspace/Lucene-Solr-master-Linux/lucene/build/sandbox/test/temp/junit4-J0-20170805_065326_28114859422508897150519.syserr
   [junit4] >>> JVM J0 emitted unexpected output (verbatim) ----
   [junit4] Java HotSpot(TM) Server VM warning: Option UseConcMarkSweepGC was deprecated in version 9.0 and will likely be removed in a future release.
   [junit4] <<< JVM J0: EOF ----

[...truncated 213 lines...]
   [junit4] JVM J2: stderr was not empty, see: /home/jenkins/workspace/Lucene-Solr-master-Linux/lucene/build/spatial-extras/test/temp/junit4-J2-20170805_065359_64516355061983932040365.syserr
   [junit4] >>> JVM J2 emitted unexpected output (verbatim) ----
   [junit4] Java HotSpot(TM) Server VM warning: Option UseConcMarkSweepGC was deprecated in version 9.0 and will likely be removed in a future release.
   [junit4] <<< JVM J2: EOF ----

   [junit4] JVM J0: stderr was not empty, see: /home/jenkins/workspace/Lucene-Solr-master-Linux/lucene/build/spatial-extras/test/temp/junit4-J0-20170805_065359_64511768729234468334713.syserr
   [junit4] >>> JVM J0 emitted unexpected output (verbatim) ----
   [junit4] Java HotSpot(TM) Server VM warning: Option UseConcMarkSweepGC was deprecated in version 9.0 and will likely be removed in a future release.
   [junit4] <<< JVM J0: EOF ----

   [junit4] JVM J1: stderr was not empty, see: /home/jenkins/workspace/Lucene-Solr-master-Linux/lucene/build/spatial-extras/test/temp/junit4-J1-20170805_065359_6451631367081347660551.syserr
   [junit4] >>> JVM J1 emitted unexpected output (verbatim) ----
   [junit4] Java HotSpot(TM) Server VM warning: Option UseConcMarkSweepGC was deprecated in version 9.0 and will likely be removed in a future release.
   [junit4] <<< JVM J1: EOF ----

[...truncated 140 lines...]
   [junit4] JVM J0: stderr was not empty, see: /home/jenkins/workspace/Lucene-Solr-master-Linux/lucene/build/spatial/test/temp/junit4-J0-20170805_065408_9146732346164559495833.syserr
   [junit4] >>> JVM J0 emitted unexpected output (verbatim) ----
   [junit4] Java HotSpot(TM) Server VM warning: Option UseConcMarkSweepGC was deprecated in version 9.0 and will likely be removed in a future release.
   [junit4] <<< JVM J0: EOF ----

[...truncated 163 lines...]
   [junit4] JVM J2: stderr was not empty, see: /home/jenkins/workspace/Lucene-Solr-master-Linux/lucene/build/spatial3d/test/temp/junit4-J2-20170805_065411_0468817648185975245009.syserr
   [junit4] >>> JVM J2 emitted unexpected output (verbatim) ----
   [junit4] Java HotSpot(TM) Server VM warning: Option UseConcMarkSweepGC was deprecated in version 9.0 and will likely be removed in a future release.
   [junit4] <<< JVM J2: EOF ----

[...truncated 5 lines...]
   [junit4] JVM J0: stderr was not empty, see: /home/jenkins/workspace/Lucene-Solr-master-Linux/lucene/build/spatial3d/test/temp/junit4-J0-20170805_065411_0465076537959221394155.syserr
   [junit4] >>> JVM J0 emitted unexpected output (verbatim) ----
   [junit4] Java HotSpot(TM) Server VM warning: Option UseConcMarkSweepGC was deprecated in version 9.0 and will likely be removed in a future release.
   [junit4] <<< JVM J0: EOF ----

[...truncated 4 lines...]
   [junit4] JVM J1: stderr was not empty, see: /home/jenkins/workspace/Lucene-Solr-master-Linux/lucene/build/spatial3d/test/temp/junit4-J1-20170805_065411_0463038605372466542647.syserr
   [junit4] >>> JVM J1 emitted unexpected output (verbatim) ----
   [junit4] Java HotSpot(TM) Server VM warning: Option UseConcMarkSweepGC was deprecated in version 9.0 and will likely be removed in a future release.
   [junit4] <<< JVM J1: EOF ----

[...truncated 303 lines...]
   [junit4] JVM J1: stderr was not empty, see: /home/jenkins/workspace/Lucene-Solr-master-Linux/lucene/build/suggest/test/temp/junit4-J1-20170805_065601_58310777279975539148939.syserr
   [junit4] >>> JVM J1 emitted unexpected output (verbatim) ----
   [junit4] Java HotSpot(TM) Server VM warning: Option UseConcMarkSweepGC was deprecated in version 9.0 and will likely be removed in a future release.
   [junit4] <<< JVM J1: EOF ----

[...truncated 3 lines...]
   [junit4] JVM J2: stderr was not empty, see: /home/jenkins/workspace/Lucene-Solr-master-Linux/lucene/build/suggest/test/temp/junit4-J2-20170805_065601_58310434335903771259281.syserr
   [junit4] >>> JVM J2 emitted unexpected output (verbatim) ----
   [junit4] Java HotSpot(TM) Server VM warning: Option UseConcMarkSweepGC was deprecated in version 9.0 and will likely be removed in a future release.
   [junit4] <<< JVM J2: EOF ----

[...truncated 3 lines...]
   [junit4] JVM J0: stderr was not empty, see: /home/jenkins/workspace/Lucene-Solr-master-Linux/lucene/build/suggest/test/temp/junit4-J0-20170805_065601_5835489787766263788000.syserr
   [junit4] >>> JVM J0 emitted unexpected output (verbatim) ----
   [junit4] Java HotSpot(TM) Server VM warning: Option UseConcMarkSweepGC was deprecated in version 9.0 and will likely be removed in a future release.
   [junit4] <<< JVM J0: EOF ----

[...truncated 2315 lines...]
   [junit4] Suite: org.apache.solr.TestDistributedSearch
   [junit4]   2> 686011 INFO  (SUITE-TestDistributedSearch-seed#[5FA99E14ACD87BE9]-worker) [    ] o.a.s.SolrTestCaseJ4 SecureRandom sanity checks: test.solr.allowed.securerandom=null & java.security.egd=file:/dev/./urandom
   [junit4]   2> Creating dataDir: /home/jenkins/workspace/Lucene-Solr-master-Linux/solr/build/solr-core/test/J0/temp/solr.TestDistributedSearch_5FA99E14ACD87BE9-001/init-core-data-001
   [junit4]   2> 686011 WARN  (SUITE-TestDistributedSearch-seed#[5FA99E14ACD87BE9]-worker) [    ] o.a.s.SolrTestCaseJ4 startTrackingSearchers: numOpens=3 numCloses=3
   [junit4]   2> 686011 INFO  (SUITE-TestDistributedSearch-seed#[5FA99E14ACD87BE9]-worker) [    ] o.a.s.SolrTestCaseJ4 Using PointFields (NUMERIC_POINTS_SYSPROP=true) w/NUMERIC_DOCVALUES_SYSPROP=true
   [junit4]   2> 686011 INFO  (SUITE-TestDistributedSearch-seed#[5FA99E14ACD87BE9]-worker) [    ] o.a.s.SolrTestCaseJ4 Randomized ssl (false) and clientAuth (false) via: @org.apache.solr.SolrTestCaseJ4$SuppressSSL(bugUrl="https://issues.apache.org/jira/browse/SOLR-9061")
   [junit4]   2> 686011 INFO  (SUITE-TestDistributedSearch-seed#[5FA99E14ACD87BE9]-worker) [    ] o.a.s.BaseDistributedSearchTestCase Setting hostContext system property: /b_r/x
   [junit4]   2> 686081 INFO  (TEST-TestDistributedSearch.test-seed#[5FA99E14ACD87BE9]) [    ] o.a.s.SolrTestCaseJ4 Writing core.properties file to /home/jenkins/workspace/Lucene-Solr-master-Linux/solr/build/solr-core/test/J0/temp/solr.TestDistributedSearch_5FA99E14ACD87BE9-001/tempDir-001/control/cores/collection1
   [junit4]   2> 686082 INFO  (TEST-TestDistributedSearch.test-seed#[5FA99E14ACD87BE9]) [    ] o.e.j.s.Server jetty-9.3.14.v20161028
   [junit4]   2> 686082 INFO  (TEST-TestDistributedSearch.test-seed#[5FA99E14ACD87BE9]) [    ] o.e.j.s.h.ContextHandler Started o.e.j.s.ServletContextHandler@13fc879{/b_r/x,null,AVAILABLE}
   [junit4]   2> 686084 INFO  (TEST-TestDistributedSearch.test-seed#[5FA99E14ACD87BE9]) [    ] o.e.j.s.AbstractConnector Started ServerConnector@5927ae{HTTP/1.1,[http/1.1]}{127.0.0.1:41183}
   [junit4]   2> 686084 INFO  (TEST-TestDistributedSearch.test-seed#[5FA99E14ACD87BE9]) [    ] o.e.j.s.Server Started @687161ms
   [junit4]   2> 686084 INFO  (TEST-TestDistributedSearch.test-seed#[5FA99E14ACD87BE9]) [    ] o.a.s.c.s.e.JettySolrRunner Jetty properties: {hostContext=/b_r/x, hostPort=41183, coreRootDirectory=/home/jenkins/workspace/Lucene-Solr-master-Linux/solr/build/solr-core/test/J0/temp/solr.TestDistributedSearch_5FA99E14ACD87BE9-001/tempDir-001/control/cores}
   [junit4]   2> 686084 ERROR (TEST-TestDistributedSearch.test-seed#[5FA99E14ACD87BE9]) [    ] o.a.s.s.StartupLoggingUtils Missing Java Option solr.log.dir. Logging may be missing or incomplete.
   [junit4]   2> 686084 INFO  (TEST-TestDistributedSearch.test-seed#[5FA99E14ACD87BE9]) [    ] o.a.s.s.SolrDispatchFilter  ___      _       Welcome to Apache Solr? version 8.0.0
   [junit4]   2> 686084 INFO  (TEST-TestDistributedSearch.test-seed#[5FA99E14ACD87BE9]) [    ] o.a.s.s.SolrDispatchFilter / __| ___| |_ _   Starting in standalone mode on port null
   [junit4]   2> 686084 INFO  (TEST-TestDistributedSearch.test-seed#[5FA99E14ACD87BE9]) [    ] o.a.s.s.SolrDispatchFilter \__ \/ _ \ | '_|  Install dir: null, Default config dir: null
   [junit4]   2> 686084 INFO  (TEST-TestDistributedSearch.test-seed#[5FA99E14ACD87BE9]) [    ] o.a.s.s.SolrDispatchFilter |___/\___/_|_|    Start time: 2017-08-05T07:08:16.113895Z
   [junit4]   2> 686085 INFO  (TEST-TestDistributedSearch.test-seed#[5FA99E14ACD87BE9]) [    ] o.a.s.c.SolrXmlConfig Loading container configuration from /home/jenkins/workspace/Lucene-Solr-master-Linux/solr/build/solr-core/test/J0/temp/solr.TestDistributedSearch_5FA99E14ACD87BE9-001/tempDir-001/control/solr.xml
   [junit4]   2> 686086 INFO  (TEST-TestDistributedSearch.test-seed#[5FA99E14ACD87BE9]) [    ] o.a.s.c.SolrXmlConfig MBean server found: com.sun.jmx.mbeanserver.JmxMBeanServer@10ccc36, but no JMX reporters were configured - adding default JMX reporter.
   [junit4]   2> 686104 INFO  (TEST-TestDistributedSearch.test-seed#[5FA99E14ACD87BE9]) [    ] o.a.s.m.r.SolrJmxReporter JMX monitoring for 'solr.node' (registry 'solr.node') enabled at server: com.sun.jmx.mbeanserver.JmxMBeanServer@10ccc36
   [junit4]   2> 686107 INFO  (TEST-TestDistributedSearch.test-seed#[5FA99E14ACD87BE9]) [    ] o.a.s.m.r.SolrJmxReporter JMX monitoring for 'solr.jvm' (registry 'solr.jvm') enabled at server: com.sun.jmx.mbeanserver.JmxMBeanServer@10ccc36
   [junit4]   2> 686107 INFO  (TEST-TestDistributedSearch.test-seed#[5FA99E14ACD87BE9]) [    ] o.a.s.m.r.SolrJmxReporter JMX monitoring for 'solr.jetty' (registry 'solr.jetty') enabled at server: com.sun.jmx.mbeanserver.JmxMBeanServer@10ccc36
   [junit4]   2> 686108 INFO  (TEST-TestDistributedSearch.test-seed#[5FA99E14ACD87BE9]) [    ] o.a.s.c.CorePropertiesLocator Found 1 core definitions underneath /home/jenkins/workspace/Lucene-Solr-master-Linux/solr/build/solr-core/test/J0/temp/solr.TestDistributedSearch_5FA99E14ACD87BE9-001/tempDir-001/control/cores
   [junit4]   2> 686108 INFO  (TEST-TestDistributedSearch.test-seed#[5FA99E14ACD87BE9]) [    ] o.a.s.c.CorePropertiesLocator Cores are: [collection1]
   [junit4]   2> 686109 INFO  (coreLoadExecutor-2538-thread-1) [    ] o.a.s.c.SolrResourceLoader [null] Added 2 libs to classloader, from paths: [/home/jenkins/workspace/Lucene-Solr-master-Linux/solr/core/src/test-files/solr/collection1/lib, /home/jenkins/workspace/Lucene-Solr-master-Linux/solr/core/src/test-files/solr/collection1/lib/classes]
   [junit4]   2> 686123 INFO  (coreLoadExecutor-2538-thread-1) [    ] o.a.s.c.SolrConfig Using Lucene MatchVersion: 8.0.0
   [junit4]   2> 686137 INFO  (coreLoadExecutor-2538-thread-1) [    ] o.a.s.s.IndexSchema [collection1] Schema name=test
   [junit4]   2> 686180 INFO  (coreLoadExecutor-2538-thread-1) [    ] o.a.s.s.IndexSchema Loaded schema test/1.0 with uniqueid field id
   [junit4]   2> 686201 INFO  (coreLoadExecutor-2538-thread-1) [    ] o.a.s.c.CoreContainer Creating SolrCore 'collection1' using configuration from configset /home/jenkins/workspace/Lucene-Solr-master-Linux/solr/core/src/test-files/solr/collection1, trusted=true
   [junit4]   2> 686201 INFO  (coreLoadExecutor-2538-thread-1) [    ] o.a.s.m.r.SolrJmxReporter JMX monitoring for 'solr.core.collection1' (registry 'solr.core.collection1') enabled at server: com.sun.jmx.mbeanserver.JmxMBeanServer@10ccc36
   [junit4]   2> 686201 INFO  (coreLoadExecutor-2538-thread-1) [    ] o.a.s.c.SolrCore solr.RecoveryStrategy.Builder
   [junit4]   2> 686201 INFO  (coreLoadExecutor-2538-thread-1) [    ] o.a.s.c.SolrCore [[collection1] ] Opening new SolrCore at [/home/jenkins/workspace/Lucene-Solr-master-Linux/solr/core/src/test-files/solr/collection1], dataDir=[/home/jenkins/workspace/Lucene-Solr-master-Linux/solr/build/solr-core/test/J0/temp/solr.TestDistributedSearch_5FA99E14ACD87BE9-001/tempDir-001/control/cores/collection1/data/]
   [junit4]   2> 686203 INFO  (coreLoadExecutor-2538-thread-1) [    ] o.a.s.u.RandomMergePolicy RandomMergePolicy wrapping class org.apache.lucene.index.TieredMergePolicy: [TieredMergePolicy: maxMergeAtOnce=27, maxMergeAtOnceExplicit=13, maxMergedSegmentMB=62.1865234375, floorSegmentMB=1.6162109375, forceMergeDeletesPctAllowed=11.070148917307556, segmentsPerTier=35.0, maxCFSSegmentSizeMB=8.796093022207999E12, noCFSRatio=0.4677772363493181
   [junit4]   2> 686232 INFO  (coreLoadExecutor-2538-thread-1) [    ] o.a.s.u.UpdateHandler Using UpdateLog implementation: org.apache.solr.update.UpdateLog
   [junit4]   2> 686232 INFO  (coreLoadExecutor-2538-thread-1) [    ] o.a.s.u.UpdateLog Initializing UpdateLog: dataDir= defaultSyncLevel=FLUSH numRecordsToKeep=100 maxNumLogsToKeep=10 numVersionBuckets=65536
   [junit4]   2> 686233 INFO  (coreLoadExecutor-2538-thread-1) [    ] o.a.s.u.CommitTracker Hard AutoCommit: disabled
   [junit4]   2> 686233 INFO  (coreLoadExecutor-2538-thread-1) [    ] o.a.s.u.CommitTracker Soft AutoCommit: disabled
   [junit4]   2> 686233 INFO  (coreLoadExecutor-2538-thread-1) [    ] o.a.s.u.RandomMergePolicy RandomMergePolicy wrapping class org.apache.lucene.index.LogDocMergePolicy: [LogDocMergePolicy: minMergeSize=1000, mergeFactor=44, maxMergeSize=9223372036854775807, maxMergeSizeForForcedMerge=9223372036854775807, calibrateSizeByDeletes=true, maxMergeDocs=2147483647, maxCFSSegmentSizeMB=8.796093022207999E12, noCFSRatio=0.0]
   [junit4]   2> 686233 INFO  (coreLoadExecutor-2538-thread-1) [    ] o.a.s.s.SolrIndexSearcher Opening [Searcher@467db5[collection1] main]
   [junit4]   2> 686234 INFO  (coreLoadExecutor-2538-thread-1) [    ] o.a.s.h.c.SpellCheckComponent Initializing spell checkers
   [junit4]   2> 686245 INFO  (coreLoadExecutor-2538-thread-1) [    ] o.a.s.s.DirectSolrSpellChecker init: {name=direct,classname=DirectSolrSpellChecker,field=lowerfilt,minQueryLength=3}
   [junit4]   2> 686295 INFO  (coreLoadExecutor-2538-thread-1) [    ] o.a.s.h.ReplicationHandler Commits will be reserved for  10000
   [junit4]   2> 686295 INFO  (searcherExecutor-2539-thread-1) [    ] o.a.s.h.c.SpellCheckComponent Loading spell index for spellchecker: default
   [junit4]   2> 686295 INFO  (coreLoadExecutor-2538-thread-1) [    ] o.a.s.u.UpdateLog Could not find max version in index or recent updates, using new clock 1574874011479834624
   [junit4]   2> 686295 INFO  (searcherExecutor-2539-thread-1) [    ] o.a.s.h.c.SpellCheckComponent Loading spell index for spellchecker: direct
   [junit4]   2> 686295 INFO  (searcherExecutor-2539-thread-1) [    ] o.a.s.h.c.SpellCheckComponent Loading spell index for spellchecker: wordbreak
   [junit4]   2> 686295 INFO  (searcherExecutor-2539-thread-1) [    ] o.a.s.h.c.SpellCheckComponent Loading spell index for spellchecker: multipleFields
   [junit4]   2> 686295 INFO  (searcherExecutor-2539-thread-1) [    ] o.a.s.h.c.SpellCheckComponent Loading spell index for spellchecker: jarowinkler
   [junit4]   2> 686296 INFO  (searcherExecutor-2539-thread-1) [    ] o.a.s.h.c.SpellCheckComponent Loading spell index for spellchecker: external
   [junit4]   2> 686296 INFO  (searcherExecutor-2539-thread-1) [    ] o.a.s.h.c.SpellCheckComponent Loading spell index for spellchecker: freq
   [junit4]   2> 686296 INFO  (searcherExecutor-2539-thread-1) [    ] o.a.s.h.c.SpellCheckComponent Loading spell index for spellchecker: fqcn
   [junit4]   2> 686296 INFO  (searcherExecutor-2539-thread-1) [    ] o.a.s.h.c.SpellCheckComponent Loading spell index for spellchecker: perDict
   [junit4]   2> 686297 INFO  (searcherExecutor-2539-thread-1) [    ] o.a.s.c.SolrCore [collection1] Registered new searcher Searcher@467db5[collection1] main{ExitableDirectoryReader(UninvertingDirectoryReader())}
   [junit4]   2> 686693 INFO  (TEST-TestDistributedSearch.test-seed#[5FA99E14ACD87BE9]) [    ] o.a.s.SolrTestCaseJ4 Writing core.properties file to /home/jenkins/workspace/Lucene-Solr-master-Linux/solr/build/solr-core/test/J0/temp/solr.TestDistributedSearch_5FA99E14ACD87BE9-001/tempDir-001/shard0/cores/collection1
   [junit4]   2> 686693 INFO  (TEST-TestDistributedSearch.test-seed#[5FA99E14ACD87BE9]) [    ] o.e.j.s.Server jetty-9.3.14.v20161028
   [junit4]   2> 686694 INFO  (TEST-TestDistributedSearch.test-seed#[5FA99E14ACD87BE9]) [    ] o.e.j.s.h.ContextHandler Started o.e.j.s.ServletContextHandler@7eca5e{/b_r/x,null,AVAILABLE}
   [junit4]   2> 686694 INFO  (TEST-TestDistributedSearch.test-seed#[5FA99E14ACD87BE9]) [    ] o.e.j.s.AbstractConnector Started ServerConnector@12bc46a{HTTP/1.1,[http/1.1]}{127.0.0.1:42479}
   [junit4]   2> 686694 INFO  (TEST-TestDistributedSearch.test-seed#[5FA99E14ACD87BE9]) [    ] o.e.j.s.Server Started @687771ms
   [junit4]   2> 686694 INFO  (TEST-TestDistributedSearch.test-seed#[5FA99E14ACD87BE9]) [    ] o.a.s.c.s.e.JettySolrRunner Jetty properties: {hostContext=/b_r/x, hostPort=42479, coreRootDirectory=/home/jenkins/workspace/Lucene-Solr-master-Linux/solr/build/solr-core/test/J0/temp/solr.TestDistributedSearch_5FA99E14ACD87BE9-001/tempDir-001/shard0/cores}
   [junit4]   2> 686695 ERROR (TEST-TestDistributedSearch.test-seed#[5FA99E14ACD87BE9]) [    ] o.a.s.s.StartupLoggingUtils Missing Java Option solr.log.dir. Logging may be missing or incomplete.
   [junit4]   2> 686695 INFO  (TEST-TestDistributedSearch.test-seed#[5FA99E14ACD87BE9]) [    ] o.a.s.s.SolrDispatchFilter  ___      _       Welcome to Apache Solr? version 8.0.0
   [junit4]   2> 686695 INFO  (TEST-TestDistributedSearch.test-seed#[5FA99E14ACD87BE9]) [    ] o.a.s.s.SolrDispatchFilter / __| ___| |_ _   Starting in standalone mode on port null
   [junit4]   2> 686695 INFO  (TEST-TestDistributedSearch.test-seed#[5FA99E14ACD87BE9]) [    ] o.a.s.s.SolrDispatchFilter \__ \/ _ \ | '_|  Install dir: null, Default config dir: null
   [junit4]   2> 686695 INFO  (TEST-TestDistributedSearch.test-seed#[5FA99E14ACD87BE9]) [    ] o.a.s.s.SolrDispatchFilter |___/\___/_|_|    Start time: 2017-08-05T07:08:16.724296Z
   [junit4]   2> 686695 INFO  (TEST-TestDistributedSearch.test-seed#[5FA99E14ACD87BE9]) [    ] o.a.s.c.SolrXmlConfig Loading container configuration from /home/jenkins/workspace/Lucene-Solr-master-Linux/solr/build/solr-core/test/J0/temp/solr.TestDistributedSearch_5FA99E14ACD87BE9-001/tempDir-001/shard0/solr.xml
   [junit4]   2> 686697 INFO  (TEST-TestDistributedSearch.test-seed#[5FA99E14ACD87BE9]) [    ] o.a.s.c.SolrXmlConfig MBean server found: com.sun.jmx.mbeanserver.JmxMBeanServer@10ccc36, but no JMX reporters were configured - adding default JMX reporter.
   [junit4]   2> 686712 INFO  (TEST-TestDistributedSearch.test-seed#[5FA99E14ACD87BE9]) [    ] o.a.s.m.r.SolrJmxReporter JMX monitoring for 'solr.node' (registry 'solr.node') enabled at server: com.sun.jmx.mbeanserver.JmxMBeanServer@10ccc36
   [junit4]   2> 686716 INFO  (TEST-TestDistributedSearch.test-seed#[5FA99E14ACD87BE9]) [    ] o.a.s.m.r.SolrJmxReporter JMX monitoring for 'solr.jvm' (registry 'solr.jvm') enabled at server: com.sun.jmx.mbeanserver.JmxMBeanServer@10ccc36
   [junit4]   2> 686716 INFO  (TEST-TestDistributedSearch.test-seed#[5FA99E14ACD87BE9]) [    ] o.a.s.m.r.SolrJmxReporter JMX monitoring for 'solr.jetty' (registry 'solr.jetty') enabled at server: com.sun.jmx.mbeanserver.JmxMBeanServer@10ccc36
   [junit4]   2> 686717 INFO  (TEST-TestDistributedSearch.test-seed#[5FA99E14ACD87BE9]) [    ] o.a.s.c.CorePropertiesLocator Found 1 core definitions underneath /home/jenkins/workspace/Lucene-Solr-master-Linux/solr/build/solr-core/test/J0/temp/solr.TestDistributedSearch_5FA99E14ACD87BE9-001/tempDir-001/shard0/cores
   [junit4]   2> 686717 INFO  (TEST-TestDistributedSearch.test-seed#[5FA99E14ACD87BE9]) [    ] o.a.s.c.CorePropertiesLocator Cores are: [collection1]
   [junit4]   2> 686717 INFO  (coreLoadExecutor-2549-thread-1) [    ] o.a.s.c.SolrResourceLoader [null] Added 2 libs to classloader, from paths: [/home/jenkins/workspace/Lucene-Solr-master-Linux/solr/core/src/test-files/solr/collection1/lib, /home/jenkins/workspace/Lucene-Solr-master-Linux/solr/core/src/test-files/solr/collection1/lib/classes]
   [junit4]   2> 686734 INFO  (coreLoadExecutor-2549-thread-1) [    ] o.a.s.c.SolrConfig Using Lucene MatchVersion: 8.0.0
   [junit4]   2> 686746 INFO  (coreLoadExecutor-2549-thread-1) [    ] o.a.s.s.IndexSchema [collection1] Schema name=test
   [junit4]   2> 686793 INFO  (coreLoadExecutor-2549-thread-1) [    ] o.a.s.s.IndexSchema Loaded schema test/1.0 with uniqueid field id
   [junit4]   2> 686798 INFO  (coreLoadExecutor-2549-thread-1) [    ] o.a.s.c.CoreContainer Creating SolrCore 'collection1' using configuration from configset /home/jenkins/workspace/Lucene-Solr-master-Linux/solr/core/src/test-files/solr/collection1, trusted=true
   [junit4]   2> 686798 INFO  (coreLoadExecutor-2549-thread-1) [    ] o.a.s.m.r.SolrJmxReporter JMX monitoring for 'solr.core.collection1' (registry 'solr.core.collection1') enabled at server: com.sun.jmx.mbeanserver.JmxMBeanServer@10ccc36
   [junit4]   2> 686798 INFO  (coreLoadExecutor-2549-thread-1) [    ] o.a.s.c.SolrCore solr.RecoveryStrategy.Builder
   [junit4]   2> 686798 INFO  (coreLoadExecutor-2549-thread-1) [    ] o.a.s.c.SolrCore [[collection1] ] Opening new SolrCore at [/home/jenkins/workspace/Lucene-Solr-master-Linux/solr/core/src/test-files/solr/collection1], dataDir=[/home/jenkins/workspace/Lucene-Solr-master-Linux/solr/build/solr-core/test/J0/temp/solr.TestDistributedSearch_5FA99E14ACD87BE9-001/tempDir-001/shard0/cores/collection1/data/]
   [junit4]   2> 686799 INFO  (coreLoadExecutor-2549-thread-1) [    ] o.a.s.u.RandomMergePolicy RandomMergePolicy wrapping class org.apache.lucene.index.TieredMergePolicy: [TieredMergePolicy: maxMergeAtOnce=27, maxMergeAtOnceExplicit=13, maxMergedSegmentMB=62.1865234375, floorSegmentMB=1.6162109375, forceMergeDeletesPctAllowed=11.070148917307556, segmentsPerTier=35.0, maxCFSSegmentSizeMB=8.796093022207999E12, noCFSRatio=0.4677772363493181
   [junit4]   2> 686828 INFO  (coreLoadExecutor-2549-thread-1) [    ] o.a.s.u.UpdateHandler Using UpdateLog implementation: org.apache.solr.update.UpdateLog
   [junit4]   2> 686828 INFO  (coreLoadExecutor-2549-thread-1) [    ] o.a.s.u.UpdateLog Initializing UpdateLog: dataDir= defaultSyncLevel=FLUSH numRecordsToKeep=100 maxNumLogsToKeep=10 numVersionBuckets=65536
   [junit4]   2> 686828 INFO  (coreLoadExecutor-2549-thread-1) [    ] o.a.s.u.CommitTracker Hard AutoCommit: disabled
   [junit4]   2> 686828 INFO  (coreLoadExecutor-2549-thread-1) [    ] o.a.s.u.CommitTracker Soft AutoCommit: disabled
   [junit4]   2> 686829 INFO  (coreLoadExecutor-2549-thread-1) [    ] o.a.s.u.RandomMergePolicy RandomMergePolicy wrapping class org.apache.lucene.index.LogDocMergePolicy: [LogDocMergePolicy: minMergeSize=1000, mergeFactor=44, maxMergeSize=9223372036854775807, maxMergeSizeForForcedMerge=9223372036854775807, calibrateSizeByDeletes=true, maxMergeDocs=2147483647, maxCFSSegmentSizeMB=8.796093022207999E12, noCFSRatio=0.0]
   [junit4]   2> 686829 INFO  (coreLoadExecutor-2549-thread-1) [    ] o.a.s.s.SolrIndexSearcher Opening [Searcher@12fce07[collection1] main]
   [junit4]   2> 686829 INFO  (coreLoadExecutor-2549-thread-1) [    ] o.a.s.h.c.SpellCheckComponent Initializing spell checkers
   [junit4]   2> 686841 INFO  (coreLoadExecutor-2549-thread-1) [    ] o.a.s.s.DirectSolrSpellChecker init: {name=direct,classname=DirectSolrSpellChecker,field=lowerfilt,minQueryLength=3}
   [junit4]   2> 686902 INFO  (coreLoadExecutor-2549-thread-1) [    ] o.a.s.h.ReplicationHandler Commits will be reserved for  10000
   [junit4]   2> 686903 INFO  (searcherExecutor-2550-thread-1) [    ] o.a.s.h.c.SpellCheckComponent Loading spell index for spellchecker: default
   [junit4]   2> 686903 INFO  (coreLoadExecutor-2549-thread-1) [    ] o.a.s.u.UpdateLog Could not find max version in index or recent updates, using new clock 1574874012117368832
   [junit4]   2> 686903 INFO  (searcherExecutor-2550-thread-1) [    ] o.a.s.h.c.SpellCheckComponent Loading spell index for spellchecker: direct
   [junit4]   2> 686903 INFO  (searcherExecutor-2550-thread-1) [    ] o.a.s.h.c.SpellCheckComponent Loading spell index for spellchecker: wordbreak
   [junit4]   2> 686903 INFO  (searcherExecutor-2550-thread-1) [    ] o.a.s.h.c.SpellCheckComponent Loading spell index for spellchecker: multipleFields
   [junit4]   2> 686903 INFO  (searcherExecutor-2550-thread-1) [    ] o.a.s.h.c.SpellCheckComponent Loading spell index for spellchecker: jarowinkler
   [junit4]   2> 686904 INFO  (searcherExecutor-2550-thread-1) [    ] o.a.s.h.c.SpellCheckComponent Loading spell index for spellchecker: external
   [junit4]   2> 686904 INFO  (searcherExecutor-2550-thread-1) [    ] o.a.s.h.c.SpellCheckComponent Loading spell index for spellchecker: freq
   [junit4]   2> 686904 INFO  (searcherExecutor-2550-thread-1) [    ] o.a.s.h.c.SpellCheckComponent Loading spell index for spellchecker: fqcn
   [junit4]   2> 686904 INFO  (searcherExecutor-2550-thread-1) [    ] o.a.s.h.c.SpellCheckComponent Loading spell index for spellchecker: perDict
   [junit4]   2> 686906 INFO  (searcherExecutor-2550-thread-1) [    ] o.a.s.c.SolrCore [collection1] Registered new searcher Searcher@12fce07[collection1] main{ExitableDirectoryReader(UninvertingDirectoryReader())}
   [junit4]   2> 687233 INFO  (TEST-TestDistributedSearch.test-seed#[5FA99E14ACD87BE9]) [    ] o.a.s.SolrTestCaseJ4 ###Starting test
   [junit4]   2> 687239 INFO  (qtp6905117-6284) [    ] o.a.s.u.p.LogUpdateProcessorFactory [collection1]  webapp=/b_r/x path=/update params={wt=javabin&version=2}{deleteByQuery=*:* (-1574874012465496064)} 0 3
   [junit4]   2> 687243 INFO  (qtp2925167-6301) [    ] o.a.s.u.p.LogUpdateProcessorFactory [collection1]  webapp=/b_r/x path=/update params={wt=javabin&version=2}{deleteByQuery=*:* (-1574874012470738944)} 0 3
   [junit4]   2> 687247 INFO  (qtp6905117-6285) [    ] o.a.s.u.p.LogUpdateProcessorFactory [collection1]  webapp=/b_r/x path=/update params={wt=javabin&version=2}{add=[1 (1574874012474933248)]} 0 2
   [junit4]   2> 687249 INFO  (qtp2925167-6302) [    ] o.a.s.u.p.LogUpdateProcessorFactory [collection1]  webapp=/b_r/x path=/update params={wt=javabin&version=2}{add=[1 (1574874012478078976)]} 0 1
   [junit4]   2> 687251 INFO  (qtp6905117-6286) [    ] o.a.s.u.p.LogUpdateProcessorFactory [collection1]  webapp=/b_r/x path=/update params={wt=javabin&version=2}{add=[2 (1574874012481224704)]} 0 0
   [junit4]   2> 687252 INFO  (qtp2925167-6303) [    ] o.a.s.u.p.LogUpdateProcessorFactory [collection1]  webapp=/b_r/x path=/update params={wt=javabin&version=2}{add=[2 (1574874012482273280)]} 0 0
   [junit4]   2> 687253 INFO  (qtp6905117-6279) [    ] o.a.s.u.p.LogUpdateProcessorFactory [collection1]  webapp=/b_r/x path=/update params={wt=javabin&version=2}{add=[3 (1574874012483321856)]} 0 0
   [junit4]   2> 687254 INFO  (qtp2925167-6296) [    ] o.a.s.u.p.LogUpdateProcessorFactory [collection1]  webapp=/b_r/x path=/update params={wt=javabin&version=2}{add=[3 (1574874012484370432)]} 0 0
   [junit4]   2> 687255 INFO  (qtp6905117-6284) [    ] o.a.s.u.p.LogUpdateProcessorFactory [collection1]  webapp=/b_r/x path=/update params={wt=javabin&version=2}{add=[4 (1574874012485419008)]} 0 0
   [junit4]   2> 687256 INFO  (qtp2925167-6301) [    ] o.a.s.u.p.LogUpdateProcessorFactory [collection1]  webapp=/b_r/x path=/update params={wt=javabin&version=2}{add=[4 (1574874012486467584)]} 0 0
   [junit4]   2> 687257 INFO  (qtp6905117-6285) [    ] o.a.s.u.p.LogUpdateProcessorFactory [collection1]  webapp=/b_r/x path=/update params={wt=javabin&version=2}{add=[5 (1574874012487516160)]} 0 0
   [junit4]   2> 687258 INFO  (qtp2925167-6302) [    ] o.a.s.u.p.LogUpdateProcessorFactory [collection1]  webapp=/b_r/x path=/update params={wt=javabin&version=2}{add=[5 (1574874012488564736)]} 0 0
   [junit4]   2> 687259 INFO  (qtp6905117-6286) [    ] o.a.s.u.p.LogUpdateProcessorFactory [collection1]  webapp=/b_r/x path=/update params={wt=javabin&version=2}{add=[6 (1574874012489613312)]} 0 0
   [junit4]   2> 687260 INFO  (qtp2925167-6303) [    ] o.a.s.u.p.LogUpdateProcessorFactory [collection1]  webapp=/b_r/x path=/update params={wt=javabin&version=2}{add=[6 (1574874012491710464)]} 0 0
   [junit4]   2> 687261 INFO  (qtp6905117-6279) [    ] o.a.s.u.p.LogUpdateProcessorFactory [collection1]  webapp=/b_r/x path=/update params={wt=javabin&version=2}{add=[7 (1574874012492759040)]} 0 0
   [junit4]   2> 687262 INFO  (qtp2925167-6296) [    ] o.a.s.u.p.LogUpdateProcessorFactory [collection1]  webapp=/b_r/x path=/update params={wt=javabin&version=2}{add=[7 (1574874012492759040)]} 0 0
   [junit4]   2> 687263 INFO  (qtp6905117-6284) [    ] o.a.s.u.p.LogUpdateProcessorFactory [collection1]  webapp=/b_r/x path=/update params={wt=javabin&version=2}{add=[8 (1574874012494856192)]} 0 0
   [junit4]   2> 687264 INFO  (qtp2925167-6301) [    ] o.a.s.u.p.LogUpdateProcessorFactory [collection1]  webapp=/b_r/x path=/update params={wt=javabin&version=2}{add=[8 (1574874012495904768)]} 0 0
   [junit4]   2> 687265 INFO  (qtp6905117-6285) [    ] o.a.s.u.p.LogUpdateProcessorFactory [collection1]  webapp=/b_r/x path=/update params={wt=javabin&version=2}{add=[9 (1574874012496953344)]} 0 0
   [junit4]   2> 687266 INFO  (qtp2925167-6302) [    ] o.a.s.u.p.LogUpdateProcessorFactory [collection1]  webapp=/b_r/x path=/update params={wt=javabin&version=2}{add=[9 (1574874012496953344)]} 0 0
   [junit4]   2> 687266 INFO  (qtp6905117-6286) [    ] o.a.s.u.DirectUpdateHandler2 start commit{_version_=1574874012498001920,optimize=false,openSearcher=true,waitSearcher=true,expungeDeletes=false,softCommit=false,prepareCommit=false}
   [junit4]   2> 687266 INFO  (qtp6905117-6286) [    ] o.a.s.u.SolrIndexWriter Calling setCommitData with IW:org.apache.solr.update.SolrIndexWriter@f02442 commitCommandVersion:1574874012498001920
   [junit4]   2> 687280 INFO  (qtp6905117-6286) [    ] o.a.s.s.SolrIndexSearcher Opening [Searcher@8e8949[collection1] main]
   [junit4]   2> 687281 INFO  (qtp6905117-6286) [    ] o.a.s.u.DirectUpdateHandler2 end_commit_flush
   [junit4]   2> 687283 INFO  (searcherExecutor-2539-thread-1) [    ] o.a.s.c.SolrCore [collection1] Registered new searcher Searcher@8e8949[collection1] main{ExitableDirectoryReader(UninvertingDirectoryReader(Uninverting(_0(8.0.0):c9)))}
   [junit4]   2> 687283 INFO  (qtp6905117-6286) [    ] o.a.s.u.p.LogUpdateProcessorFactory [collection1]  webapp=/b_r/x path=/update params={waitSearcher=true&commit=true&softCommit=false&wt=javabin&version=2}{commit=} 0 16
   [junit4]   2> 687283 INFO  (qtp2925167-6303) [    ] o.a.s.u.DirectUpdateHandler2 start commit{_version_=1574874012515827712,optimize=false,openSearcher=true,waitSearcher=true,expungeDeletes=false,softCommit=false,prepareCommit=false}
   [junit4]   2> 687283 INFO  (qtp2925167-6303) [    ] o.a.s.u.SolrIndexWriter Calling setCommitData with IW:org.apache.solr.update.SolrIndexWriter@56e4b1 commitCommandVersion:1574874012515827712
   [junit4]   2> 687290 INFO  (qtp2925167-6303) [    ] o.a.s.s.SolrIndexSearcher Opening [Searcher@1fd79e9[collection1] main]
   [junit4]   2> 687290 INFO  (qtp2925167-6303) [    ] o.a.s.u.DirectUpdateHandler2 end_commit_flush
   [junit4]   2> 687291 INFO  (searcherExecutor-2550-thread-1) [    ] o.a.s.c.SolrCore [collection1] Registered new searcher Searcher@1fd79e9[collection1] main{ExitableDirectoryReader(UninvertingDirectoryReader(Uninverting(_0(8.0.0):c9)))}
   [junit4]   2> 687291 INFO  (qtp2925167-6303) [    ] o.a.s.u.p.LogUpdateProcessorFactory [collection1]  webapp=/b_r/x path=/update params={waitSearcher=true&commit=true&softCommit=false&wt=javabin&version=2}{commit=} 0 7
   [junit4]   2> 687293 INFO  (qtp6905117-6279) [    ] o.a.s.u.p.LogUpdateProcessorFactory [collection1]  webapp=/b_r/x path=/update params={wt=javabin&version=2}{add=[10 (1574874012524216320)]} 0 1
   [junit4]   2> 687295 INFO  (qtp2925167-6296) [    ] o.a.s.u.p.LogUpdateProcessorFactory [collection1]  webapp=/b_r/x path=/update params={wt=javabin&version=2}{add=[10 (1574874012527362048)]} 0 1
   [junit4]   2> 687296 INFO  (qtp6905117-6284) [    ] o.a.s.u.p.LogUpdateProcessorFactory [collection1]  webapp=/b_r/x path=/update params={wt=javabin&version=2}{add=[11 (1574874012528410624)]} 0 0
   [junit4]   2> 687297 INFO  (qtp2925167-6301) [    ] o.a.s.u.p.LogUpdateProcessorFactory [collection1]  webapp=/b_r/x path=/update params={wt=javabin&version=2}{add=[11 (1574874012529459200)]} 0 0
   [junit4]   2> 687297 INFO  (qtp6905117-6285) [    ] o.a.s.u.p.LogUpdateProcessorFactory [collection1]  webapp=/b_r/x path=/update params={wt=javabin&version=2}{add=[12 (1574874012530507776)]} 0 0
   [junit4]   2> 687298 INFO  (qtp2925167-6302) [    ] o.a.s.u.p.LogUpdateProcessorFactory [collection1]  webapp=/b_r/x path=/update params={wt=javabin&version=2}{add=[12 (1574874012531556352)]} 0 0
   [junit4]   2> 687299 INFO  (qtp6905117-6286) [    ] o.a.s.u.p.LogUpdateProcessorFactory [collection1]  webapp=/b_r/x path=/update params={wt=javabin&version=2}{add=[13 (1574874012532604928)]} 0 0
   [junit4]   2> 687299 INFO  (qtp2925167-6303) [    ] o.a.s.u.p.LogUpdateProcessorFactory [collection1]  webapp=/b_r/x path=/update params={wt=javabin&version=2}{add=[13 (1574874012532604928)]} 0 0
   [junit4]   2> 687300 INFO  (qtp6905117-6279) [    ] o.a.s.u.p.LogUpdateProcessorFactory [collection1]  webapp=/b_r/x path=/update params={wt=javabin&version=2}{add=[1001 (1574874012532604929)]} 0 0
   [junit4]   2> 687301 INFO  (qtp2925167-6296) [    ] o.a.s.u.p.LogUpdateProcessorFactory [collection1]  webapp=/b_r/x path=/update params={wt=javabin&version=2}{add=[1001 (1574874012533653504)]} 0 0
   [junit4]   2> 687301 INFO  (qtp6905117-6284) [    ] o.a.s.u.p.LogUpdateProcessorFactory [collection1]  webapp=/b_r/x path=/update params={wt=javabin&version=2}{add=[14 (1574874012534702080)]} 0 0
   [junit4]   2> 687301 INFO  (qtp2925167-6301) [    ] o.a.s.u.p.LogUpdateProcessorFactory [collection1]  webapp=/b_r/x path=/update params={wt=javabin&version=2}{add=[14 (1574874012534702080)]} 0 0
   [junit4]   2> 687302 INFO  (qtp6905117-6285) [    ] o.a.s.u.p.LogUpdateProcessorFactory [collection1]  webapp=/b_r/x path=/update params={wt=javabin&version=2}{add=[15 (1574874012535750656)]} 0 0
   [junit4]   2> 687302 INFO  (qtp2925167-6302) [    ] o.a.s.u.p.LogUpdateProcessorFactory [collection1]  webapp=/b_r/x path=/update params={wt=javabin&version=2}{add=[15 (1574874012535750656)]} 0 0
   [junit4]   2> 687302 INFO  (qtp6905117-6286) [    ] o.a.s.u.p.LogUpdateProcessorFactory [collection1]  webapp=/b_r/x path=/update params={wt=javabin&version=2}{add=[16 (1574874012535750657)]} 0 0
   [junit4]   2> 687303 INFO  (qtp2925167-6303) [    ] o.a.s.u.p.LogUpdateProcessorFactory [collection1]  webapp=/b_r/x path=/update params={wt=javabin&version=2}{add=[16 (1574874012535750657)]} 0 0
   [junit4]   2> 687303 INFO  (qtp6905117-6279) [    ] o.a.s.u.p.LogUpdateProcessorFactory [collection1]  webapp=/b_r/x path=/update params={wt=javabin&version=2}{add=[17 (1574874012536799232)]} 0 0
   [junit4]   2> 687303 INFO  (qtp2925167-6296) [    ] o.a.s.u.p.LogUpdateProcessorFactory [collection1]  webapp=/b_r/x path=/update params={wt=javabin&version=2}{add=[17 (1574874012536799232)]} 0 0
   [junit4]   2> 687304 INFO  (qtp6905117-6284) [    ] o.a.s.u.p.LogUpdateProcessorFactory [collection1]  webapp=/b_r/x path=/update params={wt=javabin&version=2}{add=[100 (1574874012537847808)]} 0 0
   [junit4]   2> 687304 INFO  (qtp2925167-6301) [    ] o.a.s.u.p.LogUpdateProcessorFactory [collection1]  webapp=/b_r/x path=/update params={wt=javabin&version=2}{add=[100 (1574874012537847808)]} 0 0
   [junit4]   2> 687304 INFO  (qtp6905117-6285) [    ] o.a.s.u.p.LogUpdateProcessorFactory [collection1]  webapp=/b_r/x path=/update params={wt=javabin&version=2}{add=[101 (1574874012537847809)]} 0 0
   [junit4]   2> 687304 INFO  (qtp2925167-6302) [    ] o.a.s.u.p.LogUpdateProcessorFactory [collection1]  webapp=/b_r/x path=/update params={wt=javabin&version=2}{add=[101 (1574874012537847809)]} 0 0
   [junit4]   2> 687305 INFO  (qtp6905117-6286) [    ] o.a.s.u.p.LogUpdateProcessorFactory [collection1]  webapp=/b_r/x path=/update params={wt=javabin&version=2}{add=[102 (1574874012538896384)]} 0 0
   [junit4]   2> 687305 INFO  (qtp2925167-6303) [    ] o.a.s.u.p.LogUpdateProcessorFactory [collection1]  webapp=/b_r/x path=/update params={wt=javabin&version=2}{add=[102 (1574874012538896384)]} 0 0
   [junit4]   2> 687305 INFO  (qtp6905117-6279) [    ] o.a.s.u.p.LogUpdateProcessorFactory [collection1]  webapp=/b_r/x path=/update params={wt=javabin&version=2}{add=[103 (1574874012538896385)]} 0 0
   [junit4]   2> 687306 INFO  (qtp2925167-6296) [    ] o.a.s.u.p.LogUpdateProcessorFactory [collection1]  webapp=/b_r/x path=/update params={wt=javabin&version=2}{add=[103 (1574874012538896385)]} 0 0
   [junit4]   2> 687306 INFO  (qtp6905117-6284) [    ] o.a.s.u.p.LogUpdateProcessorFactory [collection1]  webapp=/b_r/x path=/update params={wt=javabin&version=2}{add=[104 (1574874012539944960)]} 0 0
   [junit4]   2> 687306 INFO  (qtp2925167-6301) [    ] o.a.s.u.p.LogUpdateProcessorFactory [collection1]  webapp=/b_r/x path=/update params={wt=javabin&version=2}{add=[104 (1574874012539944960)]} 0 0
   [junit4]   2> 687307 INFO  (qtp6905117-6285) [    ] o.a.s.u.p.LogUpdateProcessorFactory [collection1]  webapp=/b_r/x path=/update params={wt=javabin&version=2}{add=[105 (1574874012539944961)]} 0 0
   [junit4]   2> 687307 INFO  (qtp2925167-6302) [    ] o.a.s.u.p.LogUpdateProcessorFactory [collection1]  webapp=/b_r/x path=/update params={wt=javabin&version=2}{add=[105 (1574874012540993536)]} 0 0
   [junit4]   2> 687307 INFO  (qtp6905117-6286) [    ] o.a.s.u.p.LogUpdateProcessorFactory [collection1]  webapp=/b_r/x path=/update params={wt=javabin&version=2}{add=[106 (1574874012540993536)]} 0 0
   [junit4]   2> 687307 INFO  (qtp2925167-6303) [    ] o.a.s.u.p.LogUpdateProcessorFactory [collection1]  webapp=/b_r/x path=/update params={wt=javabin&version=2}{add=[106 (1574874012540993537)]} 0 0
   [junit4]   2> 687308 INFO  (qtp6905117-6279) [    ] o.a.s.u.p.LogUpdateProcessorFactory [collection1]  webapp=/b_r/x path=/update params={wt=javabin&version=2}{add=[107 (1574874012542042112)]} 0 0
   [junit4]   2> 687308 INFO  (qtp2925167-6296) [    ] o.a.s.u.p.LogUpdateProcessorFactory [collection1]  webapp=/b_r/x path=/update params={wt=javabin&version=2}{add=[107 (1574874012542042112)]} 0 0
   [junit4]   2> 687308 INFO  (qtp6905117-6284) [    ] o.a.s.u.p.LogUpdateProcessorFactory [collection1]  webapp=/b_r/x path=/update params={wt=javabin&version=2}{add=[108 (1574874012542042113)]} 0 0
   [junit4]   2> 687309 INFO  (qtp2925167-6301) [    ] o.a.s.u.p.LogUpdateProcessorFactory [collection1]  webapp=/b_r/x path=/update params={wt=javabin&version=2}{add=[108 (1574874012542042113)]} 0 0
   [junit4]   2> 687309 INFO  (qtp6905117-6285) [    ] o.a.s.u.p.LogUpdateProcessorFactory [collection1]  webapp=/b_r/x path=/update params={wt=javabin&version=2}{add=[109 (1574874012543090688)]} 0 0
   [junit4]   2> 687309 INFO  (qtp2925167-6302) [    ] o.a.s.u.p.LogUpdateProcessorFactory [collection1]  webapp=/b_r/x path=/update params={wt=javabin&version=2}{add=[109 (1574874012543090688)]} 0 0
   [junit4]   2> 687310 INFO  (qtp6905117-6286) [    ] o.a.s.u.p.LogUpdateProcessorFactory [collection1]  webapp=/b_r/x path=/update params={wt=javabin&version=2}{add=[110 (1574874012543090689)]} 0 0
   [junit4]   2> 687310 INFO  (qtp2925167-6303) [    ] o.a.s.u.p.LogUpdateProcessorFactory [collection1]  webapp=/b_r/x path=/update params={wt=javabin&version=2}{add=[110 (1574874012544139264)]} 0 0
   [junit4]   2> 687310 INFO  (qtp6905117-6279) [    ] o.a.s.u.p.LogUpdateProcessorFactory [collection1]  webapp=/b_r/x path=/update params={wt=javabin&version=2}{add=[111 (1574874012544139264)]} 0 0
   [junit4]   2> 687310 INFO  (qtp2925167-6296) [    ] o.a.s.u.p.LogUpdateProcessorFactory [collection1]  webapp=/b_r/x path=/update params={wt=javabin&version=2}{add=[111 (1574874012544139265)]} 0 0
   [junit4]   2> 687311 INFO  (qtp6905117-6284) [    ] o.a.s.u.p.LogUpdateProcessorFactory [collection1]  webapp=/b_r/x path=/update params={wt=javabin&version=2}{add=[112 (1574874012545187840)]} 0 0
   [junit4]   2> 687311 INFO  (qtp2925167-6301) [    ] o.a.s.u.p.LogUpdateProcessorFactory [collection1]  webapp=/b_r/x path=/update params={wt=javabin&version=2}{add=[112 (1574874012545187840)]} 0 0
   [junit4]   2> 687311 INFO  (qtp6905117-6285) [    ] o.a.s.u.p.LogUpdateProcessorFactory [collection1]  webapp=/b_r/x path=/update params={wt=javabin&version=2}{add=[113 (1574874012545187841)]} 0 0
   [junit4]   2> 687312 INFO  (qtp2925167-6302) [    ] o.a.s.u.p.LogUpdateProcessorFactory [collection1]  webapp=/b_r/x path=/update params={wt=javabin&version=2}{add=[113 (1574874012545187841)]} 0 0
   [junit4]   2> 687312 INFO  (qtp6905117-6286) [    ] o.a.s.u.p.LogUpdateProcessorFactory [collection1]  webapp=/b_r/x path=/update params={wt=javabin&version=2}{add=[114 (1574874012546236416)]} 0 0
   [junit4]   2> 687312 INFO  (qtp2925167-6303) [    ] o.a.s.u.p.LogUpdateProcessorFactory [collection1]  webapp=/b_r/x path=/update params={wt=javabin&version=2}{add=[114 (1574874012546236416)]} 0 0
   [junit4]   2> 687313 INFO  (qtp6905117-6279) [    ] o.a.s.u.p.LogUpdateProcessorFactory [collection1]  webapp=/b_r/x path=/update params={wt=javabin&version=2}{add=[115 (1574874012546236417)]} 0 0
   [junit4]   2> 687313 INFO  (qtp2925167-6296) [    ] o.a.s.u.p.LogUpdateProcessorFactory [collection1]  webapp=/b_r/x path=/update params={wt=javabin&version=2}{add=[115 (1574874012547284992)]} 0 0
   [junit4]   2> 687313 INFO  (qtp6905117-6284) [    ] o.a.s.u.p.LogUpdateProcessorFactory [collection1]  webapp=/b_r/x path=/update params={wt=javabin&version=2}{add=[116 (1574874012547284992)]} 0 0
   [junit4]   2> 687313 INFO  (qtp2925167-6301) [    ] o.a.s.u.p.LogUpdateProcessorFactory [collection1]  webapp=/b_r/x path=/update params={wt=javabin&version=2}{add=[116 (1574874012547284993)]} 0 0
   [junit4]   2> 687314 INFO  (qtp6905117-6285) [    ] o.a.s.u.p.LogUpdateProcessorFactory [collection1]  webapp=/b_r/x path=/update params={wt=javabin&version=2}{add=[117 (1574874012548333568)]} 0 0
   [junit4]   2> 687314 INFO  (qtp2925167-6302) [    ] o.a.s.u.p.LogUpdateProcessorFactory [collection1]  webapp=/b_r/x path=/update params={wt=javabin&version=2}{add=[117 (1574874012548333568)]} 0 0
   [junit4]   2> 687314 INFO  (qtp6905117-6286) [    ] o.a.s.u.p.LogUpdateProcessorFactory [collection1]  webapp=/b_r/x path=/update params={wt=javabin&version=2}{add=[118 (1574874012548333569)]} 0 0
   [junit4]   2> 687315 INFO  (qtp2925167-6303) [    ] o.a.s.u.p.LogUpdateProcessorFactory [collection1]  webapp=/b_r/x path=/update params={wt=javabin&version=2}{add=[118 (1574874012549382144)]} 0 0
   [junit4]   2> 687315 INFO  (qtp6905117-6279) [    ] o.a.s.u.p.LogUpdateProcessorFactory [collection1]  webapp=/b_r/x path=/update params={wt=javabin&version=2}{add=[119 (1574874012549382144)]} 0 0
   [junit4]   2> 687315 INFO  (qtp2925167-6296) [    ] o.a.s.u.p.LogUpdateProcessorFactory [collection1]  webapp=/b_r/x path=/update params={wt=javabin&version=2}{add=[119 (1574874012549382145)]} 0 0
   [junit4]   2> 687316 INFO  (qtp6905117-6284) [    ] o.a.s.u.p.LogUpdateProcessorFactory [collection1]  webapp=/b_r/x path=/update params={wt=javabin&version=2}{add=[120 (1574874012549382145)]} 0 0
   [junit4]   2> 687316 INFO  (qtp2925167-6301) [    ] o.a.s.u.p.LogUpdateProcessorFactory [collection1]  webapp=/b_r/x path=/update params={wt=javabin&version=2}{add=[120 (1574874012550430720)]} 0 0
   [junit4]   2> 687316 INFO  (qtp6905117-6285) [    ] o.a.s.u.p.LogUpdateProcessorFactory [collection1]  webapp=/b_r/x path=/update params={wt=javabin&version=2}{add=[121 (1574874012550430720)]} 0 0
   [junit4]   2> 687317 INFO  (qtp2925167-6302) [    ] o.a.s.u.p.LogUpdateProcessorFactory [collection1]  webapp=/b_r/x path=/update params={wt=javabin&version=2}{add=[121 (1574874012551479296)]} 0 0
   [junit4]   2> 687317 INFO  (qtp6905117-6286) [    ] o.a.s.u.p.LogUpdateProcessorFactory [collection1]  webapp=/b_r/x path=/update params={wt=javabin&version=2}{add=[122 (1574874012551479296)]} 0 0
   [junit4]   2> 687317 INFO  (qtp2925167-6303) [    ] o.a.s.u.p.LogUpdateProcessorFactory [collection1]  webapp=/b_r/x path=/update params={wt=javabin&version=2}{add=[122 (1574874012551479297)]} 0 0
   [junit4]   2> 687318 INFO  (qtp6905117-6279) [    ] o.a.s.u.p.LogUpdateProcessorFactory [collection1]  webapp=/b_r/x path=/update params={wt=javabin&version=2}{add=[123 (1574874012552527872)]} 0 0
   [junit4]   2> 687318 INFO  (qtp2925167-6296) [    ] o.a.s.u.p.LogUpdateProcessorFactory [collection1]  webapp=/b_r/x path=/update params={wt=javabin&version=2}{add=[123 (1574874012552527872)]} 0 0
   [junit4]   2> 687318 INFO  (qtp6905117-6284) [    ] o.a.s.u.p.LogUpdateProcessorFactory [collection1]  webapp=/b_r/x path=/update params={wt=javabin&version=2}{add=[124 (1574874012552527873)]} 0 0
   [junit4]   2> 687319 INFO  (qtp2925167-6301) [    ] o.a.s.u.p.LogUpdateProcessorFactory [collection1]  webapp=/b_r/x path=/update params={wt=javabin&version=2}{add=[124 (1574874012553576448)]} 0 0
   [junit4]   2> 687319 INFO  (qtp6905117-6285) [    ] o.a.s.u.p.LogUpdateProcessorFactory [collection1]  webapp=/b_r/x path=/update params={wt=javabin&version=2}{add=[125 (1574874012553576448)]} 0 0
   [junit4]   2> 687319 INFO  (qtp2925167-6302) [    ] o.a.s.u.p.LogUpdateProcessorFactory [collection1]  webapp=/b_r/x path=/update params={wt=javabin&version=2}{add=[125 (1574874012553576449)]} 0 0
   [junit4]   2> 687320 INFO  (qtp6905117-6286) [    ] o.a.s.u.p.LogUpdateProcessorFactory [collection1]  webapp=/b_r/x path=/update params={wt=javabin&version=2}{add=[126 (1574874012554625024)]} 0 0
   [junit4]   2> 687320 INFO  (qtp2925167-6303) [    ] o.a.s.u.p.LogUpdateProcessorFactory [collection1]  webapp=/b_r/x path=/update params={wt=javabin&version=2}{add=[126 (1574874012554625024)]} 0 0
   [junit4]   2> 687320 INFO  (qtp6905117-6279) [    ] o.a.s.u.p.LogUpdateProcessorFactory [collection1]  webapp=/b_r/x path=/update params={wt=javabin&version=2}{add=[127 (1574874012554625025)]} 0 0
   [junit4]   2> 687321 INFO  (qtp2925167-6296) [    ] o.a.s.u.p.LogUpdateProcessorFactory [collection1]  webapp=/b_r/x path=/update params={wt=javabin&version=2}{add=[127 (1574874012555673600)]} 0 0
   [junit4]   2> 687321 INFO  (qtp6905117-6284) [    ] o.a.s.u.p.LogUpdateProcessorFactory [collection1]  webapp=/b_r/x path=/update params={wt=javabin&version=2}{add=[128 (1574874012555673600)]} 0 0
   [junit4]   2> 687321 INFO  (qtp2925167-6301) [    ] o.a.s.u.p.LogUpdateProcessorFactory [collection1]  webapp=/b_r/x path=/update params={wt=javabin&version=2}{add=[128 (1574874012555673601)]} 0 0
   [junit4]   2> 687322 INFO  (qtp6905117-6285) [    ] o.a.s.u.p.LogUpdateProcessorFactory [collection1]  webapp=/b_r/x path=/update params={wt=javabin&version=2}{add=[129 (1574874012555673601)]} 0 0
   [junit4]   2> 687322 INFO  (qtp2925167-6302) [    ] o.a.s.u.p.LogUpdateProcessorFactory [collection1]  webapp=/b_r/x path=/update params={wt=javabin&version=2}{add=[129 (1574874012556722176)]} 0 0
   [junit4]   2> 687322 INFO  (qtp6905117-6286) [    ] o.a.s.u.p.LogUpdateProcessorFactory [collection1]  webapp=/b_r/x path=/update params={wt=javabin&version=2}{add=[130 (1574874012556722176)]} 0 0
   [junit4]   2> 687322 INFO  (qtp2925167-6303) [    ] o.a.s.u.p.LogUpdateProcessorFactory [collection1]  webapp=/b_r/x path=/update params={wt=javabin&version=2}{add=[130 (1574874012556722177)]} 0 0
   [junit4]   2> 687323 INFO  (qtp6905117-6279) [    ] o.a.s.u.p.LogUpdateProcessorFactory [collection1]  webapp=/b_r/x path=/update params={wt=javabin&version=2}{add=[131 (1574874012557770752)]} 0 0
   [junit4]   2> 687323 INFO  (qtp2925167-6296) [    ] o.a.s.u.p.LogUpdateProcessorFactory [collection1]  webapp=/b_r/x path=/update params={wt=javabin&version=2}{add=[131 (1574874012557770752)]} 0 0
   [junit4]   2> 687323 INFO  (qtp6905117-6284) [    ] o.a.s.u.p.LogUpdateProcessorFactory [collection1]  webapp=/b_r/x path=/update params={wt=javabin&version=2}{add=[132 (1574874012557770753)]} 0 0
   [junit4]   2> 687324 INFO  (qtp2925167-6301) [    ] o.a.s.u.p.LogUpdateProcessorFactory [collection1]  webapp=/b_r/x path=/update params={wt=javabin&version=2}{add=[132 (1574874012558819328)]} 0 0
   [junit4]   2> 687324 INFO  (qtp6905117-6285) [    ] o.a.s.u.p.LogUpdateProcessorFactory [collection1]  webapp=/b_r/x path=/update params={wt=javabin&version=2}{add=[133 (1574874012558819328)]} 0 0
   [junit4]   2> 687324 INFO  (qtp2925167-6302) [    ] o.a.s.u.p.LogUpdateProcessorFactory [collection1]  webapp=/b_r/x path=/update params={wt=javabin&version=2}{add=[133 (1574874012558819329)]} 0 0
   [junit4]   2> 687325 INFO  (qtp6905117-6286) [    ] o.a.s.u.p.LogUpdateProcessorFactory [collection1]  webapp=/b_r/x path=/update params={wt=javabin&version=2}{add=[134 (1574874012559867904)]} 0 0
   [junit4]   2> 687325 INFO  (qtp2925167-6303) [    ] o.a.s.u.p.LogUpdateProcessorFactory [collection1]  webapp=/b_r/x path=/update params={wt=javabin&version=2}{add=[134 (1574874012559867904)]} 0 0
   [junit4]   2> 687325 INFO  (qtp6905117-6279) [    ] o.a.s.u.p.LogUpdateProcessorFactory [collection1]  webapp=/b_r/x path=/update params={wt=javabin&version=2}{add=[135 (1574874012559867905)]} 0 0
   [junit4]   2> 687326 INFO  (qtp2925167-6296) [    ] o.a.s.u.p.LogUpdateProcessorFactory [collection1]  webapp=/b_r/x path=/update params={wt=javabin&version=2}{add=[135 (1574874012560916480)]} 0 0
   [junit4]   2> 687326 INFO  (qtp6905117-6284) [    ] o.a.s.u.p.LogUpdateProcessorFactory [collection1]  webapp=/b_r/x path=/update params={wt=javabin&version=2}{add=[136 (1574874012560916480)]} 0 0
   [junit4]   2> 687326 INFO  (qtp2925167-6301) [    ] o.a.s.u.p.LogUpdateProcessorFactory [collection1]  webapp=/b_r/x path=/update params={wt=javabin&version=2}{add=[136 (1574874012560916481)]} 0 0
   [junit4]   2> 687327 INFO  (qtp6905117-6285) [    ] o.a.s.u.p.LogUpdateProcessorFactory [collection1]  webapp=/b_r/x path=/update params={wt=javabin&version=2}{add=[137 (1574874012561965056)]} 0 0
   [junit4]   2> 687327 INFO  (qtp2925167-6302) [    ] o.a.s.u.p.LogUpdateProcessorFactory [collection1]  webapp=/b_r/x path=/update params={wt=javabin&version=2}{add=[137 (1574874012561965056)]} 0 0
   [junit4]   2> 687327 INFO  (qtp6905117-6286) [    ] o.a.s.u.p.LogUpdateProcessorFactory [collection1]  webapp=/b_r/x path=/update params={wt=javabin&version=2}{add=[138 (1574874012561965057)]} 0 0
   [junit4]   2> 687328 INFO  (qtp2925167-6303) [    ] o.a.s.u.p.LogUpdateProcessorFactory [collection1]  webapp=/b_r/x path=/update params={wt=javabin&version=2}{add=[138 (1574874012563013632)]} 0 0
   [junit4]   2> 687328 INFO  (qtp6905117-6279) [    ] o.a.s.u.p.LogUpdateProcessorFactory [collection1]  webapp=/b_r/x path=/update params={wt=javabin

[...truncated too long message...]

ns/workspace/Lucene-Solr-master-Linux/solr/build/contrib/solr-analytics/test/temp/junit4-J0-20170805_073557_99117322610255901838116.syserr
   [junit4] >>> JVM J0 emitted unexpected output (verbatim) ----
   [junit4] Java HotSpot(TM) Server VM warning: Option UseConcMarkSweepGC was deprecated in version 9.0 and will likely be removed in a future release.
   [junit4] <<< JVM J0: EOF ----

[...truncated 499 lines...]
   [junit4] JVM J2: stderr was not empty, see: /home/jenkins/workspace/Lucene-Solr-master-Linux/solr/build/contrib/solr-clustering/test/temp/junit4-J2-20170805_073636_25316153359368660545612.syserr
   [junit4] >>> JVM J2 emitted unexpected output (verbatim) ----
   [junit4] Java HotSpot(TM) Server VM warning: Option UseConcMarkSweepGC was deprecated in version 9.0 and will likely be removed in a future release.
   [junit4] <<< JVM J2: EOF ----

[...truncated 3 lines...]
   [junit4] JVM J1: stderr was not empty, see: /home/jenkins/workspace/Lucene-Solr-master-Linux/solr/build/contrib/solr-clustering/test/temp/junit4-J1-20170805_073636_25318340227931812861636.syserr
   [junit4] >>> JVM J1 emitted unexpected output (verbatim) ----
   [junit4] Java HotSpot(TM) Server VM warning: Option UseConcMarkSweepGC was deprecated in version 9.0 and will likely be removed in a future release.
   [junit4] <<< JVM J1: EOF ----

[...truncated 3 lines...]
   [junit4] JVM J0: stderr was not empty, see: /home/jenkins/workspace/Lucene-Solr-master-Linux/solr/build/contrib/solr-clustering/test/temp/junit4-J0-20170805_073636_2534534208489631236566.syserr
   [junit4] >>> JVM J0 emitted unexpected output (verbatim) ----
   [junit4] Java HotSpot(TM) Server VM warning: Option UseConcMarkSweepGC was deprecated in version 9.0 and will likely be removed in a future release.
   [junit4] <<< JVM J0: EOF ----

[...truncated 1131 lines...]
   [junit4] JVM J1: stderr was not empty, see: /home/jenkins/workspace/Lucene-Solr-master-Linux/solr/build/contrib/solr-dataimporthandler-extras/test/temp/junit4-J1-20170805_073651_1325981436589844756343.syserr
   [junit4] >>> JVM J1 emitted unexpected output (verbatim) ----
   [junit4] Java HotSpot(TM) Server VM warning: Option UseConcMarkSweepGC was deprecated in version 9.0 and will likely be removed in a future release.
   [junit4] <<< JVM J1: EOF ----

[...truncated 3 lines...]
   [junit4] JVM J0: stderr was not empty, see: /home/jenkins/workspace/Lucene-Solr-master-Linux/solr/build/contrib/solr-dataimporthandler-extras/test/temp/junit4-J0-20170805_073651_1325154962390447346260.syserr
   [junit4] >>> JVM J0 emitted unexpected output (verbatim) ----
   [junit4] Java HotSpot(TM) Server VM warning: Option UseConcMarkSweepGC was deprecated in version 9.0 and will likely be removed in a future release.
   [junit4] <<< JVM J0: EOF ----

[...truncated 596 lines...]
   [junit4] JVM J1: stderr was not empty, see: /home/jenkins/workspace/Lucene-Solr-master-Linux/solr/build/contrib/solr-dataimporthandler/test/temp/junit4-J1-20170805_073656_75211123623371564258869.syserr
   [junit4] >>> JVM J1 emitted unexpected output (verbatim) ----
   [junit4] Java HotSpot(TM) Server VM warning: Option UseConcMarkSweepGC was deprecated in version 9.0 and will likely be removed in a future release.
   [junit4] <<< JVM J1: EOF ----

   [junit4] JVM J0: stderr was not empty, see: /home/jenkins/workspace/Lucene-Solr-master-Linux/solr/build/contrib/solr-dataimporthandler/test/temp/junit4-J0-20170805_073656_7523859502444979519112.syserr
   [junit4] >>> JVM J0 emitted unexpected output (verbatim) ----
   [junit4] Java HotSpot(TM) Server VM warning: Option UseConcMarkSweepGC was deprecated in version 9.0 and will likely be removed in a future release.
   [junit4] <<< JVM J0: EOF ----

   [junit4] JVM J2: stderr was not empty, see: /home/jenkins/workspace/Lucene-Solr-master-Linux/solr/build/contrib/solr-dataimporthandler/test/temp/junit4-J2-20170805_073656_7526903277775671760853.syserr
   [junit4] >>> JVM J2 emitted unexpected output (verbatim) ----
   [junit4] Java HotSpot(TM) Server VM warning: Option UseConcMarkSweepGC was deprecated in version 9.0 and will likely be removed in a future release.
   [junit4] <<< JVM J2: EOF ----

[...truncated 503 lines...]
   [junit4] JVM J1: stderr was not empty, see: /home/jenkins/workspace/Lucene-Solr-master-Linux/solr/build/contrib/solr-cell/test/temp/junit4-J1-20170805_073716_4734927561690888067441.syserr
   [junit4] >>> JVM J1 emitted unexpected output (verbatim) ----
   [junit4] Java HotSpot(TM) Server VM warning: Option UseConcMarkSweepGC was deprecated in version 9.0 and will likely be removed in a future release.
   [junit4] <<< JVM J1: EOF ----

[...truncated 3 lines...]
   [junit4] JVM J2: stderr was not empty, see: /home/jenkins/workspace/Lucene-Solr-master-Linux/solr/build/contrib/solr-cell/test/temp/junit4-J2-20170805_073716_47313097075130728823151.syserr
   [junit4] >>> JVM J2 emitted unexpected output (verbatim) ----
   [junit4] Java HotSpot(TM) Server VM warning: Option UseConcMarkSweepGC was deprecated in version 9.0 and will likely be removed in a future release.
   [junit4] <<< JVM J2: EOF ----

[...truncated 3 lines...]
   [junit4] JVM J0: stderr was not empty, see: /home/jenkins/workspace/Lucene-Solr-master-Linux/solr/build/contrib/solr-cell/test/temp/junit4-J0-20170805_073716_4731882958774369806761.syserr
   [junit4] >>> JVM J0 emitted unexpected output (verbatim) ----
   [junit4] Java HotSpot(TM) Server VM warning: Option UseConcMarkSweepGC was deprecated in version 9.0 and will likely be removed in a future release.
   [junit4] <<< JVM J0: EOF ----

[...truncated 507 lines...]
   [junit4] JVM J0: stderr was not empty, see: /home/jenkins/workspace/Lucene-Solr-master-Linux/solr/build/contrib/solr-langid/test/temp/junit4-J0-20170805_073725_20615038546614738519269.syserr
   [junit4] >>> JVM J0 emitted unexpected output (verbatim) ----
   [junit4] Java HotSpot(TM) Server VM warning: Option UseConcMarkSweepGC was deprecated in version 9.0 and will likely be removed in a future release.
   [junit4] <<< JVM J0: EOF ----

   [junit4] JVM J1: stderr was not empty, see: /home/jenkins/workspace/Lucene-Solr-master-Linux/solr/build/contrib/solr-langid/test/temp/junit4-J1-20170805_073725_2064343129829692979341.syserr
   [junit4] >>> JVM J1 emitted unexpected output (verbatim) ----
   [junit4] Java HotSpot(TM) Server VM warning: Option UseConcMarkSweepGC was deprecated in version 9.0 and will likely be removed in a future release.
   [junit4] <<< JVM J1: EOF ----

[...truncated 592 lines...]
   [junit4] JVM J1: stderr was not empty, see: /home/jenkins/workspace/Lucene-Solr-master-Linux/solr/build/contrib/solr-ltr/test/temp/junit4-J1-20170805_073730_70315240038820766641505.syserr
   [junit4] >>> JVM J1 emitted unexpected output (verbatim) ----
   [junit4] Java HotSpot(TM) Server VM warning: Option UseConcMarkSweepGC was deprecated in version 9.0 and will likely be removed in a future release.
   [junit4] <<< JVM J1: EOF ----

[...truncated 3 lines...]
   [junit4] JVM J2: stderr was not empty, see: /home/jenkins/workspace/Lucene-Solr-master-Linux/solr/build/contrib/solr-ltr/test/temp/junit4-J2-20170805_073730_7037908057474361129338.syserr
   [junit4] >>> JVM J2 emitted unexpected output (verbatim) ----
   [junit4] Java HotSpot(TM) Server VM warning: Option UseConcMarkSweepGC was deprecated in version 9.0 and will likely be removed in a future release.
   [junit4] <<< JVM J2: EOF ----

[...truncated 3 lines...]
   [junit4] JVM J0: stderr was not empty, see: /home/jenkins/workspace/Lucene-Solr-master-Linux/solr/build/contrib/solr-ltr/test/temp/junit4-J0-20170805_073730_70317604086437306761481.syserr
   [junit4] >>> JVM J0 emitted unexpected output (verbatim) ----
   [junit4] Java HotSpot(TM) Server VM warning: Option UseConcMarkSweepGC was deprecated in version 9.0 and will likely be removed in a future release.
   [junit4] <<< JVM J0: EOF ----

[...truncated 538 lines...]
   [junit4] JVM J1: stderr was not empty, see: /home/jenkins/workspace/Lucene-Solr-master-Linux/solr/build/contrib/solr-uima/test/temp/junit4-J1-20170805_073801_6385758379692198359050.syserr
   [junit4] >>> JVM J1 emitted unexpected output (verbatim) ----
   [junit4] Java HotSpot(TM) Server VM warning: Option UseConcMarkSweepGC was deprecated in version 9.0 and will likely be removed in a future release.
   [junit4] <<< JVM J1: EOF ----

[...truncated 3 lines...]
   [junit4] JVM J0: stderr was not empty, see: /home/jenkins/workspace/Lucene-Solr-master-Linux/solr/build/contrib/solr-uima/test/temp/junit4-J0-20170805_073801_63815638732909738492115.syserr
   [junit4] >>> JVM J0 emitted unexpected output (verbatim) ----
   [junit4] Java HotSpot(TM) Server VM warning: Option UseConcMarkSweepGC was deprecated in version 9.0 and will likely be removed in a future release.
   [junit4] <<< JVM J0: EOF ----

[...truncated 494 lines...]
   [junit4] JVM J0: stderr was not empty, see: /home/jenkins/workspace/Lucene-Solr-master-Linux/solr/build/contrib/solr-velocity/test/temp/junit4-J0-20170805_073810_4207467676888908511325.syserr
   [junit4] >>> JVM J0 emitted unexpected output (verbatim) ----
   [junit4] Java HotSpot(TM) Server VM warning: Option UseConcMarkSweepGC was deprecated in version 9.0 and will likely be removed in a future release.
   [junit4] <<< JVM J0: EOF ----

[...truncated 29 lines...]
-validate-source-patterns:
[source-patterns] tabs instead spaces: solr/solr-ref-guide/src/solrcloud-autoscaling-api.adoc

BUILD FAILED
/home/jenkins/workspace/Lucene-Solr-master-Linux/build.xml:810: The following error occurred while executing this line:
/home/jenkins/workspace/Lucene-Solr-master-Linux/build.xml:130: Found 1 violations in source files (tabs instead spaces).

Total time: 67 minutes 15 seconds
Build step 'Invoke Ant' marked build as failure
Archiving artifacts
[WARNINGS] Skipping publisher since build result is FAILURE
Recording test results
Email was triggered for: Failure - Any
Sending email for trigger: Failure - Any

Mime
View raw message