lucene-dev mailing list archives

Site index · List index
Message view « Date » · « Thread »
Top « Date » · « Thread »
From Policeman Jenkins Server <jenk...@thetaphi.de>
Subject [JENKINS] Lucene-Solr-master-Linux (64bit/jdk1.8.0_144) - Build # 20354 - Unstable!
Date Mon, 21 Aug 2017 14:40:54 GMT
Build: https://jenkins.thetaphi.de/job/Lucene-Solr-master-Linux/20354/
Java: 64bit/jdk1.8.0_144 -XX:+UseCompressedOops -XX:+UseG1GC

1 tests failed.
FAILED:  junit.framework.TestSuite.org.apache.solr.security.hadoop.TestImpersonationWithHadoopAuth

Error Message:
2 threads leaked from SUITE scope at org.apache.solr.security.hadoop.TestImpersonationWithHadoopAuth:     1) Thread[id=21925, name=jetty-launcher-2664-thread-1-EventThread, state=TIMED_WAITING, group=TGRP-TestImpersonationWithHadoopAuth]         at sun.misc.Unsafe.park(Native Method)         at java.util.concurrent.locks.LockSupport.parkNanos(LockSupport.java:215)         at java.util.concurrent.locks.AbstractQueuedSynchronizer.doAcquireSharedNanos(AbstractQueuedSynchronizer.java:1037)         at java.util.concurrent.locks.AbstractQueuedSynchronizer.tryAcquireSharedNanos(AbstractQueuedSynchronizer.java:1328)         at java.util.concurrent.CountDownLatch.await(CountDownLatch.java:277)         at org.apache.curator.CuratorZookeeperClient.internalBlockUntilConnectedOrTimedOut(CuratorZookeeperClient.java:323)         at org.apache.curator.RetryLoop.callWithRetry(RetryLoop.java:105)         at org.apache.curator.framework.imps.GetDataBuilderImpl.pathInForeground(GetDataBuilderImpl.java:288)         at org.apache.curator.framework.imps.GetDataBuilderImpl.forPath(GetDataBuilderImpl.java:279)         at org.apache.curator.framework.imps.GetDataBuilderImpl.forPath(GetDataBuilderImpl.java:41)         at org.apache.curator.framework.recipes.shared.SharedValue.readValue(SharedValue.java:244)         at org.apache.curator.framework.recipes.shared.SharedValue.access$100(SharedValue.java:44)         at org.apache.curator.framework.recipes.shared.SharedValue$1.process(SharedValue.java:61)         at org.apache.curator.framework.imps.NamespaceWatcher.process(NamespaceWatcher.java:67)         at org.apache.zookeeper.ClientCnxn$EventThread.processEvent(ClientCnxn.java:530)         at org.apache.zookeeper.ClientCnxn$EventThread.run(ClientCnxn.java:505)    2) Thread[id=21929, name=jetty-launcher-2664-thread-2-EventThread, state=TIMED_WAITING, group=TGRP-TestImpersonationWithHadoopAuth]         at sun.misc.Unsafe.park(Native Method)         at java.util.concurrent.locks.LockSupport.parkNanos(LockSupport.java:215)         at java.util.concurrent.locks.AbstractQueuedSynchronizer.doAcquireSharedNanos(AbstractQueuedSynchronizer.java:1037)         at java.util.concurrent.locks.AbstractQueuedSynchronizer.tryAcquireSharedNanos(AbstractQueuedSynchronizer.java:1328)         at java.util.concurrent.CountDownLatch.await(CountDownLatch.java:277)         at org.apache.curator.CuratorZookeeperClient.internalBlockUntilConnectedOrTimedOut(CuratorZookeeperClient.java:323)         at org.apache.curator.RetryLoop.callWithRetry(RetryLoop.java:105)         at org.apache.curator.framework.imps.GetDataBuilderImpl.pathInForeground(GetDataBuilderImpl.java:288)         at org.apache.curator.framework.imps.GetDataBuilderImpl.forPath(GetDataBuilderImpl.java:279)         at org.apache.curator.framework.imps.GetDataBuilderImpl.forPath(GetDataBuilderImpl.java:41)         at org.apache.curator.framework.recipes.shared.SharedValue.readValue(SharedValue.java:244)         at org.apache.curator.framework.recipes.shared.SharedValue.access$100(SharedValue.java:44)         at org.apache.curator.framework.recipes.shared.SharedValue$1.process(SharedValue.java:61)         at org.apache.curator.framework.imps.NamespaceWatcher.process(NamespaceWatcher.java:67)         at org.apache.zookeeper.ClientCnxn$EventThread.processEvent(ClientCnxn.java:530)         at org.apache.zookeeper.ClientCnxn$EventThread.run(ClientCnxn.java:505)

Stack Trace:
com.carrotsearch.randomizedtesting.ThreadLeakError: 2 threads leaked from SUITE scope at org.apache.solr.security.hadoop.TestImpersonationWithHadoopAuth: 
   1) Thread[id=21925, name=jetty-launcher-2664-thread-1-EventThread, state=TIMED_WAITING, group=TGRP-TestImpersonationWithHadoopAuth]
        at sun.misc.Unsafe.park(Native Method)
        at java.util.concurrent.locks.LockSupport.parkNanos(LockSupport.java:215)
        at java.util.concurrent.locks.AbstractQueuedSynchronizer.doAcquireSharedNanos(AbstractQueuedSynchronizer.java:1037)
        at java.util.concurrent.locks.AbstractQueuedSynchronizer.tryAcquireSharedNanos(AbstractQueuedSynchronizer.java:1328)
        at java.util.concurrent.CountDownLatch.await(CountDownLatch.java:277)
        at org.apache.curator.CuratorZookeeperClient.internalBlockUntilConnectedOrTimedOut(CuratorZookeeperClient.java:323)
        at org.apache.curator.RetryLoop.callWithRetry(RetryLoop.java:105)
        at org.apache.curator.framework.imps.GetDataBuilderImpl.pathInForeground(GetDataBuilderImpl.java:288)
        at org.apache.curator.framework.imps.GetDataBuilderImpl.forPath(GetDataBuilderImpl.java:279)
        at org.apache.curator.framework.imps.GetDataBuilderImpl.forPath(GetDataBuilderImpl.java:41)
        at org.apache.curator.framework.recipes.shared.SharedValue.readValue(SharedValue.java:244)
        at org.apache.curator.framework.recipes.shared.SharedValue.access$100(SharedValue.java:44)
        at org.apache.curator.framework.recipes.shared.SharedValue$1.process(SharedValue.java:61)
        at org.apache.curator.framework.imps.NamespaceWatcher.process(NamespaceWatcher.java:67)
        at org.apache.zookeeper.ClientCnxn$EventThread.processEvent(ClientCnxn.java:530)
        at org.apache.zookeeper.ClientCnxn$EventThread.run(ClientCnxn.java:505)
   2) Thread[id=21929, name=jetty-launcher-2664-thread-2-EventThread, state=TIMED_WAITING, group=TGRP-TestImpersonationWithHadoopAuth]
        at sun.misc.Unsafe.park(Native Method)
        at java.util.concurrent.locks.LockSupport.parkNanos(LockSupport.java:215)
        at java.util.concurrent.locks.AbstractQueuedSynchronizer.doAcquireSharedNanos(AbstractQueuedSynchronizer.java:1037)
        at java.util.concurrent.locks.AbstractQueuedSynchronizer.tryAcquireSharedNanos(AbstractQueuedSynchronizer.java:1328)
        at java.util.concurrent.CountDownLatch.await(CountDownLatch.java:277)
        at org.apache.curator.CuratorZookeeperClient.internalBlockUntilConnectedOrTimedOut(CuratorZookeeperClient.java:323)
        at org.apache.curator.RetryLoop.callWithRetry(RetryLoop.java:105)
        at org.apache.curator.framework.imps.GetDataBuilderImpl.pathInForeground(GetDataBuilderImpl.java:288)
        at org.apache.curator.framework.imps.GetDataBuilderImpl.forPath(GetDataBuilderImpl.java:279)
        at org.apache.curator.framework.imps.GetDataBuilderImpl.forPath(GetDataBuilderImpl.java:41)
        at org.apache.curator.framework.recipes.shared.SharedValue.readValue(SharedValue.java:244)
        at org.apache.curator.framework.recipes.shared.SharedValue.access$100(SharedValue.java:44)
        at org.apache.curator.framework.recipes.shared.SharedValue$1.process(SharedValue.java:61)
        at org.apache.curator.framework.imps.NamespaceWatcher.process(NamespaceWatcher.java:67)
        at org.apache.zookeeper.ClientCnxn$EventThread.processEvent(ClientCnxn.java:530)
        at org.apache.zookeeper.ClientCnxn$EventThread.run(ClientCnxn.java:505)
	at __randomizedtesting.SeedInfo.seed([8983C477E607B9CC]:0)




Build Log:
[...truncated 13188 lines...]
   [junit4] Suite: org.apache.solr.security.hadoop.TestImpersonationWithHadoopAuth
   [junit4]   2> Creating dataDir: /home/jenkins/workspace/Lucene-Solr-master-Linux/solr/build/solr-core/test/J1/temp/solr.security.hadoop.TestImpersonationWithHadoopAuth_8983C477E607B9CC-001/init-core-data-001
   [junit4]   2> 2362316 INFO  (SUITE-TestImpersonationWithHadoopAuth-seed#[8983C477E607B9CC]-worker) [    ] o.a.s.SolrTestCaseJ4 Using PointFields (NUMERIC_POINTS_SYSPROP=true) w/NUMERIC_DOCVALUES_SYSPROP=false
   [junit4]   2> 2362317 INFO  (SUITE-TestImpersonationWithHadoopAuth-seed#[8983C477E607B9CC]-worker) [    ] o.a.s.SolrTestCaseJ4 Randomized ssl (false) and clientAuth (false) via: @org.apache.solr.util.RandomizeSSL(reason=, value=NaN, ssl=NaN, clientAuth=NaN)
   [junit4]   2> 2362317 INFO  (SUITE-TestImpersonationWithHadoopAuth-seed#[8983C477E607B9CC]-worker) [    ] o.a.s.SolrTestCaseJ4 SecureRandom sanity checks: test.solr.allowed.securerandom=null & java.security.egd=file:/dev/./urandom
   [junit4]   2> 2362329 INFO  (SUITE-TestImpersonationWithHadoopAuth-seed#[8983C477E607B9CC]-worker) [    ] o.a.s.c.MiniSolrCloudCluster Starting cluster of 2 servers in /home/jenkins/workspace/Lucene-Solr-master-Linux/solr/build/solr-core/test/J1/temp/solr.security.hadoop.TestImpersonationWithHadoopAuth_8983C477E607B9CC-001/tempDir-001
   [junit4]   2> 2362329 INFO  (SUITE-TestImpersonationWithHadoopAuth-seed#[8983C477E607B9CC]-worker) [    ] o.a.s.c.ZkTestServer STARTING ZK TEST SERVER
   [junit4]   2> 2362329 INFO  (Thread-8488) [    ] o.a.s.c.ZkTestServer client port:0.0.0.0/0.0.0.0:0
   [junit4]   2> 2362329 INFO  (Thread-8488) [    ] o.a.s.c.ZkTestServer Starting server
   [junit4]   2> 2362330 ERROR (Thread-8488) [    ] o.a.z.s.ZooKeeperServer ZKShutdownHandler is not registered, so ZooKeeper server won't take any action on ERROR or SHUTDOWN server state changes
   [junit4]   2> 2362429 INFO  (SUITE-TestImpersonationWithHadoopAuth-seed#[8983C477E607B9CC]-worker) [    ] o.a.s.c.ZkTestServer start zk server on port:33783
   [junit4]   2> 2362437 INFO  (jetty-launcher-2664-thread-1) [    ] o.e.j.s.Server jetty-9.3.20.v20170531
   [junit4]   2> 2362437 INFO  (jetty-launcher-2664-thread-2) [    ] o.e.j.s.Server jetty-9.3.20.v20170531
   [junit4]   2> 2362438 INFO  (jetty-launcher-2664-thread-2) [    ] o.e.j.s.h.ContextHandler Started o.e.j.s.ServletContextHandler@7ca4c1b5{/solr,null,AVAILABLE}
   [junit4]   2> 2362438 INFO  (jetty-launcher-2664-thread-1) [    ] o.e.j.s.h.ContextHandler Started o.e.j.s.ServletContextHandler@453203b7{/solr,null,AVAILABLE}
   [junit4]   2> 2362440 INFO  (jetty-launcher-2664-thread-1) [    ] o.e.j.s.AbstractConnector Started ServerConnector@54851cea{HTTP/1.1,[http/1.1]}{127.0.0.1:45985}
   [junit4]   2> 2362440 INFO  (jetty-launcher-2664-thread-2) [    ] o.e.j.s.AbstractConnector Started ServerConnector@2bf0f6fd{HTTP/1.1,[http/1.1]}{127.0.0.1:45243}
   [junit4]   2> 2362440 INFO  (jetty-launcher-2664-thread-1) [    ] o.e.j.s.Server Started @2364042ms
   [junit4]   2> 2362440 INFO  (jetty-launcher-2664-thread-2) [    ] o.e.j.s.Server Started @2364042ms
   [junit4]   2> 2362440 INFO  (jetty-launcher-2664-thread-1) [    ] o.a.s.c.s.e.JettySolrRunner Jetty properties: {hostContext=/solr, hostPort=45985}
   [junit4]   2> 2362440 INFO  (jetty-launcher-2664-thread-2) [    ] o.a.s.c.s.e.JettySolrRunner Jetty properties: {hostContext=/solr, hostPort=45243}
   [junit4]   2> 2362440 ERROR (jetty-launcher-2664-thread-1) [    ] o.a.s.s.StartupLoggingUtils Missing Java Option solr.log.dir. Logging may be missing or incomplete.
   [junit4]   2> 2362440 ERROR (jetty-launcher-2664-thread-2) [    ] o.a.s.s.StartupLoggingUtils Missing Java Option solr.log.dir. Logging may be missing or incomplete.
   [junit4]   2> 2362441 INFO  (jetty-launcher-2664-thread-1) [    ] o.a.s.s.SolrDispatchFilter  ___      _       Welcome to Apache Solr? version 8.0.0
   [junit4]   2> 2362441 INFO  (jetty-launcher-2664-thread-2) [    ] o.a.s.s.SolrDispatchFilter  ___      _       Welcome to Apache Solr? version 8.0.0
   [junit4]   2> 2362441 INFO  (jetty-launcher-2664-thread-1) [    ] o.a.s.s.SolrDispatchFilter / __| ___| |_ _   Starting in cloud mode on port null
   [junit4]   2> 2362441 INFO  (jetty-launcher-2664-thread-2) [    ] o.a.s.s.SolrDispatchFilter / __| ___| |_ _   Starting in cloud mode on port null
   [junit4]   2> 2362441 INFO  (jetty-launcher-2664-thread-1) [    ] o.a.s.s.SolrDispatchFilter \__ \/ _ \ | '_|  Install dir: null, Default config dir: null
   [junit4]   2> 2362441 INFO  (jetty-launcher-2664-thread-2) [    ] o.a.s.s.SolrDispatchFilter \__ \/ _ \ | '_|  Install dir: null, Default config dir: null
   [junit4]   2> 2362441 INFO  (jetty-launcher-2664-thread-1) [    ] o.a.s.s.SolrDispatchFilter |___/\___/_|_|    Start time: 2017-08-21T14:27:16.069Z
   [junit4]   2> 2362441 INFO  (jetty-launcher-2664-thread-2) [    ] o.a.s.s.SolrDispatchFilter |___/\___/_|_|    Start time: 2017-08-21T14:27:16.069Z
   [junit4]   2> 2362443 INFO  (jetty-launcher-2664-thread-2) [    ] o.a.s.s.SolrDispatchFilter solr.xml found in ZooKeeper. Loading...
   [junit4]   2> 2362443 INFO  (jetty-launcher-2664-thread-1) [    ] o.a.s.s.SolrDispatchFilter solr.xml found in ZooKeeper. Loading...
   [junit4]   2> 2362448 WARN  (NIOServerCxn.Factory:0.0.0.0/0.0.0.0:0) [    ] o.a.z.s.NIOServerCnxn caught end of stream exception
   [junit4]   2> EndOfStreamException: Unable to read additional data from client sessionid 0x15e0530c5760002, likely client has closed socket
   [junit4]   2> 	at org.apache.zookeeper.server.NIOServerCnxn.doIO(NIOServerCnxn.java:239)
   [junit4]   2> 	at org.apache.zookeeper.server.NIOServerCnxnFactory.run(NIOServerCnxnFactory.java:203)
   [junit4]   2> 	at java.lang.Thread.run(Thread.java:748)
   [junit4]   2> 2362450 INFO  (jetty-launcher-2664-thread-2) [    ] o.a.s.c.ZkContainer Zookeeper client=127.0.0.1:33783/solr
   [junit4]   2> 2362450 INFO  (jetty-launcher-2664-thread-1) [    ] o.a.s.c.ZkContainer Zookeeper client=127.0.0.1:33783/solr
   [junit4]   2> 2362481 INFO  (jetty-launcher-2664-thread-2) [n:127.0.0.1:45243_solr    ] o.a.s.c.Overseer Overseer (id=null) closing
   [junit4]   2> 2362481 INFO  (jetty-launcher-2664-thread-1) [n:127.0.0.1:45985_solr    ] o.a.s.c.Overseer Overseer (id=null) closing
   [junit4]   2> 2362482 INFO  (jetty-launcher-2664-thread-2) [n:127.0.0.1:45243_solr    ] o.a.s.c.OverseerElectionContext I am going to be the leader 127.0.0.1:45243_solr
   [junit4]   2> 2362482 INFO  (jetty-launcher-2664-thread-1) [n:127.0.0.1:45985_solr    ] o.a.s.c.ZkController Register node as live in ZooKeeper:/live_nodes/127.0.0.1:45985_solr
   [junit4]   2> 2362482 INFO  (jetty-launcher-2664-thread-2) [n:127.0.0.1:45243_solr    ] o.a.s.c.Overseer Overseer (id=98521948878143493-127.0.0.1:45243_solr-n_0000000000) starting
   [junit4]   2> 2362483 INFO  (zkCallback-2676-thread-1-processing-n:127.0.0.1:45985_solr) [n:127.0.0.1:45985_solr    ] o.a.s.c.c.ZkStateReader Updated live nodes from ZooKeeper... (0) -> (1)
   [junit4]   2> 2362483 INFO  (zkCallback-2675-thread-1-processing-n:127.0.0.1:45243_solr) [n:127.0.0.1:45243_solr    ] o.a.s.c.c.ZkStateReader Updated live nodes from ZooKeeper... (0) -> (1)
   [junit4]   2> 2362488 INFO  (jetty-launcher-2664-thread-2) [n:127.0.0.1:45243_solr    ] o.a.s.c.ZkController Register node as live in ZooKeeper:/live_nodes/127.0.0.1:45243_solr
   [junit4]   2> 2362489 INFO  (zkCallback-2676-thread-1-processing-n:127.0.0.1:45985_solr) [n:127.0.0.1:45985_solr    ] o.a.s.c.c.ZkStateReader Updated live nodes from ZooKeeper... (1) -> (2)
   [junit4]   2> 2362492 INFO  (zkCallback-2675-thread-2-processing-n:127.0.0.1:45243_solr) [n:127.0.0.1:45243_solr    ] o.a.s.c.c.ZkStateReader Updated live nodes from ZooKeeper... (1) -> (2)
   [junit4]   2> 2362507 INFO  (jetty-launcher-2664-thread-1) [n:127.0.0.1:45985_solr    ] o.a.s.c.CoreContainer Initializing authentication plugin: org.apache.solr.security.HadoopAuthPlugin
   [junit4]   2> 2362507 INFO  (jetty-launcher-2664-thread-1) [n:127.0.0.1:45985_solr    ] o.a.s.s.HadoopAuthPlugin Params: {proxyuser.anyHostUsersGroup.hosts=*, proxyuser.wrongHost.hosts=1.1.1.1.1.1, proxyuser.bogusGroup.groups=__some_bogus_group, proxyuser.localHostAnyGroup.groups=*, cookie.domain=127.0.0.1, proxyuser.wrongHost.groups=*, type=simple, proxyuser.noHosts.groups=*, proxyuser.anyHostUsersGroup.groups=jenkins, proxyuser.noGroups.hosts=*, proxyuser.anyHostAnyUser.groups=*, delegation-token.token-kind=solr-dt, proxyuser.bogusGroup.hosts=*, zk-dt-secret-manager.znodeWorkingPath=solr/security/zkdtsm, signer.secret.provider.zookeeper.path=/token, zk-dt-secret-manager.enable=true, proxyuser.localHostAnyGroup.hosts=localhost.localdomain,localhost,127.0.0.1, proxyuser.anyHostAnyUser.hosts=*, signer.secret.provider=zookeeper}
   [junit4]   2> 2362507 INFO  (jetty-launcher-2664-thread-1) [n:127.0.0.1:45985_solr    ] o.a.c.f.i.CuratorFrameworkImpl Starting
   [junit4]   2> 2362508 INFO  (jetty-launcher-2664-thread-1-EventThread) [n:127.0.0.1:45985_solr    ] o.a.c.f.s.ConnectionStateManager State change: CONNECTED
   [junit4]   2> 2362530 INFO  (jetty-launcher-2664-thread-2) [n:127.0.0.1:45243_solr    ] o.a.s.c.CoreContainer Initializing authentication plugin: org.apache.solr.security.HadoopAuthPlugin
   [junit4]   2> 2362530 INFO  (jetty-launcher-2664-thread-2) [n:127.0.0.1:45243_solr    ] o.a.s.s.HadoopAuthPlugin Params: {proxyuser.anyHostUsersGroup.hosts=*, proxyuser.wrongHost.hosts=1.1.1.1.1.1, proxyuser.bogusGroup.groups=__some_bogus_group, proxyuser.localHostAnyGroup.groups=*, cookie.domain=127.0.0.1, proxyuser.wrongHost.groups=*, type=simple, proxyuser.noHosts.groups=*, proxyuser.anyHostUsersGroup.groups=jenkins, proxyuser.noGroups.hosts=*, proxyuser.anyHostAnyUser.groups=*, delegation-token.token-kind=solr-dt, proxyuser.bogusGroup.hosts=*, zk-dt-secret-manager.znodeWorkingPath=solr/security/zkdtsm, signer.secret.provider.zookeeper.path=/token, zk-dt-secret-manager.enable=true, proxyuser.localHostAnyGroup.hosts=localhost.localdomain,localhost,127.0.0.1, proxyuser.anyHostAnyUser.hosts=*, signer.secret.provider=zookeeper}
   [junit4]   2> 2362531 INFO  (jetty-launcher-2664-thread-2) [n:127.0.0.1:45243_solr    ] o.a.c.f.i.CuratorFrameworkImpl Starting
   [junit4]   2> 2362532 INFO  (jetty-launcher-2664-thread-2-EventThread) [n:127.0.0.1:45243_solr    ] o.a.c.f.s.ConnectionStateManager State change: CONNECTED
   [junit4]   2> 2362545 INFO  (jetty-launcher-2664-thread-2) [n:127.0.0.1:45243_solr    ] o.a.s.c.CoreContainer PKIAuthenticationPlugin is managing internode requests
   [junit4]   2> 2362568 INFO  (jetty-launcher-2664-thread-2) [n:127.0.0.1:45243_solr    ] o.a.s.m.r.SolrJmxReporter JMX monitoring for 'solr_45243.solr.node' (registry 'solr.node') enabled at server: com.sun.jmx.mbeanserver.JmxMBeanServer@e6d5e94
   [junit4]   2> 2362573 INFO  (jetty-launcher-2664-thread-2) [n:127.0.0.1:45243_solr    ] o.a.s.m.r.SolrJmxReporter JMX monitoring for 'solr_45243.solr.jvm' (registry 'solr.jvm') enabled at server: com.sun.jmx.mbeanserver.JmxMBeanServer@e6d5e94
   [junit4]   2> 2362573 INFO  (jetty-launcher-2664-thread-2) [n:127.0.0.1:45243_solr    ] o.a.s.m.r.SolrJmxReporter JMX monitoring for 'solr_45243.solr.jetty' (registry 'solr.jetty') enabled at server: com.sun.jmx.mbeanserver.JmxMBeanServer@e6d5e94
   [junit4]   2> 2362574 INFO  (jetty-launcher-2664-thread-2) [n:127.0.0.1:45243_solr    ] o.a.s.c.CorePropertiesLocator Found 0 core definitions underneath /home/jenkins/workspace/Lucene-Solr-master-Linux/solr/build/solr-core/test/J1/temp/solr.security.hadoop.TestImpersonationWithHadoopAuth_8983C477E607B9CC-001/tempDir-001/node2/.
   [junit4]   2> 2363521 INFO  (jetty-launcher-2664-thread-1) [n:127.0.0.1:45985_solr    ] o.a.s.c.CoreContainer PKIAuthenticationPlugin is managing internode requests
   [junit4]   2> 2363553 INFO  (jetty-launcher-2664-thread-1) [n:127.0.0.1:45985_solr    ] o.a.s.m.r.SolrJmxReporter JMX monitoring for 'solr_45985.solr.node' (registry 'solr.node') enabled at server: com.sun.jmx.mbeanserver.JmxMBeanServer@e6d5e94
   [junit4]   2> 2363559 INFO  (jetty-launcher-2664-thread-1) [n:127.0.0.1:45985_solr    ] o.a.s.m.r.SolrJmxReporter JMX monitoring for 'solr_45985.solr.jvm' (registry 'solr.jvm') enabled at server: com.sun.jmx.mbeanserver.JmxMBeanServer@e6d5e94
   [junit4]   2> 2363559 INFO  (jetty-launcher-2664-thread-1) [n:127.0.0.1:45985_solr    ] o.a.s.m.r.SolrJmxReporter JMX monitoring for 'solr_45985.solr.jetty' (registry 'solr.jetty') enabled at server: com.sun.jmx.mbeanserver.JmxMBeanServer@e6d5e94
   [junit4]   2> 2363560 INFO  (jetty-launcher-2664-thread-1) [n:127.0.0.1:45985_solr    ] o.a.s.c.CorePropertiesLocator Found 0 core definitions underneath /home/jenkins/workspace/Lucene-Solr-master-Linux/solr/build/solr-core/test/J1/temp/solr.security.hadoop.TestImpersonationWithHadoopAuth_8983C477E607B9CC-001/tempDir-001/node1/.
   [junit4]   2> 2363577 INFO  (SUITE-TestImpersonationWithHadoopAuth-seed#[8983C477E607B9CC]-worker) [    ] o.a.s.c.c.ZkStateReader Updated live nodes from ZooKeeper... (0) -> (2)
   [junit4]   2> 2363577 INFO  (SUITE-TestImpersonationWithHadoopAuth-seed#[8983C477E607B9CC]-worker) [    ] o.a.s.c.s.i.ZkClientClusterStateProvider Cluster at 127.0.0.1:33783/solr ready
   [junit4]   2> 2363588 INFO  (TEST-TestImpersonationWithHadoopAuth.testProxyNoConfigHosts-seed#[8983C477E607B9CC]) [    ] o.a.s.SolrTestCaseJ4 ###Starting testProxyNoConfigHosts
   [junit4]   2> 2363591 WARN  (TEST-TestImpersonationWithHadoopAuth.testProxyNoConfigHosts-seed#[8983C477E607B9CC]) [    ] o.a.h.c.p.ResponseProcessCookies Invalid cookie header: "Set-Cookie: hadoop.auth="u=noHosts&p=noHosts&t=simple-dt&e=1503361637217&s=EmIgmlcgBqtq4dYBANyTMcfkWN4="; Domain=127.0.0.1; Expires= ., 22- . .-2017 00:27:17 GMT; HttpOnly". Invalid 'expires' attribute: ., 22- . .-2017 00:27:17 GMT
   [junit4]   2> 2363591 INFO  (TEST-TestImpersonationWithHadoopAuth.testProxyNoConfigHosts-seed#[8983C477E607B9CC]) [    ] o.a.s.SolrTestCaseJ4 ###Ending testProxyNoConfigHosts
   [junit4] IGNOR/A 0.00s J1 | TestImpersonationWithHadoopAuth.testForwarding
   [junit4]    > Assumption #1: 'awaitsfix' test group is disabled (@AwaitsFix(bugUrl=https://issues.apache.org/jira/browse/HADOOP-9893))
   [junit4]   2> 2363601 INFO  (TEST-TestImpersonationWithHadoopAuth.testProxyWrongHost-seed#[8983C477E607B9CC]) [    ] o.a.s.SolrTestCaseJ4 ###Starting testProxyWrongHost
   [junit4]   2> 2378615 WARN  (jetty-launcher-2664-thread-2-SendThread(127.0.0.1:33783)) [n:127.0.0.1:45243_solr    ] o.a.z.ClientCnxn Client session timed out, have not heard from server in 15092ms for sessionid 0x15e0530c5760008
   [junit4]   2> 2378615 WARN  (jetty-launcher-2664-thread-1-SendThread(127.0.0.1:33783)) [n:127.0.0.1:45985_solr    ] o.a.z.ClientCnxn Client session timed out, have not heard from server in 15055ms for sessionid 0x15e0530c5760006
   [junit4]   2> 2378615 WARN  (jetty-launcher-2664-thread-2-SendThread(127.0.0.1:33783)) [n:127.0.0.1:45243_solr    ] o.a.z.ClientCnxn Client session timed out, have not heard from server in 16022ms for sessionid 0x15e0530c5760005
   [junit4]   2> 2378615 WARN  (NIOServerCxn.Factory:0.0.0.0/0.0.0.0:0) [    ] o.a.z.s.NIOServerCnxn caught end of stream exception
   [junit4]   2> EndOfStreamException: Unable to read additional data from client sessionid 0x15e0530c5760006, likely client has closed socket
   [junit4]   2> 	at org.apache.zookeeper.server.NIOServerCnxn.doIO(NIOServerCnxn.java:239)
   [junit4]   2> 	at org.apache.zookeeper.server.NIOServerCnxnFactory.run(NIOServerCnxnFactory.java:203)
   [junit4]   2> 	at java.lang.Thread.run(Thread.java:748)
   [junit4]   2> 2378615 WARN  (jetty-launcher-2664-thread-1-SendThread(127.0.0.1:33783)) [n:127.0.0.1:45985_solr    ] o.a.z.ClientCnxn Client session timed out, have not heard from server in 15092ms for sessionid 0x15e0530c5760007
   [junit4]   2> 2378615 WARN  (NIOServerCxn.Factory:0.0.0.0/0.0.0.0:0) [    ] o.a.z.s.NIOServerCnxn caught end of stream exception
   [junit4]   2> EndOfStreamException: Unable to read additional data from client sessionid 0x15e0530c5760008, likely client has closed socket
   [junit4]   2> 	at org.apache.zookeeper.server.NIOServerCnxn.doIO(NIOServerCnxn.java:239)
   [junit4]   2> 	at org.apache.zookeeper.server.NIOServerCnxnFactory.run(NIOServerCnxnFactory.java:203)
   [junit4]   2> 	at java.lang.Thread.run(Thread.java:748)
   [junit4]   2> 2378615 WARN  (NIOServerCxn.Factory:0.0.0.0/0.0.0.0:0) [    ] o.a.z.s.NIOServerCnxn caught end of stream exception
   [junit4]   2> EndOfStreamException: Unable to read additional data from client sessionid 0x15e0530c5760007, likely client has closed socket
   [junit4]   2> 	at org.apache.zookeeper.server.NIOServerCnxn.doIO(NIOServerCnxn.java:239)
   [junit4]   2> 	at org.apache.zookeeper.server.NIOServerCnxnFactory.run(NIOServerCnxnFactory.java:203)
   [junit4]   2> 	at java.lang.Thread.run(Thread.java:748)
   [junit4]   2> 2378615 WARN  (NIOServerCxn.Factory:0.0.0.0/0.0.0.0:0) [    ] o.a.z.s.NIOServerCnxn caught end of stream exception
   [junit4]   2> EndOfStreamException: Unable to read additional data from client sessionid 0x15e0530c5760005, likely client has closed socket
   [junit4]   2> 	at org.apache.zookeeper.server.NIOServerCnxn.doIO(NIOServerCnxn.java:239)
   [junit4]   2> 	at org.apache.zookeeper.server.NIOServerCnxnFactory.run(NIOServerCnxnFactory.java:203)
   [junit4]   2> 	at java.lang.Thread.run(Thread.java:748)
   [junit4]   2> 2378616 WARN  (TEST-TestImpersonationWithHadoopAuth.testProxyWrongHost-seed#[8983C477E607B9CC]) [    ] o.a.h.c.p.ResponseProcessCookies Invalid cookie header: "Set-Cookie: hadoop.auth="u=wrongHost&p=wrongHost&t=simple-dt&e=1503361637230&s=FfUSn2DClIG9IFN1zYBpyDs0UbI="; Domain=127.0.0.1; Expires= ., 22- . .-2017 00:27:17 GMT; HttpOnly". Invalid 'expires' attribute: ., 22- . .-2017 00:27:17 GMT
   [junit4]   2> 2378616 INFO  (TEST-TestImpersonationWithHadoopAuth.testProxyWrongHost-seed#[8983C477E607B9CC]) [    ] o.a.s.SolrTestCaseJ4 ###Ending testProxyWrongHost
   [junit4]   2> 2378630 INFO  (TEST-TestImpersonationWithHadoopAuth.testProxyValidateHost-seed#[8983C477E607B9CC]) [    ] o.a.s.SolrTestCaseJ4 ###Starting testProxyValidateHost
   [junit4]   2> 2378631 INFO  (qtp347145329-21889) [n:127.0.0.1:45243_solr    ] o.a.s.h.a.CollectionsHandler Invoked Collection Action :list with params doAs=bar&action=LIST&user.name=localHostAnyGroup&wt=javabin&version=2 and sendToOCPQueue=true
   [junit4]   2> 2378631 INFO  (qtp347145329-21889) [n:127.0.0.1:45243_solr    ] o.a.s.s.HttpSolrCall [admin] webapp=null path=/admin/collections params={doAs=bar&action=LIST&user.name=localHostAnyGroup&wt=javabin&version=2} status=0 QTime=0
   [junit4]   2> 2378631 WARN  (TEST-TestImpersonationWithHadoopAuth.testProxyValidateHost-seed#[8983C477E607B9CC]) [    ] o.a.h.c.p.ResponseProcessCookies Invalid cookie header: "Set-Cookie: hadoop.auth="u=localHostAnyGroup&p=localHostAnyGroup&t=simple-dt&e=1503361652259&s=Lv92fnC4BKgh0wwhlL7seMfFNC8="; Domain=127.0.0.1; Expires= ., 22- . .-2017 00:27:32 GMT; HttpOnly". Invalid 'expires' attribute: ., 22- . .-2017 00:27:32 GMT
   [junit4]   2> 2378632 INFO  (TEST-TestImpersonationWithHadoopAuth.testProxyValidateHost-seed#[8983C477E607B9CC]) [    ] o.a.s.SolrTestCaseJ4 ###Ending testProxyValidateHost
   [junit4]   2> 2378658 INFO  (TEST-TestImpersonationWithHadoopAuth.testProxyInvalidGroup-seed#[8983C477E607B9CC]) [    ] o.a.s.SolrTestCaseJ4 ###Starting testProxyInvalidGroup
   [junit4]   2> 2378664 WARN  (qtp347145329-21889) [n:127.0.0.1:45243_solr    ] o.a.h.s.ShellBasedUnixGroupsMapping got exception trying to get groups for user bar: id: ‘bar’: no such user
   [junit4]   2> id: ‘bar’: no such user
   [junit4]   2> 
   [junit4]   2> 2378665 WARN  (TEST-TestImpersonationWithHadoopAuth.testProxyInvalidGroup-seed#[8983C477E607B9CC]) [    ] o.a.h.c.p.ResponseProcessCookies Invalid cookie header: "Set-Cookie: hadoop.auth="u=bogusGroup&p=bogusGroup&t=simple-dt&e=1503361652287&s=JGudMsjM7SIwh5JjZs20XtnMf6A="; Domain=127.0.0.1; Expires= ., 22- . .-2017 00:27:32 GMT; HttpOnly". Invalid 'expires' attribute: ., 22- . .-2017 00:27:32 GMT
   [junit4]   2> 2378666 INFO  (TEST-TestImpersonationWithHadoopAuth.testProxyInvalidGroup-seed#[8983C477E607B9CC]) [    ] o.a.s.SolrTestCaseJ4 ###Ending testProxyInvalidGroup
   [junit4]   2> 2378681 INFO  (TEST-TestImpersonationWithHadoopAuth.testProxyInvalidProxyUser-seed#[8983C477E607B9CC]) [    ] o.a.s.SolrTestCaseJ4 ###Starting testProxyInvalidProxyUser
   [junit4]   2> 2378684 WARN  (TEST-TestImpersonationWithHadoopAuth.testProxyInvalidProxyUser-seed#[8983C477E607B9CC]) [    ] o.a.h.c.p.ResponseProcessCookies Invalid cookie header: "Set-Cookie: hadoop.auth="u=bar&p=bar&t=simple-dt&e=1503361652311&s=iouUNs6J+fCHkK/Oq6Y0pVX4HRY="; Domain=127.0.0.1; Expires= ., 22- . .-2017 00:27:32 GMT; HttpOnly". Invalid 'expires' attribute: ., 22- . .-2017 00:27:32 GMT
   [junit4]   2> 2378684 INFO  (TEST-TestImpersonationWithHadoopAuth.testProxyInvalidProxyUser-seed#[8983C477E607B9CC]) [    ] o.a.s.SolrTestCaseJ4 ###Ending testProxyInvalidProxyUser
   [junit4]   2> 2378700 INFO  (TEST-TestImpersonationWithHadoopAuth.testProxyValidateAnyHostAnyUser-seed#[8983C477E607B9CC]) [    ] o.a.s.SolrTestCaseJ4 ###Starting testProxyValidateAnyHostAnyUser
   [junit4]   2> 2378701 INFO  (qtp347145329-21885) [n:127.0.0.1:45243_solr    ] o.a.s.h.a.CollectionsHandler Invoked Collection Action :list with params doAs=bar&action=LIST&user.name=anyHostAnyUser&wt=javabin&version=2 and sendToOCPQueue=true
   [junit4]   2> 2378701 INFO  (qtp347145329-21885) [n:127.0.0.1:45243_solr    ] o.a.s.s.HttpSolrCall [admin] webapp=null path=/admin/collections params={doAs=bar&action=LIST&user.name=anyHostAnyUser&wt=javabin&version=2} status=0 QTime=0
   [junit4]   2> 2378701 WARN  (TEST-TestImpersonationWithHadoopAuth.testProxyValidateAnyHostAnyUser-seed#[8983C477E607B9CC]) [    ] o.a.h.c.p.ResponseProcessCookies Invalid cookie header: "Set-Cookie: hadoop.auth="u=anyHostAnyUser&p=anyHostAnyUser&t=simple-dt&e=1503361652329&s=Q8ZvTeEOlkSH/SJH7eCwyG3wzVI="; Domain=127.0.0.1; Expires= ., 22- . .-2017 00:27:32 GMT; HttpOnly". Invalid 'expires' attribute: ., 22- . .-2017 00:27:32 GMT
   [junit4]   2> 2378701 INFO  (TEST-TestImpersonationWithHadoopAuth.testProxyValidateAnyHostAnyUser-seed#[8983C477E607B9CC]) [    ] o.a.s.SolrTestCaseJ4 ###Ending testProxyValidateAnyHostAnyUser
   [junit4]   2> 2378714 INFO  (TEST-TestImpersonationWithHadoopAuth.testProxyNoConfigGroups-seed#[8983C477E607B9CC]) [    ] o.a.s.SolrTestCaseJ4 ###Starting testProxyNoConfigGroups
   [junit4]   2> 2378715 INFO  (jetty-launcher-2664-thread-2-EventThread) [n:127.0.0.1:45243_solr    ] o.a.c.f.s.ConnectionStateManager State change: SUSPENDED
   [junit4]   2> 2378718 WARN  (zkCallback-2682-thread-3) [    ] o.a.s.c.c.ConnectionManager Watcher org.apache.solr.common.cloud.ConnectionManager@dfa3a94 name: ZooKeeperConnection Watcher:127.0.0.1:33783/solr got event WatchedEvent state:Disconnected type:None path:null path: null type: None
   [junit4]   2> 2378718 WARN  (zkCallback-2682-thread-3) [    ] o.a.s.c.c.ConnectionManager zkClient has disconnected
   [junit4]   2> 2378718 WARN  (zkCallback-2675-thread-1-processing-n:127.0.0.1:45243_solr) [n:127.0.0.1:45243_solr    ] o.a.s.c.c.ConnectionManager Watcher org.apache.solr.common.cloud.ConnectionManager@1651814f name: ZooKeeperConnection Watcher:127.0.0.1:33783/solr got event WatchedEvent state:Disconnected type:None path:null path: null type: None
   [junit4]   2> 2378718 WARN  (zkCallback-2675-thread-1-processing-n:127.0.0.1:45243_solr) [n:127.0.0.1:45243_solr    ] o.a.s.c.c.ConnectionManager zkClient has disconnected
   [junit4]   2> 2378718 WARN  (zkCallback-2676-thread-1-processing-n:127.0.0.1:45985_solr) [n:127.0.0.1:45985_solr    ] o.a.s.c.c.ConnectionManager Watcher org.apache.solr.common.cloud.ConnectionManager@57b70c27 name: ZooKeeperConnection Watcher:127.0.0.1:33783/solr got event WatchedEvent state:Disconnected type:None path:null path: null type: None
   [junit4]   2> 2378718 WARN  (zkCallback-2676-thread-1-processing-n:127.0.0.1:45985_solr) [n:127.0.0.1:45985_solr    ] o.a.s.c.c.ConnectionManager zkClient has disconnected
   [junit4]   2> 2378723 WARN  (TEST-TestImpersonationWithHadoopAuth.testProxyNoConfigGroups-seed#[8983C477E607B9CC]) [    ] o.a.h.c.p.ResponseProcessCookies Invalid cookie header: "Set-Cookie: hadoop.auth="u=noGroups&p=noGroups&t=simple-dt&e=1503361652346&s=93BgVHfF9a8AonK6b3mtYGhjsSM="; Domain=127.0.0.1; Expires= ., 22- . .-2017 00:27:32 GMT; HttpOnly". Invalid 'expires' attribute: ., 22- . .-2017 00:27:32 GMT
   [junit4]   2> 2378724 INFO  (TEST-TestImpersonationWithHadoopAuth.testProxyNoConfigGroups-seed#[8983C477E607B9CC]) [    ] o.a.s.SolrTestCaseJ4 ###Ending testProxyNoConfigGroups
   [junit4]   2> 2378734 INFO  (TEST-TestImpersonationWithHadoopAuth.testProxyNullProxyUser-seed#[8983C477E607B9CC]) [    ] o.a.s.SolrTestCaseJ4 ###Starting testProxyNullProxyUser
   [junit4]   2> 2378736 INFO  (qtp347145329-21881) [    ] o.a.s.s.SolrDispatchFilter Error authenticating
   [junit4]   2> java.lang.IllegalArgumentException: userName is NULL, empty or contains a '&'
   [junit4]   2> 	at org.apache.hadoop.security.authentication.util.AuthToken.checkForIllegalArgument(AuthToken.java:87)
   [junit4]   2> 	at org.apache.hadoop.security.authentication.util.AuthToken.<init>(AuthToken.java:70)
   [junit4]   2> 	at org.apache.hadoop.security.authentication.server.AuthenticationToken.<init>(AuthenticationToken.java:58)
   [junit4]   2> 	at org.apache.hadoop.security.authentication.server.PseudoAuthenticationHandler.authenticate(PseudoAuthenticationHandler.java:195)
   [junit4]   2> 	at org.apache.hadoop.security.token.delegation.web.DelegationTokenAuthenticationHandler.authenticate(DelegationTokenAuthenticationHandler.java:348)
   [junit4]   2> 	at org.apache.solr.security.RequestContinuesRecorderAuthenticationHandler.authenticate(RequestContinuesRecorderAuthenticationHandler.java:69)
   [junit4]   2> 	at org.apache.hadoop.security.authentication.server.AuthenticationFilter.doFilter(AuthenticationFilter.java:518)
   [junit4]   2> 	at org.apache.solr.security.HadoopAuthFilter.doFilter(HadoopAuthFilter.java:110)
   [junit4]   2> 	at org.apache.solr.security.HadoopAuthPlugin.doAuthenticate(HadoopAuthPlugin.java:245)
   [junit4]   2> 	at org.apache.solr.servlet.SolrDispatchFilter.authenticateRequest(SolrDispatchFilter.java:449)
   [junit4]   2> 	at org.apache.solr.servlet.SolrDispatchFilter.doFilter(SolrDispatchFilter.java:345)
   [junit4]   2> 	at org.apache.solr.servlet.SolrDispatchFilter.doFilter(SolrDispatchFilter.java:324)
   [junit4]   2> 	at org.eclipse.jetty.servlet.ServletHandler$CachedChain.doFilter(ServletHandler.java:1759)
   [junit4]   2> 	at org.apache.solr.client.solrj.embedded.JettySolrRunner$DebugFilter.doFilter(JettySolrRunner.java:139)
   [junit4]   2> 	at org.eclipse.jetty.servlet.ServletHandler$CachedChain.doFilter(ServletHandler.java:1759)
   [junit4]   2> 	at org.eclipse.jetty.servlet.ServletHandler.doHandle(ServletHandler.java:582)
   [junit4]   2> 	at org.eclipse.jetty.server.session.SessionHandler.doHandle(SessionHandler.java:224)
   [junit4]   2> 	at org.eclipse.jetty.server.handler.ContextHandler.doHandle(ContextHandler.java:1180)
   [junit4]   2> 	at org.eclipse.jetty.servlet.ServletHandler.doScope(ServletHandler.java:512)
   [junit4]   2> 	at org.eclipse.jetty.server.session.SessionHandler.doScope(SessionHandler.java:185)
   [junit4]   2> 	at org.eclipse.jetty.server.handler.ContextHandler.doScope(ContextHandler.java:1112)
   [junit4]   2> 	at org.eclipse.jetty.server.handler.ScopedHandler.handle(ScopedHandler.java:141)
   [junit4]   2> 	at org.eclipse.jetty.server.handler.gzip.GzipHandler.handle(GzipHandler.java:493)
   [junit4]   2> 	at org.eclipse.jetty.server.handler.HandlerWrapper.handle(HandlerWrapper.java:134)
   [junit4]   2> 	at org.eclipse.jetty.server.Server.handle(Server.java:534)
   [junit4]   2> 	at org.eclipse.jetty.server.HttpChannel.handle(HttpChannel.java:320)
   [junit4]   2> 	at org.eclipse.jetty.server.HttpConnection.onFillable(HttpConnection.java:251)
   [junit4]   2> 	at org.eclipse.jetty.io.AbstractConnection$ReadCallback.succeeded(AbstractConnection.java:283)
   [junit4]   2> 	at org.eclipse.jetty.io.FillInterest.fillable(FillInterest.java:108)
   [junit4]   2> 	at org.eclipse.jetty.io.SelectChannelEndPoint$2.run(SelectChannelEndPoint.java:93)
   [junit4]   2> 	at org.eclipse.jetty.util.thread.strategy.ExecuteProduceConsume.executeProduceConsume(ExecuteProduceConsume.java:303)
   [junit4]   2> 	at org.eclipse.jetty.util.thread.strategy.ExecuteProduceConsume.produceConsume(ExecuteProduceConsume.java:148)
   [junit4]   2> 	at org.eclipse.jetty.util.thread.strategy.ExecuteProduceConsume.run(ExecuteProduceConsume.java:136)
   [junit4]   2> 	at org.eclipse.jetty.util.thread.QueuedThreadPool.runJob(QueuedThreadPool.java:671)
   [junit4]   2> 	at org.eclipse.jetty.util.thread.QueuedThreadPool$2.run(QueuedThreadPool.java:589)
   [junit4]   2> 	at java.lang.Thread.run(Thread.java:748)
   [junit4]   2> 2378736 WARN  (qtp347145329-21881) [    ] o.e.j.s.ServletHandler /solr/admin/collections
   [junit4]   2> org.apache.solr.common.SolrException: Error during request authentication, 
   [junit4]   2> 	at org.apache.solr.servlet.SolrDispatchFilter.authenticateRequest(SolrDispatchFilter.java:455)
   [junit4]   2> 	at org.apache.solr.servlet.SolrDispatchFilter.doFilter(SolrDispatchFilter.java:345)
   [junit4]   2> 	at org.apache.solr.servlet.SolrDispatchFilter.doFilter(SolrDispatchFilter.java:324)
   [junit4]   2> 	at org.eclipse.jetty.servlet.ServletHandler$CachedChain.doFilter(ServletHandler.java:1759)
   [junit4]   2> 	at org.apache.solr.client.solrj.embedded.JettySolrRunner$DebugFilter.doFilter(JettySolrRunner.java:139)
   [junit4]   2> 	at org.eclipse.jetty.servlet.ServletHandler$CachedChain.doFilter(ServletHandler.java:1759)
   [junit4]   2> 	at org.eclipse.jetty.servlet.ServletHandler.doHandle(ServletHandler.java:582)
   [junit4]   2> 	at org.eclipse.jetty.server.session.SessionHandler.doHandle(SessionHandler.java:224)
   [junit4]   2> 	at org.eclipse.jetty.server.handler.ContextHandler.doHandle(ContextHandler.java:1180)
   [junit4]   2> 	at org.eclipse.jetty.servlet.ServletHandler.doScope(ServletHandler.java:512)
   [junit4]   2> 	at org.eclipse.jetty.server.session.SessionHandler.doScope(SessionHandler.java:185)
   [junit4]   2> 	at org.eclipse.jetty.server.handler.ContextHandler.doScope(ContextHandler.java:1112)
   [junit4]   2> 	at org.eclipse.jetty.server.handler.ScopedHandler.handle(ScopedHandler.java:141)
   [junit4]   2> 	at org.eclipse.jetty.server.handler.gzip.GzipHandler.handle(GzipHandler.java:493)
   [junit4]   2> 	at org.eclipse.jetty.server.handler.HandlerWrapper.handle(HandlerWrapper.java:134)
   [junit4]   2> 	at org.eclipse.jetty.server.Server.handle(Server.java:534)
   [junit4]   2> 	at org.eclipse.jetty.server.HttpChannel.handle(HttpChannel.java:320)
   [junit4]   2> 	at org.eclipse.jetty.server.HttpConnection.onFillable(HttpConnection.java:251)
   [junit4]   2> 	at org.eclipse.jetty.io.AbstractConnection$ReadCallback.succeeded(AbstractConnection.java:283)
   [junit4]   2> 	at org.eclipse.jetty.io.FillInterest.fillable(FillInterest.java:108)
   [junit4]   2> 	at org.eclipse.jetty.io.SelectChannelEndPoint$2.run(SelectChannelEndPoint.java:93)
   [junit4]   2> 	at org.eclipse.jetty.util.thread.strategy.ExecuteProduceConsume.executeProduceConsume(ExecuteProduceConsume.java:303)
   [junit4]   2> 	at org.eclipse.jetty.util.thread.strategy.ExecuteProduceConsume.produceConsume(ExecuteProduceConsume.java:148)
   [junit4]   2> 	at org.eclipse.jetty.util.thread.strategy.ExecuteProduceConsume.run(ExecuteProduceConsume.java:136)
   [junit4]   2> 	at org.eclipse.jetty.util.thread.QueuedThreadPool.runJob(QueuedThreadPool.java:671)
   [junit4]   2> 	at org.eclipse.jetty.util.thread.QueuedThreadPool$2.run(QueuedThreadPool.java:589)
   [junit4]   2> 	at java.lang.Thread.run(Thread.java:748)
   [junit4]   2> Caused by: java.lang.IllegalArgumentException: userName is NULL, empty or contains a '&'
   [junit4]   2> 	at org.apache.hadoop.security.authentication.util.AuthToken.checkForIllegalArgument(AuthToken.java:87)
   [junit4]   2> 	at org.apache.hadoop.security.authentication.util.AuthToken.<init>(AuthToken.java:70)
   [junit4]   2> 	at org.apache.hadoop.security.authentication.server.AuthenticationToken.<init>(AuthenticationToken.java:58)
   [junit4]   2> 	at org.apache.hadoop.security.authentication.server.PseudoAuthenticationHandler.authenticate(PseudoAuthenticationHandler.java:195)
   [junit4]   2> 	at org.apache.hadoop.security.token.delegation.web.DelegationTokenAuthenticationHandler.authenticate(DelegationTokenAuthenticationHandler.java:348)
   [junit4]   2> 	at org.apache.solr.security.RequestContinuesRecorderAuthenticationHandler.authenticate(RequestContinuesRecorderAuthenticationHandler.java:69)
   [junit4]   2> 	at org.apache.hadoop.security.authentication.server.AuthenticationFilter.doFilter(AuthenticationFilter.java:518)
   [junit4]   2> 	at org.apache.solr.security.HadoopAuthFilter.doFilter(HadoopAuthFilter.java:110)
   [junit4]   2> 	at org.apache.solr.security.HadoopAuthPlugin.doAuthenticate(HadoopAuthPlugin.java:245)
   [junit4]   2> 	at org.apache.solr.servlet.SolrDispatchFilter.authenticateRequest(SolrDispatchFilter.java:449)
   [junit4]   2> 	... 26 more
   [junit4]   2> 2378738 INFO  (TEST-TestImpersonationWithHadoopAuth.testProxyNullProxyUser-seed#[8983C477E607B9CC]) [    ] o.a.s.SolrTestCaseJ4 ###Ending testProxyNullProxyUser
   [junit4]   2> 2378750 INFO  (TEST-TestImpersonationWithHadoopAuth.testProxyValidateGroup-seed#[8983C477E607B9CC]) [    ] o.a.s.SolrTestCaseJ4 ###Starting testProxyValidateGroup
   [junit4]   2> 2378751 INFO  (qtp347145329-21891) [n:127.0.0.1:45243_solr    ] o.a.s.h.a.CollectionsHandler Invoked Collection Action :list with params doAs=jenkins&action=LIST&user.name=anyHostUsersGroup&wt=javabin&version=2 and sendToOCPQueue=true
   [junit4]   2> 2378751 INFO  (qtp347145329-21891) [n:127.0.0.1:45243_solr    ] o.a.s.s.HttpSolrCall [admin] webapp=null path=/admin/collections params={doAs=jenkins&action=LIST&user.name=anyHostUsersGroup&wt=javabin&version=2} status=0 QTime=0
   [junit4]   2> 2378752 WARN  (TEST-TestImpersonationWithHadoopAuth.testProxyValidateGroup-seed#[8983C477E607B9CC]) [    ] o.a.h.c.p.ResponseProcessCookies Invalid cookie header: "Set-Cookie: hadoop.auth="u=anyHostUsersGroup&p=anyHostUsersGroup&t=simple-dt&e=1503361652379&s=REQGsdi1z1xRmqdlyRpcUH8l3jA="; Domain=127.0.0.1; Expires= ., 22- . .-2017 00:27:32 GMT; HttpOnly". Invalid 'expires' attribute: ., 22- . .-2017 00:27:32 GMT
   [junit4]   2> 2378752 INFO  (TEST-TestImpersonationWithHadoopAuth.testProxyValidateGroup-seed#[8983C477E607B9CC]) [    ] o.a.s.SolrTestCaseJ4 ###Ending testProxyValidateGroup
   [junit4]   2> 2379477 INFO  (jetty-closer-2665-thread-2) [    ] o.e.j.s.AbstractConnector Stopped ServerConnector@54851cea{HTTP/1.1,[http/1.1]}{127.0.0.1:0}
   [junit4]   2> 2379477 INFO  (jetty-closer-2665-thread-1) [    ] o.e.j.s.AbstractConnector Stopped ServerConnector@2bf0f6fd{HTTP/1.1,[http/1.1]}{127.0.0.1:0}
   [junit4]   2> 2379477 INFO  (jetty-closer-2665-thread-2) [    ] o.a.s.c.CoreContainer Shutting down CoreContainer instance=1442998256
   [junit4]   2> 2379477 INFO  (jetty-closer-2665-thread-1) [    ] o.a.s.c.CoreContainer Shutting down CoreContainer instance=1354012084
   [junit4]   2> 2379477 INFO  (jetty-closer-2665-thread-2) [    ] o.a.s.m.SolrMetricManager Closing metric reporters for registry=solr.node, tag=null
   [junit4]   2> 2379477 INFO  (jetty-closer-2665-thread-1) [    ] o.a.s.m.SolrMetricManager Closing metric reporters for registry=solr.node, tag=null
   [junit4]   2> 2379477 INFO  (jetty-closer-2665-thread-2) [    ] o.a.s.m.r.SolrJmxReporter Closing reporter [org.apache.solr.metrics.reporters.SolrJmxReporter@2675e577: rootName = solr_45985, domain = solr.node, service url = null, agent id = null] for registry solr.node / com.codahale.metrics.MetricRegistry@17f1ddcb
   [junit4]   2> 2379477 INFO  (jetty-closer-2665-thread-1) [    ] o.a.s.m.r.SolrJmxReporter Closing reporter [org.apache.solr.metrics.reporters.SolrJmxReporter@3c942b6a: rootName = solr_45243, domain = solr.node, service url = null, agent id = null] for registry solr.node / com.codahale.metrics.MetricRegistry@1ab100f
   [junit4]   2> 2379481 INFO  (jetty-closer-2665-thread-2) [    ] o.a.s.m.SolrMetricManager Closing metric reporters for registry=solr.jvm, tag=null
   [junit4]   2> 2379481 INFO  (jetty-closer-2665-thread-2) [    ] o.a.s.m.r.SolrJmxReporter Closing reporter [org.apache.solr.metrics.reporters.SolrJmxReporter@43f9e7f2: rootName = solr_45985, domain = solr.jvm, service url = null, agent id = null] for registry solr.jvm / com.codahale.metrics.MetricRegistry@5144bae5
   [junit4]   2> 2379481 INFO  (jetty-closer-2665-thread-1) [    ] o.a.s.m.SolrMetricManager Closing metric reporters for registry=solr.jvm, tag=null
   [junit4]   2> 2379481 INFO  (jetty-closer-2665-thread-1) [    ] o.a.s.m.r.SolrJmxReporter Closing reporter [org.apache.solr.metrics.reporters.SolrJmxReporter@5124eaa8: rootName = solr_45243, domain = solr.jvm, service url = null, agent id = null] for registry solr.jvm / com.codahale.metrics.MetricRegistry@5144bae5
   [junit4]   2> 2379484 INFO  (jetty-closer-2665-thread-1) [    ] o.a.s.m.SolrMetricManager Closing metric reporters for registry=solr.jetty, tag=null
   [junit4]   2> 2379484 INFO  (jetty-closer-2665-thread-1) [    ] o.a.s.m.r.SolrJmxReporter Closing reporter [org.apache.solr.metrics.reporters.SolrJmxReporter@10030dc3: rootName = solr_45243, domain = solr.jetty, service url = null, agent id = null] for registry solr.jetty / com.codahale.metrics.MetricRegistry@52072622
   [junit4]   2> 2379484 INFO  (jetty-closer-2665-thread-2) [    ] o.a.s.m.SolrMetricManager Closing metric reporters for registry=solr.jetty, tag=null
   [junit4]   2> 2379484 INFO  (jetty-closer-2665-thread-2) [    ] o.a.s.m.r.SolrJmxReporter Closing reporter [org.apache.solr.metrics.reporters.SolrJmxReporter@1152403f: rootName = solr_45985, domain = solr.jetty, service url = null, agent id = null] for registry solr.jetty / com.codahale.metrics.MetricRegistry@52072622
   [junit4]   2> 2379732 INFO  (jetty-launcher-2664-thread-1-EventThread) [n:127.0.0.1:45985_solr    ] o.a.c.f.s.ConnectionStateManager State change: SUSPENDED
   [junit4]   2> 2380209 INFO  (jetty-closer-2665-thread-2) [    ] o.a.s.m.SolrMetricManager Closing metric reporters for registry=solr.cluster, tag=null
   [junit4]   2> 2380209 INFO  (jetty-closer-2665-thread-2) [    ] o.a.s.c.TransientSolrCoreCacheDefault Allocating transient cache for 2147483647 transient cores
   [junit4]   2> 2380209 WARN  (zkCallback-2676-thread-3-processing-n:127.0.0.1:45985_solr) [n:127.0.0.1:45985_solr    ] o.a.s.c.c.ZkStateReader ZooKeeper watch triggered, but Solr cannot talk to ZK: [KeeperErrorCode = Session expired for /live_nodes]
   [junit4]   2> 2380209 ERROR (Thread[Thread-8508,5,TGRP-TestImpersonationWithHadoopAuth]) [n:127.0.0.1:45985_solr    ] o.a.h.s.t.d.AbstractDelegationTokenSecretManager ExpiredTokenRemover received java.lang.InterruptedException: sleep interrupted
   [junit4]   2> 2380210 INFO  (jetty-closer-2665-thread-2) [    ] o.e.j.s.h.ContextHandler Stopped o.e.j.s.ServletContextHandler@453203b7{/solr,null,UNAVAILABLE}
   [junit4]   2> 2380598 INFO  (zkCallback-2675-thread-2-processing-n:127.0.0.1:45243_solr) [n:127.0.0.1:45243_solr    ] o.a.s.c.c.ZkStateReader Updated live nodes from ZooKeeper... (2) -> (1)
   [junit4]   2> 2380599 INFO  (jetty-closer-2665-thread-1) [    ] o.a.s.m.SolrMetricManager Closing metric reporters for registry=solr.cluster, tag=null
   [junit4]   2> 2380599 INFO  (jetty-closer-2665-thread-1) [    ] o.a.s.c.TransientSolrCoreCacheDefault Allocating transient cache for 2147483647 transient cores
   [junit4]   2> 2380599 INFO  (jetty-closer-2665-thread-1) [    ] o.a.s.c.Overseer Overseer (id=98521948878143493-127.0.0.1:45243_solr-n_0000000000) closing
   [junit4]   2> 2380599 INFO  (OverseerStateUpdate-98521948878143493-127.0.0.1:45243_solr-n_0000000000) [n:127.0.0.1:45243_solr    ] o.a.s.c.Overseer Overseer Loop exiting : 127.0.0.1:45243_solr
   [junit4]   2> 2380599 WARN  (zkCallback-2675-thread-2-processing-n:127.0.0.1:45243_solr) [n:127.0.0.1:45243_solr    ] o.a.s.c.c.ZkStateReader ZooKeeper watch triggered, but Solr cannot talk to ZK: [KeeperErrorCode = Session expired for /live_nodes]
   [junit4]   2> 2380599 ERROR (Thread[Thread-8505,5,TGRP-TestImpersonationWithHadoopAuth]) [n:127.0.0.1:45243_solr    ] o.a.h.s.t.d.AbstractDelegationTokenSecretManager ExpiredTokenRemover received java.lang.InterruptedException: sleep interrupted
   [junit4]   2> 2380600 INFO  (jetty-closer-2665-thread-1) [    ] o.e.j.s.h.ContextHandler Stopped o.e.j.s.ServletContextHandler@7ca4c1b5{/solr,null,UNAVAILABLE}
   [junit4]   2> 2380601 ERROR (SUITE-TestImpersonationWithHadoopAuth-seed#[8983C477E607B9CC]-worker) [    ] o.a.z.s.ZooKeeperServer ZKShutdownHandler is not registered, so ZooKeeper server won't take any action on ERROR or SHUTDOWN server state changes
   [junit4]   2> 2380601 INFO  (SUITE-TestImpersonationWithHadoopAuth-seed#[8983C477E607B9CC]-worker) [    ] o.a.s.c.ZkTestServer connecting to 127.0.0.1:33783 33783
   [junit4]   2> 2385633 INFO  (Thread-8488) [    ] o.a.s.c.ZkTestServer connecting to 127.0.0.1:33783 33783
   [junit4]   2> 2385634 WARN  (Thread-8488) [    ] o.a.s.c.ZkTestServer Watch limit violations: 
   [junit4]   2> Maximum concurrent create/delete watches above limit:
   [junit4]   2> 
   [junit4]   2> 	3	/solr/aliases.json
   [junit4]   2> 	3	/solr/clusterprops.json
   [junit4]   2> 	2	/solr/security.json
   [junit4]   2> 
   [junit4]   2> Maximum concurrent data watches above limit:
   [junit4]   2> 
   [junit4]   2> 	3	/solr/security/zkdtsm/ZKDTSMRoot/ZKDTSMKeyIdRoot
   [junit4]   2> 	3	/solr/clusterstate.json
   [junit4]   2> 	2	/solr/security/zkdtsm/ZKDTSMRoot/ZKDTSMMasterKeyRoot/DK_1
   [junit4]   2> 	2	/solr/security/zkdtsm/ZKDTSMRoot/ZKDTSMMasterKeyRoot/DK_3
   [junit4]   2> 	2	/solr/security/zkdtsm/ZKDTSMRoot/ZKDTSMMasterKeyRoot/DK_2
   [junit4]   2> 	2	/solr/security/zkdtsm/ZKDTSMRoot/ZKDTSMMasterKeyRoot/DK_4
   [junit4]   2> 	2	/solr/security/zkdtsm/ZKDTSMRoot/ZKDTSMSeqNumRoot
   [junit4]   2> 
   [junit4]   2> Maximum concurrent children watches above limit:
   [junit4]   2> 
   [junit4]   2> 	3	/solr/live_nodes
   [junit4]   2> 	3	/solr/collections
   [junit4]   2> 	2	/solr/security/zkdtsm/ZKDTSMRoot/ZKDTSMMasterKeyRoot
   [junit4]   2> 	2	/solr/security/zkdtsm/ZKDTSMRoot/ZKDTSMTokensRoot
   [junit4]   2> 
   [junit4]   2> 2385634 INFO  (SUITE-TestImpersonationWithHadoopAuth-seed#[8983C477E607B9CC]-worker) [    ] o.a.s.SolrTestCaseJ4 ------------------------------------------------------- Done waiting for tracked resources to be released
   [junit4]   2> Aug 21, 2017 2:27:39 PM com.carrotsearch.randomizedtesting.ThreadLeakControl checkThreadLeaks
   [junit4]   2> WARNING: Will linger awaiting termination of 2 leaked thread(s).
   [junit4]   2> Aug 21, 2017 2:27:59 PM com.carrotsearch.randomizedtesting.ThreadLeakControl checkThreadLeaks
   [junit4]   2> SEVERE: 2 threads leaked from SUITE scope at org.apache.solr.security.hadoop.TestImpersonationWithHadoopAuth: 
   [junit4]   2>    1) Thread[id=21925, name=jetty-launcher-2664-thread-1-EventThread, state=TIMED_WAITING, group=TGRP-TestImpersonationWithHadoopAuth]
   [junit4]   2>         at sun.misc.Unsafe.park(Native Method)
   [junit4]   2>         at java.util.concurrent.locks.LockSupport.parkNanos(LockSupport.java:215)
   [junit4]   2>         at java.util.concurrent.locks.AbstractQueuedSynchronizer.doAcquireSharedNanos(AbstractQueuedSynchronizer.java:1037)
   [junit4]   2>         at java.util.concurrent.locks.AbstractQueuedSynchronizer.tryAcquireSharedNanos(AbstractQueuedSynchronizer.java:1328)
   [junit4]   2>         at java.util.concurrent.CountDownLatch.await(CountDownLatch.java:277)
   [junit4]   2>         at org.apache.curator.CuratorZookeeperClient.internalBlockUntilConnectedOrTimedOut(CuratorZookeeperClient.java:323)
   [junit4]   2>         at org.apache.curator.RetryLoop.callWithRetry(RetryLoop.java:105)
   [junit4]   2>         at org.apache.curator.framework.imps.GetDataBuilderImpl.pathInForeground(GetDataBuilderImpl.java:288)
   [junit4]   2>         at org.apache.curator.framework.imps.GetDataBuilderImpl.forPath(GetDataBuilderImpl.java:279)
   [junit4]   2>         at org.apache.curator.framework.imps.GetDataBuilderImpl.forPath(GetDataBuilderImpl.java:41)
   [junit4]   2>         at org.apache.curator.framework.recipes.shared.SharedValue.readValue(SharedValue.java:244)
   [junit4]   2>         at org.apache.curator.framework.recipes.shared.SharedValue.access$100(SharedValue.java:44)
   [junit4]   2>         at org.apache.curator.framework.recipes.shared.SharedValue$1.process(SharedValue.java:61)
   [junit4]   2>         at org.apache.curator.framework.imps.NamespaceWatcher.process(NamespaceWatcher.java:67)
   [junit4]   2>         at org.apache.zookeeper.ClientCnxn$EventThread.processEvent(ClientCnxn.java:530)
   [junit4]   2>         at org.apache.zookeeper.ClientCnxn$EventThread.run(ClientCnxn.java:505)
   [junit4]   2>    2) Thread[id=21929, name=jetty-launcher-2664-thread-2-EventThread, state=TIMED_WAITING, group=TGRP-TestImpersonationWithHadoopAuth]
   [junit4]   2>         at sun.misc.Unsafe.park(Native Method)
   [junit4]   2>         at java.util.concurrent.locks.LockSupport.parkNanos(LockSupport.java:215)
   [junit4]   2>         at java.util.concurrent.locks.AbstractQueuedSynchronizer.doAcquireSharedNanos(AbstractQueuedSynchronizer.java:1037)
   [junit4]   2>         at java.util.concurrent.locks.AbstractQueuedSynchronizer.tryAcquireSharedNanos(AbstractQueuedSynchronizer.java:1328)
   [junit4]   2>         at java.util.concurrent.CountDownLatch.await(CountDownLatch.java:277)
   [junit4]   2>         at org.apache.curator.CuratorZookeeperClient.internalBlockUntilConnectedOrTimedOut(CuratorZookeeperClient.java:323)
   [junit4]   2>         at org.apache.curator.RetryLoop.callWithRetry(RetryLoop.java:105)
   [junit4]   2>         at org.apache.curator.framework.imps.GetDataBuilderImpl.pathInForeground(GetDataBuilderImpl.java:288)
   [junit4]   2>         at org.apache.curator.framework.imps.GetDataBuilderImpl.forPath(GetDataBuilderImpl.java:279)
   [junit4]   2>         at org.apache.curator.framework.imps.GetDataBuilderImpl.forPath(GetDataBuilderImpl.java:41)
   [junit4]   2>         at org.apache.curator.framework.recipes.shared.SharedValue.readValue(SharedValue.java:244)
   [junit4]   2>         at org.apache.curator.framework.recipes.shared.SharedValue.access$100(SharedValue.java:44)
   [junit4]   2>         at org.apache.curator.framework.recipes.shared.SharedValue$1.process(SharedValue.java:61)
   [junit4]   2>         at org.apache.curator.framework.imps.NamespaceWatcher.process(NamespaceWatcher.java:67)
   [junit4]   2>         at org.apache.zookeeper.ClientCnxn$EventThread.processEvent(ClientCnxn.java:530)
   [junit4]   2>         at org.apache.zookeeper.ClientCnxn$EventThread.run(ClientCnxn.java:505)
   [junit4]   2> Aug 21, 2017 2:27:59 PM com.carrotsearch.randomizedtesting.ThreadLeakControl tryToInterruptAll
   [junit4]   2> INFO: Starting to interrupt leaked threads:
   [junit4]   2>    1) Thread[id=21925, name=jetty-launcher-2664-thread-1-EventThread, state=TIMED_WAITING, group=TGRP-TestImpersonationWithHadoopAuth]
   [junit4]   2>    2) Thread[id=21929, name=jetty-launcher-2664-thread-2-EventThread, state=TIMED_WAITING, group=TGRP-TestImpersonationWithHadoopAuth]
   [junit4]   2> 2405757 ERROR (jetty-launcher-2664-thread-2-EventThread) [n:127.0.0.1:45243_solr    ] o.a.c.f.i.CuratorFrameworkImpl Watcher exception
   [junit4]   2> java.lang.InterruptedException
   [junit4]   2> 	at java.util.concurrent.locks.AbstractQueuedSynchronizer.doAcquireSharedNanos(AbstractQueuedSynchronizer.java:1039)
   [junit4]   2> 	at java.util.concurrent.locks.AbstractQueuedSynchronizer.tryAcquireSharedNanos(AbstractQueuedSynchronizer.java:1328)
   [junit4]   2> 	at java.util.concurrent.CountDownLatch.await(CountDownLatch.java:277)
   [junit4]   2> 	at org.apache.curator.CuratorZookeeperClient.internalBlockUntilConnectedOrTimedOut(CuratorZookeeperClient.java:323)
   [junit4]   2> 	at org.apache.curator.RetryLoop.callWithRetry(RetryLoop.java:105)
   [junit4]   2> 	at org.apache.curator.framework.imps.GetDataBuilderImpl.pathInForeground(GetDataBuilderImpl.java:288)
   [junit4]   2> 	at org.apache.curator.framework.imps.GetDataBuilderImpl.forPath(GetDataBuilderImpl.java:279)
   [junit4]   2> 	at org.apache.curator.framework.imps.GetDataBuilderImpl.forPath(GetDataBuilderImpl.java:41)
   [junit4]   2> 	at org.apache.curator.framework.recipes.shared.SharedValue.readValue(SharedValue.java:244)
   [junit4]   2> 	at org.apache.curator.framework.recipes.shared.SharedValue.access$100(SharedValue.java:44)
   [junit4]   2> 	at org.apache.curator.framework.recipes.shared.SharedValue$1.process(SharedValue.java:61)
   [junit4]   2> 	at org.apache.curator.framework.imps.NamespaceWatcher.process(NamespaceWatcher.java:67)
   [junit4]   2> 	at org.apache.zookeeper.ClientCnxn$EventThread.processEvent(ClientCnxn.java:530)
   [junit4]   2> 	at org.apache.zookeeper.ClientCnxn$EventThread.run(ClientCnxn.java:505)
   [junit4]   2> 2405757 ERROR (jetty-launcher-2664-thread-1-EventThread) [n:127.0.0.1:45985_solr    ] o.a.c.f.i.CuratorFrameworkImpl Watcher exception
   [junit4]   2> java.lang.InterruptedException
   [junit4]   2> 	at java.util.concurrent.locks.AbstractQueuedSynchronizer.doAcquireSharedNanos(AbstractQueuedSynchronizer.java:1039)
   [junit4]   2> 	at java.util.concurrent.locks.AbstractQueuedSynchronizer.tryAcquireSharedNanos(AbstractQueuedSynchronizer.java:1328)
   [junit4]   2> 	at java.util.concurrent.CountDownLatch.await(CountDownLatch.java:277)
   [junit4]   2> 	at org.apache.curator.CuratorZookeeperClient.internalBlockUntilConnectedOrTimedOut(CuratorZookeeperClient.java:323)
   [junit4]   2> 	at org.apache.curator.RetryLoop.callWithRetry(RetryLoop.java:105)
   [junit4]   2> 	at org.apache.curator.framework.imps.GetDataBuilderImpl.pathInForeground(GetDataBuilderImpl.java:288)
   [junit4]   2> 	at org.apache.curator.framework.imps.GetDataBuilderImpl.forPath(GetDataBuilderImpl.java:279)
   [junit4]   2> 	at org.apache.curator.framework.imps.GetDataBuilderImpl.forPath(GetDataBuilderImpl.java:41)
   [junit4]   2> 	at org.apache.curator.framework.recipes.shared.SharedValue.readValue(SharedValue.java:244)
   [junit4]   2> 	at org.apache.curator.framework.recipes.shared.SharedValue.access$100(SharedValue.java:44)
   [junit4]   2> 	at org.apache.curator.framework.recipes.shared.SharedValue$1.process(SharedValue.java:61)
   [junit4]   2> 	at org.apache.curator.framework.imps.NamespaceWatcher.process(NamespaceWatcher.java:67)
   [junit4]   2> 	at org.apache.zookeeper.ClientCnxn$EventThread.processEvent(ClientCnxn.java:530)
   [junit4]   2> 	at org.apache.zookeeper.ClientCnxn$EventThread.run(ClientCnxn.java:505)
   [junit4]   2> Aug 21, 2017 2:27:59 PM com.carrotsearch.randomizedtesting.ThreadLeakControl tryToInterruptAll
   [junit4]   2> INFO: All leaked threads terminated.
   [junit4]   2> NOTE: test params are: codec=Asserting(Lucene70): {}, docValues:{}, maxPointsInLeafNode=1862, maxMBSortInHeap=6.147020502154096, sim=RandomSimilarity(queryNorm=false): {}, locale=th, timezone=America/Montserrat
   [junit4]   2> NOTE: Linux 4.10.0-27-generic amd64/Oracle Corporation 1.8.0_144 (64-bit)/cpus=8,threads=1,free=257468168,total=536870912
   [junit4]   2> NOTE: All tests run in this JVM: [CdcrUpdateLogTest, BJQParserTest, AlternateDirectoryTest, TestPartialUpdateDeduplication, TestJsonRequest, TestCollationFieldDocValues, LeaderInitiatedRecoveryOnShardRestartTest, StressHdfsTest, ChaosMonkeySafeLeaderWithPullReplicasTest, SampleTest, BlockCacheTest, DistributedFacetPivotSmallTest, TestCorePropertiesReload, HdfsTlogReplayBufferedWhileIndexingTest, TestSimpleTextCodec, TestManagedSynonymGraphFilterFactory, TestXmlQParserPlugin, TestLegacyTerms, TestNumericRangeQuery64, TestCoreContainer, SegmentsInfoRequestHandlerTest, ReplaceNodeTest, PeerSyncReplicationTest, ZkControllerTest, PreAnalyzedFieldManagedSchemaCloudTest, TestFileDictionaryLookup, TestImplicitCoreProperties, TestUseDocValuesAsStored2, ResourceLoaderTest, MultiThreadedOCPTest, TestSolrCloudSnapshots, PrimUtilsTest, TestStressUserVersions, TestRTGBase, TestFieldTypeResource, TestConfigSetsAPI, TestValueSourceCache, FileBasedSpellCheckerTest, TestHdfsBackupRestoreCore, HealthCheckHandlerTest, MoveReplicaHDFSTest, TestNamedUpdateProcessors, TestRandomCollapseQParserPlugin, TestRuleBasedAuthorizationPlugin, SolrIndexMetricsTest, InfixSuggestersTest, DeleteShardTest, ShardRoutingTest, TestBulkSchemaConcurrent, DocValuesTest, TestCharFilters, SoftAutoCommitTest, HdfsRestartWhileUpdatingTest, TestFieldCollectionResource, TestXIncludeConfig, DocExpirationUpdateProcessorFactoryTest, TestElisionMultitermQuery, CacheHeaderTest, HttpSolrCallGetCoreTest, TestLegacyFieldCache, CoreAdminRequestStatusTest, CursorMarkTest, MoreLikeThisHandlerTest, ClusterStateUpdateTest, TestDistributedStatsComponentCardinality, PKIAuthenticationIntegrationTest, BigEndianAscendingWordSerializerTest, TestStressInPlaceUpdates, TestManagedSchemaAPI, TestSolrCoreParser, TestPostingsSolrHighlighter, QueryParsingTest, TestRTimerTree, SystemInfoHandlerTest, DistributedVersionInfoTest, TestClassicSimilarityFactory, BasicFunctionalityTest, TestCloudInspectUtil, TestSimpleTrackingShardHandler, TestMinMaxOnMultiValuedField, ShardSplitTest, TestCollapseQParserPlugin, TestEmbeddedSolrServerSchemaAPI, TestStressVersions, TestGraphTermsQParserPlugin, DirectSolrConnectionTest, TestSolrIndexConfig, TestFastLRUCache, SolrCmdDistributorTest, TestLegacyNumericRangeQueryBuilder, TestNRTOpen, TestCoreDiscovery, SimpleCollectionCreateDeleteTest, TestCloudPseudoReturnFields, TermVectorComponentTest, TestMacros, ZkStateWriterTest, UninvertDocValuesMergePolicyTest, CdcrRequestHandlerTest, CdcrBootstrapTest, TestPushWriter, IndexSchemaTest, SparseHLLTest, TestSweetSpotSimilarityFactory, TestManagedResourceStorage, DOMUtilTest, TestMultiWordSynonyms, TestIntervalFaceting, SliceStateTest, TestFieldCacheSortRandom, SchemaVersionSpecificBehaviorTest, CloudExitableDirectoryReaderTest, PreAnalyzedUpdateProcessorTest, TriLevelCompositeIdRoutingTest, DistributedQueryComponentOptimizationTest, SolrGangliaReporterTest, TestSchemaSimilarityResource, OpenCloseCoreStressTest, TestStressRecovery, TestFieldCache, UpdateLogTest, DocValuesNotIndexedTest, HttpPartitionTest, SolrXmlInZkTest, TestAuthenticationFramework, TestClusterProperties, TestCollectionsAPIViaSolrCloudCluster, TestLocalFSCloudBackupRestore, TestMiniSolrCloudClusterSSL, TestPullReplicaErrorHandling, TestRandomRequestDistribution, TestReplicaProperties, TestShortCircuitedRequests, TestTolerantUpdateProcessorCloud, TestPolicyCloud, HdfsRecoveryZkTest, BlobRepositoryCloudTest, CoreSorterTest, DirectoryFactoryTest, ExitableDirectoryReaderTest, QueryResultKeyTest, TestBackupRepositoryFactory, TestConfigSetImmutable, TestConfigSetProperties, TestInfoStreamLogging, TestInitParams, RequestLoggingTest, SearchHandlerTest, TestBlobHandler, DistributedFacetExistsSmallTest, DistributedFacetPivotLongTailTest, DistributedSuggestComponentTest, TestExpandComponent, TestHttpShardHandlerFactory, JavabinLoaderTest, WrapperMergePolicyFactoryTest, TestLegacyField, TestLegacyNumericUtils, JvmMetricsTest, SolrMetricManagerTest, SolrGraphiteReporterTest, SolrCloudReportersTest, ManagedSchemaRoundRobinCloudTest, TestSchemaManager, AnalyticsQueryTest, MergeStrategyTest, TestOverriddenPrefixQueryForCustomFieldType, TestPayloadScoreQParserPlugin, TestRecoveryHdfs, BlockJoinFacetRandomTest, BlockJoinFacetSimpleTest, TestNestedDocsSort, TestScoreJoinQPNoScore, TestLRUStatsCache, TestSha256AuthenticationProvider, TestDelegationWithHadoopAuth, TestImpersonationWithHadoopAuth]
   [junit4]   2> NOTE: reproduce with: ant test  -Dtestcase=TestImpersonationWithHadoopAuth -Dtests.seed=8983C477E607B9CC -Dtests.multiplier=3 -Dtests.slow=true -Dtests.locale=th -Dtests.timezone=America/Montserrat -Dtests.asserts=true -Dtests.file.encoding=ISO-8859-1
   [junit4] ERROR   0.00s J1 | TestImpersonationWithHadoopAuth (suite) <<<
   [junit4]    > Throwable #1: com.carrotsearch.randomizedtesting.ThreadLeakError: 2 threads leaked from SUITE scope at org.apache.solr.security.hadoop.TestImpersonationWithHadoopAuth: 
   [junit4]    >    1) Thread[id=21925, name=jetty-launcher-2664-thread-1-EventThread, state=TIMED_WAITING, group=TGRP-TestImpersonationWithHadoopAuth]
   [junit4]    >         at sun.misc.Unsafe.park(Native Method)
   [junit4]    >         at java.util.concurrent.locks.LockSupport.parkNanos(LockSupport.java:215)
   [junit4]    >         at java.util.concurrent.locks.AbstractQueuedSynchronizer.doAcquireSharedNanos(AbstractQueuedSynchronizer.java:1037)
   [junit4]    >         at java.util.concurrent.locks.AbstractQueuedSynchronizer.tryAcquireSharedNanos(AbstractQueuedSynchronizer.java:1328)
   [junit4]    >         at java.util.concurrent.CountDownLatch.await(CountDownLatch.java:277)
   [junit4]    >         at org.apache.curator.CuratorZookeeperClient.internalBlockUntilConnectedOrTimedOut(CuratorZookeeperClient.java:323)
   [junit4]    >         at org.apache.curator.RetryLoop.callWithRetry(RetryLoop.java:105)
   [junit4]    >         at org.apache.curator.framework.imps.GetDataBuilderImpl.pathInForeground(GetDataBuilderImpl.java:288)
   [junit4]    >         at org.apache.curator.framework.imps.GetDataBuilderImpl.forPath(GetDataBuilderImpl.java:279)
   [junit4]    >         at org.apache.curator.framework.imps.GetDataBuilderImpl.forPath(GetDataBuilderImpl.java:41)
   [junit4]    >         at org.apache.curator.framework.recipes.shared.SharedValue.readValue(SharedValue.java:244)
   [junit4]    >         at org.apache.curator.framework.recipes.shared.SharedValue.access$100(SharedValue.java:44)
   [junit4]    >         at org.apache.curator.framework.recipes.shared.SharedValue$1.process(SharedValue.java:61)
   [junit4]    >         at org.apache.curator.framework.imps.NamespaceWatcher.process(NamespaceWatcher.java:67)
   [junit4]    >         at org.apache.zookeeper.ClientCnxn$EventThread.processEvent(ClientCnxn.java:530)
   [junit4]    >         at org.apache.zookeeper.ClientCnxn$EventThread.run(ClientCnxn.java:505)
   [junit4]    >    2) Thread[id=21929, name=jetty-launcher-2664-thread-2-EventThread, state=TIMED_WAITING, group=TGRP-TestImpersonationWithHadoopAuth]
   [junit4]    >         at sun.misc.Unsafe.park(Native Method)
   [junit4]    >         at java.util.concurrent.locks.LockSupport.parkNanos(LockSupport.java:215)
   [junit4]    >         at java.util.concurrent.locks.AbstractQueuedSynchronizer.doAcquireSharedNanos(AbstractQueuedSynchronizer.java:1037)
   [junit4]    >         at java.util.concurrent.locks.AbstractQueuedSynchronizer.tryAcquireSharedNanos(AbstractQueuedSynchronizer.java:1328)
   [junit4]    >         at java.util.concurrent.CountDownLatch.await(CountDownLatch.java:277)
   [junit4]    >         at org.apache.curator.CuratorZookeeperClient.internalBlockUntilConnectedOrTimedOut(CuratorZookeeperClient.java:323)
   [junit4]    >         at org.apache.curator.RetryLoop.callWithRetry(RetryLoop.java:105)
   [junit4]    >         at org.apache.curator.framework.imps.GetDataBuilderImpl.pathInForeground(GetDataBuilderImpl.java:288)
   [junit4]    >         at org.apache.curator.framework.imps.GetDataBuilderImpl.forPath(GetDataBuilderImpl.java:279)
   [junit4]    >         at org.apache.curator.framework.imps.GetDataBuilderImpl.forPath(GetDataBuilderImpl.java:41)
   [junit4]    >         at org.apache.curator.framework.recipes.shared.SharedValue.readValue(SharedValue.java:244)
   [junit4]    >         at org.apache.curator.framework.recipes.shared.SharedValue.access$100(SharedValue.java:44)
   [junit4]    >         at org.apache.curator.framework.recipes.shared.SharedValue$1.process(SharedValue.java:61)
   [junit4]    >         at org.apache.curator.framework.imps.NamespaceWatcher.process(NamespaceWatcher.java:67)
   [junit4]    >         at org.apache.zookeeper.ClientCnxn$EventThread.processEvent(ClientCnxn.java:530)
   [junit4]    >         at org.apache.zookeeper.ClientCnxn$EventThread.run(ClientCnxn.java:505)
   [junit4]    > 	at __randomizedtesting.SeedInfo.seed([8983C477E607B9CC]:0)
   [junit4] Completed [729/730 (1!)] on J1 in 43.50s, 10 tests, 1 error, 1 skipped <<< FAILURES!

[...truncated 43271 lines...]

Mime
View raw message