lucene-dev mailing list archives

Site index · List index
Message view « Date » · « Thread »
Top « Date » · « Thread »
From Apache Jenkins Server <jenk...@builds.apache.org>
Subject [JENKINS] Lucene-Solr-NightlyTests-master - Build # 1396 - Still unstable
Date Tue, 03 Oct 2017 10:25:39 GMT
Build: https://builds.apache.org/job/Lucene-Solr-NightlyTests-master/1396/

11 tests failed.
FAILED:  org.apache.lucene.index.TestBinaryDocValuesUpdates.testTonsOfUpdates

Error Message:
_2_1f.fnm

Stack Trace:
java.io.FileNotFoundException: _2_1f.fnm
	at __randomizedtesting.SeedInfo.seed([97BDAF83DA855A84:EF98718838A57566]:0)
	at org.apache.lucene.store.RAMDirectory.openInput(RAMDirectory.java:243)
	at org.apache.lucene.store.Directory.openChecksumInput(Directory.java:119)
	at org.apache.lucene.store.RawDirectoryWrapper.openChecksumInput(RawDirectoryWrapper.java:41)
	at org.apache.lucene.codecs.lucene60.Lucene60FieldInfosFormat.read(Lucene60FieldInfosFormat.java:113)
	at org.apache.lucene.index.SegmentReader.initFieldInfos(SegmentReader.java:190)
	at org.apache.lucene.index.SegmentReader.<init>(SegmentReader.java:93)
	at org.apache.lucene.index.ReadersAndUpdates.writeFieldUpdates(ReadersAndUpdates.java:688)
	at org.apache.lucene.index.IndexWriter$ReaderPool.writeSomeDocValuesUpdates(IndexWriter.java:703)
	at org.apache.lucene.index.FrozenBufferedUpdates.apply(FrozenBufferedUpdates.java:331)
	at org.apache.lucene.index.DocumentsWriter$ResolveUpdatesEvent.process(DocumentsWriter.java:723)
	at org.apache.lucene.index.IndexWriter.processEvents(IndexWriter.java:5058)
	at org.apache.lucene.index.IndexWriter.processEvents(IndexWriter.java:5046)
	at org.apache.lucene.index.IndexWriter.updateDocValues(IndexWriter.java:1877)
	at org.apache.lucene.index.TestBinaryDocValuesUpdates.testTonsOfUpdates(TestBinaryDocValuesUpdates.java:1323)
	at sun.reflect.NativeMethodAccessorImpl.invoke0(Native Method)
	at sun.reflect.NativeMethodAccessorImpl.invoke(NativeMethodAccessorImpl.java:62)
	at sun.reflect.DelegatingMethodAccessorImpl.invoke(DelegatingMethodAccessorImpl.java:43)
	at java.lang.reflect.Method.invoke(Method.java:498)
	at com.carrotsearch.randomizedtesting.RandomizedRunner.invoke(RandomizedRunner.java:1737)
	at com.carrotsearch.randomizedtesting.RandomizedRunner$8.evaluate(RandomizedRunner.java:934)
	at com.carrotsearch.randomizedtesting.RandomizedRunner$9.evaluate(RandomizedRunner.java:970)
	at com.carrotsearch.randomizedtesting.RandomizedRunner$10.evaluate(RandomizedRunner.java:984)
	at org.apache.lucene.util.TestRuleSetupTeardownChained$1.evaluate(TestRuleSetupTeardownChained.java:49)
	at org.apache.lucene.util.AbstractBeforeAfterRule$1.evaluate(AbstractBeforeAfterRule.java:45)
	at org.apache.lucene.util.TestRuleThreadAndTestName$1.evaluate(TestRuleThreadAndTestName.java:48)
	at org.apache.lucene.util.TestRuleIgnoreAfterMaxFailures$1.evaluate(TestRuleIgnoreAfterMaxFailures.java:64)
	at org.apache.lucene.util.TestRuleMarkFailure$1.evaluate(TestRuleMarkFailure.java:47)
	at com.carrotsearch.randomizedtesting.rules.StatementAdapter.evaluate(StatementAdapter.java:36)
	at com.carrotsearch.randomizedtesting.ThreadLeakControl$StatementRunner.run(ThreadLeakControl.java:368)
	at com.carrotsearch.randomizedtesting.ThreadLeakControl.forkTimeoutingTask(ThreadLeakControl.java:817)
	at com.carrotsearch.randomizedtesting.ThreadLeakControl$3.evaluate(ThreadLeakControl.java:468)
	at com.carrotsearch.randomizedtesting.RandomizedRunner.runSingleTest(RandomizedRunner.java:943)
	at com.carrotsearch.randomizedtesting.RandomizedRunner$5.evaluate(RandomizedRunner.java:829)
	at com.carrotsearch.randomizedtesting.RandomizedRunner$6.evaluate(RandomizedRunner.java:879)
	at com.carrotsearch.randomizedtesting.RandomizedRunner$7.evaluate(RandomizedRunner.java:890)
	at org.apache.lucene.util.AbstractBeforeAfterRule$1.evaluate(AbstractBeforeAfterRule.java:45)
	at com.carrotsearch.randomizedtesting.rules.StatementAdapter.evaluate(StatementAdapter.java:36)
	at org.apache.lucene.util.TestRuleStoreClassName$1.evaluate(TestRuleStoreClassName.java:41)
	at com.carrotsearch.randomizedtesting.rules.NoShadowingOrOverridesOnMethodsRule$1.evaluate(NoShadowingOrOverridesOnMethodsRule.java:40)
	at com.carrotsearch.randomizedtesting.rules.NoShadowingOrOverridesOnMethodsRule$1.evaluate(NoShadowingOrOverridesOnMethodsRule.java:40)
	at com.carrotsearch.randomizedtesting.rules.StatementAdapter.evaluate(StatementAdapter.java:36)
	at com.carrotsearch.randomizedtesting.rules.StatementAdapter.evaluate(StatementAdapter.java:36)
	at com.carrotsearch.randomizedtesting.rules.StatementAdapter.evaluate(StatementAdapter.java:36)
	at org.apache.lucene.util.TestRuleAssertionsRequired$1.evaluate(TestRuleAssertionsRequired.java:53)
	at org.apache.lucene.util.TestRuleMarkFailure$1.evaluate(TestRuleMarkFailure.java:47)
	at org.apache.lucene.util.TestRuleIgnoreAfterMaxFailures$1.evaluate(TestRuleIgnoreAfterMaxFailures.java:64)
	at org.apache.lucene.util.TestRuleIgnoreTestSuites$1.evaluate(TestRuleIgnoreTestSuites.java:54)
	at com.carrotsearch.randomizedtesting.rules.StatementAdapter.evaluate(StatementAdapter.java:36)
	at com.carrotsearch.randomizedtesting.ThreadLeakControl$StatementRunner.run(ThreadLeakControl.java:368)
	at java.lang.Thread.run(Thread.java:748)


FAILED:  org.apache.lucene.index.TestIndexSorting.testRandom3

Error Message:
Test abandoned because suite timeout was reached.

Stack Trace:
java.lang.Exception: Test abandoned because suite timeout was reached.
	at __randomizedtesting.SeedInfo.seed([97BDAF83DA855A84]:0)


FAILED:  junit.framework.TestSuite.org.apache.lucene.index.TestIndexSorting

Error Message:
Suite timeout exceeded (>= 7200000 msec).

Stack Trace:
java.lang.Exception: Suite timeout exceeded (>= 7200000 msec).
	at __randomizedtesting.SeedInfo.seed([97BDAF83DA855A84]:0)


FAILED:  org.apache.lucene.index.TestNumericDocValuesUpdates.testTonsOfUpdates

Error Message:
_1_j.fnm

Stack Trace:
java.io.FileNotFoundException: _1_j.fnm
	at __randomizedtesting.SeedInfo.seed([97BDAF83DA855A84:EF98718838A57566]:0)
	at org.apache.lucene.store.RAMDirectory.openInput(RAMDirectory.java:243)
	at org.apache.lucene.store.Directory.openChecksumInput(Directory.java:119)
	at org.apache.lucene.store.RawDirectoryWrapper.openChecksumInput(RawDirectoryWrapper.java:41)
	at org.apache.lucene.codecs.lucene60.Lucene60FieldInfosFormat.read(Lucene60FieldInfosFormat.java:113)
	at org.apache.lucene.index.SegmentReader.initFieldInfos(SegmentReader.java:190)
	at org.apache.lucene.index.SegmentReader.<init>(SegmentReader.java:93)
	at org.apache.lucene.index.ReadersAndUpdates.writeFieldUpdates(ReadersAndUpdates.java:688)
	at org.apache.lucene.index.IndexWriter$ReaderPool.writeSomeDocValuesUpdates(IndexWriter.java:703)
	at org.apache.lucene.index.FrozenBufferedUpdates.apply(FrozenBufferedUpdates.java:331)
	at org.apache.lucene.index.DocumentsWriter$ResolveUpdatesEvent.process(DocumentsWriter.java:723)
	at org.apache.lucene.index.IndexWriter.processEvents(IndexWriter.java:5058)
	at org.apache.lucene.index.IndexWriter.processEvents(IndexWriter.java:5046)
	at org.apache.lucene.index.IndexWriter.updateDocValues(IndexWriter.java:1877)
	at org.apache.lucene.index.TestNumericDocValuesUpdates.testTonsOfUpdates(TestNumericDocValuesUpdates.java:1557)
	at sun.reflect.NativeMethodAccessorImpl.invoke0(Native Method)
	at sun.reflect.NativeMethodAccessorImpl.invoke(NativeMethodAccessorImpl.java:62)
	at sun.reflect.DelegatingMethodAccessorImpl.invoke(DelegatingMethodAccessorImpl.java:43)
	at java.lang.reflect.Method.invoke(Method.java:498)
	at com.carrotsearch.randomizedtesting.RandomizedRunner.invoke(RandomizedRunner.java:1737)
	at com.carrotsearch.randomizedtesting.RandomizedRunner$8.evaluate(RandomizedRunner.java:934)
	at com.carrotsearch.randomizedtesting.RandomizedRunner$9.evaluate(RandomizedRunner.java:970)
	at com.carrotsearch.randomizedtesting.RandomizedRunner$10.evaluate(RandomizedRunner.java:984)
	at org.apache.lucene.util.TestRuleSetupTeardownChained$1.evaluate(TestRuleSetupTeardownChained.java:49)
	at org.apache.lucene.util.AbstractBeforeAfterRule$1.evaluate(AbstractBeforeAfterRule.java:45)
	at org.apache.lucene.util.TestRuleThreadAndTestName$1.evaluate(TestRuleThreadAndTestName.java:48)
	at org.apache.lucene.util.TestRuleIgnoreAfterMaxFailures$1.evaluate(TestRuleIgnoreAfterMaxFailures.java:64)
	at org.apache.lucene.util.TestRuleMarkFailure$1.evaluate(TestRuleMarkFailure.java:47)
	at com.carrotsearch.randomizedtesting.rules.StatementAdapter.evaluate(StatementAdapter.java:36)
	at com.carrotsearch.randomizedtesting.ThreadLeakControl$StatementRunner.run(ThreadLeakControl.java:368)
	at com.carrotsearch.randomizedtesting.ThreadLeakControl.forkTimeoutingTask(ThreadLeakControl.java:817)
	at com.carrotsearch.randomizedtesting.ThreadLeakControl$3.evaluate(ThreadLeakControl.java:468)
	at com.carrotsearch.randomizedtesting.RandomizedRunner.runSingleTest(RandomizedRunner.java:943)
	at com.carrotsearch.randomizedtesting.RandomizedRunner$5.evaluate(RandomizedRunner.java:829)
	at com.carrotsearch.randomizedtesting.RandomizedRunner$6.evaluate(RandomizedRunner.java:879)
	at com.carrotsearch.randomizedtesting.RandomizedRunner$7.evaluate(RandomizedRunner.java:890)
	at org.apache.lucene.util.AbstractBeforeAfterRule$1.evaluate(AbstractBeforeAfterRule.java:45)
	at com.carrotsearch.randomizedtesting.rules.StatementAdapter.evaluate(StatementAdapter.java:36)
	at org.apache.lucene.util.TestRuleStoreClassName$1.evaluate(TestRuleStoreClassName.java:41)
	at com.carrotsearch.randomizedtesting.rules.NoShadowingOrOverridesOnMethodsRule$1.evaluate(NoShadowingOrOverridesOnMethodsRule.java:40)
	at com.carrotsearch.randomizedtesting.rules.NoShadowingOrOverridesOnMethodsRule$1.evaluate(NoShadowingOrOverridesOnMethodsRule.java:40)
	at com.carrotsearch.randomizedtesting.rules.StatementAdapter.evaluate(StatementAdapter.java:36)
	at com.carrotsearch.randomizedtesting.rules.StatementAdapter.evaluate(StatementAdapter.java:36)
	at com.carrotsearch.randomizedtesting.rules.StatementAdapter.evaluate(StatementAdapter.java:36)
	at org.apache.lucene.util.TestRuleAssertionsRequired$1.evaluate(TestRuleAssertionsRequired.java:53)
	at org.apache.lucene.util.TestRuleMarkFailure$1.evaluate(TestRuleMarkFailure.java:47)
	at org.apache.lucene.util.TestRuleIgnoreAfterMaxFailures$1.evaluate(TestRuleIgnoreAfterMaxFailures.java:64)
	at org.apache.lucene.util.TestRuleIgnoreTestSuites$1.evaluate(TestRuleIgnoreTestSuites.java:54)
	at com.carrotsearch.randomizedtesting.rules.StatementAdapter.evaluate(StatementAdapter.java:36)
	at com.carrotsearch.randomizedtesting.ThreadLeakControl$StatementRunner.run(ThreadLeakControl.java:368)
	at java.lang.Thread.run(Thread.java:748)


FAILED:  org.apache.lucene.spatial3d.TestGeo3DPoint.testRandomBig

Error Message:
Test abandoned because suite timeout was reached.

Stack Trace:
java.lang.Exception: Test abandoned because suite timeout was reached.
	at __randomizedtesting.SeedInfo.seed([7EEE99CF8C3E390F]:0)


FAILED:  junit.framework.TestSuite.org.apache.lucene.spatial3d.TestGeo3DPoint

Error Message:
Suite timeout exceeded (>= 7200000 msec).

Stack Trace:
java.lang.Exception: Suite timeout exceeded (>= 7200000 msec).
	at __randomizedtesting.SeedInfo.seed([7EEE99CF8C3E390F]:0)


FAILED:  org.apache.solr.cloud.TestCollectionsAPIViaSolrCloudCluster.testCollectionCreateSearchDelete

Error Message:
Error from server at https://127.0.0.1:43512/solr/testcollection_shard1_replica_n3: Expected mime type application/octet-stream but got text/html. <html> <head> <meta http-equiv="Content-Type" content="text/html;charset=ISO-8859-1"/> <title>Error 404 </title> </head> <body> <h2>HTTP ERROR: 404</h2> <p>Problem accessing /solr/testcollection_shard1_replica_n3/update. Reason: <pre>    Can not find: /solr/testcollection_shard1_replica_n3/update</pre></p> <hr /><a href="http://eclipse.org/jetty">Powered by Jetty:// 9.3.20.v20170531</a><hr/> </body> </html> 

Stack Trace:
org.apache.solr.client.solrj.impl.CloudSolrClient$RouteException: Error from server at https://127.0.0.1:43512/solr/testcollection_shard1_replica_n3: Expected mime type application/octet-stream but got text/html. <html>
<head>
<meta http-equiv="Content-Type" content="text/html;charset=ISO-8859-1"/>
<title>Error 404 </title>
</head>
<body>
<h2>HTTP ERROR: 404</h2>
<p>Problem accessing /solr/testcollection_shard1_replica_n3/update. Reason:
<pre>    Can not find: /solr/testcollection_shard1_replica_n3/update</pre></p>
<hr /><a href="http://eclipse.org/jetty">Powered by Jetty:// 9.3.20.v20170531</a><hr/>
</body>
</html>

	at __randomizedtesting.SeedInfo.seed([2E0EDC8B5614DAF5:8DF4722ED1FC3050]:0)
	at org.apache.solr.client.solrj.impl.CloudSolrClient.directUpdate(CloudSolrClient.java:539)
	at org.apache.solr.client.solrj.impl.CloudSolrClient.sendRequest(CloudSolrClient.java:993)
	at org.apache.solr.client.solrj.impl.CloudSolrClient.requestWithRetryOnStaleState(CloudSolrClient.java:862)
	at org.apache.solr.client.solrj.impl.CloudSolrClient.request(CloudSolrClient.java:793)
	at org.apache.solr.client.solrj.SolrRequest.process(SolrRequest.java:178)
	at org.apache.solr.client.solrj.request.UpdateRequest.commit(UpdateRequest.java:233)
	at org.apache.solr.cloud.TestCollectionsAPIViaSolrCloudCluster.testCollectionCreateSearchDelete(TestCollectionsAPIViaSolrCloudCluster.java:167)
	at sun.reflect.NativeMethodAccessorImpl.invoke0(Native Method)
	at sun.reflect.NativeMethodAccessorImpl.invoke(NativeMethodAccessorImpl.java:62)
	at sun.reflect.DelegatingMethodAccessorImpl.invoke(DelegatingMethodAccessorImpl.java:43)
	at java.lang.reflect.Method.invoke(Method.java:498)
	at com.carrotsearch.randomizedtesting.RandomizedRunner.invoke(RandomizedRunner.java:1737)
	at com.carrotsearch.randomizedtesting.RandomizedRunner$8.evaluate(RandomizedRunner.java:934)
	at com.carrotsearch.randomizedtesting.RandomizedRunner$9.evaluate(RandomizedRunner.java:970)
	at com.carrotsearch.randomizedtesting.RandomizedRunner$10.evaluate(RandomizedRunner.java:984)
	at com.carrotsearch.randomizedtesting.rules.SystemPropertiesRestoreRule$1.evaluate(SystemPropertiesRestoreRule.java:57)
	at org.apache.lucene.util.TestRuleSetupTeardownChained$1.evaluate(TestRuleSetupTeardownChained.java:49)
	at org.apache.lucene.util.AbstractBeforeAfterRule$1.evaluate(AbstractBeforeAfterRule.java:45)
	at org.apache.lucene.util.TestRuleThreadAndTestName$1.evaluate(TestRuleThreadAndTestName.java:48)
	at org.apache.lucene.util.TestRuleIgnoreAfterMaxFailures$1.evaluate(TestRuleIgnoreAfterMaxFailures.java:64)
	at org.apache.lucene.util.TestRuleMarkFailure$1.evaluate(TestRuleMarkFailure.java:47)
	at com.carrotsearch.randomizedtesting.rules.StatementAdapter.evaluate(StatementAdapter.java:36)
	at com.carrotsearch.randomizedtesting.ThreadLeakControl$StatementRunner.run(ThreadLeakControl.java:368)
	at com.carrotsearch.randomizedtesting.ThreadLeakControl.forkTimeoutingTask(ThreadLeakControl.java:817)
	at com.carrotsearch.randomizedtesting.ThreadLeakControl$3.evaluate(ThreadLeakControl.java:468)
	at com.carrotsearch.randomizedtesting.RandomizedRunner.runSingleTest(RandomizedRunner.java:943)
	at com.carrotsearch.randomizedtesting.RandomizedRunner$5.evaluate(RandomizedRunner.java:829)
	at com.carrotsearch.randomizedtesting.RandomizedRunner$6.evaluate(RandomizedRunner.java:879)
	at com.carrotsearch.randomizedtesting.RandomizedRunner$7.evaluate(RandomizedRunner.java:890)
	at com.carrotsearch.randomizedtesting.rules.StatementAdapter.evaluate(StatementAdapter.java:36)
	at com.carrotsearch.randomizedtesting.rules.SystemPropertiesRestoreRule$1.evaluate(SystemPropertiesRestoreRule.java:57)
	at org.apache.lucene.util.AbstractBeforeAfterRule$1.evaluate(AbstractBeforeAfterRule.java:45)
	at com.carrotsearch.randomizedtesting.rules.StatementAdapter.evaluate(StatementAdapter.java:36)
	at org.apache.lucene.util.TestRuleStoreClassName$1.evaluate(TestRuleStoreClassName.java:41)
	at com.carrotsearch.randomizedtesting.rules.NoShadowingOrOverridesOnMethodsRule$1.evaluate(NoShadowingOrOverridesOnMethodsRule.java:40)
	at com.carrotsearch.randomizedtesting.rules.NoShadowingOrOverridesOnMethodsRule$1.evaluate(NoShadowingOrOverridesOnMethodsRule.java:40)
	at com.carrotsearch.randomizedtesting.rules.StatementAdapter.evaluate(StatementAdapter.java:36)
	at com.carrotsearch.randomizedtesting.rules.StatementAdapter.evaluate(StatementAdapter.java:36)
	at com.carrotsearch.randomizedtesting.rules.StatementAdapter.evaluate(StatementAdapter.java:36)
	at org.apache.lucene.util.TestRuleAssertionsRequired$1.evaluate(TestRuleAssertionsRequired.java:53)
	at org.apache.lucene.util.TestRuleMarkFailure$1.evaluate(TestRuleMarkFailure.java:47)
	at org.apache.lucene.util.TestRuleIgnoreAfterMaxFailures$1.evaluate(TestRuleIgnoreAfterMaxFailures.java:64)
	at org.apache.lucene.util.TestRuleIgnoreTestSuites$1.evaluate(TestRuleIgnoreTestSuites.java:54)
	at com.carrotsearch.randomizedtesting.rules.StatementAdapter.evaluate(StatementAdapter.java:36)
	at com.carrotsearch.randomizedtesting.ThreadLeakControl$StatementRunner.run(ThreadLeakControl.java:368)
	at java.lang.Thread.run(Thread.java:748)
Caused by: org.apache.solr.client.solrj.impl.HttpSolrClient$RemoteSolrException: Error from server at https://127.0.0.1:43512/solr/testcollection_shard1_replica_n3: Expected mime type application/octet-stream but got text/html. <html>
<head>
<meta http-equiv="Content-Type" content="text/html;charset=ISO-8859-1"/>
<title>Error 404 </title>
</head>
<body>
<h2>HTTP ERROR: 404</h2>
<p>Problem accessing /solr/testcollection_shard1_replica_n3/update. Reason:
<pre>    Can not find: /solr/testcollection_shard1_replica_n3/update</pre></p>
<hr /><a href="http://eclipse.org/jetty">Powered by Jetty:// 9.3.20.v20170531</a><hr/>
</body>
</html>

	at org.apache.solr.client.solrj.impl.HttpSolrClient.executeMethod(HttpSolrClient.java:591)
	at org.apache.solr.client.solrj.impl.HttpSolrClient.request(HttpSolrClient.java:253)
	at org.apache.solr.client.solrj.impl.HttpSolrClient.request(HttpSolrClient.java:242)
	at org.apache.solr.client.solrj.impl.LBHttpSolrClient.doRequest(LBHttpSolrClient.java:483)
	at org.apache.solr.client.solrj.impl.LBHttpSolrClient.request(LBHttpSolrClient.java:413)
	at org.apache.solr.client.solrj.impl.CloudSolrClient.lambda$directUpdate$0(CloudSolrClient.java:516)
	at java.util.concurrent.FutureTask.run(FutureTask.java:266)
	at org.apache.solr.common.util.ExecutorUtil$MDCAwareThreadPoolExecutor.lambda$execute$0(ExecutorUtil.java:188)
	at java.util.concurrent.ThreadPoolExecutor.runWorker(ThreadPoolExecutor.java:1149)
	at java.util.concurrent.ThreadPoolExecutor$Worker.run(ThreadPoolExecutor.java:624)
	... 1 more


FAILED:  org.apache.solr.cloud.TestTlogReplica.testBasicLeaderElection

Error Message:
Can not find doc 4 in http://127.0.0.1:41212/solr

Stack Trace:
java.lang.AssertionError: Can not find doc 4 in http://127.0.0.1:41212/solr
	at __randomizedtesting.SeedInfo.seed([2E0EDC8B5614DAF5:B8861AC3BE8E9D0F]:0)
	at org.junit.Assert.fail(Assert.java:93)
	at org.junit.Assert.assertTrue(Assert.java:43)
	at org.junit.Assert.assertNotNull(Assert.java:526)
	at org.apache.solr.cloud.TestTlogReplica.checkRTG(TestTlogReplica.java:861)
	at org.apache.solr.cloud.TestTlogReplica.testBasicLeaderElection(TestTlogReplica.java:637)
	at sun.reflect.NativeMethodAccessorImpl.invoke0(Native Method)
	at sun.reflect.NativeMethodAccessorImpl.invoke(NativeMethodAccessorImpl.java:62)
	at sun.reflect.DelegatingMethodAccessorImpl.invoke(DelegatingMethodAccessorImpl.java:43)
	at java.lang.reflect.Method.invoke(Method.java:498)
	at com.carrotsearch.randomizedtesting.RandomizedRunner.invoke(RandomizedRunner.java:1737)
	at com.carrotsearch.randomizedtesting.RandomizedRunner$8.evaluate(RandomizedRunner.java:934)
	at com.carrotsearch.randomizedtesting.RandomizedRunner$9.evaluate(RandomizedRunner.java:970)
	at com.carrotsearch.randomizedtesting.RandomizedRunner$10.evaluate(RandomizedRunner.java:984)
	at com.carrotsearch.randomizedtesting.rules.SystemPropertiesRestoreRule$1.evaluate(SystemPropertiesRestoreRule.java:57)
	at org.apache.lucene.util.TestRuleSetupTeardownChained$1.evaluate(TestRuleSetupTeardownChained.java:49)
	at org.apache.lucene.util.AbstractBeforeAfterRule$1.evaluate(AbstractBeforeAfterRule.java:45)
	at org.apache.lucene.util.TestRuleThreadAndTestName$1.evaluate(TestRuleThreadAndTestName.java:48)
	at org.apache.lucene.util.TestRuleIgnoreAfterMaxFailures$1.evaluate(TestRuleIgnoreAfterMaxFailures.java:64)
	at org.apache.lucene.util.TestRuleMarkFailure$1.evaluate(TestRuleMarkFailure.java:47)
	at com.carrotsearch.randomizedtesting.rules.StatementAdapter.evaluate(StatementAdapter.java:36)
	at com.carrotsearch.randomizedtesting.ThreadLeakControl$StatementRunner.run(ThreadLeakControl.java:368)
	at com.carrotsearch.randomizedtesting.ThreadLeakControl.forkTimeoutingTask(ThreadLeakControl.java:817)
	at com.carrotsearch.randomizedtesting.ThreadLeakControl$3.evaluate(ThreadLeakControl.java:468)
	at com.carrotsearch.randomizedtesting.RandomizedRunner.runSingleTest(RandomizedRunner.java:943)
	at com.carrotsearch.randomizedtesting.RandomizedRunner$5.evaluate(RandomizedRunner.java:829)
	at com.carrotsearch.randomizedtesting.RandomizedRunner$6.evaluate(RandomizedRunner.java:879)
	at com.carrotsearch.randomizedtesting.RandomizedRunner$7.evaluate(RandomizedRunner.java:890)
	at com.carrotsearch.randomizedtesting.rules.StatementAdapter.evaluate(StatementAdapter.java:36)
	at com.carrotsearch.randomizedtesting.rules.SystemPropertiesRestoreRule$1.evaluate(SystemPropertiesRestoreRule.java:57)
	at org.apache.lucene.util.AbstractBeforeAfterRule$1.evaluate(AbstractBeforeAfterRule.java:45)
	at com.carrotsearch.randomizedtesting.rules.StatementAdapter.evaluate(StatementAdapter.java:36)
	at org.apache.lucene.util.TestRuleStoreClassName$1.evaluate(TestRuleStoreClassName.java:41)
	at com.carrotsearch.randomizedtesting.rules.NoShadowingOrOverridesOnMethodsRule$1.evaluate(NoShadowingOrOverridesOnMethodsRule.java:40)
	at com.carrotsearch.randomizedtesting.rules.NoShadowingOrOverridesOnMethodsRule$1.evaluate(NoShadowingOrOverridesOnMethodsRule.java:40)
	at com.carrotsearch.randomizedtesting.rules.StatementAdapter.evaluate(StatementAdapter.java:36)
	at com.carrotsearch.randomizedtesting.rules.StatementAdapter.evaluate(StatementAdapter.java:36)
	at com.carrotsearch.randomizedtesting.rules.StatementAdapter.evaluate(StatementAdapter.java:36)
	at org.apache.lucene.util.TestRuleAssertionsRequired$1.evaluate(TestRuleAssertionsRequired.java:53)
	at org.apache.lucene.util.TestRuleMarkFailure$1.evaluate(TestRuleMarkFailure.java:47)
	at org.apache.lucene.util.TestRuleIgnoreAfterMaxFailures$1.evaluate(TestRuleIgnoreAfterMaxFailures.java:64)
	at org.apache.lucene.util.TestRuleIgnoreTestSuites$1.evaluate(TestRuleIgnoreTestSuites.java:54)
	at com.carrotsearch.randomizedtesting.rules.StatementAdapter.evaluate(StatementAdapter.java:36)
	at com.carrotsearch.randomizedtesting.ThreadLeakControl$StatementRunner.run(ThreadLeakControl.java:368)
	at java.lang.Thread.run(Thread.java:748)


FAILED:  org.apache.solr.cloud.CollectionsAPIDistributedZkTest.testCollectionsAPI

Error Message:
Error from server at http://127.0.0.1:40261/solr/awhollynewcollection_0: {"awhollynewcollection_0":10}

Stack Trace:
org.apache.solr.client.solrj.impl.HttpSolrClient$RemoteSolrException: Error from server at http://127.0.0.1:40261/solr/awhollynewcollection_0: {"awhollynewcollection_0":10}
	at __randomizedtesting.SeedInfo.seed([2E0EDC8B5614DAF5:667BA83F5027F560]:0)
	at org.apache.solr.client.solrj.impl.HttpSolrClient.executeMethod(HttpSolrClient.java:627)
	at org.apache.solr.client.solrj.impl.HttpSolrClient.request(HttpSolrClient.java:253)
	at org.apache.solr.client.solrj.impl.HttpSolrClient.request(HttpSolrClient.java:242)
	at org.apache.solr.client.solrj.impl.LBHttpSolrClient.doRequest(LBHttpSolrClient.java:483)
	at org.apache.solr.client.solrj.impl.LBHttpSolrClient.request(LBHttpSolrClient.java:413)
	at org.apache.solr.client.solrj.impl.CloudSolrClient.sendRequest(CloudSolrClient.java:1121)
	at org.apache.solr.client.solrj.impl.CloudSolrClient.requestWithRetryOnStaleState(CloudSolrClient.java:862)
	at org.apache.solr.client.solrj.impl.CloudSolrClient.requestWithRetryOnStaleState(CloudSolrClient.java:967)
	at org.apache.solr.client.solrj.impl.CloudSolrClient.requestWithRetryOnStaleState(CloudSolrClient.java:967)
	at org.apache.solr.client.solrj.impl.CloudSolrClient.requestWithRetryOnStaleState(CloudSolrClient.java:967)
	at org.apache.solr.client.solrj.impl.CloudSolrClient.requestWithRetryOnStaleState(CloudSolrClient.java:967)
	at org.apache.solr.client.solrj.impl.CloudSolrClient.requestWithRetryOnStaleState(CloudSolrClient.java:967)
	at org.apache.solr.client.solrj.impl.CloudSolrClient.request(CloudSolrClient.java:793)
	at org.apache.solr.client.solrj.SolrRequest.process(SolrRequest.java:178)
	at org.apache.solr.client.solrj.SolrClient.query(SolrClient.java:942)
	at org.apache.solr.cloud.CollectionsAPIDistributedZkTest.testCollectionsAPI(CollectionsAPIDistributedZkTest.java:460)
	at sun.reflect.NativeMethodAccessorImpl.invoke0(Native Method)
	at sun.reflect.NativeMethodAccessorImpl.invoke(NativeMethodAccessorImpl.java:62)
	at sun.reflect.DelegatingMethodAccessorImpl.invoke(DelegatingMethodAccessorImpl.java:43)
	at java.lang.reflect.Method.invoke(Method.java:498)
	at com.carrotsearch.randomizedtesting.RandomizedRunner.invoke(RandomizedRunner.java:1737)
	at com.carrotsearch.randomizedtesting.RandomizedRunner$8.evaluate(RandomizedRunner.java:934)
	at com.carrotsearch.randomizedtesting.RandomizedRunner$9.evaluate(RandomizedRunner.java:970)
	at com.carrotsearch.randomizedtesting.RandomizedRunner$10.evaluate(RandomizedRunner.java:984)
	at com.carrotsearch.randomizedtesting.rules.SystemPropertiesRestoreRule$1.evaluate(SystemPropertiesRestoreRule.java:57)
	at org.apache.lucene.util.TestRuleSetupTeardownChained$1.evaluate(TestRuleSetupTeardownChained.java:49)
	at org.apache.lucene.util.AbstractBeforeAfterRule$1.evaluate(AbstractBeforeAfterRule.java:45)
	at org.apache.lucene.util.TestRuleThreadAndTestName$1.evaluate(TestRuleThreadAndTestName.java:48)
	at org.apache.lucene.util.TestRuleIgnoreAfterMaxFailures$1.evaluate(TestRuleIgnoreAfterMaxFailures.java:64)
	at org.apache.lucene.util.TestRuleMarkFailure$1.evaluate(TestRuleMarkFailure.java:47)
	at com.carrotsearch.randomizedtesting.rules.StatementAdapter.evaluate(StatementAdapter.java:36)
	at com.carrotsearch.randomizedtesting.ThreadLeakControl$StatementRunner.run(ThreadLeakControl.java:368)
	at com.carrotsearch.randomizedtesting.ThreadLeakControl.forkTimeoutingTask(ThreadLeakControl.java:817)
	at com.carrotsearch.randomizedtesting.ThreadLeakControl$3.evaluate(ThreadLeakControl.java:468)
	at com.carrotsearch.randomizedtesting.RandomizedRunner.runSingleTest(RandomizedRunner.java:943)
	at com.carrotsearch.randomizedtesting.RandomizedRunner$5.evaluate(RandomizedRunner.java:829)
	at com.carrotsearch.randomizedtesting.RandomizedRunner$6.evaluate(RandomizedRunner.java:879)
	at com.carrotsearch.randomizedtesting.RandomizedRunner$7.evaluate(RandomizedRunner.java:890)
	at com.carrotsearch.randomizedtesting.rules.StatementAdapter.evaluate(StatementAdapter.java:36)
	at com.carrotsearch.randomizedtesting.rules.SystemPropertiesRestoreRule$1.evaluate(SystemPropertiesRestoreRule.java:57)
	at org.apache.lucene.util.AbstractBeforeAfterRule$1.evaluate(AbstractBeforeAfterRule.java:45)
	at com.carrotsearch.randomizedtesting.rules.StatementAdapter.evaluate(StatementAdapter.java:36)
	at org.apache.lucene.util.TestRuleStoreClassName$1.evaluate(TestRuleStoreClassName.java:41)
	at com.carrotsearch.randomizedtesting.rules.NoShadowingOrOverridesOnMethodsRule$1.evaluate(NoShadowingOrOverridesOnMethodsRule.java:40)
	at com.carrotsearch.randomizedtesting.rules.NoShadowingOrOverridesOnMethodsRule$1.evaluate(NoShadowingOrOverridesOnMethodsRule.java:40)
	at com.carrotsearch.randomizedtesting.rules.StatementAdapter.evaluate(StatementAdapter.java:36)
	at com.carrotsearch.randomizedtesting.rules.StatementAdapter.evaluate(StatementAdapter.java:36)
	at com.carrotsearch.randomizedtesting.rules.StatementAdapter.evaluate(StatementAdapter.java:36)
	at org.apache.lucene.util.TestRuleAssertionsRequired$1.evaluate(TestRuleAssertionsRequired.java:53)
	at org.apache.lucene.util.TestRuleMarkFailure$1.evaluate(TestRuleMarkFailure.java:47)
	at org.apache.lucene.util.TestRuleIgnoreAfterMaxFailures$1.evaluate(TestRuleIgnoreAfterMaxFailures.java:64)
	at org.apache.lucene.util.TestRuleIgnoreTestSuites$1.evaluate(TestRuleIgnoreTestSuites.java:54)
	at com.carrotsearch.randomizedtesting.rules.StatementAdapter.evaluate(StatementAdapter.java:36)
	at com.carrotsearch.randomizedtesting.ThreadLeakControl$StatementRunner.run(ThreadLeakControl.java:368)
	at java.lang.Thread.run(Thread.java:748)


FAILED:  org.apache.solr.cloud.hdfs.HdfsTlogReplayBufferedWhileIndexingTest.test

Error Message:
There are still nodes recoverying - waited for 600 seconds

Stack Trace:
java.lang.AssertionError: There are still nodes recoverying - waited for 600 seconds
	at __randomizedtesting.SeedInfo.seed([2E0EDC8B5614DAF5:A65AE351F8E8B70D]:0)
	at org.junit.Assert.fail(Assert.java:93)
	at org.apache.solr.cloud.AbstractDistribZkTestBase.waitForRecoveriesToFinish(AbstractDistribZkTestBase.java:185)
	at org.apache.solr.cloud.AbstractFullDistribZkTestBase.waitForRecoveriesToFinish(AbstractFullDistribZkTestBase.java:914)
	at org.apache.solr.cloud.AbstractFullDistribZkTestBase.waitForThingsToLevelOut(AbstractFullDistribZkTestBase.java:1471)
	at org.apache.solr.cloud.TlogReplayBufferedWhileIndexingTest.test(TlogReplayBufferedWhileIndexingTest.java:99)
	at sun.reflect.NativeMethodAccessorImpl.invoke0(Native Method)
	at sun.reflect.NativeMethodAccessorImpl.invoke(NativeMethodAccessorImpl.java:62)
	at sun.reflect.DelegatingMethodAccessorImpl.invoke(DelegatingMethodAccessorImpl.java:43)
	at java.lang.reflect.Method.invoke(Method.java:498)
	at com.carrotsearch.randomizedtesting.RandomizedRunner.invoke(RandomizedRunner.java:1737)
	at com.carrotsearch.randomizedtesting.RandomizedRunner$8.evaluate(RandomizedRunner.java:934)
	at com.carrotsearch.randomizedtesting.RandomizedRunner$9.evaluate(RandomizedRunner.java:970)
	at com.carrotsearch.randomizedtesting.RandomizedRunner$10.evaluate(RandomizedRunner.java:984)
	at org.apache.solr.BaseDistributedSearchTestCase$ShardsRepeatRule$ShardsFixedStatement.callStatement(BaseDistributedSearchTestCase.java:993)
	at org.apache.solr.BaseDistributedSearchTestCase$ShardsRepeatRule$ShardsStatement.evaluate(BaseDistributedSearchTestCase.java:968)
	at com.carrotsearch.randomizedtesting.rules.SystemPropertiesRestoreRule$1.evaluate(SystemPropertiesRestoreRule.java:57)
	at org.apache.lucene.util.TestRuleSetupTeardownChained$1.evaluate(TestRuleSetupTeardownChained.java:49)
	at org.apache.lucene.util.AbstractBeforeAfterRule$1.evaluate(AbstractBeforeAfterRule.java:45)
	at org.apache.lucene.util.TestRuleThreadAndTestName$1.evaluate(TestRuleThreadAndTestName.java:48)
	at org.apache.lucene.util.TestRuleIgnoreAfterMaxFailures$1.evaluate(TestRuleIgnoreAfterMaxFailures.java:64)
	at org.apache.lucene.util.TestRuleMarkFailure$1.evaluate(TestRuleMarkFailure.java:47)
	at com.carrotsearch.randomizedtesting.rules.StatementAdapter.evaluate(StatementAdapter.java:36)
	at com.carrotsearch.randomizedtesting.ThreadLeakControl$StatementRunner.run(ThreadLeakControl.java:368)
	at com.carrotsearch.randomizedtesting.ThreadLeakControl.forkTimeoutingTask(ThreadLeakControl.java:817)
	at com.carrotsearch.randomizedtesting.ThreadLeakControl$3.evaluate(ThreadLeakControl.java:468)
	at com.carrotsearch.randomizedtesting.RandomizedRunner.runSingleTest(RandomizedRunner.java:943)
	at com.carrotsearch.randomizedtesting.RandomizedRunner$5.evaluate(RandomizedRunner.java:829)
	at com.carrotsearch.randomizedtesting.RandomizedRunner$6.evaluate(RandomizedRunner.java:879)
	at com.carrotsearch.randomizedtesting.RandomizedRunner$7.evaluate(RandomizedRunner.java:890)
	at com.carrotsearch.randomizedtesting.rules.StatementAdapter.evaluate(StatementAdapter.java:36)
	at com.carrotsearch.randomizedtesting.rules.SystemPropertiesRestoreRule$1.evaluate(SystemPropertiesRestoreRule.java:57)
	at org.apache.lucene.util.AbstractBeforeAfterRule$1.evaluate(AbstractBeforeAfterRule.java:45)
	at com.carrotsearch.randomizedtesting.rules.StatementAdapter.evaluate(StatementAdapter.java:36)
	at org.apache.lucene.util.TestRuleStoreClassName$1.evaluate(TestRuleStoreClassName.java:41)
	at com.carrotsearch.randomizedtesting.rules.NoShadowingOrOverridesOnMethodsRule$1.evaluate(NoShadowingOrOverridesOnMethodsRule.java:40)
	at com.carrotsearch.randomizedtesting.rules.NoShadowingOrOverridesOnMethodsRule$1.evaluate(NoShadowingOrOverridesOnMethodsRule.java:40)
	at com.carrotsearch.randomizedtesting.rules.StatementAdapter.evaluate(StatementAdapter.java:36)
	at com.carrotsearch.randomizedtesting.rules.StatementAdapter.evaluate(StatementAdapter.java:36)
	at com.carrotsearch.randomizedtesting.rules.StatementAdapter.evaluate(StatementAdapter.java:36)
	at org.apache.lucene.util.TestRuleAssertionsRequired$1.evaluate(TestRuleAssertionsRequired.java:53)
	at org.apache.lucene.util.TestRuleMarkFailure$1.evaluate(TestRuleMarkFailure.java:47)
	at org.apache.lucene.util.TestRuleIgnoreAfterMaxFailures$1.evaluate(TestRuleIgnoreAfterMaxFailures.java:64)
	at org.apache.lucene.util.TestRuleIgnoreTestSuites$1.evaluate(TestRuleIgnoreTestSuites.java:54)
	at com.carrotsearch.randomizedtesting.rules.StatementAdapter.evaluate(StatementAdapter.java:36)
	at com.carrotsearch.randomizedtesting.ThreadLeakControl$StatementRunner.run(ThreadLeakControl.java:368)
	at java.lang.Thread.run(Thread.java:748)


FAILED:  org.apache.solr.cloud.SharedFSAutoReplicaFailoverTest.test

Error Message:
No live SolrServers available to handle this request:[http://127.0.0.1:40574/solrj_collection4, http://127.0.0.1:45600/solrj_collection4, http://127.0.0.1:41996/solrj_collection4, http://127.0.0.1:41443/solrj_collection4]

Stack Trace:
org.apache.solr.client.solrj.SolrServerException: No live SolrServers available to handle this request:[http://127.0.0.1:40574/solrj_collection4, http://127.0.0.1:45600/solrj_collection4, http://127.0.0.1:41996/solrj_collection4, http://127.0.0.1:41443/solrj_collection4]
	at __randomizedtesting.SeedInfo.seed([2E0EDC8B5614DAF5:A65AE351F8E8B70D]:0)
	at org.apache.solr.client.solrj.impl.LBHttpSolrClient.request(LBHttpSolrClient.java:462)
	at org.apache.solr.client.solrj.impl.CloudSolrClient.sendRequest(CloudSolrClient.java:1121)
	at org.apache.solr.client.solrj.impl.CloudSolrClient.requestWithRetryOnStaleState(CloudSolrClient.java:862)
	at org.apache.solr.client.solrj.impl.CloudSolrClient.requestWithRetryOnStaleState(CloudSolrClient.java:967)
	at org.apache.solr.client.solrj.impl.CloudSolrClient.request(CloudSolrClient.java:793)
	at org.apache.solr.client.solrj.SolrRequest.process(SolrRequest.java:178)
	at org.apache.solr.client.solrj.SolrClient.query(SolrClient.java:942)
	at org.apache.solr.client.solrj.SolrClient.query(SolrClient.java:957)
	at org.apache.solr.cloud.SharedFSAutoReplicaFailoverTest.queryAndAssertResultSize(SharedFSAutoReplicaFailoverTest.java:342)
	at org.apache.solr.cloud.SharedFSAutoReplicaFailoverTest.testBasics(SharedFSAutoReplicaFailoverTest.java:253)
	at org.apache.solr.cloud.SharedFSAutoReplicaFailoverTest.test(SharedFSAutoReplicaFailoverTest.java:136)
	at sun.reflect.NativeMethodAccessorImpl.invoke0(Native Method)
	at sun.reflect.NativeMethodAccessorImpl.invoke(NativeMethodAccessorImpl.java:62)
	at sun.reflect.DelegatingMethodAccessorImpl.invoke(DelegatingMethodAccessorImpl.java:43)
	at java.lang.reflect.Method.invoke(Method.java:498)
	at com.carrotsearch.randomizedtesting.RandomizedRunner.invoke(RandomizedRunner.java:1737)
	at com.carrotsearch.randomizedtesting.RandomizedRunner$8.evaluate(RandomizedRunner.java:934)
	at com.carrotsearch.randomizedtesting.RandomizedRunner$9.evaluate(RandomizedRunner.java:970)
	at com.carrotsearch.randomizedtesting.RandomizedRunner$10.evaluate(RandomizedRunner.java:984)
	at org.apache.solr.BaseDistributedSearchTestCase$ShardsRepeatRule$ShardsFixedStatement.callStatement(BaseDistributedSearchTestCase.java:993)
	at org.apache.solr.BaseDistributedSearchTestCase$ShardsRepeatRule$ShardsStatement.evaluate(BaseDistributedSearchTestCase.java:968)
	at com.carrotsearch.randomizedtesting.rules.SystemPropertiesRestoreRule$1.evaluate(SystemPropertiesRestoreRule.java:57)
	at org.apache.lucene.util.TestRuleSetupTeardownChained$1.evaluate(TestRuleSetupTeardownChained.java:49)
	at org.apache.lucene.util.AbstractBeforeAfterRule$1.evaluate(AbstractBeforeAfterRule.java:45)
	at org.apache.lucene.util.TestRuleThreadAndTestName$1.evaluate(TestRuleThreadAndTestName.java:48)
	at org.apache.lucene.util.TestRuleIgnoreAfterMaxFailures$1.evaluate(TestRuleIgnoreAfterMaxFailures.java:64)
	at org.apache.lucene.util.TestRuleMarkFailure$1.evaluate(TestRuleMarkFailure.java:47)
	at com.carrotsearch.randomizedtesting.rules.StatementAdapter.evaluate(StatementAdapter.java:36)
	at com.carrotsearch.randomizedtesting.ThreadLeakControl$StatementRunner.run(ThreadLeakControl.java:368)
	at com.carrotsearch.randomizedtesting.ThreadLeakControl.forkTimeoutingTask(ThreadLeakControl.java:817)
	at com.carrotsearch.randomizedtesting.ThreadLeakControl$3.evaluate(ThreadLeakControl.java:468)
	at com.carrotsearch.randomizedtesting.RandomizedRunner.runSingleTest(RandomizedRunner.java:943)
	at com.carrotsearch.randomizedtesting.RandomizedRunner$5.evaluate(RandomizedRunner.java:829)
	at com.carrotsearch.randomizedtesting.RandomizedRunner$6.evaluate(RandomizedRunner.java:879)
	at com.carrotsearch.randomizedtesting.RandomizedRunner$7.evaluate(RandomizedRunner.java:890)
	at com.carrotsearch.randomizedtesting.rules.StatementAdapter.evaluate(StatementAdapter.java:36)
	at com.carrotsearch.randomizedtesting.rules.SystemPropertiesRestoreRule$1.evaluate(SystemPropertiesRestoreRule.java:57)
	at org.apache.lucene.util.AbstractBeforeAfterRule$1.evaluate(AbstractBeforeAfterRule.java:45)
	at com.carrotsearch.randomizedtesting.rules.StatementAdapter.evaluate(StatementAdapter.java:36)
	at org.apache.lucene.util.TestRuleStoreClassName$1.evaluate(TestRuleStoreClassName.java:41)
	at com.carrotsearch.randomizedtesting.rules.NoShadowingOrOverridesOnMethodsRule$1.evaluate(NoShadowingOrOverridesOnMethodsRule.java:40)
	at com.carrotsearch.randomizedtesting.rules.NoShadowingOrOverridesOnMethodsRule$1.evaluate(NoShadowingOrOverridesOnMethodsRule.java:40)
	at com.carrotsearch.randomizedtesting.rules.StatementAdapter.evaluate(StatementAdapter.java:36)
	at com.carrotsearch.randomizedtesting.rules.StatementAdapter.evaluate(StatementAdapter.java:36)
	at com.carrotsearch.randomizedtesting.rules.StatementAdapter.evaluate(StatementAdapter.java:36)
	at org.apache.lucene.util.TestRuleAssertionsRequired$1.evaluate(TestRuleAssertionsRequired.java:53)
	at org.apache.lucene.util.TestRuleMarkFailure$1.evaluate(TestRuleMarkFailure.java:47)
	at org.apache.lucene.util.TestRuleIgnoreAfterMaxFailures$1.evaluate(TestRuleIgnoreAfterMaxFailures.java:64)
	at org.apache.lucene.util.TestRuleIgnoreTestSuites$1.evaluate(TestRuleIgnoreTestSuites.java:54)
	at com.carrotsearch.randomizedtesting.rules.StatementAdapter.evaluate(StatementAdapter.java:36)
	at com.carrotsearch.randomizedtesting.ThreadLeakControl$StatementRunner.run(ThreadLeakControl.java:368)
	at java.lang.Thread.run(Thread.java:748)
Caused by: org.apache.solr.client.solrj.impl.HttpSolrClient$RemoteSolrException: Error from server at http://127.0.0.1:41443/solrj_collection4: no servers hosting shard: shard2
	at org.apache.solr.client.solrj.impl.HttpSolrClient.executeMethod(HttpSolrClient.java:627)
	at org.apache.solr.client.solrj.impl.HttpSolrClient.request(HttpSolrClient.java:253)
	at org.apache.solr.client.solrj.impl.HttpSolrClient.request(HttpSolrClient.java:242)
	at org.apache.solr.client.solrj.impl.LBHttpSolrClient.doRequest(LBHttpSolrClient.java:483)
	at org.apache.solr.client.solrj.impl.LBHttpSolrClient.request(LBHttpSolrClient.java:413)
	... 51 more




Build Log:
[...truncated 508 lines...]
   [junit4] Suite: org.apache.lucene.index.TestBinaryDocValuesUpdates
   [junit4]   2> NOTE: download the large Jenkins line-docs file by running 'ant get-jenkins-line-docs' in the lucene directory.
   [junit4]   2> NOTE: reproduce with: ant test  -Dtestcase=TestBinaryDocValuesUpdates -Dtests.method=testTonsOfUpdates -Dtests.seed=97BDAF83DA855A84 -Dtests.multiplier=2 -Dtests.nightly=true -Dtests.slow=true -Dtests.linedocsfile=/home/jenkins/jenkins-slave/workspace/Lucene-Solr-NightlyTests-master/test-data/enwiki.random.lines.txt -Dtests.locale=ar-DZ -Dtests.timezone=Europe/San_Marino -Dtests.asserts=true -Dtests.file.encoding=US-ASCII
   [junit4] ERROR    125s J0 | TestBinaryDocValuesUpdates.testTonsOfUpdates <<<
   [junit4]    > Throwable #1: java.io.FileNotFoundException: _2_1f.fnm
   [junit4]    > 	at __randomizedtesting.SeedInfo.seed([97BDAF83DA855A84:EF98718838A57566]:0)
   [junit4]    > 	at org.apache.lucene.store.RAMDirectory.openInput(RAMDirectory.java:243)
   [junit4]    > 	at org.apache.lucene.store.Directory.openChecksumInput(Directory.java:119)
   [junit4]    > 	at org.apache.lucene.store.RawDirectoryWrapper.openChecksumInput(RawDirectoryWrapper.java:41)
   [junit4]    > 	at org.apache.lucene.codecs.lucene60.Lucene60FieldInfosFormat.read(Lucene60FieldInfosFormat.java:113)
   [junit4]    > 	at org.apache.lucene.index.SegmentReader.initFieldInfos(SegmentReader.java:190)
   [junit4]    > 	at org.apache.lucene.index.SegmentReader.<init>(SegmentReader.java:93)
   [junit4]    > 	at org.apache.lucene.index.ReadersAndUpdates.writeFieldUpdates(ReadersAndUpdates.java:688)
   [junit4]    > 	at org.apache.lucene.index.IndexWriter$ReaderPool.writeSomeDocValuesUpdates(IndexWriter.java:703)
   [junit4]    > 	at org.apache.lucene.index.FrozenBufferedUpdates.apply(FrozenBufferedUpdates.java:331)
   [junit4]    > 	at org.apache.lucene.index.DocumentsWriter$ResolveUpdatesEvent.process(DocumentsWriter.java:723)
   [junit4]    > 	at org.apache.lucene.index.IndexWriter.processEvents(IndexWriter.java:5058)
   [junit4]    > 	at org.apache.lucene.index.IndexWriter.processEvents(IndexWriter.java:5046)
   [junit4]    > 	at org.apache.lucene.index.IndexWriter.updateDocValues(IndexWriter.java:1877)
   [junit4]    > 	at org.apache.lucene.index.TestBinaryDocValuesUpdates.testTonsOfUpdates(TestBinaryDocValuesUpdates.java:1323)
   [junit4]    > 	at java.lang.Thread.run(Thread.java:748)
   [junit4]   1> TEST: isNRT=true reader1=StandardDirectoryReader(segments:3:nrt _0(8.0.0):C2)
   [junit4]   1> TEST: now reopen
   [junit4]   2> NOTE: leaving temporary files on disk at: /home/jenkins/jenkins-slave/workspace/Lucene-Solr-NightlyTests-master/checkout/lucene/build/core/test/J0/temp/lucene.index.TestBinaryDocValuesUpdates_97BDAF83DA855A84-001
   [junit4]   2> NOTE: test params are: codec=Asserting(Lucene70): {bdv=PostingsFormat(name=LuceneFixedGap), f=PostingsFormat(name=Direct), k1=PostingsFormat(name=Direct), dvUpdateKey=PostingsFormat(name=Direct), k2=BlockTreeOrds(blocksize=128), foo=PostingsFormat(name=Direct), upd=PostingsFormat(name=Memory), updKey=PostingsFormat(name=LuceneFixedGap), id=BlockTreeOrds(blocksize=128), key=BlockTreeOrds(blocksize=128)}, docValues:{ndv=DocValuesFormat(name=Memory), f10=DocValuesFormat(name=Lucene70), f12=DocValuesFormat(name=Direct), f11=DocValuesFormat(name=Asserting), f14=DocValuesFormat(name=Lucene70), f13=DocValuesFormat(name=Memory), updKey=DocValuesFormat(name=Memory), f0=DocValuesFormat(name=Asserting), f16=DocValuesFormat(name=Direct), f1=DocValuesFormat(name=Direct), f15=DocValuesFormat(name=Asserting), f2=DocValuesFormat(name=Memory), f18=DocValuesFormat(name=Lucene70), f17=DocValuesFormat(name=Memory), f3=DocValuesFormat(name=Lucene70), f4=DocValuesFormat(name=Asserting), f19=DocValuesFormat(name=Asserting), f5=DocValuesFormat(name=Direct), bdv2=DocValuesFormat(name=Asserting), f6=DocValuesFormat(name=Memory), f7=DocValuesFormat(name=Lucene70), number=DocValuesFormat(name=Lucene70), f8=DocValuesFormat(name=Asserting), bdv1=DocValuesFormat(name=Lucene70), f9=DocValuesFormat(name=Direct), id=DocValuesFormat(name=Direct), val=DocValuesFormat(name=Lucene70), f20=DocValuesFormat(name=Memory), upd=DocValuesFormat(name=Lucene70), sort=DocValuesFormat(name=Asserting), cf0=DocValuesFormat(name=Lucene70), cf2=DocValuesFormat(name=Direct), cf1=DocValuesFormat(name=Asserting), cf4=DocValuesFormat(name=Lucene70), cf3=DocValuesFormat(name=Memory), cf6=DocValuesFormat(name=Direct), cf5=DocValuesFormat(name=Asserting), cf8=DocValuesFormat(name=Lucene70), cf7=DocValuesFormat(name=Memory), cf9=DocValuesFormat(name=Asserting), ssdv=DocValuesFormat(name=Asserting), sdv=DocValuesFormat(name=Lucene70), cf20=DocValuesFormat(name=Lucene70), key=DocValuesFormat(name=Direct), cf=DocValuesFormat(name=Direct), cf18=DocValuesFormat(name=Asserting), cf19=DocValuesFormat(name=Direct), cf16=DocValuesFormat(name=Memory), f=DocValuesFormat(name=Asserting), cf17=DocValuesFormat(name=Lucene70), cf14=DocValuesFormat(name=Asserting), cf15=DocValuesFormat(name=Direct), cf12=DocValuesFormat(name=Memory), control=DocValuesFormat(name=Lucene70), cf13=DocValuesFormat(name=Lucene70), cf10=DocValuesFormat(name=Asserting), cf11=DocValuesFormat(name=Direct), bdv=DocValuesFormat(name=Memory)}, maxPointsInLeafNode=1502, maxMBSortInHeap=6.6008420735622035, sim=RandomSimilarity(queryNorm=true): {}, locale=ar-DZ, timezone=Europe/San_Marino
   [junit4]   2> NOTE: Linux 4.4.0-83-generic amd64/Oracle Corporation 1.8.0_144 (64-bit)/cpus=4,threads=1,free=127713408,total=511705088
   [junit4]   2> NOTE: All tests run in this JVM: [TestDeletionPolicy, Test4GBStoredFields, TestSpanMultiTermQueryWrapper, TestClassicSimilarity, TestMultiTermQueryRewrites, TestTermVectorsWriter, TestUniqueTermCount, TestAllFilesCheckIndexHeader, TestSloppyPhraseQuery, TestUTF32ToUTF8, TestBytesStore, TestPagedBytes, TestIndexedDISI, TestDirectPacked, TestCodecs, TestCachingCollector, TestLucene50TermVectorsFormat, TestThreadedForceMerge, TestIntBlockPool, TestIndexInput, TestFuzzyQuery, TestOfflineSorter, TestFlex, TestTopFieldCollector, TestBinaryDocValuesUpdates]
   [junit4] Completed [58/454 (1!)] on J0 in 198.31s, 29 tests, 1 error <<< FAILURES!

[...truncated 934 lines...]
   [junit4] Suite: org.apache.lucene.index.TestNumericDocValuesUpdates
   [junit4]   2> NOTE: download the large Jenkins line-docs file by running 'ant get-jenkins-line-docs' in the lucene directory.
   [junit4]   2> NOTE: reproduce with: ant test  -Dtestcase=TestNumericDocValuesUpdates -Dtests.method=testTonsOfUpdates -Dtests.seed=97BDAF83DA855A84 -Dtests.multiplier=2 -Dtests.nightly=true -Dtests.slow=true -Dtests.linedocsfile=/home/jenkins/jenkins-slave/workspace/Lucene-Solr-NightlyTests-master/test-data/enwiki.random.lines.txt -Dtests.locale=sr-RS -Dtests.timezone=America/Dominica -Dtests.asserts=true -Dtests.file.encoding=US-ASCII
   [junit4] ERROR   49.3s J1 | TestNumericDocValuesUpdates.testTonsOfUpdates <<<
   [junit4]    > Throwable #1: java.io.FileNotFoundException: _1_j.fnm
   [junit4]    > 	at __randomizedtesting.SeedInfo.seed([97BDAF83DA855A84:EF98718838A57566]:0)
   [junit4]    > 	at org.apache.lucene.store.RAMDirectory.openInput(RAMDirectory.java:243)
   [junit4]    > 	at org.apache.lucene.store.Directory.openChecksumInput(Directory.java:119)
   [junit4]    > 	at org.apache.lucene.store.RawDirectoryWrapper.openChecksumInput(RawDirectoryWrapper.java:41)
   [junit4]    > 	at org.apache.lucene.codecs.lucene60.Lucene60FieldInfosFormat.read(Lucene60FieldInfosFormat.java:113)
   [junit4]    > 	at org.apache.lucene.index.SegmentReader.initFieldInfos(SegmentReader.java:190)
   [junit4]    > 	at org.apache.lucene.index.SegmentReader.<init>(SegmentReader.java:93)
   [junit4]    > 	at org.apache.lucene.index.ReadersAndUpdates.writeFieldUpdates(ReadersAndUpdates.java:688)
   [junit4]    > 	at org.apache.lucene.index.IndexWriter$ReaderPool.writeSomeDocValuesUpdates(IndexWriter.java:703)
   [junit4]    > 	at org.apache.lucene.index.FrozenBufferedUpdates.apply(FrozenBufferedUpdates.java:331)
   [junit4]    > 	at org.apache.lucene.index.DocumentsWriter$ResolveUpdatesEvent.process(DocumentsWriter.java:723)
   [junit4]    > 	at org.apache.lucene.index.IndexWriter.processEvents(IndexWriter.java:5058)
   [junit4]    > 	at org.apache.lucene.index.IndexWriter.processEvents(IndexWriter.java:5046)
   [junit4]    > 	at org.apache.lucene.index.IndexWriter.updateDocValues(IndexWriter.java:1877)
   [junit4]    > 	at org.apache.lucene.index.TestNumericDocValuesUpdates.testTonsOfUpdates(TestNumericDocValuesUpdates.java:1557)
   [junit4]    > 	at java.lang.Thread.run(Thread.java:748)
   [junit4]   2> NOTE: leaving temporary files on disk at: /home/jenkins/jenkins-slave/workspace/Lucene-Solr-NightlyTests-master/checkout/lucene/build/core/test/J1/temp/lucene.index.TestNumericDocValuesUpdates_97BDAF83DA855A84-001
   [junit4]   2> NOTE: test params are: codec=Asserting(Lucene70): {ndv=Lucene50(blocksize=128), f=TestBloomFilteredLucenePostings(BloomFilteringPostingsFormat(Lucene50(blocksize=128))), k1=TestBloomFilteredLucenePostings(BloomFilteringPostingsFormat(Lucene50(blocksize=128))), dvUpdateKey=Lucene50(blocksize=128), k2=FST50, foo=TestBloomFilteredLucenePostings(BloomFilteringPostingsFormat(Lucene50(blocksize=128))), upd=PostingsFormat(name=MockRandom), updKey=TestBloomFilteredLucenePostings(BloomFilteringPostingsFormat(Lucene50(blocksize=128))), id=FST50, key=FST50}, docValues:{ndv=DocValuesFormat(name=Lucene70), ndv2=DocValuesFormat(name=Asserting), ndv1=DocValuesFormat(name=Lucene70), f10=DocValuesFormat(name=Lucene70), f12=DocValuesFormat(name=Direct), f11=DocValuesFormat(name=Asserting), f14=DocValuesFormat(name=Lucene70), updKey=DocValuesFormat(name=Asserting), f13=DocValuesFormat(name=Lucene70), f0=DocValuesFormat(name=Asserting), f16=DocValuesFormat(name=Direct), f1=DocValuesFormat(name=Direct), f15=DocValuesFormat(name=Asserting), f2=DocValuesFormat(name=Lucene70), f18=DocValuesFormat(name=Lucene70), f17=DocValuesFormat(name=Lucene70), f3=DocValuesFormat(name=Lucene70), f4=DocValuesFormat(name=Asserting), f19=DocValuesFormat(name=Asserting), f5=DocValuesFormat(name=Direct), f6=DocValuesFormat(name=Lucene70), f7=DocValuesFormat(name=Lucene70), number=DocValuesFormat(name=Direct), f8=DocValuesFormat(name=Asserting), f9=DocValuesFormat(name=Direct), id=DocValuesFormat(name=Direct), val=DocValuesFormat(name=Lucene70), f20=DocValuesFormat(name=Lucene70), upd=DocValuesFormat(name=Lucene70), sort=DocValuesFormat(name=Asserting), cf0=DocValuesFormat(name=Lucene70), cf2=DocValuesFormat(name=Direct), cf1=DocValuesFormat(name=Asserting), cf4=DocValuesFormat(name=Lucene70), cf3=DocValuesFormat(name=Lucene70), cf6=DocValuesFormat(name=Direct), cf5=DocValuesFormat(name=Asserting), cf8=DocValuesFormat(name=Lucene70), cf7=DocValuesFormat(name=Lucene70), cf9=DocValuesFormat(name=Asserting), ssdv=DocValuesFormat(name=Asserting), sdv=DocValuesFormat(name=Lucene70), foo=DocValuesFormat(name=Asserting), cf20=DocValuesFormat(name=Lucene70), key=DocValuesFormat(name=Direct), cf=DocValuesFormat(name=Direct), cf18=DocValuesFormat(name=Asserting), cf19=DocValuesFormat(name=Direct), f=DocValuesFormat(name=Asserting), cf16=DocValuesFormat(name=Lucene70), cf17=DocValuesFormat(name=Lucene70), cf14=DocValuesFormat(name=Asserting), cf15=DocValuesFormat(name=Direct), cf12=DocValuesFormat(name=Lucene70), control=DocValuesFormat(name=Lucene70), cf13=DocValuesFormat(name=Lucene70), cf10=DocValuesFormat(name=Asserting), cf11=DocValuesFormat(name=Direct), bdv=DocValuesFormat(name=Lucene70)}, maxPointsInLeafNode=157, maxMBSortInHeap=6.323153914436723, sim=RandomSimilarity(queryNorm=false): {}, locale=sr-RS, timezone=America/Dominica
   [junit4]   2> NOTE: Linux 4.4.0-83-generic amd64/Oracle Corporation 1.8.0_144 (64-bit)/cpus=4,threads=1,free=140823048,total=428343296
   [junit4]   2> NOTE: All tests run in this JVM: [TestIndexWriterDelete, TestComplexExplanations, TestDemo, TestFilterIterator, TestSizeBoundedForceMerge, TestElevationComparator, TestSpanExplanationsOfNonMatches, TestFilterLeafReader, TestDuelingCodecsAtNight, TestNoMergeScheduler, TestSingleInstanceLockFactory, TestFieldInvertState, TestMultiDocValues, Test2BDocs, TestMergeSchedulerExternal, TestAddIndexes, TestOmitPositions, TestTermVectorsReader, TestExternalCodecs, TestDeterminism, TestFileSwitchDirectory, TestSPIClassIterator, TestLockFactory, TestMatchNoDocsQuery, TestPerFieldDocValuesFormat, TestBooleanQuery, TestMaxPosition, TestDocumentsWriterStallControl, TestTransactions, TestBoostQuery, TestGraphTokenizers, TestCodecUtil, TestMSBRadixSorter, TestTermdocPerf, TestAutomatonQueryUnicode, TestNotDocIdSet, TestDuelingCodecs, TestSortRandom, TestVirtualMethod, TestFixedBitDocIdSet, TestDocInverterPerFieldErrorInfo, TestOmitTf, TestBytesRefAttImpl, TestPointValues, TestNumericDocValuesUpdates]
   [junit4] Completed [293/454 (2!)] on J1 in 136.03s, 32 tests, 1 error <<< FAILURES!

[...truncated 868 lines...]
   [junit4] Suite: org.apache.lucene.index.TestIndexSorting
   [junit4]   2> oct 02, 2017 8:52:06 PM com.carrotsearch.randomizedtesting.ThreadLeakControl$2 evaluate
   [junit4]   2> WARNING: Suite execution timed out: org.apache.lucene.index.TestIndexSorting
   [junit4]   2>    1) Thread[id=5750, name=SUITE-TestIndexSorting-seed#[97BDAF83DA855A84], state=RUNNABLE, group=TGRP-TestIndexSorting]
   [junit4]   2>         at java.lang.Thread.getStackTrace(Thread.java:1559)
   [junit4]   2>         at com.carrotsearch.randomizedtesting.ThreadLeakControl$4.run(ThreadLeakControl.java:696)
   [junit4]   2>         at com.carrotsearch.randomizedtesting.ThreadLeakControl$4.run(ThreadLeakControl.java:693)
   [junit4]   2>         at java.security.AccessController.doPrivileged(Native Method)
   [junit4]   2>         at com.carrotsearch.randomizedtesting.ThreadLeakControl.getStackTrace(ThreadLeakControl.java:693)
   [junit4]   2>         at com.carrotsearch.randomizedtesting.ThreadLeakControl.getThreadsWithTraces(ThreadLeakControl.java:709)
   [junit4]   2>         at com.carrotsearch.randomizedtesting.ThreadLeakControl.formatThreadStacksFull(ThreadLeakControl.java:689)
   [junit4]   2>         at com.carrotsearch.randomizedtesting.ThreadLeakControl.access$1000(ThreadLeakControl.java:65)
   [junit4]   2>         at com.carrotsearch.randomizedtesting.ThreadLeakControl$2.evaluate(ThreadLeakControl.java:415)
   [junit4]   2>         at com.carrotsearch.randomizedtesting.RandomizedRunner.runSuite(RandomizedRunner.java:705)
   [junit4]   2>         at com.carrotsearch.randomizedtesting.RandomizedRunner.access$200(RandomizedRunner.java:139)
   [junit4]   2>         at com.carrotsearch.randomizedtesting.RandomizedRunner$2.run(RandomizedRunner.java:626)
   [junit4]   2>    2) Thread[id=1, name=main, state=WAITING, group=main]
   [junit4]   2>         at java.lang.Object.wait(Native Method)
   [junit4]   2>         at java.lang.Thread.join(Thread.java:1252)
   [junit4]   2>         at java.lang.Thread.join(Thread.java:1326)
   [junit4]   2>         at com.carrotsearch.randomizedtesting.RandomizedRunner.runSuite(RandomizedRunner.java:636)
   [junit4]   2>         at com.carrotsearch.randomizedtesting.RandomizedRunner.run(RandomizedRunner.java:493)
   [junit4]   2>         at com.carrotsearch.ant.tasks.junit4.slave.SlaveMain.execute(SlaveMain.java:251)
   [junit4]   2>         at com.carrotsearch.ant.tasks.junit4.slave.SlaveMain.main(SlaveMain.java:368)
   [junit4]   2>         at com.carrotsearch.ant.tasks.junit4.slave.SlaveMainSafe.main(SlaveMainSafe.java:13)
   [junit4]   2>    3) Thread[id=9, name=JUnit4-serializer-daemon, state=TIMED_WAITING, group=main]
   [junit4]   2>         at java.lang.Thread.sleep(Native Method)
   [junit4]   2>         at com.carrotsearch.ant.tasks.junit4.events.Serializer$1.run(Serializer.java:50)
   [junit4]   2>    4) Thread[id=5751, name=TEST-TestIndexSorting.testRandom3-seed#[97BDAF83DA855A84], state=RUNNABLE, group=TGRP-TestIndexSorting]
   [junit4]   2>         at java.util.zip.Inflater.inflateBytes(Native Method)
   [junit4]   2>         at java.util.zip.Inflater.inflate(Inflater.java:259)
   [junit4]   2>         at org.apache.lucene.codecs.compressing.CompressionMode$DeflateDecompressor.decompress(CompressionMode.java:224)
   [junit4]   2>         at org.apache.lucene.codecs.compressing.CompressingStoredFieldsReader$BlockState.document(CompressingStoredFieldsReader.java:555)
   [junit4]   2>         at org.apache.lucene.codecs.compressing.CompressingStoredFieldsReader.document(CompressingStoredFieldsReader.java:571)
   [junit4]   2>         at org.apache.lucene.codecs.compressing.CompressingStoredFieldsReader.visitDocument(CompressingStoredFieldsReader.java:578)
   [junit4]   2>         at org.apache.lucene.index.CodecReader.document(CodecReader.java:83)
   [junit4]   2>         at org.apache.lucene.index.BaseCompositeReader.document(BaseCompositeReader.java:118)
   [junit4]   2>         at org.apache.lucene.index.IndexReader.document(IndexReader.java:360)
   [junit4]   2>         at org.apache.lucene.index.TestIndexSorting.testRandom3(TestIndexSorting.java:2364)
   [junit4]   2>         at sun.reflect.NativeMethodAccessorImpl.invoke0(Native Method)
   [junit4]   2>         at sun.reflect.NativeMethodAccessorImpl.invoke(NativeMethodAccessorImpl.java:62)
   [junit4]   2>         at sun.reflect.DelegatingMethodAccessorImpl.invoke(DelegatingMethodAccessorImpl.java:43)
   [junit4]   2>         at java.lang.reflect.Method.invoke(Method.java:498)
   [junit4]   2>         at com.carrotsearch.randomizedtesting.RandomizedRunner.invoke(RandomizedRunner.java:1737)
   [junit4]   2>         at com.carrotsearch.randomizedtesting.RandomizedRunner$8.evaluate(RandomizedRunner.java:934)
   [junit4]   2>         at com.carrotsearch.randomizedtesting.RandomizedRunner$9.evaluate(RandomizedRunner.java:970)
   [junit4]   2>         at com.carrotsearch.randomizedtesting.RandomizedRunner$10.evaluate(RandomizedRunner.java:984)
   [junit4]   2>         at org.apache.lucene.util.TestRuleSetupTeardownChained$1.evaluate(TestRuleSetupTeardownChained.java:49)
   [junit4]   2>         at org.apache.lucene.util.AbstractBeforeAfterRule$1.evaluate(AbstractBeforeAfterRule.java:45)
   [junit4]   2>         at org.apache.lucene.util.TestRuleThreadAndTestName$1.evaluate(TestRuleThreadAndTestName.java:48)
   [junit4]   2>         at org.apache.lucene.util.TestRuleIgnoreAfterMaxFailures$1.evaluate(TestRuleIgnoreAfterMaxFailures.java:64)
   [junit4]   2>         at org.apache.lucene.util.TestRuleMarkFailure$1.evaluate(TestRuleMarkFailure.java:47)
   [junit4]   2>         at com.carrotsearch.randomizedtesting.rules.StatementAdapter.evaluate(StatementAdapter.java:36)
   [junit4]   2>         at com.carrotsearch.randomizedtesting.ThreadLeakControl$StatementRunner.run(ThreadLeakControl.java:368)
   [junit4]   2>         at com.carrotsearch.randomizedtesting.ThreadLeakControl.forkTimeoutingTask(ThreadLeakControl.java:817)
   [junit4]   2>         at com.carrotsearch.randomizedtesting.ThreadLeakControl$3.evaluate(ThreadLeakControl.java:468)
   [junit4]   2>         at com.carrotsearch.randomizedtesting.RandomizedRunner.runSingleTest(RandomizedRunner.java:943)
   [junit4]   2>         at com.carrotsearch.randomizedtesting.RandomizedRunner$5.evaluate(RandomizedRunner.java:829)
   [junit4]   2>         at com.carrotsearch.randomizedtesting.RandomizedRunner$6.evaluate(RandomizedRunner.java:879)
   [junit4]   2>         at com.carrotsearch.randomizedtesting.RandomizedRunner$7.evaluate(RandomizedRunner.java:890)
   [junit4]   2>         at org.apache.lucene.util.AbstractBeforeAfterRule$1.evaluate(AbstractBeforeAfterRule.java:45)
   [junit4]   2>         at com.carrotsearch.randomizedtesting.rules.StatementAdapter.evaluate(StatementAdapter.java:36)
   [junit4]   2>         at org.apache.lucene.util.TestRuleStoreClassName$1.evaluate(TestRuleStoreClassName.java:41)
   [junit4]   2>         at com.carrotsearch.randomizedtesting.rules.NoShadowingOrOverridesOnMethodsRule$1.evaluate(NoShadowingOrOverridesOnMethodsRule.java:40)
   [junit4]   2>         at com.carrotsearch.randomizedtesting.rules.NoShadowingOrOverridesOnMethodsRule$1.evaluate(NoShadowingOrOverridesOnMethodsRule.java:40)
   [junit4]   2>         at com.carrotsearch.randomizedtesting.rules.StatementAdapter.evaluate(StatementAdapter.java:36)
   [junit4]   2>         at com.carrotsearch.randomizedtesting.rules.StatementAdapter.evaluate(StatementAdapter.java:36)
   [junit4]   2>         at com.carrotsearch.randomizedtesting.rules.StatementAdapter.evaluate(StatementAdapter.java:36)
   [junit4]   2>         at org.apache.lucene.util.TestRuleAssertionsRequired$1.evaluate(TestRuleAssertionsRequired.java:53)
   [junit4]   2>         at org.apache.lucene.util.TestRuleMarkFailure$1.evaluate(TestRuleMarkFailure.java:47)
   [junit4]   2>         at org.apache.lucene.util.TestRuleIgnoreAfterMaxFailures$1.evaluate(TestRuleIgnoreAfterMaxFailures.java:64)
   [junit4]   2>         at org.apache.lucene.util.TestRuleIgnoreTestSuites$1.evaluate(TestRuleIgnoreTestSuites.java:54)
   [junit4]   2>         at com.carrotsearch.randomizedtesting.rules.StatementAdapter.evaluate(StatementAdapter.java:36)
   [junit4]   2>         at com.carrotsearch.randomizedtesting.ThreadLeakControl$StatementRunner.run(ThreadLeakControl.java:368)
   [junit4]   2>         at java.lang.Thread.run(Thread.java:748)
   [junit4]   2> NOTE: download the large Jenkins line-docs file by running 'ant get-jenkins-line-docs' in the lucene directory.
   [junit4]   2> NOTE: reproduce with: ant test  -Dtestcase=TestIndexSorting -Dtests.method=testRandom3 -Dtests.seed=97BDAF83DA855A84 -Dtests.multiplier=2 -Dtests.nightly=true -Dtests.slow=true -Dtests.linedocsfile=/home/jenkins/jenkins-slave/workspace/Lucene-Solr-NightlyTests-master/test-data/enwiki.random.lines.txt -Dtests.locale=es-GT -Dtests.timezone=America/Noronha -Dtests.asserts=true -Dtests.file.encoding=US-ASCII
   [junit4] ERROR   7095s J2 | TestIndexSorting.testRandom3 <<<
   [junit4]    > Throwable #1: java.lang.Exception: Test abandoned because suite timeout was reached.
   [junit4]    > 	at __randomizedtesting.SeedInfo.seed([97BDAF83DA855A84]:0)
   [junit4]   2> oct 02, 2017 8:52:06 PM com.carrotsearch.randomizedtesting.ThreadLeakControl checkThreadLeaks
   [junit4]   2> WARNING: Will linger awaiting termination of 1 leaked thread(s).
   [junit4]   2> oct 02, 2017 8:52:26 PM com.carrotsearch.randomizedtesting.ThreadLeakControl checkThreadLeaks
   [junit4]   2> SEVERE: 1 thread leaked from SUITE scope at org.apache.lucene.index.TestIndexSorting: 
   [junit4]   2>    1) Thread[id=5751, name=TEST-TestIndexSorting.testRandom3-seed#[97BDAF83DA855A84], state=RUNNABLE, group=TGRP-TestIndexSorting]
   [junit4]   2>         at java.util.zip.Inflater.inflateBytes(Native Method)
   [junit4]   2>         at java.util.zip.Inflater.inflate(Inflater.java:259)
   [junit4]   2>         at org.apache.lucene.codecs.compressing.CompressionMode$DeflateDecompressor.decompress(CompressionMode.java:224)
   [junit4]   2>         at org.apache.lucene.codecs.compressing.CompressingStoredFieldsReader$BlockState.document(CompressingStoredFieldsReader.java:555)
   [junit4]   2>         at org.apache.lucene.codecs.compressing.CompressingStoredFieldsReader.document(CompressingStoredFieldsReader.java:571)
   [junit4]   2>         at org.apache.lucene.codecs.compressing.CompressingStoredFieldsReader.visitDocument(CompressingStoredFieldsReader.java:578)
   [junit4]   2>         at org.apache.lucene.index.CodecReader.document(CodecReader.java:83)
   [junit4]   2>         at org.apache.lucene.index.BaseCompositeReader.document(BaseCompositeReader.java:118)
   [junit4]   2>         at org.apache.lucene.index.IndexReader.document(IndexReader.java:360)
   [junit4]   2>         at org.apache.lucene.index.TestIndexSorting.testRandom3(TestIndexSorting.java:2364)
   [junit4]   2>         at sun.reflect.NativeMethodAccessorImpl.invoke0(Native Method)
   [junit4]   2>         at sun.reflect.NativeMethodAccessorImpl.invoke(NativeMethodAccessorImpl.java:62)
   [junit4]   2>         at sun.reflect.DelegatingMethodAccessorImpl.invoke(DelegatingMethodAccessorImpl.java:43)
   [junit4]   2>         at java.lang.reflect.Method.invoke(Method.java:498)
   [junit4]   2>         at com.carrotsearch.randomizedtesting.RandomizedRunner.invoke(RandomizedRunner.java:1737)
   [junit4]   2>         at com.carrotsearch.randomizedtesting.RandomizedRunner$8.evaluate(RandomizedRunner.java:934)
   [junit4]   2>         at com.carrotsearch.randomizedtesting.RandomizedRunner$9.evaluate(RandomizedRunner.java:970)
   [junit4]   2>         at com.carrotsearch.randomizedtesting.RandomizedRunner$10.evaluate(RandomizedRunner.java:984)
   [junit4]   2>         at org.apache.lucene.util.TestRuleSetupTeardownChained$1.evaluate(TestRuleSetupTeardownChained.java:49)
   [junit4]   2>         at org.apache.lucene.util.AbstractBeforeAfterRule$1.evaluate(AbstractBeforeAfterRule.java:45)
   [junit4]   2>         at org.apache.lucene.util.TestRuleThreadAndTestName$1.evaluate(TestRuleThreadAndTestName.java:48)
   [junit4]   2>         at org.apache.lucene.util.TestRuleIgnoreAfterMaxFailures$1.evaluate(TestRuleIgnoreAfterMaxFailures.java:64)
   [junit4]   2>         at org.apache.lucene.util.TestRuleMarkFailure$1.evaluate(TestRuleMarkFailure.java:47)
   [junit4]   2>         at com.carrotsearch.randomizedtesting.rules.StatementAdapter.evaluate(StatementAdapter.java:36)
   [junit4]   2>         at com.carrotsearch.randomizedtesting.ThreadLeakControl$StatementRunner.run(ThreadLeakControl.java:368)
   [junit4]   2>         at com.carrotsearch.randomizedtesting.ThreadLeakControl.forkTimeoutingTask(ThreadLeakControl.java:817)
   [junit4]   2>         at com.carrotsearch.randomizedtesting.ThreadLeakControl$3.evaluate(ThreadLeakControl.java:468)
   [junit4]   2>         at com.carrotsearch.randomizedtesting.RandomizedRunner.runSingleTest(RandomizedRunner.java:943)
   [junit4]   2>         at com.carrotsearch.randomizedtesting.RandomizedRunner$5.evaluate(RandomizedRunner.java:829)
   [junit4]   2>         at com.carrotsearch.randomizedtesting.RandomizedRunner$6.evaluate(RandomizedRunner.java:879)
   [junit4]   2>         at com.carrotsearch.randomizedtesting.RandomizedRunner$7.evaluate(RandomizedRunner.java:890)
   [junit4]   2>         at org.apache.lucene.util.AbstractBeforeAfterRule$1.evaluate(AbstractBeforeAfterRule.java:45)
   [junit4]   2>         at com.carrotsearch.randomizedtesting.rules.StatementAdapter.evaluate(StatementAdapter.java:36)
   [junit4]   2>         at org.apache.lucene.util.TestRuleStoreClassName$1.evaluate(TestRuleStoreClassName.java:41)
   [junit4]   2>         at com.carrotsearch.randomizedtesting.rules.NoShadowingOrOverridesOnMethodsRule$1.evaluate(NoShadowingOrOverridesOnMethodsRule.java:40)
   [junit4]   2>         at com.carrotsearch.randomizedtesting.rules.NoShadowingOrOverridesOnMethodsRule$1.evaluate(NoShadowingOrOverridesOnMethodsRule.java:40)
   [junit4]   2>         at com.carrotsearch.randomizedtesting.rules.StatementAdapter.evaluate(StatementAdapter.java:36)
   [junit4]   2>         at com.carrotsearch.randomizedtesting.rules.StatementAdapter.evaluate(StatementAdapter.java:36)
   [junit4]   2>         at com.carrotsearch.randomizedtesting.rules.StatementAdapter.evaluate(StatementAdapter.java:36)
   [junit4]   2>         at org.apache.lucene.util.TestRuleAssertionsRequired$1.evaluate(TestRuleAssertionsRequired.java:53)
   [junit4]   2>         at org.apache.lucene.util.TestRuleMarkFailure$1.evaluate(TestRuleMarkFailure.java:47)
   [junit4]   2>         at org.apache.lucene.util.TestRuleIgnoreAfterMaxFailures$1.evaluate(TestRuleIgnoreAfterMaxFailures.java:64)
   [junit4]   2>         at org.apache.lucene.util.TestRuleIgnoreTestSuites$1.evaluate(TestRuleIgnoreTestSuites.java:54)
   [junit4]   2>         at com.carrotsearch.randomizedtesting.rules.StatementAdapter.evaluate(StatementAdapter.java:36)
   [junit4]   2>         at com.carrotsearch.randomizedtesting.ThreadLeakControl$StatementRunner.run(ThreadLeakControl.java:368)
   [junit4]   2>         at java.lang.Thread.run(Thread.java:748)
   [junit4]   2> oct 02, 2017 8:52:26 PM com.carrotsearch.randomizedtesting.ThreadLeakControl tryToInterruptAll
   [junit4]   2> INFO: Starting to interrupt leaked threads:
   [junit4]   2>    1) Thread[id=5751, name=TEST-TestIndexSorting.testRandom3-seed#[97BDAF83DA855A84], state=RUNNABLE, group=TGRP-TestIndexSorting]
   [junit4]   2> NOTE: leaving temporary files on disk at: /home/jenkins/jenkins-slave/workspace/Lucene-Solr-NightlyTests-master/checkout/lucene/build/core/test/J2/temp/lucene.index.TestIndexSorting_97BDAF83DA855A84-001
   [junit4]   2> Oct 02, 2017 10:52:26 PM com.carrotsearch.randomizedtesting.ThreadLeakControl tryToInterruptAll
   [junit4]   2> INFO: All leaked threads terminated.
   [junit4]   2> NOTE: test params are: codec=Lucene70, sim=RandomSimilarity(queryNorm=true): {positions=DFR I(ne)LZ(0.3), id=DFR I(n)B1, term_vectors=IB LL-L3(800.0)}, locale=es-GT, timezone=America/Noronha
   [junit4]   2> NOTE: Linux 4.4.0-83-generic amd64/Oracle Corporation 1.8.0_144 (64-bit)/cpus=4,threads=1,free=110311800,total=432537600
   [junit4]   2> NOTE: All tests run in this JVM: [TestSimpleExplanationsOfNonMatches, Test2BSortedDocValuesOrds, TestTermScorer, TestSortedSetSortField, TestMutablePointsReaderUtils, TestBinaryDocument, TestTopDocsMerge, TestTermRangeQuery, TestMathUtil, TestField, TestSearchForDuplicates, TestDirectoryReader, TestLucene70NormsFormat, TestNRTThreads, TestMultiLevelSkipList, TestDocValues, TestSubScorerFreqs, TestFieldsReader, TestSloppyMath, TestIndexWriterMerging, TestGeoEncodingUtils, TestQueryRescorer, TestCharsRefBuilder, TestMergePolicyWrapper, TestSpanSearchEquivalence, TestNIOFSDirectory, TestTimSorterWorstCase, TestIntArrayDocIdSet, TestBytesRefHash, TestLSBRadixSorter, TestStringHelper, TestPayloads, TestRegexpQuery, TestCachingTokenFilter, TestSpans, Test2BBKDPoints, TestSegmentTermDocs, Test2BNumericDocValues, TestSegmentTermEnum, TestSearchWithThreads, TestStopFilter, TestBooleanSimilarity, TestNRTReaderWithThreads, TestPerFieldPostingsFormat2, TestForUtil, TestStressIndexing2, TestSpanNearQuery, TestNumericUtils, TestIndexWriterDeleteByQuery, TestOneMergeWrappingMergePolicy, TestSegmentReader, TestAllFilesHaveChecksumFooter, TestVersion, TestRamUsageEstimator, TestConjunctions, TestSpanTermQuery, TestCharacterUtils, TestPackedInts, TestIntsRef, TestIndexWriterReader, TestPrefixQuery, TestFieldCacheRewriteMethod, TestAutomaton, TestFastCompressionMode, TestIndexManyDocuments, TestFilterDirectory, TestAllFilesHaveCodecHeader, TestIndexWriterMergePolicy, TestMultiTermsEnum, TestLongRangeFieldQueries, TestExceedMaxTermLength, TestRadixSelector, TestTopDocsCollector, TestComplexExplanationsOfNonMatches, TestBufferedIndexInput, TestNoMergePolicy, TestIndexWriterWithThreads, TestShardSearching, TestMultiMMap, TestBooleanOr, TestBasics, TestFlushByRamOrCountsPolicy, TestBoolean2, TestPersistentSnapshotDeletionPolicy, TestStressAdvance, TestNorms, TestIndexWriterCommit, TestTimeLimitingCollector, TestSearchAfter, TestConcurrentMergeScheduler, TestHighCompressionMode, TestNeverDelete, TestLongPostings, TestStressIndexing, TestRollingUpdates, TestSnapshotDeletionPolicy, TestIndexWriterUnicode, TestTieredMergePolicy, TestIndexWriterForceMerge, TestPerFieldPostingsFormat, TestArrayUtil, TestTermsEnum, TestSameTokenSamePosition, TestAttributeSource, TestTotalHitCountCollector, TestRecyclingByteBlockAllocator, TestSpanFirstQuery, TestIsCurrent, TestIndexWriterLockRelease, TestPhrasePrefixQuery, TestByteBlockPool, TestBytesRef, TestAssertions, TestCharFilter, TestRollback, TestTwoPhaseCommitTool, TestNot, TestIndexWriterOnJRECrash, TestReaderClosed, MultiCollectorTest, TestScoreCachingWrappingScorer, TestSimpleAttributeImpl, Test2BPositions, TestIndexCommit, TestTerm, Test2BPostingsBytes, TestIOUtils, TestNewestSegment, TestByteArrayDataInput, Test2BBinaryDocValues, Test2BPagedBytes, TestCharArrayMap, TestCharArraySet, TestDelegatingAnalyzerWrapper, TestReusableStringReader, TestWordlistLoader, TestPackedTokenAttributeImpl, TestBlockPostingsFormat, TestBlockPostingsFormat2, TestBlockPostingsFormat3, TestLucene50StoredFieldsFormatHighCompression, TestLucene60FieldInfoFormat, TestLucene60PointsFormat, TestLucene70SegmentInfoFormat, TestPolygon2D, Test2BPoints, Test2BSortedDocValuesFixedSorted, TestAllFilesDetectTruncation, TestDemoParallelLeafReader, TestDocsWithFieldSet, TestExitableDirectoryReader, TestFieldReuse, TestFilterDirectoryReader, TestIndexReaderClose, TestIndexSorting]
   [junit4]   2> NOTE: download the large Jenkins line-docs file by running 'ant get-jenkins-line-docs' in the lucene directory.
   [junit4]   2> NOTE: reproduce with: ant test  -Dtestcase=TestIndexSorting -Dtests.seed=97BDAF83DA855A84 -Dtests.multiplier=2 -Dtests.nightly=true -Dtests.slow=true -Dtests.linedocsfile=/home/jenkins/jenkins-slave/workspace/Lucene-Solr-NightlyTests-master/test-data/enwiki.random.lines.txt -Dtests.locale=es-GT -Dtests.timezone=America/Noronha -Dtests.asserts=true -Dtests.file.encoding=US-ASCII
   [junit4] ERROR   0.00s J2 | TestIndexSorting (suite) <<<
   [junit4]    > Throwable #1: java.lang.Exception: Suite timeout exceeded (>= 7200000 msec).
   [junit4]    > 	at __randomizedtesting.SeedInfo.seed([97BDAF83DA855A84]:0)
   [junit4] Completed [454/454 (3!)] on J2 in 7220.32s, 50 tests, 2 errors <<< FAILURES!

[...truncated 8695 lines...]
   [junit4] Suite: org.apache.lucene.spatial3d.TestGeo3DPoint
   [junit4]   2> oct 03, 2017 3:03:46 AM com.carrotsearch.randomizedtesting.ThreadLeakControl$2 evaluate
   [junit4]   2> WARNING: Suite execution timed out: org.apache.lucene.spatial3d.TestGeo3DPoint
   [junit4]   2>    1) Thread[id=18, name=TEST-TestGeo3DPoint.testRandomBig-seed#[7EEE99CF8C3E390F], state=RUNNABLE, group=TGRP-TestGeo3DPoint]
   [junit4]   2>         at org.apache.lucene.spatial3d.geom.Plane.findIntersections(Plane.java:650)
   [junit4]   2>         at org.apache.lucene.spatial3d.geom.StandardXYZSolid.<init>(StandardXYZSolid.java:177)
   [junit4]   2>         at org.apache.lucene.spatial3d.geom.XYZSolidFactory.makeXYZSolid(XYZSolidFactory.java:64)
   [junit4]   2>         at org.apache.lucene.spatial3d.TestGeo3DPoint.verify(TestGeo3DPoint.java:847)
   [junit4]   2>         at org.apache.lucene.spatial3d.TestGeo3DPoint.doTestRandom(TestGeo3DPoint.java:548)
   [junit4]   2>         at org.apache.lucene.spatial3d.TestGeo3DPoint.testRandomBig(TestGeo3DPoint.java:480)
   [junit4]   2>         at sun.reflect.NativeMethodAccessorImpl.invoke0(Native Method)
   [junit4]   2>         at sun.reflect.NativeMethodAccessorImpl.invoke(NativeMethodAccessorImpl.java:62)
   [junit4]   2>         at sun.reflect.DelegatingMethodAccessorImpl.invoke(DelegatingMethodAccessorImpl.java:43)
   [junit4]   2>         at java.lang.reflect.Method.invoke(Method.java:498)
   [junit4]   2>         at com.carrotsearch.randomizedtesting.RandomizedRunner.invoke(RandomizedRunner.java:1737)
   [junit4]   2>         at com.carrotsearch.randomizedtesting.RandomizedRunner$8.evaluate(RandomizedRunner.java:934)
   [junit4]   2>         at com.carrotsearch.randomizedtesting.RandomizedRunner$9.evaluate(RandomizedRunner.java:970)
   [junit4]   2>         at com.carrotsearch.randomizedtesting.RandomizedRunner$10.evaluate(RandomizedRunner.java:984)
   [junit4]   2>         at org.apache.lucene.util.TestRuleSetupTeardownChained$1.evaluate(TestRuleSetupTeardownChained.java:49)
   [junit4]   2>         at org.apache.lucene.util.AbstractBeforeAfterRule$1.evaluate(AbstractBeforeAfterRule.java:45)
   [junit4]   2>         at org.apache.lucene.util.TestRuleThreadAndTestName$1.evaluate(TestRuleThreadAndTestName.java:48)
   [junit4]   2>         at org.apache.lucene.util.TestRuleIgnoreAfterMaxFailures$1.evaluate(TestRuleIgnoreAfterMaxFailures.java:64)
   [junit4]   2>         at org.apache.lucene.util.TestRuleMarkFailure$1.evaluate(TestRuleMarkFailure.java:47)
   [junit4]   2>         at com.carrotsearch.randomizedtesting.rules.StatementAdapter.evaluate(StatementAdapter.java:36)
   [junit4]   2>         at com.carrotsearch.randomizedtesting.ThreadLeakControl$StatementRunner.run(ThreadLeakControl.java:368)
   [junit4]   2>         at com.carrotsearch.randomizedtesting.ThreadLeakControl.forkTimeoutingTask(ThreadLeakControl.java:817)
   [junit4]   2>         at com.carrotsearch.randomizedtesting.ThreadLeakControl$3.evaluate(ThreadLeakControl.java:468)
   [junit4]   2>         at com.carrotsearch.randomizedtesting.RandomizedRunner.runSingleTest(RandomizedRunner.java:943)
   [junit4]   2>         at com.carrotsearch.randomizedtesting.RandomizedRunner$5.evaluate(RandomizedRunner.java:829)
   [junit4]   2>         at com.carrotsearch.randomizedtesting.RandomizedRunner$6.evaluate(RandomizedRunner.java:879)
   [junit4]   2>         at com.carrotsearch.randomizedtesting.RandomizedRunner$7.evaluate(RandomizedRunner.java:890)
   [junit4]   2>         at org.apache.lucene.util.AbstractBeforeAfterRule$1.evaluate(AbstractBeforeAfterRule.java:45)
   [junit4]   2>         at com.carrotsearch.randomizedtesting.rules.StatementAdapter.evaluate(StatementAdapter.java:36)
   [junit4]   2>         at org.apache.lucene.util.TestRuleStoreClassName$1.evaluate(TestRuleStoreClassName.java:41)
   [junit4]   2>         at com.carrotsearch.randomizedtesting.rules.NoShadowingOrOverridesOnMethodsRule$1.evaluate(NoShadowingOrOverridesOnMethodsRule.java:40)
   [junit4]   2>         at com.carrotsearch.randomizedtesting.rules.NoShadowingOrOverridesOnMethodsRule$1.evaluate(NoShadowingOrOverridesOnMethodsRule.java:40)
   [junit4]   2>         at com.carrotsearch.randomizedtesting.rules.StatementAdapter.evaluate(StatementAdapter.java:36)
   [junit4]   2>         at com.carrotsearch.randomizedtesting.rules.StatementAdapter.evaluate(StatementAdapter.java:36)
   [junit4]   2>         at com.carrotsearch.randomizedtesting.rules.StatementAdapter.evaluate(StatementAdapter.java:36)
   [junit4]   2>         at org.apache.lucene.util.TestRuleAssertionsRequired$1.evaluate(TestRuleAssertionsRequired.java:53)
   [junit4]   2>         at org.apache.lucene.util.TestRuleMarkFailure$1.evaluate(TestRuleMarkFailure.java:47)
   [junit4]   2>         at org.apache.lucene.util.TestRuleIgnoreAfterMaxFailures$1.evaluate(TestRuleIgnoreAfterMaxFailures.java:64)
   [junit4]   2>         at org.apache.lucene.util.TestRuleIgnoreTestSuites$1.evaluate(TestRuleIgnoreTestSuites.java:54)
   [junit4]   2>         at com.carrotsearch.randomizedtesting.rules.StatementAdapter.evaluate(StatementAdapter.java:36)
   [junit4]   2>         at com.carrotsearch.randomizedtesting.ThreadLeakControl$StatementRunner.run(ThreadLeakControl.java:368)
   [junit4]   2>         at java.lang.Thread.run(Thread.java:748)
   [junit4]   2>    2) Thread[id=1, name=main, state=WAITING, group=main]
   [junit4]   2>         at java.lang.Object.wait(Native Method)
   [junit4]   2>         at java.lang.Thread.join(Thread.java:1252)
   [junit4]   2>         at java.lang.Thread.join(Thread.java:1326)
   [junit4]   2>         at com.carrotsearch.randomizedtesting.RandomizedRunner.runSuite(RandomizedRunner.java:636)
   [junit4]   2>         at com.carrotsearch.randomizedtesting.RandomizedRunner.run(RandomizedRunner.java:493)
   [junit4]   2>         at com.carrotsearch.ant.tasks.junit4.slave.SlaveMain.execute(SlaveMain.java:251)
   [junit4]   2>         at com.carrotsearch.ant.tasks.junit4.slave.SlaveMain.main(SlaveMain.java:368)
   [junit4]   2>         at com.carrotsearch.ant.tasks.junit4.slave.SlaveMainSafe.main(SlaveMainSafe.java:13)
   [junit4]   2>    3) Thread[id=17, name=SUITE-TestGeo3DPoint-seed#[7EEE99CF8C3E390F], state=RUNNABLE, group=TGRP-TestGeo3DPoint]
   [junit4]   2>         at java.lang.Thread.getStackTrace(Thread.java:1559)
   [junit4]   2>         at com.carrotsearch.randomizedtesting.ThreadLeakControl$4.run(ThreadLeakControl.java:696)
   [junit4]   2>         at com.carrotsearch.randomizedtesting.ThreadLeakControl$4.run(ThreadLeakControl.java:693)
   [junit4]   2>         at java.security.AccessController.doPrivileged(Native Method)
   [junit4]   2>         at com.carrotsearch.randomizedtesting.ThreadLeakControl.getStackTrace(ThreadLeakControl.java:693)
   [junit4]   2>         at com.carrotsearch.randomizedtesting.ThreadLeakControl.getThreadsWithTraces(ThreadLeakControl.java:709)
   [junit4]   2>         at com.carrotsearch.randomizedtesting.ThreadLeakControl.formatThreadStacksFull(ThreadLeakControl.java:689)
   [junit4]   2>         at com.carrotsearch.randomizedtesting.ThreadLeakControl.access$1000(ThreadLeakControl.java:65)
   [junit4]   2>         at com.carrotsearch.randomizedtesting.ThreadLeakControl$2.evaluate(ThreadLeakControl.java:415)
   [junit4]   2>         at com.carrotsearch.randomizedtesting.RandomizedRunner.runSuite(RandomizedRunner.java:705)
   [junit4]   2>         at com.carrotsearch.randomizedtesting.RandomizedRunner.access$200(RandomizedRunner.java:139)
   [junit4]   2>         at com.carrotsearch.randomizedtesting.RandomizedRunner$2.run(RandomizedRunner.java:626)
   [junit4]   2>    4) Thread[id=9, name=JUnit4-serializer-daemon, state=TIMED_WAITING, group=main]
   [junit4]   2>         at java.lang.Thread.sleep(Native Method)
   [junit4]   2>         at com.carrotsearch.ant.tasks.junit4.events.Serializer$1.run(Serializer.java:50)
   [junit4]   2> NOTE: download the large Jenkins line-docs file by running 'ant get-jenkins-line-docs' in the lucene directory.
   [junit4]   2> NOTE: reproduce with: ant test  -Dtestcase=TestGeo3DPoint -Dtests.method=testRandomBig -Dtests.seed=7EEE99CF8C3E390F -Dtests.multiplier=2 -Dtests.nightly=true -Dtests.slow=true -Dtests.linedocsfile=/home/jenkins/jenkins-slave/workspace/Lucene-Solr-NightlyTests-master/test-data/enwiki.random.lines.txt -Dtests.locale=es-PA -Dtests.timezone=America/Noronha -Dtests.asserts=true -Dtests.file.encoding=US-ASCII
   [junit4] ERROR   7161s J2 | TestGeo3DPoint.testRandomBig <<<
   [junit4]    > Throwable #1: java.lang.Exception: Test abandoned because suite timeout was reached.
   [junit4]    > 	at __randomizedtesting.SeedInfo.seed([7EEE99CF8C3E390F]:0)
   [junit4]   2> oct 03, 2017 3:03:47 AM com.carrotsearch.randomizedtesting.ThreadLeakControl checkThreadLeaks
   [junit4]   2> WARNING: Will linger awaiting termination of 1 leaked thread(s).
   [junit4]   2> oct 03, 2017 3:04:07 AM com.carrotsearch.randomizedtesting.ThreadLeakControl checkThreadLeaks
   [junit4]   2> SEVERE: 1 thread leaked from SUITE scope at org.apache.lucene.spatial3d.TestGeo3DPoint: 
   [junit4]   2>    1) Thread[id=18, name=TEST-TestGeo3DPoint.testRandomBig-seed#[7EEE99CF8C3E390F], state=RUNNABLE, group=TGRP-TestGeo3DPoint]
   [junit4]   2>         at java.util.HashMap.getNode(HashMap.java:580)
   [junit4]   2>         at java.util.HashMap.containsKey(HashMap.java:595)
   [junit4]   2>         at java.util.HashSet.contains(HashSet.java:203)
   [junit4]   2>         at org.apache.lucene.spatial3d.TestGeo3DPoint.verify(TestGeo3DPoint.java:849)
   [junit4]   2>         at org.apache.lucene.spatial3d.TestGeo3DPoint.doTestRandom(TestGeo3DPoint.java:548)
   [junit4]   2>         at org.apache.lucene.spatial3d.TestGeo3DPoint.testRandomBig(TestGeo3DPoint.java:480)
   [junit4]   2>         at sun.reflect.NativeMethodAccessorImpl.invoke0(Native Method)
   [junit4]   2>         at sun.reflect.NativeMethodAccessorImpl.invoke(NativeMethodAccessorImpl.java:62)
   [junit4]   2>         at sun.reflect.DelegatingMethodAccessorImpl.invoke(DelegatingMethodAccessorImpl.java:43)
   [junit4]   2>         at java.lang.reflect.Method.invoke(Method.java:498)
   [junit4]   2>         at com.carrotsearch.randomizedtesting.RandomizedRunner.invoke(RandomizedRunner.java:1737)
   [junit4]   2>         at com.carrotsearch.randomizedtesting.RandomizedRunner$8.evaluate(RandomizedRunner.java:934)
   [junit4]   2>         at com.carrotsearch.randomizedtesting.RandomizedRunner$9.evaluate(RandomizedRunner.java:970)
   [junit4]   2>         at com.carrotsearch.randomizedtesting.RandomizedRunner$10.evaluate(RandomizedRunner.java:984)
   [junit4]   2>         at org.apache.lucene.util.TestRuleSetupTeardownChained$1.evaluate(TestRuleSetupTeardownChained.java:49)
   [junit4]   2>         at org.apache.lucene.util.AbstractBeforeAfterRule$1.evaluate(AbstractBeforeAfterRule.java:45)
   [junit4]   2>         at org.apache.lucene.util.TestRuleThreadAndTestName$1.evaluate(TestRuleThreadAndTestName.java:48)
   [junit4]   2>         at org.apache.lucene.util.TestRuleIgnoreAfterMaxFailures$1.evaluate(TestRuleIgnoreAfterMaxFailures.java:64)
   [junit4]   2>         at org.apache.lucene.util.TestRuleMarkFailure$1.evaluate(TestRuleMarkFailure.java:47)
   [junit4]   2>         at com.carrotsearch.randomizedtesting.rules.StatementAdapter.evaluate(StatementAdapter.java:36)
   [junit4]   2>         at com.carrotsearch.randomizedtesting.ThreadLeakControl$StatementRunner.run(ThreadLeakControl.java:368)
   [junit4]   2>         at com.carrotsearch.randomizedtesting.ThreadLeakControl.forkTimeoutingTask(ThreadLeakControl.java:817)
   [junit4]   2>         at com.carrotsearch.randomizedtesting.ThreadLeakControl$3.evaluate(ThreadLeakControl.java:468)
   [junit4]   2>         at com.carrotsearch.randomizedtesting.RandomizedRunner.runSingleTest(RandomizedRunner.java:943)
   [junit4]   2>         at com.carrotsearch.randomizedtesting.RandomizedRunner$5.evaluate(RandomizedRunner.java:829)
   [junit4]   2>         at com.carrotsearch.randomizedtesting.RandomizedRunner$6.evaluate(RandomizedRunner.java:879)
   [junit4]   2>         at com.carrotsearch.randomizedtesting.RandomizedRunner$7.evaluate(RandomizedRunner.java:890)
   [junit4]   2>         at org.apache.lucene.util.AbstractBeforeAfterRule$1.evaluate(AbstractBeforeAfterRule.java:45)
   [junit4]   2>         at com.carrotsearch.randomizedtesting.rules.StatementAdapter.evaluate(StatementAdapter.java:36)
   [junit4]   2>         at org.apache.lucene.util.TestRuleStoreClassName$1.evaluate(TestRuleStoreClassName.java:41)
   [junit4]   2>         at com.carrotsearch.randomizedtesting.rules.NoShadowingOrOverridesOnMethodsRule$1.evaluate(NoShadowingOrOverridesOnMethodsRule.java:40)
   [junit4]   2>         at com.carrotsearch.randomizedtesting.rules.NoShadowingOrOverridesOnMethodsRule$1.evaluate(NoShadowingOrOverridesOnMethodsRule.java:40)
   [junit4]   2>         at com.carrotsearch.randomizedtesting.rules.StatementAdapter.evaluate(StatementAdapter.java:36)
   [junit4]   2>         at com.carrotsearch.randomizedtesting.rules.StatementAdapter.evaluate(StatementAdapter.java:36)
   [junit4]   2>         at com.carrotsearch.randomizedtesting.rules.StatementAdapter.evaluate(StatementAdapter.java:36)
   [junit4]   2>         at org.apache.lucene.util.TestRuleAssertionsRequired$1.evaluate(TestRuleAssertionsRequired.java:53)
   [junit4]   2>         at org.apache.lucene.util.TestRuleMarkFailure$1.evaluate(TestRuleMarkFailure.java:47)
   [junit4]   2>         at org.apache.lucene.util.TestRuleIgnoreAfterMaxFailures$1.evaluate(TestRuleIgnoreAfterMaxFailures.java:64)
   [junit4]   2>         at org.apache.lucene.util.TestRuleIgnoreTestSuites$1.evaluate(TestRuleIgnoreTestSuites.java:54)
   [junit4]   2>         at com.carrotsearch.randomizedtesting.rules.StatementAdapter.evaluate(StatementAdapter.java:36)
   [junit4]   2>         at com.carrotsearch.randomizedtesting.ThreadLeakControl$StatementRunner.run(ThreadLeakControl.java:368)
   [junit4]   2>         at java.lang.Thread.run(Thread.java:748)
   [junit4]   2> oct 03, 2017 3:04:07 AM com.carrotsearch.randomizedtesting.ThreadLeakControl tryToInterruptAll
   [junit4]   2> INFO: Starting to interrupt leaked threads:
   [junit4]   2>    1) Thread[id=18, name=TEST-TestGeo3DPoint.testRandomBig-seed#[7EEE99CF8C3E390F], state=RUNNABLE, group=TGRP-TestGeo3DPoint]
   [junit4]   2> NOTE: leaving temporary files on disk at: /home/jenkins/jenkins-slave/workspace/Lucene-Solr-NightlyTests-master/checkout/lucene/build/spatial3d/test/J2/temp/lucene.spatial3d.TestGeo3DPoint_7EEE99CF8C3E390F-001
   [junit4]   2> Oct 03, 2017 5:04:07 AM com.carrotsearch.randomizedtesting.ThreadLeakControl tryToInterruptAll
   [junit4]   2> INFO: All leaked threads terminated.
   [junit4]   2> NOTE: test params are: codec=Lucene70, sim=RandomSimilarity(queryNorm=false): {}, locale=es-PA, timezone=America/Noronha
   [junit4]   2> NOTE: Linux 4.4.0-83-generic amd64/Oracle Corporation 1.8.0_144 (64-bit)/cpus=4,threads=1,free=205926752,total=517472256
   [junit4]   2> NOTE: All tests run in this JVM: [GeoPointTest, XYZSolidTest, TestGeo3DDocValues, TestGeo3DPoint]
   [junit4]   2> NOTE: download the large Jenkins line-docs file by running 'ant get-jenkins-line-docs' in the lucene directory.
   [junit4]   2> NOTE: reproduce with: ant test  -Dtestcase=TestGeo3DPoint -Dtests.seed=7EEE99CF8C3E390F -Dtests.multiplier=2 -Dtests.nightly=true -Dtests.slow=true -Dtests.linedocsfile=/home/jenkins/jenkins-slave/workspace/Lucene-Solr-NightlyTests-master/test-data/enwiki.random.lines.txt -Dtests.locale=es-PA -Dtests.timezone=America/Noronha -Dtests.asserts=true -Dtests.file.encoding=US-ASCII
   [junit4] ERROR   0.00s J2 | TestGeo3DPoint (suite) <<<
   [junit4]    > Throwable #1: java.lang.Exception: Suite timeout exceeded (>= 7200000 msec).
   [junit4]    > 	at __randomizedtesting.SeedInfo.seed([7EEE99CF8C3E390F]:0)
   [junit4] Completed [15/15 (1!)] on J2 in 7220.87s, 5 tests, 2 errors <<< FAILURES!

[...truncated 2541 lines...]
   [junit4] Suite: org.apache.solr.cloud.TestCollectionsAPIViaSolrCloudCluster
   [junit4]   2> Creating dataDir: /home/jenkins/jenkins-slave/workspace/Lucene-Solr-NightlyTests-master/checkout/solr/build/solr-core/test/J2/temp/solr.cloud.TestCollectionsAPIViaSolrCloudCluster_2E0EDC8B5614DAF5-001/init-core-data-001
   [junit4]   2> 3923799 WARN  (SUITE-TestCollectionsAPIViaSolrCloudCluster-seed#[2E0EDC8B5614DAF5]-worker) [    ] o.a.s.SolrTestCase

[...truncated too long message...]

.solrj.impl.HttpSolrClient.request(HttpSolrClient.java:242)
   [junit4]    > 	at org.apache.solr.client.solrj.impl.LBHttpSolrClient.doRequest(LBHttpSolrClient.java:483)
   [junit4]    > 	at org.apache.solr.client.solrj.impl.LBHttpSolrClient.request(LBHttpSolrClient.java:413)
   [junit4]    > 	... 51 more
   [junit4]   2> 10671646 WARN  (SUITE-SharedFSAutoReplicaFailoverTest-seed#[2E0EDC8B5614DAF5]-worker) [    ] o.a.h.h.s.d.DirectoryScanner DirectoryScanner: shutdown has been called
   [junit4]   2> 10672246 INFO  (SUITE-SharedFSAutoReplicaFailoverTest-seed#[2E0EDC8B5614DAF5]-worker) [    ] o.m.log Stopped HttpServer2$SelectChannelConnectorWithSafeStartup@localhost:0
   [junit4]   2> 10672317 WARN  (2120041076@qtp-377701981-1 - Acceptor0 HttpServer2$SelectChannelConnectorWithSafeStartup@localhost:33793) [    ] o.a.h.h.HttpServer2 HttpServer Acceptor: isRunning is false. Rechecking.
   [junit4]   2> 10672318 WARN  (2120041076@qtp-377701981-1 - Acceptor0 HttpServer2$SelectChannelConnectorWithSafeStartup@localhost:33793) [    ] o.a.h.h.HttpServer2 HttpServer Acceptor: isRunning is false
   [junit4]   2> 10672371 WARN  (DataNode: [[[DISK]file:/home/jenkins/jenkins-slave/workspace/Lucene-Solr-NightlyTests-master/checkout/solr/build/solr-core/test/J1/temp/solr.cloud.SharedFSAutoReplicaFailoverTest_2E0EDC8B5614DAF5-001/tempDir-001/hdfsBaseDir/data/data3/, [DISK]file:/home/jenkins/jenkins-slave/workspace/Lucene-Solr-NightlyTests-master/checkout/solr/build/solr-core/test/J1/temp/solr.cloud.SharedFSAutoReplicaFailoverTest_2E0EDC8B5614DAF5-001/tempDir-001/hdfsBaseDir/data/data4/]]  heartbeating to lucene2-us-west.apache.org/127.0.0.1:40113) [    ] o.a.h.h.s.d.IncrementalBlockReportManager IncrementalBlockReportManager interrupted
   [junit4]   2> 10672371 WARN  (DataNode: [[[DISK]file:/home/jenkins/jenkins-slave/workspace/Lucene-Solr-NightlyTests-master/checkout/solr/build/solr-core/test/J1/temp/solr.cloud.SharedFSAutoReplicaFailoverTest_2E0EDC8B5614DAF5-001/tempDir-001/hdfsBaseDir/data/data3/, [DISK]file:/home/jenkins/jenkins-slave/workspace/Lucene-Solr-NightlyTests-master/checkout/solr/build/solr-core/test/J1/temp/solr.cloud.SharedFSAutoReplicaFailoverTest_2E0EDC8B5614DAF5-001/tempDir-001/hdfsBaseDir/data/data4/]]  heartbeating to lucene2-us-west.apache.org/127.0.0.1:40113) [    ] o.a.h.h.s.d.DataNode Ending block pool service for: Block pool BP-1454115979-127.0.0.1-1507018175283 (Datanode Uuid e6e7a4e3-595c-4b6d-83a8-771b358e3c25) service to lucene2-us-west.apache.org/127.0.0.1:40113
   [junit4]   2> 10672391 WARN  (SUITE-SharedFSAutoReplicaFailoverTest-seed#[2E0EDC8B5614DAF5]-worker) [    ] o.a.h.h.s.d.DirectoryScanner DirectoryScanner: shutdown has been called
   [junit4]   2> 10672778 INFO  (SUITE-SharedFSAutoReplicaFailoverTest-seed#[2E0EDC8B5614DAF5]-worker) [    ] o.m.log Stopped HttpServer2$SelectChannelConnectorWithSafeStartup@localhost:0
   [junit4]   2> 10672825 WARN  (DataNode: [[[DISK]file:/home/jenkins/jenkins-slave/workspace/Lucene-Solr-NightlyTests-master/checkout/solr/build/solr-core/test/J1/temp/solr.cloud.SharedFSAutoReplicaFailoverTest_2E0EDC8B5614DAF5-001/tempDir-001/hdfsBaseDir/data/data1/, [DISK]file:/home/jenkins/jenkins-slave/workspace/Lucene-Solr-NightlyTests-master/checkout/solr/build/solr-core/test/J1/temp/solr.cloud.SharedFSAutoReplicaFailoverTest_2E0EDC8B5614DAF5-001/tempDir-001/hdfsBaseDir/data/data2/]]  heartbeating to lucene2-us-west.apache.org/127.0.0.1:40113) [    ] o.a.h.h.s.d.DataNode Ending block pool service for: Block pool BP-1454115979-127.0.0.1-1507018175283 (Datanode Uuid 834c687e-ca7c-4505-a6a2-61a859ed8aca) service to lucene2-us-west.apache.org/127.0.0.1:40113
   [junit4]   2> 10673173 INFO  (SUITE-SharedFSAutoReplicaFailoverTest-seed#[2E0EDC8B5614DAF5]-worker) [    ] o.m.log Stopped HttpServer2$SelectChannelConnectorWithSafeStartup@lucene2-us-west.apache.org:0
   [junit4]   2> NOTE: leaving temporary files on disk at: /home/jenkins/jenkins-slave/workspace/Lucene-Solr-NightlyTests-master/checkout/solr/build/solr-core/test/J1/temp/solr.cloud.SharedFSAutoReplicaFailoverTest_2E0EDC8B5614DAF5-001
   [junit4]   2> Oct 03, 2017 8:12:20 AM com.carrotsearch.randomizedtesting.ThreadLeakControl checkThreadLeaks
   [junit4]   2> WARNING: Will linger awaiting termination of 34 leaked thread(s).
   [junit4]   2> NOTE: test params are: codec=Asserting(Lucene70): {id=PostingsFormat(name=LuceneVarGapFixedInterval), text=PostingsFormat(name=LuceneFixedGap)}, docValues:{_version_=DocValuesFormat(name=Asserting)}, maxPointsInLeafNode=559, maxMBSortInHeap=6.758935922879759, sim=RandomSimilarity(queryNorm=false): {}, locale=mk, timezone=Africa/Niamey
   [junit4]   2> NOTE: Linux 4.4.0-83-generic amd64/Oracle Corporation 1.8.0_144 (64-bit)/cpus=4,threads=2,free=255699992,total=522190848
   [junit4]   2> NOTE: All tests run in this JVM: [MoveReplicaHDFSUlogDirTest, MergeStrategyTest, TestZkAclsWithHadoopAuth, TestDefaultStatsCache, TestPivotHelperCode, BlockJoinFacetRandomTest, TestSizeLimitedDistributedMap, TestPolicyCloud, TestReRankQParserPlugin, TestSolrConfigHandlerCloud, RulesTest, TestManagedSchema, DeleteStatusTest, TermVectorComponentTest, TestReplicaProperties, TestBlendedInfixSuggestions, CoreAdminHandlerTest, TestDocTermOrds, RecoveryAfterSoftCommitTest, DirectoryFactoryTest, TestFiltering, TestFieldTypeCollectionResource, TestRetrieveFieldsOptimizer, TestRestoreCore, TestPushWriter, TestCloudJSONFacetJoinDomain, DOMUtilTest, JsonLoaderTest, HdfsRestartWhileUpdatingTest, DistributedFacetPivotLargeTest, ConjunctionSolrSpellCheckerTest, SegmentsInfoRequestHandlerTest, AnalysisAfterCoreReloadTest, SuggesterTSTTest, TestRandomFlRTGCloud, TestSearcherReuse, TestLegacyField, TestSimpleTrackingShardHandler, TestDynamicFieldResource, TestSweetSpotSimilarityFactory, TestLeaderElectionZkExpiry, TestBM25SimilarityFactory, BadComponentTest, CollectionsAPIAsyncDistributedZkTest, TestXmlQParser, SimpleMLTQParserTest, TestQueryWrapperFilter, TestAddFieldRealTimeGet, StatelessScriptUpdateProcessorFactoryTest, ZkStateWriterTest, ResourceLoaderTest, HdfsTlogReplayBufferedWhileIndexingTest, DocValuesTest, SoftAutoCommitTest, SolrShardReporterTest, AlternateDirectoryTest, TestSystemIdResolver, BasicFunctionalityTest, ManagedSchemaRoundRobinCloudTest, TestStressLiveNodes, HdfsChaosMonkeyNothingIsSafeTest, TestCollectionAPI, TestFilteredDocIdSet, CollectionsAPIDistributedZkTest, TestStressVersions, TestJettySolrRunner, TestMissingGroups, TestNRTOpen, TestManagedSynonymFilterFactory, TestComplexPhraseQParserPlugin, TestExactStatsCache, TestManagedResource, VMParamsZkACLAndCredentialsProvidersTest, TestValueSourceCache, TestConfigSetsAPIExclusivity, TestFuzzyAnalyzedSuggestions, HighlighterMaxOffsetTest, ZkSolrClientTest, DateRangeFieldTest, TestMacros, CoreAdminRequestStatusTest, TestDeleteCollectionOnDownNodes, TestSimpleTextCodec, TestTestInjection, TestPKIAuthenticationPlugin, TestInitQParser, SolrCLIZkUtilsTest, DirectSolrConnectionTest, TestPrepRecovery, StressHdfsTest, CdcrReplicationDistributedZkTest, SpellCheckComponentTest, TestScoreJoinQPScore, TestEmbeddedSolrServerAdminHandler, TestPerFieldSimilarity, TestNonDefinedSimilarityFactory, TestPointFields, DocValuesNotIndexedTest, LoggingHandlerTest, TestRTGBase, TestUpdate, SOLR749Test, TestTolerantUpdateProcessorRandomCloud, TestBinaryResponseWriter, QueryParsingTest, TestLRUCache, TestDelegationWithHadoopAuth, TestSolr4Spatial2, ShardRoutingCustomTest, TestCloudRecovery, SolrCmdDistributorTest, DisMaxRequestHandlerTest, NodeMutatorTest, BufferStoreTest, TestConfigSetImmutable, JvmMetricsTest, ZkCLITest, NoCacheHeaderTest, TestCloudSchemaless, V2ApiIntegrationTest, TestFieldCacheWithThreads, SolrMetricManagerTest, AutoCommitTest, TestDistributedGrouping, TestRecovery, DistributedSpellCheckComponentTest, ZkControllerTest, TestRealTimeGet, HardAutoCommitTest, TestCoreContainer, SimpleFacetsTest, TestGroupingSearch, BadIndexSchemaTest, TestSort, DirectUpdateHandlerTest, TestIndexSearcher, HighlighterTest, SolrIndexSplitterTest, TestCoreDiscovery, TestFoldingMultitermQuery, SpatialFilterTest, SchemaVersionSpecificBehaviorTest, SortByFunctionTest, TestSolrDeletionPolicy1, XsltUpdateRequestHandlerTest, LukeRequestHandlerTest, TestIndexingPerformance, FieldAnalysisRequestHandlerTest, FastVectorHighlighterTest, IndexSchemaRuntimeFieldTest, IndexSchemaTest, UpdateRequestProcessorFactoryTest, UniqFieldsUpdateProcessorFactoryTest, CSVRequestHandlerTest, CopyFieldTest, TestSolrDeletionPolicy2, SampleTest, TestBinaryField, TestSearchPerf, TestElisionMultitermQuery, TestPostingsSolrHighlighter, TestCharFilters, TestXIncludeConfig, TestFastWriter, TestFastOutputStream, URLClassifyProcessorTest, TestFastLRUCache, PrimUtilsTest, ClusterStateTest, TestUtils, SystemInfoHandlerTest, UUIDFieldTest, CircularListTest, DistributedMLTComponentTest, SolrTestCaseJ4Test, TestCursorMarkWithoutUniqueKey, TestDistributedMissingSort, TestHighlightDedupGrouping, TestTolerantSearch, TestLuceneIndexBackCompat, TestEmbeddedSolrServerConstructors, TestEmbeddedSolrServerSchemaAPI, ConnectionReuseTest, AliasIntegrationTest, AssignTest, AsyncCallRequestStatusResponseTest, CdcrBootstrapTest, CloudExitableDirectoryReaderTest, CollectionReloadTest, CollectionTooManyReplicasTest, ConcurrentDeleteAndCreateCollectionTest, ConfigSetsAPITest, DeleteInactiveReplicaTest, DeleteLastCustomShardedReplicaTest, DeleteNodeTest, DeleteReplicaTest, DistribDocExpirationUpdateProcessorTest, DistribJoinFromCollectionTest, DistributedQueueTest, DistributedVersionInfoTest, HealthCheckHandlerTest, HttpPartitionTest, MissingSegmentRecoveryTest, MoveReplicaTest, OutOfBoxZkACLAndCredentialsProvidersTest, OverriddenZkACLAndCredentialsProvidersTest, OverseerCollectionConfigSetProcessorTest, OverseerRolesTest, OverseerTaskQueueTest, ReplaceNodeTest, SaslZkACLProviderTest, SharedFSAutoReplicaFailoverTest]
   [junit4] Completed [549/734 (5!)] on J1 in 173.69s, 1 test, 1 error <<< FAILURES!

[...truncated 47532 lines...]

Mime
View raw message