lucene-dev mailing list archives

Site index · List index
Message view « Date » · « Thread »
Top « Date » · « Thread »
From Policeman Jenkins Server <jenk...@thetaphi.de>
Subject [JENKINS] Lucene-Solr-7.x-Solaris (64bit/jdk1.8.0) - Build # 253 - Still Unstable!
Date Fri, 20 Oct 2017 06:43:30 GMT
Build: https://jenkins.thetaphi.de/job/Lucene-Solr-7.x-Solaris/253/
Java: 64bit/jdk1.8.0 -XX:-UseCompressedOops -XX:+UseSerialGC

1 tests failed.
FAILED:  junit.framework.TestSuite.org.apache.solr.cloud.TestSolrCloudWithSecureImpersonation

Error Message:
2 threads leaked from SUITE scope at org.apache.solr.cloud.TestSolrCloudWithSecureImpersonation:     1) Thread[id=11721, name=jetty-launcher-1627-thread-1-EventThread, state=TIMED_WAITING, group=TGRP-TestSolrCloudWithSecureImpersonation]         at sun.misc.Unsafe.park(Native Method)         at java.util.concurrent.locks.LockSupport.parkNanos(LockSupport.java:215)         at java.util.concurrent.locks.AbstractQueuedSynchronizer.doAcquireSharedNanos(AbstractQueuedSynchronizer.java:1037)         at java.util.concurrent.locks.AbstractQueuedSynchronizer.tryAcquireSharedNanos(AbstractQueuedSynchronizer.java:1328)         at java.util.concurrent.CountDownLatch.await(CountDownLatch.java:277)         at org.apache.curator.CuratorZookeeperClient.internalBlockUntilConnectedOrTimedOut(CuratorZookeeperClient.java:323)         at org.apache.curator.RetryLoop.callWithRetry(RetryLoop.java:105)         at org.apache.curator.framework.imps.GetDataBuilderImpl.pathInForeground(GetDataBuilderImpl.java:288)         at org.apache.curator.framework.imps.GetDataBuilderImpl.forPath(GetDataBuilderImpl.java:279)         at org.apache.curator.framework.imps.GetDataBuilderImpl.forPath(GetDataBuilderImpl.java:41)         at org.apache.curator.framework.recipes.shared.SharedValue.readValue(SharedValue.java:244)         at org.apache.curator.framework.recipes.shared.SharedValue.access$100(SharedValue.java:44)         at org.apache.curator.framework.recipes.shared.SharedValue$1.process(SharedValue.java:61)         at org.apache.curator.framework.imps.NamespaceWatcher.process(NamespaceWatcher.java:67)         at org.apache.zookeeper.ClientCnxn$EventThread.processEvent(ClientCnxn.java:530)         at org.apache.zookeeper.ClientCnxn$EventThread.run(ClientCnxn.java:505)    2) Thread[id=11722, name=jetty-launcher-1627-thread-2-EventThread, state=TIMED_WAITING, group=TGRP-TestSolrCloudWithSecureImpersonation]         at sun.misc.Unsafe.park(Native Method)         at java.util.concurrent.locks.LockSupport.parkNanos(LockSupport.java:215)         at java.util.concurrent.locks.AbstractQueuedSynchronizer.doAcquireSharedNanos(AbstractQueuedSynchronizer.java:1037)         at java.util.concurrent.locks.AbstractQueuedSynchronizer.tryAcquireSharedNanos(AbstractQueuedSynchronizer.java:1328)         at java.util.concurrent.CountDownLatch.await(CountDownLatch.java:277)         at org.apache.curator.CuratorZookeeperClient.internalBlockUntilConnectedOrTimedOut(CuratorZookeeperClient.java:323)         at org.apache.curator.RetryLoop.callWithRetry(RetryLoop.java:105)         at org.apache.curator.framework.imps.GetDataBuilderImpl.pathInForeground(GetDataBuilderImpl.java:288)         at org.apache.curator.framework.imps.GetDataBuilderImpl.forPath(GetDataBuilderImpl.java:279)         at org.apache.curator.framework.imps.GetDataBuilderImpl.forPath(GetDataBuilderImpl.java:41)         at org.apache.curator.framework.recipes.shared.SharedValue.readValue(SharedValue.java:244)         at org.apache.curator.framework.recipes.shared.SharedValue.access$100(SharedValue.java:44)         at org.apache.curator.framework.recipes.shared.SharedValue$1.process(SharedValue.java:61)         at org.apache.curator.framework.imps.NamespaceWatcher.process(NamespaceWatcher.java:67)         at org.apache.zookeeper.ClientCnxn$EventThread.processEvent(ClientCnxn.java:530)         at org.apache.zookeeper.ClientCnxn$EventThread.run(ClientCnxn.java:505)

Stack Trace:
com.carrotsearch.randomizedtesting.ThreadLeakError: 2 threads leaked from SUITE scope at org.apache.solr.cloud.TestSolrCloudWithSecureImpersonation: 
   1) Thread[id=11721, name=jetty-launcher-1627-thread-1-EventThread, state=TIMED_WAITING, group=TGRP-TestSolrCloudWithSecureImpersonation]
        at sun.misc.Unsafe.park(Native Method)
        at java.util.concurrent.locks.LockSupport.parkNanos(LockSupport.java:215)
        at java.util.concurrent.locks.AbstractQueuedSynchronizer.doAcquireSharedNanos(AbstractQueuedSynchronizer.java:1037)
        at java.util.concurrent.locks.AbstractQueuedSynchronizer.tryAcquireSharedNanos(AbstractQueuedSynchronizer.java:1328)
        at java.util.concurrent.CountDownLatch.await(CountDownLatch.java:277)
        at org.apache.curator.CuratorZookeeperClient.internalBlockUntilConnectedOrTimedOut(CuratorZookeeperClient.java:323)
        at org.apache.curator.RetryLoop.callWithRetry(RetryLoop.java:105)
        at org.apache.curator.framework.imps.GetDataBuilderImpl.pathInForeground(GetDataBuilderImpl.java:288)
        at org.apache.curator.framework.imps.GetDataBuilderImpl.forPath(GetDataBuilderImpl.java:279)
        at org.apache.curator.framework.imps.GetDataBuilderImpl.forPath(GetDataBuilderImpl.java:41)
        at org.apache.curator.framework.recipes.shared.SharedValue.readValue(SharedValue.java:244)
        at org.apache.curator.framework.recipes.shared.SharedValue.access$100(SharedValue.java:44)
        at org.apache.curator.framework.recipes.shared.SharedValue$1.process(SharedValue.java:61)
        at org.apache.curator.framework.imps.NamespaceWatcher.process(NamespaceWatcher.java:67)
        at org.apache.zookeeper.ClientCnxn$EventThread.processEvent(ClientCnxn.java:530)
        at org.apache.zookeeper.ClientCnxn$EventThread.run(ClientCnxn.java:505)
   2) Thread[id=11722, name=jetty-launcher-1627-thread-2-EventThread, state=TIMED_WAITING, group=TGRP-TestSolrCloudWithSecureImpersonation]
        at sun.misc.Unsafe.park(Native Method)
        at java.util.concurrent.locks.LockSupport.parkNanos(LockSupport.java:215)
        at java.util.concurrent.locks.AbstractQueuedSynchronizer.doAcquireSharedNanos(AbstractQueuedSynchronizer.java:1037)
        at java.util.concurrent.locks.AbstractQueuedSynchronizer.tryAcquireSharedNanos(AbstractQueuedSynchronizer.java:1328)
        at java.util.concurrent.CountDownLatch.await(CountDownLatch.java:277)
        at org.apache.curator.CuratorZookeeperClient.internalBlockUntilConnectedOrTimedOut(CuratorZookeeperClient.java:323)
        at org.apache.curator.RetryLoop.callWithRetry(RetryLoop.java:105)
        at org.apache.curator.framework.imps.GetDataBuilderImpl.pathInForeground(GetDataBuilderImpl.java:288)
        at org.apache.curator.framework.imps.GetDataBuilderImpl.forPath(GetDataBuilderImpl.java:279)
        at org.apache.curator.framework.imps.GetDataBuilderImpl.forPath(GetDataBuilderImpl.java:41)
        at org.apache.curator.framework.recipes.shared.SharedValue.readValue(SharedValue.java:244)
        at org.apache.curator.framework.recipes.shared.SharedValue.access$100(SharedValue.java:44)
        at org.apache.curator.framework.recipes.shared.SharedValue$1.process(SharedValue.java:61)
        at org.apache.curator.framework.imps.NamespaceWatcher.process(NamespaceWatcher.java:67)
        at org.apache.zookeeper.ClientCnxn$EventThread.processEvent(ClientCnxn.java:530)
        at org.apache.zookeeper.ClientCnxn$EventThread.run(ClientCnxn.java:505)
	at __randomizedtesting.SeedInfo.seed([C5F18D7E77876671]:0)




Build Log:
[...truncated 12426 lines...]
   [junit4] Suite: org.apache.solr.cloud.TestSolrCloudWithSecureImpersonation
   [junit4]   2> 1430834 INFO  (SUITE-TestSolrCloudWithSecureImpersonation-seed#[C5F18D7E77876671]-worker) [    ] o.a.s.SolrTestCaseJ4 SecureRandom sanity checks: test.solr.allowed.securerandom=null & java.security.egd=file:/dev/./urandom
   [junit4]   2> Creating dataDir: /export/home/jenkins/workspace/Lucene-Solr-7.x-Solaris/solr/build/solr-core/test/J1/temp/solr.cloud.TestSolrCloudWithSecureImpersonation_C5F18D7E77876671-001/init-core-data-001
   [junit4]   2> 1430835 INFO  (SUITE-TestSolrCloudWithSecureImpersonation-seed#[C5F18D7E77876671]-worker) [    ] o.a.s.SolrTestCaseJ4 Using PointFields (NUMERIC_POINTS_SYSPROP=true) w/NUMERIC_DOCVALUES_SYSPROP=true
   [junit4]   2> 1430836 INFO  (SUITE-TestSolrCloudWithSecureImpersonation-seed#[C5F18D7E77876671]-worker) [    ] o.a.s.SolrTestCaseJ4 Randomized ssl (false) and clientAuth (true) via: @org.apache.solr.util.RandomizeSSL(reason=, value=NaN, ssl=NaN, clientAuth=NaN)
   [junit4]   2> 1430898 WARN  (SUITE-TestSolrCloudWithSecureImpersonation-seed#[C5F18D7E77876671]-worker) [    ] o.a.h.u.NativeCodeLoader Unable to load native-hadoop library for your platform... using builtin-java classes where applicable
   [junit4]   2> 1431098 INFO  (SUITE-TestSolrCloudWithSecureImpersonation-seed#[C5F18D7E77876671]-worker) [    ] o.a.s.c.MiniSolrCloudCluster Starting cluster of 2 servers in /export/home/jenkins/workspace/Lucene-Solr-7.x-Solaris/solr/build/solr-core/test/J1/temp/solr.cloud.TestSolrCloudWithSecureImpersonation_C5F18D7E77876671-001/tempDir-001
   [junit4]   2> 1431099 INFO  (SUITE-TestSolrCloudWithSecureImpersonation-seed#[C5F18D7E77876671]-worker) [    ] o.a.s.c.ZkTestServer STARTING ZK TEST SERVER
   [junit4]   2> 1431099 INFO  (Thread-2091) [    ] o.a.s.c.ZkTestServer client port:0.0.0.0/0.0.0.0:0
   [junit4]   2> 1431099 INFO  (Thread-2091) [    ] o.a.s.c.ZkTestServer Starting server
   [junit4]   2> 1431104 ERROR (Thread-2091) [    ] o.a.z.s.ZooKeeperServer ZKShutdownHandler is not registered, so ZooKeeper server won't take any action on ERROR or SHUTDOWN server state changes
   [junit4]   2> 1431199 INFO  (SUITE-TestSolrCloudWithSecureImpersonation-seed#[C5F18D7E77876671]-worker) [    ] o.a.s.c.ZkTestServer start zk server on port:61300
   [junit4]   2> 1431225 INFO  (jetty-launcher-1627-thread-1) [    ] o.e.j.s.Server jetty-9.3.20.v20170531
   [junit4]   2> 1431228 INFO  (jetty-launcher-1627-thread-1) [    ] o.e.j.s.h.ContextHandler Started o.e.j.s.ServletContextHandler@682e51a9{/solr,null,AVAILABLE}
   [junit4]   2> 1431230 INFO  (jetty-launcher-1627-thread-1) [    ] o.e.j.s.AbstractConnector Started ServerConnector@5ae0e368{HTTP/1.1,[http/1.1]}{127.0.0.1:45720}
   [junit4]   2> 1431230 INFO  (jetty-launcher-1627-thread-1) [    ] o.e.j.s.Server Started @1433569ms
   [junit4]   2> 1431230 INFO  (jetty-launcher-1627-thread-1) [    ] o.a.s.c.s.e.JettySolrRunner Jetty properties: {hostContext=/solr, hostPort=45720}
   [junit4]   2> 1431230 ERROR (jetty-launcher-1627-thread-1) [    ] o.a.s.u.StartupLoggingUtils Missing Java Option solr.log.dir. Logging may be missing or incomplete.
   [junit4]   2> 1431230 INFO  (jetty-launcher-1627-thread-1) [    ] o.a.s.s.SolrDispatchFilter  ___      _       Welcome to Apache Solr™ version 7.2.0
   [junit4]   2> 1431230 INFO  (jetty-launcher-1627-thread-1) [    ] o.a.s.s.SolrDispatchFilter / __| ___| |_ _   Starting in cloud mode on port null
   [junit4]   2> 1431230 INFO  (jetty-launcher-1627-thread-1) [    ] o.a.s.s.SolrDispatchFilter \__ \/ _ \ | '_|  Install dir: null, Default config dir: null
   [junit4]   2> 1431230 INFO  (jetty-launcher-1627-thread-1) [    ] o.a.s.s.SolrDispatchFilter |___/\___/_|_|    Start time: 2017-10-20T05:40:34.494Z
   [junit4]   2> 1431282 INFO  (jetty-launcher-1627-thread-2) [    ] o.e.j.s.Server jetty-9.3.20.v20170531
   [junit4]   2> 1431286 INFO  (jetty-launcher-1627-thread-2) [    ] o.e.j.s.h.ContextHandler Started o.e.j.s.ServletContextHandler@1aaaeb1b{/solr,null,AVAILABLE}
   [junit4]   2> 1431287 INFO  (jetty-launcher-1627-thread-2) [    ] o.e.j.s.AbstractConnector Started ServerConnector@231957b6{HTTP/1.1,[http/1.1]}{127.0.0.1:62188}
   [junit4]   2> 1431287 INFO  (jetty-launcher-1627-thread-2) [    ] o.e.j.s.Server Started @1433626ms
   [junit4]   2> 1431288 INFO  (jetty-launcher-1627-thread-2) [    ] o.a.s.c.s.e.JettySolrRunner Jetty properties: {hostContext=/solr, hostPort=62188}
   [junit4]   2> 1431291 ERROR (jetty-launcher-1627-thread-2) [    ] o.a.s.u.StartupLoggingUtils Missing Java Option solr.log.dir. Logging may be missing or incomplete.
   [junit4]   2> 1431291 INFO  (jetty-launcher-1627-thread-2) [    ] o.a.s.s.SolrDispatchFilter  ___      _       Welcome to Apache Solr™ version 7.2.0
   [junit4]   2> 1431291 INFO  (jetty-launcher-1627-thread-2) [    ] o.a.s.s.SolrDispatchFilter / __| ___| |_ _   Starting in cloud mode on port null
   [junit4]   2> 1431291 INFO  (jetty-launcher-1627-thread-2) [    ] o.a.s.s.SolrDispatchFilter \__ \/ _ \ | '_|  Install dir: null, Default config dir: null
   [junit4]   2> 1431291 INFO  (jetty-launcher-1627-thread-2) [    ] o.a.s.s.SolrDispatchFilter |___/\___/_|_|    Start time: 2017-10-20T05:40:34.555Z
   [junit4]   2> 1431329 INFO  (jetty-launcher-1627-thread-1) [    ] o.a.s.s.SolrDispatchFilter solr.xml found in ZooKeeper. Loading...
   [junit4]   2> 1431330 INFO  (jetty-launcher-1627-thread-2) [    ] o.a.s.s.SolrDispatchFilter solr.xml found in ZooKeeper. Loading...
   [junit4]   2> 1431338 INFO  (jetty-launcher-1627-thread-1) [    ] o.a.s.c.ZkContainer Zookeeper client=127.0.0.1:61300/solr
   [junit4]   2> 1431341 INFO  (jetty-launcher-1627-thread-2) [    ] o.a.s.c.ZkContainer Zookeeper client=127.0.0.1:61300/solr
   [junit4]   2> 1431454 INFO  (jetty-launcher-1627-thread-2) [n:127.0.0.1:62188_solr    ] o.a.s.c.Overseer Overseer (id=null) closing
   [junit4]   2> 1431455 INFO  (jetty-launcher-1627-thread-2) [n:127.0.0.1:62188_solr    ] o.a.s.c.OverseerElectionContext I am going to be the leader 127.0.0.1:62188_solr
   [junit4]   2> 1431456 INFO  (jetty-launcher-1627-thread-2) [n:127.0.0.1:62188_solr    ] o.a.s.c.Overseer Overseer (id=98859616460275718-127.0.0.1:62188_solr-n_0000000000) starting
   [junit4]   2> 1431465 INFO  (jetty-launcher-1627-thread-1) [n:127.0.0.1:45720_solr    ] o.a.s.c.Overseer Overseer (id=null) closing
   [junit4]   2> 1431465 INFO  (jetty-launcher-1627-thread-2) [n:127.0.0.1:62188_solr    ] o.a.s.c.ZkController Register node as live in ZooKeeper:/live_nodes/127.0.0.1:62188_solr
   [junit4]   2> 1431467 INFO  (jetty-launcher-1627-thread-1) [n:127.0.0.1:45720_solr    ] o.a.s.c.ZkController Register node as live in ZooKeeper:/live_nodes/127.0.0.1:45720_solr
   [junit4]   2> 1431511 INFO  (jetty-launcher-1627-thread-1) [n:127.0.0.1:45720_solr    ] o.a.s.c.CoreContainer Initializing authentication plugin: org.apache.solr.security.HttpParamDelegationTokenPlugin
   [junit4]   2> 1431513 INFO  (zkCallback-1638-thread-1-processing-n:127.0.0.1:45720_solr) [n:127.0.0.1:45720_solr    ] o.a.s.c.c.ZkStateReader Updated live nodes from ZooKeeper... (0) -> (2)
   [junit4]   2> 1431519 WARN  (jetty-launcher-1627-thread-1) [n:127.0.0.1:45720_solr    ] o.a.s.c.s.i.Krb5HttpClientBuilder org.apache.solr.client.solrj.impl.Krb5HttpClientBuilder is configured without specifying system property 'java.security.auth.login.config'
   [junit4]   2> 1431523 INFO  (OverseerStateUpdate-98859616460275718-127.0.0.1:62188_solr-n_0000000000) [n:127.0.0.1:62188_solr    ] o.a.s.c.c.ZkStateReader Updated live nodes from ZooKeeper... (0) -> (2)
   [junit4]   2> 1431553 INFO  (jetty-launcher-1627-thread-1) [n:127.0.0.1:45720_solr    ] o.a.s.s.KerberosPlugin Params: {solr.kerberos.impersonator.user.noGroups.hosts=*, solr.kerberos.impersonator.user.bogusGroup.groups=__some_bogus_group, token.valid=30, cookie.domain=127.0.0.1, solr.kerberos.impersonator.user.anyHostAnyUser.groups=*, solr.kerberos.impersonator.user.bogusGroup.hosts=*, solr.kerberos.impersonator.user.anyHostAnyUser.hosts=*, token.validity=36000, solr.kerberos.impersonator.user.noHosts.groups=*, type=kerberos, solr.kerberos.impersonator.user.localHostAnyGroup.groups=*, delegation-token.token-kind=solr-dt, solr.kerberos.impersonator.user.wrongHost.hosts=1.1.1.1.1.1, cookie.path=/, zk-dt-secret-manager.znodeWorkingPath=solr/security/zkdtsm, solr.kerberos.impersonator.user.localHostAnyGroup.hosts=serv1-vm3,localhost,127.0.0.1, signer.secret.provider.zookeeper.path=/token, solr.kerberos.impersonator.user.anyHostUsersGroup.groups=staff, zk-dt-secret-manager.enable=true, solr.kerberos.impersonator.user.wrongHost.groups=*, kerberos.name.rules=DEFAULT, signer.secret.provider=zookeeper, solr.kerberos.impersonator.user.anyHostUsersGroup.hosts=*}
   [junit4]   2> 1431587 INFO  (jetty-launcher-1627-thread-2) [n:127.0.0.1:62188_solr    ] o.a.s.c.CoreContainer Initializing authentication plugin: org.apache.solr.security.HttpParamDelegationTokenPlugin
   [junit4]   2> 1431587 WARN  (jetty-launcher-1627-thread-2) [n:127.0.0.1:62188_solr    ] o.a.s.c.s.i.Krb5HttpClientBuilder org.apache.solr.client.solrj.impl.Krb5HttpClientBuilder is configured without specifying system property 'java.security.auth.login.config'
   [junit4]   2> 1431598 INFO  (jetty-launcher-1627-thread-2) [n:127.0.0.1:62188_solr    ] o.a.s.s.KerberosPlugin Params: {solr.kerberos.impersonator.user.noGroups.hosts=*, solr.kerberos.impersonator.user.bogusGroup.groups=__some_bogus_group, token.valid=30, cookie.domain=127.0.0.1, solr.kerberos.impersonator.user.anyHostAnyUser.groups=*, solr.kerberos.impersonator.user.bogusGroup.hosts=*, solr.kerberos.impersonator.user.anyHostAnyUser.hosts=*, token.validity=36000, solr.kerberos.impersonator.user.noHosts.groups=*, type=kerberos, solr.kerberos.impersonator.user.localHostAnyGroup.groups=*, delegation-token.token-kind=solr-dt, solr.kerberos.impersonator.user.wrongHost.hosts=1.1.1.1.1.1, cookie.path=/, zk-dt-secret-manager.znodeWorkingPath=solr/security/zkdtsm, solr.kerberos.impersonator.user.localHostAnyGroup.hosts=serv1-vm3,localhost,127.0.0.1, signer.secret.provider.zookeeper.path=/token, solr.kerberos.impersonator.user.anyHostUsersGroup.groups=staff, zk-dt-secret-manager.enable=true, solr.kerberos.impersonator.user.wrongHost.groups=*, kerberos.name.rules=DEFAULT, signer.secret.provider=zookeeper, solr.kerberos.impersonator.user.anyHostUsersGroup.hosts=*}
   [junit4]   2> 1431684 INFO  (jetty-launcher-1627-thread-2) [n:127.0.0.1:62188_solr    ] o.a.c.f.i.CuratorFrameworkImpl Starting
   [junit4]   2> 1431684 INFO  (jetty-launcher-1627-thread-1) [n:127.0.0.1:45720_solr    ] o.a.c.f.i.CuratorFrameworkImpl Starting
   [junit4]   2> 1431722 INFO  (jetty-launcher-1627-thread-1-EventThread) [n:127.0.0.1:45720_solr    ] o.a.c.f.s.ConnectionStateManager State change: CONNECTED
   [junit4]   2> 1431725 INFO  (jetty-launcher-1627-thread-2-EventThread) [n:127.0.0.1:62188_solr    ] o.a.c.f.s.ConnectionStateManager State change: CONNECTED
   [junit4]   2> 1431922 WARN  (jetty-launcher-1627-thread-1) [n:127.0.0.1:45720_solr    ] o.a.s.c.s.i.Krb5HttpClientBuilder org.apache.solr.client.solrj.impl.Krb5HttpClientBuilder is configured without specifying system property 'java.security.auth.login.config'
   [junit4]   2> 1431933 WARN  (jetty-launcher-1627-thread-2) [n:127.0.0.1:62188_solr    ] o.a.s.c.s.i.Krb5HttpClientBuilder org.apache.solr.client.solrj.impl.Krb5HttpClientBuilder is configured without specifying system property 'java.security.auth.login.config'
   [junit4]   2> 1431994 INFO  (jetty-launcher-1627-thread-1) [n:127.0.0.1:45720_solr    ] o.a.s.m.r.SolrJmxReporter JMX monitoring for 'solr_45720.solr.node' (registry 'solr.node') enabled at server: com.sun.jmx.mbeanserver.JmxMBeanServer@3d0118e3
   [junit4]   2> 1432005 INFO  (jetty-launcher-1627-thread-2) [n:127.0.0.1:62188_solr    ] o.a.s.m.r.SolrJmxReporter JMX monitoring for 'solr_62188.solr.node' (registry 'solr.node') enabled at server: com.sun.jmx.mbeanserver.JmxMBeanServer@3d0118e3
   [junit4]   2> 1432012 INFO  (jetty-launcher-1627-thread-1) [n:127.0.0.1:45720_solr    ] o.a.s.m.r.SolrJmxReporter JMX monitoring for 'solr_45720.solr.jvm' (registry 'solr.jvm') enabled at server: com.sun.jmx.mbeanserver.JmxMBeanServer@3d0118e3
   [junit4]   2> 1432012 INFO  (jetty-launcher-1627-thread-1) [n:127.0.0.1:45720_solr    ] o.a.s.m.r.SolrJmxReporter JMX monitoring for 'solr_45720.solr.jetty' (registry 'solr.jetty') enabled at server: com.sun.jmx.mbeanserver.JmxMBeanServer@3d0118e3
   [junit4]   2> 1432012 INFO  (jetty-launcher-1627-thread-2) [n:127.0.0.1:62188_solr    ] o.a.s.m.r.SolrJmxReporter JMX monitoring for 'solr_62188.solr.jvm' (registry 'solr.jvm') enabled at server: com.sun.jmx.mbeanserver.JmxMBeanServer@3d0118e3
   [junit4]   2> 1432012 INFO  (jetty-launcher-1627-thread-2) [n:127.0.0.1:62188_solr    ] o.a.s.m.r.SolrJmxReporter JMX monitoring for 'solr_62188.solr.jetty' (registry 'solr.jetty') enabled at server: com.sun.jmx.mbeanserver.JmxMBeanServer@3d0118e3
   [junit4]   2> 1432013 INFO  (jetty-launcher-1627-thread-1) [n:127.0.0.1:45720_solr    ] o.a.s.c.CorePropertiesLocator Found 0 core definitions underneath /export/home/jenkins/workspace/Lucene-Solr-7.x-Solaris/solr/build/solr-core/test/J1/temp/solr.cloud.TestSolrCloudWithSecureImpersonation_C5F18D7E77876671-001/tempDir-001/node1/.
   [junit4]   2> 1432015 INFO  (jetty-launcher-1627-thread-2) [n:127.0.0.1:62188_solr    ] o.a.s.c.CorePropertiesLocator Found 0 core definitions underneath /export/home/jenkins/workspace/Lucene-Solr-7.x-Solaris/solr/build/solr-core/test/J1/temp/solr.cloud.TestSolrCloudWithSecureImpersonation_C5F18D7E77876671-001/tempDir-001/node2/.
   [junit4]   2> 1432287 INFO  (TEST-TestSolrCloudWithSecureImpersonation.testForwarding-seed#[C5F18D7E77876671]) [    ] o.a.s.SolrTestCaseJ4 ###Starting testForwarding
   [junit4]   2> 1432827 INFO  (TEST-TestSolrCloudWithSecureImpersonation.testForwarding-seed#[C5F18D7E77876671]) [    ] o.a.s.c.c.ZkStateReader Updated live nodes from ZooKeeper... (0) -> (2)
   [junit4]   2> 1432828 INFO  (TEST-TestSolrCloudWithSecureImpersonation.testForwarding-seed#[C5F18D7E77876671]) [    ] o.a.s.c.s.i.ZkClientClusterStateProvider Cluster at 127.0.0.1:61300/solr ready
   [junit4]   2> 1432876 INFO  (qtp934619849-11678) [n:127.0.0.1:45720_solr    ] o.a.s.h.a.CollectionsHandler Invoked Collection Action :create with params pullReplicas=0&replicationFactor=1&collection.configName=conf1&maxShardsPerNode=1&name=forwardingCollection&nrtReplicas=1&action=CREATE&numShards=1&tlogReplicas=0&wt=javabin&version=2 and sendToOCPQueue=true
   [junit4]   2> 1432879 INFO  (OverseerThreadFactory-4809-thread-1-processing-n:127.0.0.1:62188_solr) [n:127.0.0.1:62188_solr    ] o.a.s.c.CreateCollectionCmd Create collection forwardingCollection
   [junit4]   2> 1433001 INFO  (OverseerStateUpdate-98859616460275718-127.0.0.1:62188_solr-n_0000000000) [n:127.0.0.1:62188_solr    ] o.a.s.c.o.SliceMutator createReplica() {
   [junit4]   2>   "operation":"ADDREPLICA",
   [junit4]   2>   "collection":"forwardingCollection",
   [junit4]   2>   "shard":"shard1",
   [junit4]   2>   "core":"forwardingCollection_shard1_replica_n1",
   [junit4]   2>   "state":"down",
   [junit4]   2>   "base_url":"http://127.0.0.1:45720/solr",
   [junit4]   2>   "type":"NRT",
   [junit4]   2>   "waitForFinalState":"false"} 
   [junit4]   2> 1433208 INFO  (qtp934619849-11671) [n:127.0.0.1:45720_solr    ] o.a.s.h.a.CoreAdminOperation core create command qt=/admin/cores&coreNodeName=core_node2&collection.configName=conf1&newCollection=true&name=forwardingCollection_shard1_replica_n1&action=CREATE&numShards=1&collection=forwardingCollection&shard=shard1&wt=javabin&version=2&replicaType=NRT
   [junit4]   2> 1433209 INFO  (qtp934619849-11671) [n:127.0.0.1:45720_solr    ] o.a.s.c.TransientSolrCoreCacheDefault Allocating transient cache for 2147483647 transient cores
   [junit4]   2> 1433317 INFO  (zkCallback-1638-thread-1-processing-n:127.0.0.1:45720_solr) [n:127.0.0.1:45720_solr    ] o.a.s.c.c.ZkStateReader A cluster state change: [WatchedEvent state:SyncConnected type:NodeDataChanged path:/collections/forwardingCollection/state.json] for collection [forwardingCollection] has occurred - updating... (live nodes size: [2])
   [junit4]   2> 1433318 INFO  (zkCallback-1638-thread-2-processing-n:127.0.0.1:45720_solr) [n:127.0.0.1:45720_solr    ] o.a.s.c.c.ZkStateReader A cluster state change: [WatchedEvent state:SyncConnected type:NodeDataChanged path:/collections/forwardingCollection/state.json] for collection [forwardingCollection] has occurred - updating... (live nodes size: [2])
   [junit4]   2> 1434240 INFO  (qtp934619849-11671) [n:127.0.0.1:45720_solr c:forwardingCollection s:shard1 r:core_node2 x:forwardingCollection_shard1_replica_n1] o.a.s.c.SolrConfig Using Lucene MatchVersion: 7.2.0
   [junit4]   2> 1434267 INFO  (qtp934619849-11671) [n:127.0.0.1:45720_solr c:forwardingCollection s:shard1 r:core_node2 x:forwardingCollection_shard1_replica_n1] o.a.s.s.IndexSchema [forwardingCollection_shard1_replica_n1] Schema name=test
   [junit4]   2> 1434376 INFO  (qtp934619849-11671) [n:127.0.0.1:45720_solr c:forwardingCollection s:shard1 r:core_node2 x:forwardingCollection_shard1_replica_n1] o.a.s.s.IndexSchema Loaded schema test/1.0 with uniqueid field id
   [junit4]   2> 1434396 INFO  (qtp934619849-11671) [n:127.0.0.1:45720_solr c:forwardingCollection s:shard1 r:core_node2 x:forwardingCollection_shard1_replica_n1] o.a.s.c.CoreContainer Creating SolrCore 'forwardingCollection_shard1_replica_n1' using configuration from collection forwardingCollection, trusted=true
   [junit4]   2> 1434396 INFO  (qtp934619849-11671) [n:127.0.0.1:45720_solr c:forwardingCollection s:shard1 r:core_node2 x:forwardingCollection_shard1_replica_n1] o.a.s.m.r.SolrJmxReporter JMX monitoring for 'solr_45720.solr.core.forwardingCollection.shard1.replica_n1' (registry 'solr.core.forwardingCollection.shard1.replica_n1') enabled at server: com.sun.jmx.mbeanserver.JmxMBeanServer@3d0118e3
   [junit4]   2> 1434397 INFO  (qtp934619849-11671) [n:127.0.0.1:45720_solr c:forwardingCollection s:shard1 r:core_node2 x:forwardingCollection_shard1_replica_n1] o.a.s.c.SolrCore solr.RecoveryStrategy.Builder
   [junit4]   2> 1434397 INFO  (qtp934619849-11671) [n:127.0.0.1:45720_solr c:forwardingCollection s:shard1 r:core_node2 x:forwardingCollection_shard1_replica_n1] o.a.s.c.SolrCore [[forwardingCollection_shard1_replica_n1] ] Opening new SolrCore at [/export/home/jenkins/workspace/Lucene-Solr-7.x-Solaris/solr/build/solr-core/test/J1/temp/solr.cloud.TestSolrCloudWithSecureImpersonation_C5F18D7E77876671-001/tempDir-001/node1/forwardingCollection_shard1_replica_n1], dataDir=[/export/home/jenkins/workspace/Lucene-Solr-7.x-Solaris/solr/build/solr-core/test/J1/temp/solr.cloud.TestSolrCloudWithSecureImpersonation_C5F18D7E77876671-001/tempDir-001/node1/./forwardingCollection_shard1_replica_n1/data/]
   [junit4]   2> 1434398 INFO  (qtp934619849-11671) [n:127.0.0.1:45720_solr c:forwardingCollection s:shard1 r:core_node2 x:forwardingCollection_shard1_replica_n1] o.a.s.u.RandomMergePolicy RandomMergePolicy wrapping class org.apache.lucene.index.LogDocMergePolicy: [LogDocMergePolicy: minMergeSize=1000, mergeFactor=41, maxMergeSize=9223372036854775807, maxMergeSizeForForcedMerge=9223372036854775807, calibrateSizeByDeletes=true, maxMergeDocs=2147483647, maxCFSSegmentSizeMB=8.796093022207999E12, noCFSRatio=0.0]
   [junit4]   2> 1434448 INFO  (qtp934619849-11671) [n:127.0.0.1:45720_solr c:forwardingCollection s:shard1 r:core_node2 x:forwardingCollection_shard1_replica_n1] o.a.s.u.UpdateHandler Using UpdateLog implementation: org.apache.solr.update.UpdateLog
   [junit4]   2> 1434448 INFO  (qtp934619849-11671) [n:127.0.0.1:45720_solr c:forwardingCollection s:shard1 r:core_node2 x:forwardingCollection_shard1_replica_n1] o.a.s.u.UpdateLog Initializing UpdateLog: dataDir= defaultSyncLevel=FLUSH numRecordsToKeep=100 maxNumLogsToKeep=10 numVersionBuckets=65536
   [junit4]   2> 1434449 INFO  (qtp934619849-11671) [n:127.0.0.1:45720_solr c:forwardingCollection s:shard1 r:core_node2 x:forwardingCollection_shard1_replica_n1] o.a.s.u.CommitTracker Hard AutoCommit: disabled
   [junit4]   2> 1434449 INFO  (qtp934619849-11671) [n:127.0.0.1:45720_solr c:forwardingCollection s:shard1 r:core_node2 x:forwardingCollection_shard1_replica_n1] o.a.s.u.CommitTracker Soft AutoCommit: disabled
   [junit4]   2> 1434450 INFO  (qtp934619849-11671) [n:127.0.0.1:45720_solr c:forwardingCollection s:shard1 r:core_node2 x:forwardingCollection_shard1_replica_n1] o.a.s.u.RandomMergePolicy RandomMergePolicy wrapping class org.apache.lucene.index.LogByteSizeMergePolicy: [LogByteSizeMergePolicy: minMergeSize=1677721, mergeFactor=49, maxMergeSize=2147483648, maxMergeSizeForForcedMerge=9223372036854775807, calibrateSizeByDeletes=false, maxMergeDocs=2147483647, maxCFSSegmentSizeMB=8.796093022207999E12, noCFSRatio=0.7302270618997951]
   [junit4]   2> 1434451 INFO  (qtp934619849-11671) [n:127.0.0.1:45720_solr c:forwardingCollection s:shard1 r:core_node2 x:forwardingCollection_shard1_replica_n1] o.a.s.s.SolrIndexSearcher Opening [Searcher@2310214b[forwardingCollection_shard1_replica_n1] main]
   [junit4]   2> 1434452 INFO  (qtp934619849-11671) [n:127.0.0.1:45720_solr c:forwardingCollection s:shard1 r:core_node2 x:forwardingCollection_shard1_replica_n1] o.a.s.h.c.SpellCheckComponent Initializing spell checkers
   [junit4]   2> 1434456 INFO  (qtp934619849-11671) [n:127.0.0.1:45720_solr c:forwardingCollection s:shard1 r:core_node2 x:forwardingCollection_shard1_replica_n1] o.a.s.s.DirectSolrSpellChecker init: {name=direct,classname=DirectSolrSpellChecker,field=lowerfilt,minQueryLength=3}
   [junit4]   2> 1434475 INFO  (qtp934619849-11671) [n:127.0.0.1:45720_solr c:forwardingCollection s:shard1 r:core_node2 x:forwardingCollection_shard1_replica_n1] o.a.s.h.ReplicationHandler Commits will be reserved for 10000ms.
   [junit4]   2> 1434475 INFO  (qtp934619849-11671) [n:127.0.0.1:45720_solr c:forwardingCollection s:shard1 r:core_node2 x:forwardingCollection_shard1_replica_n1] o.a.s.u.UpdateLog Could not find max version in index or recent updates, using new clock 1581753866900209664
   [junit4]   2> 1434475 INFO  (searcherExecutor-4814-thread-1-processing-n:127.0.0.1:45720_solr x:forwardingCollection_shard1_replica_n1 s:shard1 c:forwardingCollection r:core_node2) [n:127.0.0.1:45720_solr c:forwardingCollection s:shard1 r:core_node2 x:forwardingCollection_shard1_replica_n1] o.a.s.h.c.SpellCheckComponent Loading spell index for spellchecker: default
   [junit4]   2> 1434475 INFO  (searcherExecutor-4814-thread-1-processing-n:127.0.0.1:45720_solr x:forwardingCollection_shard1_replica_n1 s:shard1 c:forwardingCollection r:core_node2) [n:127.0.0.1:45720_solr c:forwardingCollection s:shard1 r:core_node2 x:forwardingCollection_shard1_replica_n1] o.a.s.h.c.SpellCheckComponent Loading spell index for spellchecker: direct
   [junit4]   2> 1434476 INFO  (searcherExecutor-4814-thread-1-processing-n:127.0.0.1:45720_solr x:forwardingCollection_shard1_replica_n1 s:shard1 c:forwardingCollection r:core_node2) [n:127.0.0.1:45720_solr c:forwardingCollection s:shard1 r:core_node2 x:forwardingCollection_shard1_replica_n1] o.a.s.h.c.SpellCheckComponent Loading spell index for spellchecker: wordbreak
   [junit4]   2> 1434476 INFO  (searcherExecutor-4814-thread-1-processing-n:127.0.0.1:45720_solr x:forwardingCollection_shard1_replica_n1 s:shard1 c:forwardingCollection r:core_node2) [n:127.0.0.1:45720_solr c:forwardingCollection s:shard1 r:core_node2 x:forwardingCollection_shard1_replica_n1] o.a.s.h.c.SpellCheckComponent Loading spell index for spellchecker: multipleFields
   [junit4]   2> 1434476 INFO  (searcherExecutor-4814-thread-1-processing-n:127.0.0.1:45720_solr x:forwardingCollection_shard1_replica_n1 s:shard1 c:forwardingCollection r:core_node2) [n:127.0.0.1:45720_solr c:forwardingCollection s:shard1 r:core_node2 x:forwardingCollection_shard1_replica_n1] o.a.s.h.c.SpellCheckComponent Loading spell index for spellchecker: jarowinkler
   [junit4]   2> 1434477 INFO  (searcherExecutor-4814-thread-1-processing-n:127.0.0.1:45720_solr x:forwardingCollection_shard1_replica_n1 s:shard1 c:forwardingCollection r:core_node2) [n:127.0.0.1:45720_solr c:forwardingCollection s:shard1 r:core_node2 x:forwardingCollection_shard1_replica_n1] o.a.s.h.c.SpellCheckComponent Loading spell index for spellchecker: external
   [junit4]   2> 1434478 INFO  (searcherExecutor-4814-thread-1-processing-n:127.0.0.1:45720_solr x:forwardingCollection_shard1_replica_n1 s:shard1 c:forwardingCollection r:core_node2) [n:127.0.0.1:45720_solr c:forwardingCollection s:shard1 r:core_node2 x:forwardingCollection_shard1_replica_n1] o.a.s.h.c.SpellCheckComponent Loading spell index for spellchecker: freq
   [junit4]   2> 1434478 INFO  (searcherExecutor-4814-thread-1-processing-n:127.0.0.1:45720_solr x:forwardingCollection_shard1_replica_n1 s:shard1 c:forwardingCollection r:core_node2) [n:127.0.0.1:45720_solr c:forwardingCollection s:shard1 r:core_node2 x:forwardingCollection_shard1_replica_n1] o.a.s.h.c.SpellCheckComponent Loading spell index for spellchecker: fqcn
   [junit4]   2> 1434479 INFO  (searcherExecutor-4814-thread-1-processing-n:127.0.0.1:45720_solr x:forwardingCollection_shard1_replica_n1 s:shard1 c:forwardingCollection r:core_node2) [n:127.0.0.1:45720_solr c:forwardingCollection s:shard1 r:core_node2 x:forwardingCollection_shard1_replica_n1] o.a.s.h.c.SpellCheckComponent Loading spell index for spellchecker: perDict
   [junit4]   2> 1434481 INFO  (searcherExecutor-4814-thread-1-processing-n:127.0.0.1:45720_solr x:forwardingCollection_shard1_replica_n1 s:shard1 c:forwardingCollection r:core_node2) [n:127.0.0.1:45720_solr c:forwardingCollection s:shard1 r:core_node2 x:forwardingCollection_shard1_replica_n1] o.a.s.c.SolrCore [forwardingCollection_shard1_replica_n1] Registered new searcher Searcher@2310214b[forwardingCollection_shard1_replica_n1] main{ExitableDirectoryReader(UninvertingDirectoryReader())}
   [junit4]   2> 1434481 INFO  (qtp934619849-11671) [n:127.0.0.1:45720_solr c:forwardingCollection s:shard1 r:core_node2 x:forwardingCollection_shard1_replica_n1] o.a.s.c.ShardLeaderElectionContext Enough replicas found to continue.
   [junit4]   2> 1434481 INFO  (qtp934619849-11671) [n:127.0.0.1:45720_solr c:forwardingCollection s:shard1 r:core_node2 x:forwardingCollection_shard1_replica_n1] o.a.s.c.ShardLeaderElectionContext I may be the new leader - try and sync
   [junit4]   2> 1434481 INFO  (qtp934619849-11671) [n:127.0.0.1:45720_solr c:forwardingCollection s:shard1 r:core_node2 x:forwardingCollection_shard1_replica_n1] o.a.s.c.SyncStrategy Sync replicas to http://127.0.0.1:45720/solr/forwardingCollection_shard1_replica_n1/
   [junit4]   2> 1434481 INFO  (qtp934619849-11671) [n:127.0.0.1:45720_solr c:forwardingCollection s:shard1 r:core_node2 x:forwardingCollection_shard1_replica_n1] o.a.s.c.SyncStrategy Sync Success - now sync replicas to me
   [junit4]   2> 1434481 INFO  (qtp934619849-11671) [n:127.0.0.1:45720_solr c:forwardingCollection s:shard1 r:core_node2 x:forwardingCollection_shard1_replica_n1] o.a.s.c.SyncStrategy http://127.0.0.1:45720/solr/forwardingCollection_shard1_replica_n1/ has no replicas
   [junit4]   2> 1434481 INFO  (qtp934619849-11671) [n:127.0.0.1:45720_solr c:forwardingCollection s:shard1 r:core_node2 x:forwardingCollection_shard1_replica_n1] o.a.s.c.ShardLeaderElectionContext Found all replicas participating in election, clear LIR
   [junit4]   2> 1434487 INFO  (qtp934619849-11671) [n:127.0.0.1:45720_solr c:forwardingCollection s:shard1 r:core_node2 x:forwardingCollection_shard1_replica_n1] o.a.s.c.ShardLeaderElectionContext I am the new leader: http://127.0.0.1:45720/solr/forwardingCollection_shard1_replica_n1/ shard1
   [junit4]   2> 1434590 INFO  (zkCallback-1638-thread-1-processing-n:127.0.0.1:45720_solr) [n:127.0.0.1:45720_solr    ] o.a.s.c.c.ZkStateReader A cluster state change: [WatchedEvent state:SyncConnected type:NodeDataChanged path:/collections/forwardingCollection/state.json] for collection [forwardingCollection] has occurred - updating... (live nodes size: [2])
   [junit4]   2> 1434590 INFO  (zkCallback-1638-thread-2-processing-n:127.0.0.1:45720_solr) [n:127.0.0.1:45720_solr    ] o.a.s.c.c.ZkStateReader A cluster state change: [WatchedEvent state:SyncConnected type:NodeDataChanged path:/collections/forwardingCollection/state.json] for collection [forwardingCollection] has occurred - updating... (live nodes size: [2])
   [junit4]   2> 1434639 INFO  (qtp934619849-11671) [n:127.0.0.1:45720_solr c:forwardingCollection s:shard1 r:core_node2 x:forwardingCollection_shard1_replica_n1] o.a.s.c.ZkController I am the leader, no recovery necessary
   [junit4]   2> 1434643 INFO  (qtp934619849-11671) [n:127.0.0.1:45720_solr c:forwardingCollection s:shard1 r:core_node2 x:forwardingCollection_shard1_replica_n1] o.a.s.s.HttpSolrCall [admin] webapp=null path=/admin/cores params={qt=/admin/cores&coreNodeName=core_node2&collection.configName=conf1&newCollection=true&name=forwardingCollection_shard1_replica_n1&action=CREATE&numShards=1&collection=forwardingCollection&shard=shard1&wt=javabin&version=2&replicaType=NRT} status=0 QTime=1435
   [junit4]   2> 1434656 WARN  (httpShardExecutor-4805-thread-1-processing-n:127.0.0.1:62188_solr [http:////127.0.0.1:45720//solr] http:////127.0.0.1:45720//solr) [n:127.0.0.1:62188_solr    ] o.a.h.c.p.ResponseProcessCookies Invalid cookie header: "Set-Cookie: hadoop.auth="u=$&p=$&t=test&e=1508514036468&s=U+eZ78v16wH34EuNMGkrFpkolE8="; Path=/; Domain=127.0.0.1; Expires=      , 20-           -2017 15:40:36 GMT; HttpOnly". Invalid 'expires' attribute: , 20- -2017 15:40:36 GMT
   [junit4]   2> 1434662 INFO  (qtp934619849-11678) [n:127.0.0.1:45720_solr    ] o.a.s.h.a.CollectionsHandler Wait for new collection to be active for at most 30 seconds. Check all shard replicas
   [junit4]   2> 1434745 INFO  (zkCallback-1638-thread-1-processing-n:127.0.0.1:45720_solr) [n:127.0.0.1:45720_solr    ] o.a.s.c.c.ZkStateReader A cluster state change: [WatchedEvent state:SyncConnected type:NodeDataChanged path:/collections/forwardingCollection/state.json] for collection [forwardingCollection] has occurred - updating... (live nodes size: [2])
   [junit4]   2> 1434745 INFO  (zkCallback-1638-thread-2-processing-n:127.0.0.1:45720_solr) [n:127.0.0.1:45720_solr    ] o.a.s.c.c.ZkStateReader A cluster state change: [WatchedEvent state:SyncConnected type:NodeDataChanged path:/collections/forwardingCollection/state.json] for collection [forwardingCollection] has occurred - updating... (live nodes size: [2])
   [junit4]   2> 1434888 INFO  (OverseerCollectionConfigSetProcessor-98859616460275718-127.0.0.1:62188_solr-n_0000000000) [n:127.0.0.1:62188_solr    ] o.a.s.c.OverseerTaskQueue Response ZK path: /overseer/collection-queue-work/qnr-0000000000 doesn't exist.  Requestor may have disconnected from ZooKeeper
   [junit4]   2> 1435667 INFO  (qtp934619849-11678) [n:127.0.0.1:45720_solr    ] o.a.s.s.HttpSolrCall [admin] webapp=null path=/admin/collections params={pullReplicas=0&replicationFactor=1&collection.configName=conf1&maxShardsPerNode=1&name=forwardingCollection&nrtReplicas=1&action=CREATE&numShards=1&tlogReplicas=0&wt=javabin&version=2} status=0 QTime=2792
   [junit4]   2> 1435668 WARN  (TEST-TestSolrCloudWithSecureImpersonation.testForwarding-seed#[C5F18D7E77876671]) [    ] o.a.h.c.p.ResponseProcessCookies Invalid cookie header: "Set-Cookie: hadoop.auth="u=user&p=user&t=test&e=1508514036121&s=weMTXen+nz1g78qJ8nlHf6owSqY="; Path=/; Domain=127.0.0.1; Expires=      , 20-           -2017 15:40:36 GMT; HttpOnly". Invalid 'expires' attribute: , 20- -2017 15:40:36 GMT
   [junit4]   2> 1435668 INFO  (TEST-TestSolrCloudWithSecureImpersonation.testForwarding-seed#[C5F18D7E77876671]) [    ] o.a.s.c.AbstractDistribZkTestBase Wait for recoveries to finish - collection: forwardingCollection failOnTimeout:true timeout (sec):100
   [junit4]   2> 1435669 INFO  (TEST-TestSolrCloudWithSecureImpersonation.testForwarding-seed#[C5F18D7E77876671]) [    ] o.a.s.c.AbstractDistribZkTestBase Recoveries finished - collection: forwardingCollection
   [junit4]   2> 1435676 INFO  (qtp934619849-11677) [n:127.0.0.1:45720_solr c:forwardingCollection s:shard1 r:core_node2 x:forwardingCollection_shard1_replica_n1] o.a.s.c.S.Request [forwardingCollection_shard1_replica_n1]  webapp=/solr path=/select params={q=*:*&wt=javabin&version=2} hits=0 status=0 QTime=0
   [junit4]   2> 1435677 WARN  (TEST-TestSolrCloudWithSecureImpersonation.testForwarding-seed#[C5F18D7E77876671]) [    ] o.a.h.c.p.ResponseProcessCookies Invalid cookie header: "Set-Cookie: hadoop.auth="u=user&p=user&t=test&e=1508514038939&s=iFT7ulSQITzvAZoDeRb0/v7/UU0="; Path=/; Domain=127.0.0.1; Expires=      , 20-           -2017 15:40:38 GMT; HttpOnly". Invalid 'expires' attribute: , 20- -2017 15:40:38 GMT
   [junit4]   2> 1435687 INFO  (qtp2142794582-11685) [n:127.0.0.1:62188_solr    ] o.a.s.c.TransientSolrCoreCacheDefault Allocating transient cache for 2147483647 transient cores
   [junit4]   2> 1435706 INFO  (qtp934619849-11670) [n:127.0.0.1:45720_solr c:forwardingCollection s:shard1 r:core_node2 x:forwardingCollection_shard1_replica_n1] o.a.s.c.S.Request [forwardingCollection_shard1_replica_n1]  webapp=/solr path=/select params={q=*:*&wt=javabin&version=2} hits=0 status=0 QTime=0
   [junit4]   2> 1435706 WARN  (qtp2142794582-11685) [n:127.0.0.1:62188_solr    ] o.a.h.c.p.ResponseProcessCookies Invalid cookie header: "Set-Cookie: hadoop.auth="u=$&p=$&t=test&e=1508514038969&s=3L4PtKDe9jFCnDyVJtEqVy1NR0E="; Path=/; Domain=127.0.0.1; Expires=      , 20-           -2017 15:40:38 GMT; HttpOnly". Invalid 'expires' attribute: , 20- -2017 15:40:38 GMT
   [junit4]   2> 1435707 WARN  (TEST-TestSolrCloudWithSecureImpersonation.testForwarding-seed#[C5F18D7E77876671]) [    ] o.a.h.c.p.ResponseProcessCookies Invalid cookie header: "Set-Cookie: hadoop.auth="u=user&p=user&t=test&e=1508514038950&s=GkipBG6qrQDzCNxRMyKbD3qRp+g="; Path=/; Domain=127.0.0.1; Expires=      , 20-           -2017 15:40:38 GMT; HttpOnly". Invalid 'expires' attribute: , 20- -2017 15:40:38 GMT
   [junit4]   2> 1435707 WARN  (TEST-TestSolrCloudWithSecureImpersonation.testForwarding-seed#[C5F18D7E77876671]) [    ] o.a.h.c.p.ResponseProcessCookies Invalid cookie header: "Set-Cookie: hadoop.auth="u=$&p=$&t=test&e=1508514038969&s=3L4PtKDe9jFCnDyVJtEqVy1NR0E="; Path=/; Domain=127.0.0.1; Expires=      , 20-           -2017 15:40:38 GMT; HttpOnly". Invalid 'expires' attribute: , 20- -2017 15:40:38 GMT
   [junit4]   2> 1435708 INFO  (TEST-TestSolrCloudWithSecureImpersonation.testForwarding-seed#[C5F18D7E77876671]) [    ] o.a.s.SolrTestCaseJ4 ###Ending testForwarding
   [junit4]   2> 1436058 INFO  (TEST-TestSolrCloudWithSecureImpersonation.testProxyWrongHost-seed#[C5F18D7E77876671]) [    ] o.a.s.SolrTestCaseJ4 ###Starting testProxyWrongHost
   [junit4]   2> 1441788 WARN  (TEST-TestSolrCloudWithSecureImpersonation.testProxyWrongHost-seed#[C5F18D7E77876671]) [    ] o.a.h.c.p.ResponseProcessCookies Invalid cookie header: "Set-Cookie: hadoop.auth="u=wrongHost&p=wrongHost&t=test&e=1508514039324&s=ycqWGAwA7ylNDMFzkBmCRjawEvc="; Path=/; Domain=127.0.0.1; Expires=      , 20-           -2017 15:40:39 GMT; HttpOnly". Invalid 'expires' attribute: , 20- -2017 15:40:39 GMT
   [junit4]   2> 1441788 INFO  (TEST-TestSolrCloudWithSecureImpersonation.testProxyWrongHost-seed#[C5F18D7E77876671]) [    ] o.a.s.SolrTestCaseJ4 ###Ending testProxyWrongHost
   [junit4]   2> 1442302 INFO  (TEST-TestSolrCloudWithSecureImpersonation.testProxyValidateGroup-seed#[C5F18D7E77876671]) [    ] o.a.s.SolrTestCaseJ4 ###Starting testProxyValidateGroup
   [junit4]   2> 1442397 INFO  (qtp934619849-11671) [n:127.0.0.1:45720_solr    ] o.a.s.h.a.CollectionsHandler Invoked Collection Action :list with params doAs=jenkins&action=LIST&wt=javabin&version=2 and sendToOCPQueue=true
   [junit4]   2> 1442397 INFO  (qtp934619849-11671) [n:127.0.0.1:45720_solr    ] o.a.s.s.HttpSolrCall [admin] webapp=null path=/admin/collections params={doAs=jenkins&action=LIST&wt=javabin&version=2} status=0 QTime=0
   [junit4]   2> 1442397 WARN  (TEST-TestSolrCloudWithSecureImpersonation.testProxyValidateGroup-seed#[C5F18D7E77876671]) [    ] o.a.h.c.p.ResponseProcessCookies Invalid cookie header: "Set-Cookie: hadoop.auth="u=anyHostUsersGroup&p=anyHostUsersGroup&t=test&e=1508514045580&s=YtR8F8d43QQlTdBAmmmTeeKJUxs="; Path=/; Domain=127.0.0.1; Expires=      , 20-           -2017 15:40:45 GMT; HttpOnly". Invalid 'expires' attribute: , 20- -2017 15:40:45 GMT
   [junit4]   2> 1442397 INFO  (TEST-TestSolrCloudWithSecureImpersonation.testProxyValidateGroup-seed#[C5F18D7E77876671]) [    ] o.a.s.SolrTestCaseJ4 ###Ending testProxyValidateGroup
   [junit4]   2> 1442846 INFO  (TEST-TestSolrCloudWithSecureImpersonation.testProxyNoConfigGroups-seed#[C5F18D7E77876671]) [    ] o.a.s.SolrTestCaseJ4 ###Starting testProxyNoConfigGroups
   [junit4]   2> 1442878 WARN  (TEST-TestSolrCloudWithSecureImpersonation.testProxyNoConfigGroups-seed#[C5F18D7E77876671]) [    ] o.a.h.c.p.ResponseProcessCookies Invalid cookie header: "Set-Cookie: hadoop.auth="u=noGroups&p=noGroups&t=test&e=1508514046111&s=3sPIiENLl5JCRe//+VbGua5PtQ8="; Path=/; Domain=127.0.0.1; Expires=      , 20-           -2017 15:40:46 GMT; HttpOnly". Invalid 'expires' attribute: , 20- -2017 15:40:46 GMT
   [junit4]   2> 1442879 INFO  (TEST-TestSolrCloudWithSecureImpersonation.testProxyNoConfigGroups-seed#[C5F18D7E77876671]) [    ] o.a.s.SolrTestCaseJ4 ###Ending testProxyNoConfigGroups
   [junit4]   2> 1443268 INFO  (TEST-TestSolrCloudWithSecureImpersonation.testProxyInvalidGroup-seed#[C5F18D7E77876671]) [    ] o.a.s.SolrTestCaseJ4 ###Starting testProxyInvalidGroup
   [junit4]   2> 1443328 WARN  (qtp934619849-11667) [    ] o.a.h.s.ShellBasedUnixGroupsMapping got exception trying to get groups for user bar: id: invalid user name: "bar"
   [junit4]   2> id: invalid user name: "bar"
   [junit4]   2> 
   [junit4]   2> 1443333 WARN  (TEST-TestSolrCloudWithSecureImpersonation.testProxyInvalidGroup-seed#[C5F18D7E77876671]) [    ] o.a.h.c.p.ResponseProcessCookies Invalid cookie header: "Set-Cookie: hadoop.auth="u=bogusGroup&p=bogusGroup&t=test&e=1508514046533&s=xFBLA4/iZwKbitDpMmwLWvl8RlE="; Path=/; Domain=127.0.0.1; Expires=      , 20-           -2017 15:40:46 GMT; HttpOnly". Invalid 'expires' attribute: , 20- -2017 15:40:46 GMT
   [junit4]   2> 1443337 INFO  (TEST-TestSolrCloudWithSecureImpersonation.testProxyInvalidGroup-seed#[C5F18D7E77876671]) [    ] o.a.s.SolrTestCaseJ4 ###Ending testProxyInvalidGroup
   [junit4]   2> 1443727 INFO  (TEST-TestSolrCloudWithSecureImpersonation.testProxyNullProxyUser-seed#[C5F18D7E77876671]) [    ] o.a.s.SolrTestCaseJ4 ###Starting testProxyNullProxyUser
   [junit4]   2> 1443728 INFO  (qtp934619849-11677) [n:127.0.0.1:45720_solr c:forwardingCollection s:shard1 r:core_node2 x:forwardingCollection_shard1_replica_n1] o.a.s.s.SolrDispatchFilter Error authenticating
   [junit4]   2> java.lang.IllegalArgumentException: userName is NULL, empty or contains a '&'
   [junit4]   2> 	at org.apache.hadoop.security.authentication.util.AuthToken.checkForIllegalArgument(AuthToken.java:87)
   [junit4]   2> 	at org.apache.hadoop.security.authentication.util.AuthToken.<init>(AuthToken.java:70)
   [junit4]   2> 	at org.apache.hadoop.security.authentication.server.AuthenticationToken.<init>(AuthenticationToken.java:58)
   [junit4]   2> 	at org.apache.solr.security.HttpParamDelegationTokenPlugin$HttpParamDelegationTokenAuthenticationHandler$HttpParamAuthenticationHandler.authenticate(HttpParamDelegationTokenPlugin.java:213)
   [junit4]   2> 	at org.apache.hadoop.security.token.delegation.web.DelegationTokenAuthenticationHandler.authenticate(DelegationTokenAuthenticationHandler.java:348)
   [junit4]   2> 	at org.apache.solr.security.RequestContinuesRecorderAuthenticationHandler.authenticate(RequestContinuesRecorderAuthenticationHandler.java:69)
   [junit4]   2> 	at org.apache.hadoop.security.authentication.server.AuthenticationFilter.doFilter(AuthenticationFilter.java:518)
   [junit4]   2> 	at org.apache.solr.security.DelegationTokenKerberosFilter.doFilter(DelegationTokenKerberosFilter.java:134)
   [junit4]   2> 	at org.apache.solr.security.HttpParamDelegationTokenPlugin$HttpParamToRequestFilter.doFilter(HttpParamDelegationTokenPlugin.java:245)
   [junit4]   2> 	at org.apache.solr.security.KerberosPlugin.doAuthenticate(KerberosPlugin.java:243)
   [junit4]   2> 	at org.apache.solr.servlet.SolrDispatchFilter.authenticateRequest(SolrDispatchFilter.java:451)
   [junit4]   2> 	at org.apache.solr.servlet.SolrDispatchFilter.doFilter(SolrDispatchFilter.java:347)
   [junit4]   2> 	at org.apache.solr.servlet.SolrDispatchFilter.doFilter(SolrDispatchFilter.java:326)
   [junit4]   2> 	at org.eclipse.jetty.servlet.ServletHandler$CachedChain.doFilter(ServletHandler.java:1759)
   [junit4]   2> 	at org.apache.solr.client.solrj.embedded.JettySolrRunner$DebugFilter.doFilter(JettySolrRunner.java:139)
   [junit4]   2> 	at org.eclipse.jetty.servlet.ServletHandler$CachedChain.doFilter(ServletHandler.java:1759)
   [junit4]   2> 	at org.eclipse.jetty.servlet.ServletHandler.doHandle(ServletHandler.java:582)
   [junit4]   2> 	at org.eclipse.jetty.server.session.SessionHandler.doHandle(SessionHandler.java:224)
   [junit4]   2> 	at org.eclipse.jetty.server.handler.ContextHandler.doHandle(ContextHandler.java:1180)
   [junit4]   2> 	at org.eclipse.jetty.servlet.ServletHandler.doScope(ServletHandler.java:512)
   [junit4]   2> 	at org.eclipse.jetty.server.session.SessionHandler.doScope(SessionHandler.java:185)
   [junit4]   2> 	at org.eclipse.jetty.server.handler.ContextHandler.doScope(ContextHandler.java:1112)
   [junit4]   2> 	at org.eclipse.jetty.server.handler.ScopedHandler.handle(ScopedHandler.java:141)
   [junit4]   2> 	at org.eclipse.jetty.server.handler.gzip.GzipHandler.handle(GzipHandler.java:493)
   [junit4]   2> 	at org.eclipse.jetty.server.handler.HandlerWrapper.handle(HandlerWrapper.java:134)
   [junit4]   2> 	at org.eclipse.jetty.server.Server.handle(Server.java:534)
   [junit4]   2> 	at org.eclipse.jetty.server.HttpChannel.handle(HttpChannel.java:320)
   [junit4]   2> 	at org.eclipse.jetty.server.HttpConnection.onFillable(HttpConnection.java:251)
   [junit4]   2> 	at org.eclipse.jetty.io.AbstractConnection$ReadCallback.succeeded(AbstractConnection.java:283)
   [junit4]   2> 	at org.eclipse.jetty.io.FillInterest.fillable(FillInterest.java:108)
   [junit4]   2> 	at org.eclipse.jetty.io.SelectChannelEndPoint$2.run(SelectChannelEndPoint.java:93)
   [junit4]   2> 	at org.eclipse.jetty.util.thread.strategy.ExecuteProduceConsume.executeProduceConsume(ExecuteProduceConsume.java:303)
   [junit4]   2> 	at org.eclipse.jetty.util.thread.strategy.ExecuteProduceConsume.produceConsume(ExecuteProduceConsume.java:148)
   [junit4]   2> 	at org.eclipse.jetty.util.thread.strategy.ExecuteProduceConsume.run(ExecuteProduceConsume.java:136)
   [junit4]   2> 	at org.eclipse.jetty.util.thread.QueuedThreadPool.runJob(QueuedThreadPool.java:671)
   [junit4]   2> 	at org.eclipse.jetty.util.thread.QueuedThreadPool$2.run(QueuedThreadPool.java:589)
   [junit4]   2> 	at java.lang.Thread.run(Thread.java:748)
   [junit4]   2> 1443728 WARN  (qtp934619849-11677) [n:127.0.0.1:45720_solr c:forwardingCollection s:shard1 r:core_node2 x:forwardingCollection_shard1_replica_n1] o.e.j.s.ServletHandler /solr/admin/collections
   [junit4]   2> org.apache.solr.common.SolrException: Error during request authentication, 
   [junit4]   2> 	at org.apache.solr.servlet.SolrDispatchFilter.authenticateRequest(SolrDispatchFilter.java:457)
   [junit4]   2> 	at org.apache.solr.servlet.SolrDispatchFilter.doFilter(SolrDispatchFilter.java:347)
   [junit4]   2> 	at org.apache.solr.servlet.SolrDispatchFilter.doFilter(SolrDispatchFilter.java:326)
   [junit4]   2> 	at org.eclipse.jetty.servlet.ServletHandler$CachedChain.doFilter(ServletHandler.java:1759)
   [junit4]   2> 	at org.apache.solr.client.solrj.embedded.JettySolrRunner$DebugFilter.doFilter(JettySolrRunner.java:139)
   [junit4]   2> 	at org.eclipse.jetty.servlet.ServletHandler$CachedChain.doFilter(ServletHandler.java:1759)
   [junit4]   2> 	at org.eclipse.jetty.servlet.ServletHandler.doHandle(ServletHandler.java:582)
   [junit4]   2> 	at org.eclipse.jetty.server.session.SessionHandler.doHandle(SessionHandler.java:224)
   [junit4]   2> 	at org.eclipse.jetty.server.handler.ContextHandler.doHandle(ContextHandler.java:1180)
   [junit4]   2> 	at org.eclipse.jetty.servlet.ServletHandler.doScope(ServletHandler.java:512)
   [junit4]   2> 	at org.eclipse.jetty.server.session.SessionHandler.doScope(SessionHandler.java:185)
   [junit4]   2> 	at org.eclipse.jetty.server.handler.ContextHandler.doScope(ContextHandler.java:1112)
   [junit4]   2> 	at org.eclipse.jetty.server.handler.ScopedHandler.handle(ScopedHandler.java:141)
   [junit4]   2> 	at org.eclipse.jetty.server.handler.gzip.GzipHandler.handle(GzipHandler.java:493)
   [junit4]   2> 	at org.eclipse.jetty.server.handler.HandlerWrapper.handle(HandlerWrapper.java:134)
   [junit4]   2> 	at org.eclipse.jetty.server.Server.handle(Server.java:534)
   [junit4]   2> 	at org.eclipse.jetty.server.HttpChannel.handle(HttpChannel.java:320)
   [junit4]   2> 	at org.eclipse.jetty.server.HttpConnection.onFillable(HttpConnection.java:251)
   [junit4]   2> 	at org.eclipse.jetty.io.AbstractConnection$ReadCallback.succeeded(AbstractConnection.java:283)
   [junit4]   2> 	at org.eclipse.jetty.io.FillInterest.fillable(FillInterest.java:108)
   [junit4]   2> 	at org.eclipse.jetty.io.SelectChannelEndPoint$2.run(SelectChannelEndPoint.java:93)
   [junit4]   2> 	at org.eclipse.jetty.util.thread.strategy.ExecuteProduceConsume.executeProduceConsume(ExecuteProduceConsume.java:303)
   [junit4]   2> 	at org.eclipse.jetty.util.thread.strategy.ExecuteProduceConsume.produceConsume(ExecuteProduceConsume.java:148)
   [junit4]   2> 	at org.eclipse.jetty.util.thread.strategy.ExecuteProduceConsume.run(ExecuteProduceConsume.java:136)
   [junit4]   2> 	at org.eclipse.jetty.util.thread.QueuedThreadPool.runJob(QueuedThreadPool.java:671)
   [junit4]   2> 	at org.eclipse.jetty.util.thread.QueuedThreadPool$2.run(QueuedThreadPool.java:589)
   [junit4]   2> 	at java.lang.Thread.run(Thread.java:748)
   [junit4]   2> Caused by: java.lang.IllegalArgumentException: userName is NULL, empty or contains a '&'
   [junit4]   2> 	at org.apache.hadoop.security.authentication.util.AuthToken.checkForIllegalArgument(AuthToken.java:87)
   [junit4]   2> 	at org.apache.hadoop.security.authentication.util.AuthToken.<init>(AuthToken.java:70)
   [junit4]   2> 	at org.apache.hadoop.security.authentication.server.AuthenticationToken.<init>(AuthenticationToken.java:58)
   [junit4]   2> 	at org.apache.solr.security.HttpParamDelegationTokenPlugin$HttpParamDelegationTokenAuthenticationHandler$HttpParamAuthenticationHandler.authenticate(HttpParamDelegationTokenPlugin.java:213)
   [junit4]   2> 	at org.apache.hadoop.security.token.delegation.web.DelegationTokenAuthenticationHandler.authenticate(DelegationTokenAuthenticationHandler.java:348)
   [junit4]   2> 	at org.apache.solr.security.RequestContinuesRecorderAuthenticationHandler.authenticate(RequestContinuesRecorderAuthenticationHandler.java:69)
   [junit4]   2> 	at org.apache.hadoop.security.authentication.server.AuthenticationFilter.doFilter(AuthenticationFilter.java:518)
   [junit4]   2> 	at org.apache.solr.security.DelegationTokenKerberosFilter.doFilter(DelegationTokenKerberosFilter.java:134)
   [junit4]   2> 	at org.apache.solr.security.HttpParamDelegationTokenPlugin$HttpParamToRequestFilter.doFilter(HttpParamDelegationTokenPlugin.java:245)
   [junit4]   2> 	at org.apache.solr.security.KerberosPlugin.doAuthenticate(KerberosPlugin.java:243)
   [junit4]   2> 	at org.apache.solr.servlet.SolrDispatchFilter.authenticateRequest(SolrDispatchFilter.java:451)
   [junit4]   2> 	... 26 more
   [junit4]   2> 1443734 INFO  (TEST-TestSolrCloudWithSecureImpersonation.testProxyNullProxyUser-seed#[C5F18D7E77876671]) [    ] o.a.s.SolrTestCaseJ4 ###Ending testProxyNullProxyUser
   [junit4]   2> 1444243 INFO  (TEST-TestSolrCloudWithSecureImpersonation.testProxyValidateHost-seed#[C5F18D7E77876671]) [    ] o.a.s.SolrTestCaseJ4 ###Starting testProxyValidateHost
   [junit4]   2> 1444246 INFO  (qtp934619849-11676) [n:127.0.0.1:45720_solr    ] o.a.s.h.a.CollectionsHandler Invoked Collection Action :list with params doAs=bar&action=LIST&wt=javabin&version=2 and sendToOCPQueue=true
   [junit4]   2> 1444246 INFO  (qtp934619849-11676) [n:127.0.0.1:45720_solr    ] o.a.s.s.HttpSolrCall [admin] webapp=null path=/admin/collections params={doAs=bar&action=LIST&wt=javabin&version=2} status=0 QTime=0
   [junit4]   2> 1444249 WARN  (TEST-TestSolrCloudWithSecureImpersonation.testProxyValidateHost-seed#[C5F18D7E77876671]) [    ] o.a.h.c.p.ResponseProcessCookies Invalid cookie header: "Set-Cookie: hadoop.auth="u=localHostAnyGroup&p=localHostAnyGroup&t=test&e=1508514047509&s=9HuvDckxZ0WoTHm6QAH4wdNLikA="; Path=/; Domain=127.0.0.1; Expires=      , 20-           -2017 15:40:47 GMT; HttpOnly". Invalid 'expires' attribute: , 20- -2017 15:40:47 GMT
   [junit4]   2> 1444249 INFO  (TEST-TestSolrCloudWithSecureImpersonation.testProxyValidateHost-seed#[C5F18D7E77876671]) [    ] o.a.s.SolrTestCaseJ4 ###Ending testProxyValidateHost
   [junit4]   2> 1444753 INFO  (TEST-TestSolrCloudWithSecureImpersonation.testProxyInvalidRemote-seed#[C5F18D7E77876671]) [    ] o.a.s.SolrTestCaseJ4 ###Starting testProxyInvalidRemote
   [junit4]   2> 1444794 WARN  (TEST-TestSolrCloudWithSecureImpersonation.testProxyInvalidRemote-seed#[C5F18D7E77876671]) [    ] o.a.h.c.p.ResponseProcessCookies Invalid cookie header: "Set-Cookie: hadoop.auth="u=localHostAnyGroup&p=localHostAnyGroup&t=test&e=1508514048017&s=p7fzfL7lw64JPjbNjY2xGpzuHdg="; Path=/; Domain=127.0.0.1; Expires=      , 20-           -2017 15:40:48 GMT; HttpOnly". Invalid 'expires' attribute: , 20- -2017 15:40:48 GMT
   [junit4]   2> 1444794 INFO  (TEST-TestSolrCloudWithSecureImpersonation.testProxyInvalidRemote-seed#[C5F18D7E77876671]) [    ] o.a.s.SolrTestCaseJ4 ###Ending testProxyInvalidRemote
   [junit4]   2> 1445230 INFO  (TEST-TestSolrCloudWithSecureImpersonation.testProxyValidateAnyHostAnyUser-seed#[C5F18D7E77876671]) [    ] o.a.s.SolrTestCaseJ4 ###Starting testProxyValidateAnyHostAnyUser
   [junit4]   2> 1445231 INFO  (qtp934619849-11665) [n:127.0.0.1:45720_solr    ] o.a.s.h.a.CollectionsHandler Invoked Collection Action :list with params doAs=bar&action=LIST&wt=javabin&version=2 and sendToOCPQueue=true
   [junit4]   2> 1445231 INFO  (qtp934619849-11665) [n:127.0.0.1:45720_solr    ] o.a.s.s.HttpSolrCall [admin] webapp=null path=/admin/collections params={doAs=bar&action=LIST&wt=javabin&version=2} status=0 QTime=0
   [junit4]   2> 1445231 WARN  (TEST-TestSolrCloudWithSecureImpersonation.testProxyValidateAnyHostAnyUser-seed#[C5F18D7E77876671]) [    ] o.a.h.c.p.ResponseProcessCookies Invalid cookie header: "Set-Cookie: hadoop.auth="u=anyHostAnyUser&p=anyHostAnyUser&t=test&e=1508514048494&s=VKFCltjND2PgjPhbwWhZn+QY008="; Path=/; Domain=127.0.0.1; Expires=      , 20-           -2017 15:40:48 GMT; HttpOnly". Invalid 'expires' attribute: , 20- -2017 15:40:48 GMT
   [junit4]   2> 1445231 INFO  (TEST-TestSolrCloudWithSecureImpersonation.testProxyValidateAnyHostAnyUser-seed#[C5F18D7E77876671]) [    ] o.a.s.SolrTestCaseJ4 ###Ending testProxyValidateAnyHostAnyUser
   [junit4]   2> 1445519 INFO  (TEST-TestSolrCloudWithSecureImpersonation.testProxyInvalidProxyUser-seed#[C5F18D7E77876671]) [    ] o.a.s.SolrTestCaseJ4 ###Starting testProxyInvalidProxyUser
   [junit4]   2> 1445531 WARN  (TEST-TestSolrCloudWithSecureImpersonation.testProxyInvalidProxyUser-seed#[C5F18D7E77876671]) [    ] o.a.h.c.p.ResponseProcessCookies Invalid cookie header: "Set-Cookie: hadoop.auth="u=bar&p=bar&t=test&e=1508514048784&s=aE85/na9YwEiOWdKF0Xc0K3ZpZ8="; Path=/; Domain=127.0.0.1; Expires=      , 20-           -2017 15:40:48 GMT; HttpOnly". Invalid 'expires' attribute: , 20- -2017 15:40:48 GMT
   [junit4]   2> 1445532 INFO  (TEST-TestSolrCloudWithSecureImpersonation.testProxyInvalidProxyUser-seed#[C5F18D7E77876671]) [    ] o.a.s.SolrTestCaseJ4 ###Ending testProxyInvalidProxyUser
   [junit4]   2> 1445819 INFO  (TEST-TestSolrCloudWithSecureImpersonation.testProxyNoConfigHosts-seed#[C5F18D7E77876671]) [    ] o.a.s.SolrTestCaseJ4 ###Starting testProxyNoConfigHosts
   [junit4]   2> 1445823 WARN  (TEST-TestSolrCloudWithSecureImpersonation.testProxyNoConfigHosts-seed#[C5F18D7E77876671]) [    ] o.a.h.c.p.ResponseProcessCookies Invalid cookie header: "Set-Cookie: hadoop.auth="u=noHosts&p=noHosts&t=test&e=1508514049084&s=Q063wZd3AGiM6X/vIQ1N9ANQUfI="; Path=/; Domain=127.0.0.1; Expires=      , 20-           -2017 15:40:49 GMT; HttpOnly". Invalid 'expires' attribute: , 20- -2017 15:40:49 GMT
   [junit4]   2> 1445824 INFO  (TEST-TestSolrCloudWithSecureImpersonation.testProxyNoConfigHosts-seed#[C5F18D7E77876671]) [    ] o.a.s.SolrTestCaseJ4 ###Ending testProxyNoConfigHosts
   [junit4]   2> 1446128 INFO  (TEST-TestSolrCloudWithSecureImpersonation.testProxyUnknownRemote-seed#[C5F18D7E77876671]) [    ] o.a.s.SolrTestCaseJ4 ###Starting testProxyUnknownRemote
   [junit4]   2> 1460636 WARN  (jetty-launcher-1627-thread-1-SendThread(127.0.0.1:61300)) [n:127.0.0.1:45720_solr    ] o.a.z.ClientCnxn Client session timed out, have not heard from server in 19220ms for sessionid 0x15f384c21bf0005
   [junit4]   2> 1460637 WARN  (jetty-launcher-1627-thread-2-SendThread(127.0.0.1:61300)) [n:127.0.0.1:62188_solr    ] o.a.z.ClientCnxn Client session timed out, have not heard from server in 19532ms for sessionid 0x15f384c21bf0008
   [junit4]   2> 1460637 WARN  (NIOServerCxn.Factory:0.0.0.0/0.0.0.0:0) [    ] o.a.z.s.NIOServerCnxn caught end of stream exception
   [junit4]   2> EndOfStreamException: Unable to read additional data from client sessionid 0x15f384c21bf0005, likely client has closed socket
   [junit4]   2> 	at org.apache.zookeeper.server.NIOServerCnxn.doIO(NIOServerCnxn.java:239)
   [junit4]   2> 	at org.apache.zookeeper.server.NIOServerCnxnFactory.run(NIOServerCnxnFactory.java:203)
   [junit4]   2> 	at java.lang.Thread.run(Thread.java:748)
   [junit4]   2> 1460637 WARN  (jetty-launcher-1627-thread-1-SendThread(127.0.0.1:61300)) [n:127.0.0.1:45720_solr    ] o.a.z.ClientCnxn Client session timed out, have not heard from server in 19533ms for sessionid 0x15f384c21bf0007
   [junit4]   2> 1460637 WARN  (NIOServerCxn.Factory:0.0.0.0/0.0.0.0:0) [    ] o.a.z.s.NIOServerCnxn caught end of stream exception
   [junit4]   2> EndOfStreamException: Unable to read additional data from client sessionid 0x15f384c21bf0008, likely client has closed socket
   [junit4]   2> 	at org.apache.zookeeper.server.NIOServerCnxn.doIO(NIOServerCnxn.java:239)
   [junit4]   2> 	at org.apache.zookeeper.server.NIOServerCnxnFactory.run(NIOServerCnxnFactory.java:203)
   [junit4]   2> 	at java.lang.Thread.run(Thread.java:748)
   [junit4]   2> 1460637 WARN  (jetty-launcher-1627-thread-2-SendThread(127.0.0.1:61300)) [n:127.0.0.1:62188_solr    ] o.a.z.ClientCnxn Client session timed out, have not heard from server in 15447ms for sessionid 0x15f384c21bf0006
   [junit4]   2> 1460642 WARN  (NIOServerCxn.Factory:0.0.0.0/0.0.0.0:0) [    ] o.a.z.s.NIOServerCnxn caught end of stream exception
   [junit4]   2> EndOfStreamException: Unable to read additional data from client sessionid 0x15f384c21bf0007, likely client has closed socket
   [junit4]   2> 	at org.apache.zookeeper.server.NIOServerCnxn.doIO(NIOServerCnxn.java:239)
   [junit4]   2> 	at org.apache.zookeeper.server.NIOServerCnxnFactory.run(NIOServerCnxnFactory.java:203)
   [junit4]   2> 	at java.lang.Thread.run(Thread.java:748)
   [junit4]   2> 1460642 WARN  (NIOServerCxn.Factory:0.0.0.0/0.0.0.0:0) [    ] o.a.z.s.NIOServerCnxn caught end of stream exception
   [junit4]   2> EndOfStreamException: Unable to read additional data from client sessionid 0x15f384c21bf0006, likely client has closed socket
   [junit4]   2> 	at org.apache.zookeeper.server.NIOServerCnxn.doIO(NIOServerCnxn.java:239)
   [junit4]   2> 	at org.apache.zookeeper.server.NIOServerCnxnFactory.run(NIOServerCnxnFactory.java:203)
   [junit4]   2> 	at java.lang.Thread.run(Thread.java:748)
   [junit4]   2> 1460647 WARN  (TEST-TestSolrCloudWithSecureImpersonation.testProxyUnknownRemote-seed#[C5F18D7E77876671]) [    ] o.a.h.c.p.ResponseProcessCookies Invalid cookie header: "Set-Cookie: hadoop.auth="u=localHostAnyGroup&p=localHostAnyGroup&t=test&e=1508514049392&s=Q0ooKHe7dp6xlUjRG/tHHGD3BSc="; Path=/; Domain=127.0.0.1; Expires=      , 20-           -2017 15:40:49 GMT; HttpOnly". Invalid 'expires' attribute: , 20- -2017 15:40:49 GMT
   [junit4]   2> 1460647 INFO  (TEST-TestSolrCloudWithSecureImpersonation.testProxyUnknownRemote-seed#[C5F18D7E77876671]) [    ] o.a.s.SolrTestCaseJ4 ###Ending testProxyUnknownRemote
   [junit4]   2> 1460737 WARN  (zkCallback-1638-thread-2-processing-n:127.0.0.1:45720_solr) [n:127.0.0.1:45720_solr    ] o.a.s.c.c.ConnectionManager Watcher org.apache.solr.common.cloud.ConnectionManager@708a6bc4 name: ZooKeeperConnection Watcher:127.0.0.1:61300/solr got event WatchedEvent state:Disconnected type:None path:null path: null type: None
   [junit4]   2> 1460737 WARN  (zkCallback-1638-thread-2-processing-n:127.0.0.1:45720_solr) [n:127.0.0.1:45720_solr    ] o.a.s.c.c.ConnectionManager zkClient has disconnected
   [junit4]   2> 1460743 INFO  (jetty-closer-1628-thread-1) [    ] o.e.j.s.AbstractConnector Stopped ServerConnector@5ae0e368{HTTP/1.1,[http/1.1]}{127.0.0.1:0}
   [junit4]   2> 1460751 INFO  (jetty-closer-1628-thread-1) [    ] o.a.s.c.CoreContainer Shutting down CoreContainer instance=467656800
   [junit4]   2> 1460752 INFO  (jetty-closer-1628-thread-2) [    ] o.e.j.s.AbstractConnector Stopped ServerConnector@231957b6{HTTP/1.1,[http/1.1]}{127.0.0.1:0}
   [junit4]   2> 1460757 INFO  (jetty-closer-1628-thread-2) [    ] o.a.s.c.CoreContainer Shutting down CoreContainer instance=7958494
   [junit4]   2> 1460758 WARN  (zkCallback-1639-thread-2-processing-n:127.0.0.1:62188_solr) [n:127.0.0.1:62188_solr    ] o.a.s.c.c.ConnectionManager Watcher org.apache.solr.common.cloud.ConnectionManager@2d7dea6c name: ZooKeeperConnection Watcher:127.0.0.1:61300/solr got event WatchedEvent state:Disconnected type:None path:null path: null type: None
   [junit4]   2> 1460758 WARN  (zkCallback-1639-thread-2-processing-n:127.0.0.1:62188_solr) [n:127.0.0.1:62188_solr    ] o.a.s.c.c.ConnectionManager zkClient has disconnected
   [junit4]   2> 1460760 INFO  (jetty-closer-1628-thread-2) [    ] o.a.s.m.SolrMetricManager Closing metric reporters for registry=solr.node, tag=null
   [junit4]   2> 1460760 INFO  (jetty-closer-1628-thread-2) [    ] o.a.s.m.r.SolrJmxReporter Closing reporter [org.apache.solr.metrics.reporters.SolrJmxReporter@666347ab: rootName = solr_62188, domain = solr.node, service url = null, agent id = null] for registry solr.node / com.codahale.metrics.MetricRegistry@32a289f2
   [junit4]   2> 1460760 INFO  (jetty-closer-1628-thread-1) [    ] o.a.s.m.SolrMetricManager Closing metric reporters for registry=solr.node, tag=null
   [junit4]   2> 1460760 INFO  (jetty-closer-1628-thread-1) [    ] o.a.s.m.r.SolrJmxReporter Closing reporter [org.apache.solr.metrics.reporters.SolrJmxReporter@4579743e: rootName = solr_45720, domain = solr.node, service url = null, agent id = null] for registry solr.node / com.codahale.metrics.MetricRegistry@4e14e8ed
   [junit4]   2> 1460862 INFO  (jetty-closer-1628-thread-2) [    ] o.a.s.m.SolrMetricManager Closing metric reporters for registry=solr.jvm, tag=null
   [junit4]   2> 1460863 INFO  (jetty-closer-1628-thread-2) [    ] o.a.s.m.r.SolrJmxReporter Closing reporter [org.apache.solr.metrics.reporters.SolrJmxReporter@145cac59: rootName = solr_62188, domain = solr.jvm, service url = null, agent id = null] for registry solr.jvm / com.codahale.metrics.MetricRegistry@464cd5fa
   [junit4]   2> 1460864 INFO  (jetty-closer-1628-thread-1) [    ] o.a.s.m.SolrMetricManager Closing metric reporters for registry=solr.jvm, tag=null
   [junit4]   2> 1460864 INFO  (jetty-closer-1628-thread-1) [    ] o.a.s.m.r.SolrJmxReporter Closing reporter [org.apache.solr.metrics.reporters.SolrJmxReporter@7451db09: rootName = solr_45720, domain = solr.jvm, service url = null, agent id = null] for registry solr.jvm / com.codahale.metrics.MetricRegistry@464cd5fa
   [junit4]   2> 1460876 INFO  (jetty-closer-1628-thread-2) [    ] o.a.s.m.SolrMetricManager Closing metric reporters for registry=solr.jetty, tag=null
   [junit4]   2> 1460876 INFO  (jetty-closer-1628-thread-2) [    ] o.a.s.m.r.SolrJmxReporter Closing reporter [org.apache.solr.metrics.reporters.SolrJmxReporter@6617fad7: rootName = solr_62188, domain = solr.jetty, service url = null, agent id = null] for registry solr.jetty / com.codahale.metrics.MetricRegistry@427359eb
   [junit4]   2> 1460879 INFO  (jetty-closer-1628-thread-1) [    ] o.a.s.m.SolrMetricManager Closing metric reporters for registry=solr.jetty, tag=null
   [junit4]   2> 1460879 INFO  (jetty-closer-1628-thread-1) [    ] o.a.s.m.r.SolrJmxReporter Closing reporter [org.apache.solr.metrics.reporters.SolrJmxReporter@783049a: rootName = solr_45720, domain = solr.jetty, service url = null, agent id = null] for registry solr.jetty / com.codahale.metrics.MetricRegistry@427359eb
   [junit4]   2> 1461786 WARN  (jetty-launcher-1627-thread-1-SendThread(127.0.0.1:61300)) [n:127.0.0.1:45720_solr    ] o.a.z.ClientCnxn Unable to reconnect to ZooKeeper service, session 0x15f384c21bf0005 has expired
   [junit4]   2> 1461786 WARN  (zkCallback-1638-thread-5-processing-n:127.0.0.1:45720_solr) [n:127.0.0.1:45720_solr    ] o.a.s.c.c.ConnectionManager Watcher org.apache.solr.common.cloud.ConnectionManager@708a6bc4 name: ZooKeeperConnection Watcher:127.0.0.1:61300/solr got event WatchedEvent state:Expired type:None path:null path: null type: None
   [junit4]   2> 1461786 WARN  (zkCallback-1638-thread-5-processing-n:127.0.0.1:45720_solr) [n:127.0.0.1:45720_solr    ] o.a.s.c.c.ConnectionManager Our previous ZooKeeper session was expired. Attempting to reconnect to recover relationship with ZooKeeper...
   [junit4]   2> 1461786 WARN  (zkCallback-1638-thread-5-processing-n:127.0.0.1:45720_solr) [n:127.0.0.1:45720_solr    ] o.a.s.c.c.DefaultConnectionStrategy Connection expired - starting a new one...
   [junit4]   2> 1461789 INFO  (zkCallback-1638-thread-5-processing-n:127.0.0.1:45720_solr) [n:127.0.0.1:45720_solr    ] o.a.s.c.c.ConnectionManager Connection with ZooKeeper reestablished.
   [junit4]   2> 1461789 INFO  (zkCallback-1638-thread-5-processing-n:127.0.0.1:45720_solr) [n:127.0.0.1:45720_solr    ] o.a.s.c.ZkController ZooKeeper session re-connected ... refreshing core states after session expiration.
   [junit4]   2> 1461790 INFO  (zkCallback-1638-thread-5-processing-n:127.0.0.1:45720_solr) [n:127.0.0.1:45720_solr    ] o.a.s.c.c.ZkStateReader Updated live nodes from ZooKeeper... (2) -> (1)
   [junit4]   2> 1461799 INFO  (zkCallback-1638-thread-5-processing-n:127.0.0.1:45720_solr) [n:127.0.0.1:45720_solr    ] o.a.s.c.ZkController Register node as live in ZooKeeper:/live_nodes/127.0.0.1:45720_solr
   [junit4]   2> 1461800 INFO  (zkCallback-1638-thread-5-processing-n:127.0.0.1:45720_solr) [n:127.0.0.1:45720_solr    ] o.a.s.c.c.DefaultConnectionStrategy Reconnected to ZooKeeper
   [junit4]   2> 1461800 INFO  (zkCallback-1638-thread-5-processing-n:127.0.0.1:45720_solr) [n:127.0.0.1:45720_solr    ] o.a.s.c.c.ConnectionManager Connected:true
   [junit4]   2> 1461801 INFO  (coreZkRegister-4798-thread-1-processing-n:127.0.0.1:45720_solr) [n:127.0.0.1:45720_solr    ] o.a.s.c.ZkController Registering core forwardingCollection_shard1_replica_n1 afterExpiration? true
   [junit4]   2> 1461801 INFO  (zkCallback-1638-thread-7-processing-n:127.0.0.1:45720_solr) [n:127.0.0.1:45720_solr    ] o.a.s.c.c.ZkStateReader Updated live nodes from ZooKeeper... (1) -> (2)
   [junit4]   2> 1461802 INFO  (Thread-2124) [n:127.0.0.1:45720_solr    ] o.a.s.c.SolrCore config update listener called for core forwardingCollection_shard1_replica_n1
   [junit4]   2> 1461802 INFO  (coreZkRegister-4798-thread-1-processing-n:127.0.0.1:45720_solr) [n:127.0.0.1:45720_solr c:forwardingCollection s:shard1 r:core_node2 x:forwardingCollection_shard1_replica_n1] o.a.s.c.ActionThrottle The last leader attempt started 27327ms ago.
   [junit4]   2> 1461802 INFO  (coreZkRegister-4798-thread-1-processing-n:127.0.0.1:45720_solr) [n:127.0.0.1:45720_solr c:forwardingCollection s:shard1 r:core_node2 x:forwardingCollection_shard1_replica_n1] o.a.s.c.ShardLeaderElectionContext I may be the new leader - try and sync
   [junit4]   2> 1461803 INFO  (coreZkRegister-4798-thread-1-processing-n:127.0.0.1:45720_solr) [n:127.0.0.1:45720_solr c:forwardingCollection s:shard1 r:core_node2 x:forwardingCollection_shard1_replica_n1] o.a.s.c.SyncStrategy Sync replicas to http://127.0.0.1:45720/solr/forwardingCollection_shard1_replica_n1/
   [junit4]   2> 1461803 INFO  (coreZkRegister-4798-thread-1-processing-n:127.0.0.1:45720_solr) [n:127.0.0.1:45720_solr c:forwardingCollection s:shard1 r:core_node2 x:forwardingCollection_shard1_replica_n1] o.a.s.c.SyncStrategy Sync Success - now sync replicas to me
   [junit4]   2> 1461803 INFO  (coreZkRegister-4798-thread-1-processing-n:127.0.0.1:45720_solr) [n:127.0.0.1:45720_solr c:forwardingCollection s:shard1 r:core_node2 x:forwardingCollection_shard1_replica_n1] o.a.s.c.SyncStrategy http://127.0.0.1:45720/solr/forwardingCollection_shard1_replica_n1/ has no replicas
   [junit4]   2> 1461805 INFO  (coreZkRegister-4798-thread-1-processing-n:127.0.0.1:45720_solr) [n:127.0.0.1:45720_solr c:forwardingCollection s:shard1 r:core_node2 x:forwardingCollection_shard1_replica_n1] o.a.s.c.ShardLeaderElectionContext I am the new leader: http://127.0.0.1:45720/solr/forwardingCollection_shard1_replica_n1/ shard1
   [junit4]   2> 1461806 INFO  (coreZkRegister-4798-thread-1-processing-n:127.0.0.1:45720_solr) [n:127.0.0.1:45720_solr c:forwardingCollection s:shard1 r:core_node2 x:forwardingCollection_shard1_replica_n1] o.a.s.c.ZkController I am the leader, no recovery necessary
   [junit4]   2> 1461888 ERROR (jetty-closer-1628-thread-1) [    ] o.a.s.c.Overseer Could not create Overseer node
   [junit4]   2> org.apache.zookeeper.KeeperException$SessionExpiredException: KeeperErrorCode = Session expired for /overseer
   [junit4]   2> 	at org.apache.zookeeper.KeeperException.create(KeeperException.java:127)
   [junit4]   2> 	at org.apache.zookeeper.KeeperException.create(KeeperException.java:51)
   [junit4]   2> 	at org.apache.zookeeper.ZooKeeper.create(ZooKeeper.java:783)
   [junit4]   2> 	at org.apache.solr.common.cloud.SolrZkClient$9.execute(SolrZkClient.java:392)
   [junit4]   2> 	at org.apache.solr.common.cloud.SolrZkClient$9.execute(SolrZkClient.java:389)
   [junit4]   2> 	at org.apache.solr.common.cloud.ZkCmdExecutor.retryOperation(ZkCmdExecutor.java:60)
   [junit4]   2> 	at org.apache.solr.common.cloud.SolrZkClient.create(SolrZkClient.java:389)
   [junit4]   2> 	at org.apache.solr.cloud.Overseer.createOverseerNode(Overseer.java:765)
   [junit4]   2> 	at org.apache.solr.cloud.Overseer.getStateUpdateQueue(Overseer.java:638)
   [junit4]   2> 	at org.apache.solr.cloud.Overseer.getStateUpdateQueue(Overseer.java:625)
   [junit4]   2> 	at org.apache.solr.cloud.ZkController.publishNodeAsDown(ZkController.java:2642)
   [junit4]   2> 	at org.apache.solr.core.CoreContainer.shutdown(CoreContainer.java:745)
   [junit4]   2> 	at org.apache.solr.servlet.SolrDispatchFilter.destroy(SolrDispatchFilter.java:317)
   [junit4]   2> 	at org.eclipse.jetty.servlet.FilterHolder.destroyInstance(FilterHolder.java:178)
   [junit4]   2> 	at org.eclipse.jetty.servlet.FilterHolder.doStop(FilterHolder.java:155)
   [junit4]   2> 	at org.eclipse.jetty.util.component.AbstractLifeCycle.stop(AbstractLifeCycle.java:89)
   [junit4]   2> 	at org.eclipse.jetty.servlet.ServletHandler.doStop(ServletHandler.java:238)
   [junit4]   2> 	at org.eclipse.jetty.util.component.AbstractLifeCycle.stop(AbstractLifeCycle.java:89)
   [junit4]   2> 	at org.eclipse.jetty.util.component.ContainerLifeCycle.stop(ContainerLifeCycle.java:142)
   [junit4]   2> 	at org.eclipse.jetty.util.component.ContainerLifeCycle.doStop(ContainerLifeCycle.java:160)
   [junit4]   2> 	at org.eclipse.jetty.server.handler.AbstractHandler.doStop(AbstractHandler.java:73)
   [junit4]   2> 	at org.eclipse.jetty.server.session.SessionHandler.doStop(SessionHandler.java:127)
   [junit4]   2> 	at org.eclipse.jetty.util.component.AbstractLifeCycle.stop(AbstractLifeCycle.java:89)
   [junit4]   2> 	at org.eclipse.jetty.util.component.ContainerLifeCycle.stop(ContainerLifeCycle.java:142)
   [junit4]   2> 	at org.eclipse.jetty.util.component.ContainerLifeCycle.doStop(ContainerLifeCycle.java:160)
   [junit4]   2> 	at org.eclipse.jetty.server.handler.AbstractHandler.doStop(AbstractHandler.java:73)
   [junit4]   2> 	at org.eclipse.jetty.server.handler.ContextHandler.stopContext(ContextHandler.java:825)
   [junit4]   2> 	at org.eclipse.jetty.servlet.ServletContextHandler.stopContext(ServletContextHandler.java:356)
   [junit4]   2> 	at org.eclipse.jetty.server.handler.ContextHandler.doStop(ContextHandler.java:880)
   [junit4]   2> 	at org.eclipse.jetty.servlet.ServletContextHandler.doStop(ServletContextHandler.java:272)
   [junit4]   2> 	at org.eclipse.jetty.util.component.AbstractLifeCycle.stop(AbstractLifeCycle.java:89)
   [junit4]   2> 	at org.eclipse.jetty.util.component.ContainerLifeCycle.stop(ContainerLifeCycle.java:142)
   [junit4]   2> 	at org.eclipse.jetty.util.component.ContainerLifeCycle.doStop(ContainerLifeCycle.java:160)
   [junit4]   2> 	at org.eclipse.jetty.server.handler.AbstractHandler.doStop(AbstractHandler.java:73)
   [junit4]   2> 	at org.eclipse.jetty.util.component.AbstractLifeCycle.stop(AbstractLifeCycle.java:89)
   [junit4]   2> 	at org.eclipse.jetty.util.component.ContainerLifeCycle.stop(ContainerLifeCycle.java:142)
   [junit4]   2> 	at org.eclipse.jetty.util.component.ContainerLifeCycle.doStop(ContainerLifeCycle.java:160)
   [junit4]   2> 	at org.eclipse.jetty.server.handler.AbstractHandler.doStop(AbstractHandler.java:73)
   [junit4]   2> 	at org.eclipse.jetty.server.Server.doStop(Server.java:493)
   [junit4]   2> 	at org.eclipse.jetty.util.component.AbstractLifeCycle.stop(AbstractLifeCycle.java:89)
   [junit4]   2> 	at org.apache.solr.client.solrj.embedded.JettySolrRunner.stop(JettySolrRunner.java:428)
   [junit4]   2> 	at org.apache.solr.cloud.MiniSolrCloudCluster.stopJettySolrRunner(MiniSolrCloudCluster.java:423)
   [junit4]   2> 	at org.apache.solr.cloud.MiniSolrCloudCluster.lambda$shutdown$1(MiniSolrCloudCluster.java:460)
   [junit4]   2> 	at java.util.concurrent.FutureTask.run(FutureTask.java:266)
   [junit4]   2> 	at org.apache.solr.common.util.ExecutorUtil$MDCAwareThreadPoolExecutor.lambda$execute$0(ExecutorUtil.java:188)
   [junit4]   2> 	at java.util.concurrent.ThreadPoolExecutor.runWorker(ThreadPoolExecutor.java:1149)
   [junit4]   2> 	at java.util.concurrent.ThreadPoolExecutor$Worker.run(ThreadPoolExecutor.java:624)
   [junit4]   2> 	at java.lang.Thread.run(Thread.java:748)
   [junit4]   2> 1461888 WARN  (jetty-closer-1628-thread-1) [    ] o.a.s.c.ZkController Could not publish node as down: org.apache.zookeeper.KeeperException$SessionExpiredException: KeeperErrorCode = Session expired for /overseer
   [junit4]   2> 1461888 INFO  (jetty-closer-1628-thread-1) [    ] o.a.s.c.ZkController Remove node as live in ZooKeeper:/live_nodes/127.0.0.1:45720_solr
   [junit4]   2> 1461890 INFO  (jetty-closer-1628-thread-1) [    ] o.a.s.m.SolrMetricManager Closing metric reporters for registry=solr.cluster, tag=null
   [junit4]   2> 1461894 INFO  (coreCloseExecutor-4819-thread-1) [n:127.0.0.1:45720_solr c:forwardingCollection s:shard1 r:core_node2 x:forwardingCollection_shard1_replica_n1] o.a.s.c.SolrCore [forwardingCollection_shard1_replica_n1]  CLOSING SolrCore org.apache.solr.core.SolrCore@7fbf56bc
   [junit4]   2> 1461894 INFO  (zkCallback-1638-thread-7-processing-n:127.0.0.1:45720_solr) [n:127.0.0.1:45720_solr    ] o.a.s.c.c.ZkStateReader Updated live nodes from ZooKeeper... (2) -> (1)
   [junit4]   2> 1461894 INFO  (coreCloseExecutor-4819-thread-1) [n:127.0.0.1:45720_solr c:forwardingCollection s:shard1 r:core_node2 x:forwardingCollection_shard1_replica_n1] o.a.s.m.SolrMetricManager Closing metric reporters for registry=solr.core.forwardingCollection.shard1.replica_n1, tag=2143246012
   [junit4]   2> 1461894 INFO  (coreCloseExecutor-4819-thread-1) [n:127.0.0.1:45720_solr c:forwardingCollection s:shard1 r:core_node2 x:forwardingCollection_shard1_replica_n1] o.a.s.m.r.SolrJmxReporter Closing reporter [org.apache.solr.metrics.reporters.SolrJmxReporter@4ed944ca: rootName = solr_45720, domain = solr.core.forwardingCollection.shard1.replica_n1, service url = null, agent id = null] for registry solr.core.forwardingCollection.shard1.replica_n1 / com.codahale.metrics.MetricRegistry@786f6af6
   [junit4]   2> 1461929 INFO  (coreCloseExecutor-4819-thread-1) [n:127.0.0.1:45720_solr c:forwardingCollection s:shard1 r:core_node2 x:forwardingCollection_shard1_replica_n1] o.a.s.m.SolrMetricManager Closing metric reporters for registry=solr.collection.forwardingCollection.shard1.leader, tag=2143246012
   [junit4]   2> 1461937 ERROR (Thread[Thread-2114,5,TGRP-TestSolrCloudWithSecureImpersonation]) [n:127.0.0.1:45720_solr    ] o.a.h.s.t.d.AbstractDelegationTokenSecretManager ExpiredTokenRemover received java.lang.InterruptedException: sleep interrupted
   [junit4]   2> 1462274 WARN  (jetty-launcher-1627-thread-1-SendThread(127.0.0.1:61300)) [n:127.0.0.1:45720_solr    ] o.a.z.ClientCnxn Unable to reconnect to ZooKeeper service, session 0x15f384c21bf0007 has expired
   [junit4]   2> 1462287 WARN  (jetty-launcher-1627-thread-2-SendThread(127.0.0.1:61300)) [n:127.0.0.1:62188_solr    ] o.a.z.ClientCnxn Unable to reconnect to ZooKeeper service, session 0x15f384c21bf0008 has expired
   [junit4]   2> 1462384 INFO  (jetty-closer-1628-thread-1) [    ] o.e.j.s.h.ContextHandler Stopped o.e.j.s.ServletContextHandler@682e51a9{/solr,null,UNAVAILABLE}
   [junit4]   2> 1462649 INFO  (zkCallback-1639-thread-6-processing-n:127.0.0.1:62188_solr) [n:127.0.0.1:62188_solr    ] o.a.s.c.c.ZkStateReader Updated live nodes from ZooKeeper... (2) -> (1)
   [junit4]   2> 1462651 INFO  (jetty-closer-1628-thread-2) [    ] o.a.s.c.ZkController Remove node as live in ZooKeeper:/live_nodes/127.0.0.1:62188_solr
   [junit4]   2> 1462652 INFO  (jetty-closer-1628-thread-2) [    ] o.a.s.m.SolrMetricManager Closing metric reporters for registry=solr.cluster, tag=null
   [junit4]   2> 1462652 INFO  (zkCallback-1639-thread-6-processing-n:127.0.0.1:62188_solr) [n:127.0.0.1:62188_solr    ] o.a.s.c.c.ZkStateReader Updated live nodes from ZooKeeper... (1) -> (0)
   [junit4]   2> 1462663 INFO  (jetty-closer-1628-thread-2) [    ] o.a.s.c.Overseer Overseer (id=98859616460275718-127.0.0.1:62188_solr-n_0000000000) closing
   [junit4]   2> 1462663 INFO  (OverseerStateUpdate-98859616460275718-127.0.0.1:62188_solr-n_0000000000) [n:127.0.0.1:62188_solr    ] o.a.s.c.Overseer Overseer Loop exiting : 127.0.0.1:62188_solr
   [junit4]   2> 1462664 WARN  (OverseerAutoScalingTriggerThread-98859616460275718-127.0.0.1:62188_solr-n_0000000000) [n:127.0.0.1:62188_solr    ] o.a.s.c.a.OverseerTriggerThread OverseerTriggerThread woken up but we are closed, exiting.
   [junit4]   2> 1462685 ERROR (Thread[Thread-2116,5,TGRP-TestSolrCloudWithSecureImpersonation]) [n:127.0.0.1:62188_solr    ] o.a.h.s.t.d.AbstractDelegationTokenSecretManager ExpiredTokenRemover received java.lang.InterruptedException: sleep interrupted
   [junit4]   2> 1462704 INFO  (jetty-closer-1628-thread-2) [    ] o.e.j.s.h.ContextHandler Stopped o.e.j.s.ServletContextHandler@1aaaeb1b{/solr,null,UNAVAILABLE}
   [junit4]   2> 1462711 ERROR (SUITE-TestSolrCloudWithSecureImpersonation-seed#[C5F18D7E77876671]-worker) [    ] o.a.z.s.ZooKeeperServer ZKShutdownHandler is not registered, so ZooKeeper server won't take any action on ERROR or SHUTDOWN server state changes
   [junit4]   2> 1462717 INFO  (SUITE-TestSolrCloudWithSecureImpersonation-seed#[C5F18D7E77876671]-worker) [    ] o.a.s.c.ZkTestServer connecting to 127.0.0.1:61300 61300
   [junit4]   2> 1468791 INFO  (Thread-2091) [    ] o.a.s.c.ZkTestServer connecting to 127.0.0.1:61300 61300
   [junit4]   2> 1468799 WARN  (Thread-2091) [    ] o.a.s.c.ZkTestServer Watch limit violations: 
   [junit4]   2> Maximum concurrent create/delete watches above limit:
   [junit4]   2> 
   [junit4]   2> 	4	/solr/aliases.json
   [junit4]   2> 	4	/solr/clusterprops.json
   [junit4]   2> 	3	/solr/security.json
   [junit4]   2> 	2	/solr/configs/conf1
   [junit4]   2> 
   [junit4]   2> Maximum concurrent data watches above limit:
   [junit4]   2> 
   [junit4]   2> 	6	/solr/collections/forwardingCollection/state.json
   [junit4]   2> 	4	/solr/security/zkdtsm/ZKDTSMRoot/ZKDTSMKeyIdRoot
   [junit4]   2> 	4	/solr/clusterstate.json
   [junit4]   2> 	2	/solr/security/zkdtsm/ZKDTSMRoot/ZKDTSMMasterKeyRoot/DK_1
   [junit4]   2> 	2	/solr/security/zkdtsm/ZKDTSMRoot/ZKDTSMMasterKeyRoot/DK_3
   [junit4]   2> 	2	/solr/overseer_elect/election/98859616460275718-127.0.0.1:62188_solr-n_0000000000
   [junit4]   2> 	2	/solr/security/zkdtsm/ZKDTSMRoot/ZKDTSMMasterKeyRoot/DK_2
   [junit4]   2> 	2	/solr/security/zkdtsm/ZKDTSMRoot/ZKDTSMMasterKeyRoot/DK_4
   [junit4]   2> 	2	/solr/security/zkdtsm/ZKDTSMRoot/ZKDTSMSeqNumRoot
   [junit4]   2> 
   [junit4]   2> Maximum concurrent children watches above limit:
   [junit4]   2> 
   [junit4]   2> 	4	/solr/live_nodes
   [junit4]   2> 	4	/solr/collections
   [junit4]   2> 	2	/solr/security/zkdtsm/ZKDTSMRoot/ZKDTSMMasterKeyRoot
   [junit4]   2> 	2	/solr/security/zkdtsm/ZKDTSMRoot/ZKDTSMTokensRoot
   [junit4]   2> 
   [junit4]   2> 1468835 INFO  (SUITE-TestSolrCloudWithSecureImpersonation-seed#[C5F18D7E77876671]-worker) [    ] o.a.s.SolrTestCaseJ4 ------------------------------------------------------- Done waiting for tracked resources to be released
   [junit4]   2> Oct 20, 2017 5:41:12 AM com.carrotsearch.randomizedtesting.ThreadLeakControl checkThreadLeaks
   [junit4]   2> WARNING: Will linger awaiting termination of 2 leaked thread(s).
   [junit4]   2> Oct 20, 2017 5:41:32 AM com.carrotsearch.randomizedtesting.ThreadLeakControl checkThreadLeaks
   [junit4]   2> SEVERE: 2 threads leaked from SUITE scope at org.apache.solr.cloud.TestSolrCloudWithSecureImpersonation: 
   [junit4]   2>    1) Thread[id=11721, name=jetty-launcher-1627-thread-1-EventThread, state=TIMED_WAITING, group=TGRP-TestSolrCloudWithSecureImpersonation]
   [junit4]   2>         at sun.misc.Unsafe.park(Native Method)
   [junit4]   2>         at java.util.concurrent.locks.LockSupport.parkNanos(LockSupport.java:215)
   [junit4]   2>         at java.util.concurrent.locks.AbstractQueuedSynchronizer.doAcquireSharedNanos(AbstractQueuedSynchronizer.java:1037)
   [junit4]   2>         at java.util.concurrent.locks.AbstractQueuedSynchronizer.tryAcquireSharedNanos(AbstractQueuedSynchronizer.java:1328)
   [junit4]   2>         at java.util.concurrent.CountDownLatch.await(CountDownLatch.java:277)
   [junit4]   2>         at org.apache.curator.CuratorZookeeperClient.internalBlockUntilConnectedOrTimedOut(CuratorZookeeperClient.java:323)
   [junit4]   2>         at org.apache.curator.RetryLoop.callWithRetry(RetryLoop.java:105)
   [junit4]   2>         at org.apache.curator.framework.imps.GetDataBuilderImpl.pathInForeground(GetDataBuilderImpl.java:288)
   [junit4]   2>         at org.apache.curator.framework.imps.GetDataBuilderImpl.forPath(GetDataBuilderImpl.java:279)
   [junit4]   2>         at org.apache.curator.framework.imps.GetDataBuilderImpl.forPath(GetDataBuilderImpl.java:41)
   [junit4]   2>         at org.apache.curator.framework.recipes.shared.SharedValue.readValue(SharedValue.java:244)
   [junit4]   2>         at org.apache.curator.framework.recipes.shared.SharedValue.access$100(SharedValue.java:44)
   [junit4]   2>         at org.apache.curator.framework.recipes.shared.SharedValue$1.process(SharedValue.java:61)
   [junit4]   2>         at org.apache.curator.framework.imps.NamespaceWatcher.process(NamespaceWatcher.java:67)
   [junit4]   2>         at org.apache.zookeeper.ClientCnxn$EventThread.processEvent(ClientCnxn.java:530)
   [junit4]   2>         at org.apache.zookeeper.ClientCnxn$EventThread.run(ClientCnxn.java:505)
   [junit4]   2>    2) Thread[id=11722, name=jetty-launcher-1627-thread-2-EventThread, state=TIMED_WAITING, group=TGRP-TestSolrCloudWithSecureImpersonation]
   [junit4]   2>         at sun.misc.Unsafe.park(Native Method)
   [junit4]   2>         at java.util.concurrent.locks.LockSupport.parkNanos(LockSupport.java:215)
   [junit4]   2>         at java.util.concurrent.locks.AbstractQueuedSynchronizer.doAcquireSharedNanos(AbstractQueuedSynchronizer.java:1037)
   [junit4]   2>         at java.util.concurrent.locks.AbstractQueuedSynchronizer.tryAcquireSharedNanos(AbstractQueuedSynchronizer.java:1328)
   [junit4]   2>         at java.util.concurrent.CountDownLatch.await(CountDownLatch.java:277)
   [junit4]   2>         at org.apache.curator.CuratorZookeeperClient.internalBlockUntilConnectedOrTimedOut(CuratorZookeeperClient.java:323)
   [junit4]   2>         at org.apache.curator.RetryLoop.callWithRetry(RetryLoop.java:105)
   [junit4]   2>         at org.apache.curator.framework.imps.GetDataBuilderImpl.pathInForeground(GetDataBuilderImpl.java:288)
   [junit4]   2>         at org.apache.curator.framework.imps.GetDataBuilderImpl.forPath(GetDataBuilderImpl.java:279)
   [junit4]   2>         at org.apache.curator.framework.imps.GetDataBuilderImpl.forPath(GetDataBuilderImpl.java:41)
   [junit4]   2>         at org.apache.curator.framework.recipes.shared.SharedValue.readValue(SharedValue.java:244)
   [junit4]   2>         at org.apache.curator.framework.recipes.shared.SharedValue.access$100(SharedValue.java:44)
   [junit4]   2>         at org.apache.curator.framework.recipes.shared.SharedValue$1.process(SharedValue.java:61)
   [junit4]   2>         at org.apache.curator.framework.imps.NamespaceWatcher.process(NamespaceWatcher.java:67)
   [junit4]   2>         at org.apache.zookeeper.ClientCnxn$EventThread.processEvent(ClientCnxn.java:530)
   [junit4]   2>         at org.apache.zookeeper.ClientCnxn$EventThread.run(ClientCnxn.java:505)
   [junit4]   2> Oct 20, 

[...truncated too long message...]

l.java:279)
   [junit4]   2> 	at org.apache.curator.framework.imps.GetDataBuilderImpl.forPath(GetDataBuilderImpl.java:41)
   [junit4]   2> 	at org.apache.curator.framework.recipes.shared.SharedValue.readValue(SharedValue.java:244)
   [junit4]   2> 	at org.apache.curator.framework.recipes.shared.SharedValue.access$100(SharedValue.java:44)
   [junit4]   2> 	at org.apache.curator.framework.recipes.shared.SharedValue$1.process(SharedValue.java:61)
   [junit4]   2> 	at org.apache.curator.framework.imps.NamespaceWatcher.process(NamespaceWatcher.java:67)
   [junit4]   2> 	at org.apache.zookeeper.ClientCnxn$EventThread.processEvent(ClientCnxn.java:530)
   [junit4]   2> 	at org.apache.zookeeper.ClientCnxn$EventThread.run(ClientCnxn.java:505)
   [junit4]   2> 1489168 WARN  (jetty-launcher-1627-thread-2-EventThread) [n:127.0.0.1:62188_solr    ] o.a.c.ConnectionState Session expired event received
   [junit4]   2> Oct 20, 2017 5:41:32 AM com.carrotsearch.randomizedtesting.ThreadLeakControl tryToInterruptAll
   [junit4]   2> INFO: All leaked threads terminated.
   [junit4]   2> 1489170 WARN  (jetty-launcher-1627-thread-2-SendThread(127.0.0.1:61300)) [n:127.0.0.1:62188_solr    ] o.a.z.ClientCnxn Session 0x0 for server null, unexpected error, closing socket connection and attempting reconnect
   [junit4]   2> java.net.ConnectException: Connection refused
   [junit4]   2> 	at sun.nio.ch.SocketChannelImpl.checkConnect(Native Method)
   [junit4]   2> 	at sun.nio.ch.SocketChannelImpl.finishConnect(SocketChannelImpl.java:717)
   [junit4]   2> 	at org.apache.zookeeper.ClientCnxnSocketNIO.doTransport(ClientCnxnSocketNIO.java:361)
   [junit4]   2> 	at org.apache.zookeeper.ClientCnxn$SendThread.run(ClientCnxn.java:1141)
   [junit4]   2> NOTE: test params are: codec=CheapBastard, sim=RandomSimilarity(queryNorm=false): {}, locale=ar-JO, timezone=Indian/Mauritius
   [junit4]   2> NOTE: SunOS 5.11 amd64/Oracle Corporation 1.8.0_141 (64-bit)/cpus=3,threads=3,free=285144960,total=518979584
   [junit4]   2> NOTE: All tests run in this JVM: [SolrCloudReportersTest, SearchRateTriggerTest, BJQParserTest, TestExactStatsCache, SOLR749Test, DocExpirationUpdateProcessorFactoryTest, TestComponentsName, DeleteStatusTest, OverseerModifyCollectionTest, JsonLoaderTest, ReplicationFactorTest, SolrMetricsIntegrationTest, TestMaxTokenLenTokenizer, TestImplicitCoreProperties, SolrXmlInZkTest, TestDistributedStatsComponentCardinality, StatelessScriptUpdateProcessorFactoryTest, TestBlendedInfixSuggestions, TestSchemaNameResource, TestSubQueryTransformer, TestCharFilters, FileBasedSpellCheckerTest, TestSearchPerf, TestManagedSchemaAPI, TestPrepRecovery, PingRequestHandlerTest, ShardRoutingCustomTest, TestRTGBase, BasicDistributedZk2Test, SaslZkACLProviderTest, SpellingQueryConverterTest, SystemInfoHandlerTest, TestRTimerTree, TestCustomSort, TestManagedResourceStorage, TestLeaderElectionZkExpiry, DistributedQueryComponentCustomSortTest, SimpleFacetsTest, RollingRestartTest, BlockJoinFacetRandomTest, TestBackupRepositoryFactory, TestOrdValues, TestLocalFSCloudBackupRestore, TermVectorComponentDistributedTest, TestIntervalFaceting, TestAnalyzedSuggestions, TestSubQueryTransformerDistrib, TestPayloadCheckQParserPlugin, AnalyticsQueryTest, LeaderInitiatedRecoveryOnCommitTest, OverriddenZkACLAndCredentialsProvidersTest, TestQueryWrapperFilter, TestConfigSetsAPIZkFailure, TestSchemaSimilarityResource, TestDistributedGrouping, HttpPartitionTest, TestLuceneMatchVersion, CloudExitableDirectoryReaderTest, MoveReplicaTest, CollectionsAPIAsyncDistributedZkTest, RemoteQueryErrorTest, TestSolrCoreSnapshots, TestCloudJSONFacetJoinDomain, TestDistribIDF, DistributedIntervalFacetingTest, DistributedFacetExistsSmallTest, TestDeleteCollectionOnDownNodes, HdfsChaosMonkeyNothingIsSafeTest, ShufflingReplicaListTransformerTest, HdfsUnloadDistributedZkTest, CopyFieldTest, AssignTest, TestJsonFacets, TestFastLRUCache, TestLegacyField, TestStressVersions, DebugComponentTest, TestCustomStream, WrapperMergePolicyFactoryTest, ConcurrentDeleteAndCreateCollectionTest, TestTrieFacet, TestSimpleTextCodec, SuggestComponentContextFilterQueryTest, TestSolrQueryParser, ClassificationUpdateProcessorFactoryTest, CustomCollectionTest, TestLuceneIndexBackCompat, TestElisionMultitermQuery, DeleteReplicaTest, TestAddFieldRealTimeGet, TestPullReplicaErrorHandling, SolrPluginUtilsTest, TestBulkSchemaConcurrent, VersionInfoTest, TestSQLHandlerNonCloud, DistributedFacetPivotSmallTest, HdfsBasicDistributedZk2Test, TestFoldingMultitermQuery, EchoParamsTest, UpdateRequestProcessorFactoryTest, TestRawTransformer, TestDownShardTolerantSearch, FileUtilsTest, PeerSyncWithIndexFingerprintCachingTest, CurrencyFieldTypeTest, TestFaceting, TestQueryUtils, CollectionsAPIDistributedZkTest, TestSha256AuthenticationProvider, HdfsCollectionsAPIDistributedZkTest, LeaderFailoverAfterPartitionTest, BasicFunctionalityTest, ExplicitHLLTest, TestConfigReload, TestFastOutputStream, AutoAddReplicasPlanActionTest, TestBinaryResponseWriter, TestHashPartitioner, SegmentsInfoRequestHandlerTest, ZkNodePropsTest, SolrCoreCheckLockOnStartupTest, SolrIndexConfigTest, TestCrossCoreJoin, TestSystemIdResolver, TestTestInjection, TestFunctionQuery, TestInPlaceUpdatesStandalone, TestMultiValuedNumericRangeQuery, PreAnalyzedFieldTest, DistributedMLTComponentTest, TestApiFramework, TestSolrCloudWithSecureImpersonation]
   [junit4]   2> NOTE: reproduce with: ant test  -Dtestcase=TestSolrCloudWithSecureImpersonation -Dtests.seed=C5F18D7E77876671 -Dtests.slow=true -Dtests.locale=ar-JO -Dtests.timezone=Indian/Mauritius -Dtests.asserts=true -Dtests.file.encoding=UTF-8
   [junit4] ERROR   0.00s J1 | TestSolrCloudWithSecureImpersonation (suite) <<<
   [junit4]    > Throwable #1: com.carrotsearch.randomizedtesting.ThreadLeakError: 2 threads leaked from SUITE scope at org.apache.solr.cloud.TestSolrCloudWithSecureImpersonation: 
   [junit4]    >    1) Thread[id=11721, name=jetty-launcher-1627-thread-1-EventThread, state=TIMED_WAITING, group=TGRP-TestSolrCloudWithSecureImpersonation]
   [junit4]    >         at sun.misc.Unsafe.park(Native Method)
   [junit4]    >         at java.util.concurrent.locks.LockSupport.parkNanos(LockSupport.java:215)
   [junit4]    >         at java.util.concurrent.locks.AbstractQueuedSynchronizer.doAcquireSharedNanos(AbstractQueuedSynchronizer.java:1037)
   [junit4]    >         at java.util.concurrent.locks.AbstractQueuedSynchronizer.tryAcquireSharedNanos(AbstractQueuedSynchronizer.java:1328)
   [junit4]    >         at java.util.concurrent.CountDownLatch.await(CountDownLatch.java:277)
   [junit4]    >         at org.apache.curator.CuratorZookeeperClient.internalBlockUntilConnectedOrTimedOut(CuratorZookeeperClient.java:323)
   [junit4]    >         at org.apache.curator.RetryLoop.callWithRetry(RetryLoop.java:105)
   [junit4]    >         at org.apache.curator.framework.imps.GetDataBuilderImpl.pathInForeground(GetDataBuilderImpl.java:288)
   [junit4]    >         at org.apache.curator.framework.imps.GetDataBuilderImpl.forPath(GetDataBuilderImpl.java:279)
   [junit4]    >         at org.apache.curator.framework.imps.GetDataBuilderImpl.forPath(GetDataBuilderImpl.java:41)
   [junit4]    >         at org.apache.curator.framework.recipes.shared.SharedValue.readValue(SharedValue.java:244)
   [junit4]    >         at org.apache.curator.framework.recipes.shared.SharedValue.access$100(SharedValue.java:44)
   [junit4]    >         at org.apache.curator.framework.recipes.shared.SharedValue$1.process(SharedValue.java:61)
   [junit4]    >         at org.apache.curator.framework.imps.NamespaceWatcher.process(NamespaceWatcher.java:67)
   [junit4]    >         at org.apache.zookeeper.ClientCnxn$EventThread.processEvent(ClientCnxn.java:530)
   [junit4]    >         at org.apache.zookeeper.ClientCnxn$EventThread.run(ClientCnxn.java:505)
   [junit4]    >    2) Thread[id=11722, name=jetty-launcher-1627-thread-2-EventThread, state=TIMED_WAITING, group=TGRP-TestSolrCloudWithSecureImpersonation]
   [junit4]    >         at sun.misc.Unsafe.park(Native Method)
   [junit4]    >         at java.util.concurrent.locks.LockSupport.parkNanos(LockSupport.java:215)
   [junit4]    >         at java.util.concurrent.locks.AbstractQueuedSynchronizer.doAcquireSharedNanos(AbstractQueuedSynchronizer.java:1037)
   [junit4]    >         at java.util.concurrent.locks.AbstractQueuedSynchronizer.tryAcquireSharedNanos(AbstractQueuedSynchronizer.java:1328)
   [junit4]    >         at java.util.concurrent.CountDownLatch.await(CountDownLatch.java:277)
   [junit4]    >         at org.apache.curator.CuratorZookeeperClient.internalBlockUntilConnectedOrTimedOut(CuratorZookeeperClient.java:323)
   [junit4]    >         at org.apache.curator.RetryLoop.callWithRetry(RetryLoop.java:105)
   [junit4]    >         at org.apache.curator.framework.imps.GetDataBuilderImpl.pathInForeground(GetDataBuilderImpl.java:288)
   [junit4]    >         at org.apache.curator.framework.imps.GetDataBuilderImpl.forPath(GetDataBuilderImpl.java:279)
   [junit4]    >         at org.apache.curator.framework.imps.GetDataBuilderImpl.forPath(GetDataBuilderImpl.java:41)
   [junit4]    >         at org.apache.curator.framework.recipes.shared.SharedValue.readValue(SharedValue.java:244)
   [junit4]    >         at org.apache.curator.framework.recipes.shared.SharedValue.access$100(SharedValue.java:44)
   [junit4]    >         at org.apache.curator.framework.recipes.shared.SharedValue$1.process(SharedValue.java:61)
   [junit4]    >         at org.apache.curator.framework.imps.NamespaceWatcher.process(NamespaceWatcher.java:67)
   [junit4]    >         at org.apache.zookeeper.ClientCnxn$EventThread.processEvent(ClientCnxn.java:530)
   [junit4]    >         at org.apache.zookeeper.ClientCnxn$EventThread.run(ClientCnxn.java:505)
   [junit4]    > 	at __randomizedtesting.SeedInfo.seed([C5F18D7E77876671]:0)
   [junit4] Completed [278/744 (1!)] on J1 in 58.35s, 12 tests, 1 error <<< FAILURES!

[...truncated 48750 lines...]

Mime
View raw message