lucene-dev mailing list archives

Site index · List index
Message view « Date » · « Thread »
Top « Date » · « Thread »
From Policeman Jenkins Server <jenk...@thetaphi.de>
Subject [JENKINS] Lucene-Solr-7.x-Windows (64bit/jdk-9.0.1) - Build # 275 - Still Unstable!
Date Tue, 31 Oct 2017 16:06:38 GMT
Build: https://jenkins.thetaphi.de/job/Lucene-Solr-7.x-Windows/275/
Java: 64bit/jdk-9.0.1 -XX:+UseCompressedOops -XX:+UseParallelGC --illegal-access=deny

8 tests failed.
FAILED:  junit.framework.TestSuite.org.apache.lucene.analysis.snowball.TestSnowballVocab

Error Message:
Could not remove the following files (in the order of attempts):    C:\Users\jenkins\workspace\Lucene-Solr-7.x-Windows\lucene\build\analysis\common\test\J0\temp\lucene.analysis.snowball.TestSnowballVocab_2E16BA5728076CCD-001\tempDir-015: java.nio.file.DirectoryNotEmptyException: C:\Users\jenkins\workspace\Lucene-Solr-7.x-Windows\lucene\build\analysis\common\test\J0\temp\lucene.analysis.snowball.TestSnowballVocab_2E16BA5728076CCD-001\tempDir-015 

Stack Trace:
java.io.IOException: Could not remove the following files (in the order of attempts):
   C:\Users\jenkins\workspace\Lucene-Solr-7.x-Windows\lucene\build\analysis\common\test\J0\temp\lucene.analysis.snowball.TestSnowballVocab_2E16BA5728076CCD-001\tempDir-015: java.nio.file.DirectoryNotEmptyException: C:\Users\jenkins\workspace\Lucene-Solr-7.x-Windows\lucene\build\analysis\common\test\J0\temp\lucene.analysis.snowball.TestSnowballVocab_2E16BA5728076CCD-001\tempDir-015

	at __randomizedtesting.SeedInfo.seed([2E16BA5728076CCD]:0)
	at org.apache.lucene.util.IOUtils.rm(IOUtils.java:329)
	at org.apache.lucene.util.TestRuleTemporaryFilesCleanup.afterAlways(TestRuleTemporaryFilesCleanup.java:216)
	at com.carrotsearch.randomizedtesting.rules.TestRuleAdapter$1.afterAlways(TestRuleAdapter.java:31)
	at com.carrotsearch.randomizedtesting.rules.StatementAdapter.evaluate(StatementAdapter.java:43)
	at com.carrotsearch.randomizedtesting.rules.StatementAdapter.evaluate(StatementAdapter.java:36)
	at org.apache.lucene.util.TestRuleAssertionsRequired$1.evaluate(TestRuleAssertionsRequired.java:53)
	at org.apache.lucene.util.TestRuleMarkFailure$1.evaluate(TestRuleMarkFailure.java:47)
	at org.apache.lucene.util.TestRuleIgnoreAfterMaxFailures$1.evaluate(TestRuleIgnoreAfterMaxFailures.java:64)
	at org.apache.lucene.util.TestRuleIgnoreTestSuites$1.evaluate(TestRuleIgnoreTestSuites.java:54)
	at com.carrotsearch.randomizedtesting.rules.StatementAdapter.evaluate(StatementAdapter.java:36)
	at com.carrotsearch.randomizedtesting.ThreadLeakControl$StatementRunner.run(ThreadLeakControl.java:368)
	at java.base/java.lang.Thread.run(Thread.java:844)


FAILED:  junit.framework.TestSuite.org.apache.lucene.index.TestBackwardsCompatibility

Error Message:
Could not remove the following files (in the order of attempts):    C:\Users\jenkins\workspace\Lucene-Solr-7.x-Windows\lucene\build\backward-codecs\test\J0\temp\lucene.index.TestBackwardsCompatibility_729E21FCBC6AE203-001\3.1.0-nocfs-001: java.nio.file.DirectoryNotEmptyException: C:\Users\jenkins\workspace\Lucene-Solr-7.x-Windows\lucene\build\backward-codecs\test\J0\temp\lucene.index.TestBackwardsCompatibility_729E21FCBC6AE203-001\3.1.0-nocfs-001    C:\Users\jenkins\workspace\Lucene-Solr-7.x-Windows\lucene\build\backward-codecs\test\J0\temp\lucene.index.TestBackwardsCompatibility_729E21FCBC6AE203-001\2.3.0-nocfs-001: java.nio.file.DirectoryNotEmptyException: C:\Users\jenkins\workspace\Lucene-Solr-7.x-Windows\lucene\build\backward-codecs\test\J0\temp\lucene.index.TestBackwardsCompatibility_729E21FCBC6AE203-001\2.3.0-nocfs-001    C:\Users\jenkins\workspace\Lucene-Solr-7.x-Windows\lucene\build\backward-codecs\test\J0\temp\lucene.index.TestBackwardsCompatibility_729E21FCBC6AE203-001\2.0.0-nocfs-001: java.nio.file.DirectoryNotEmptyException: C:\Users\jenkins\workspace\Lucene-Solr-7.x-Windows\lucene\build\backward-codecs\test\J0\temp\lucene.index.TestBackwardsCompatibility_729E21FCBC6AE203-001\2.0.0-nocfs-001 

Stack Trace:
java.io.IOException: Could not remove the following files (in the order of attempts):
   C:\Users\jenkins\workspace\Lucene-Solr-7.x-Windows\lucene\build\backward-codecs\test\J0\temp\lucene.index.TestBackwardsCompatibility_729E21FCBC6AE203-001\3.1.0-nocfs-001: java.nio.file.DirectoryNotEmptyException: C:\Users\jenkins\workspace\Lucene-Solr-7.x-Windows\lucene\build\backward-codecs\test\J0\temp\lucene.index.TestBackwardsCompatibility_729E21FCBC6AE203-001\3.1.0-nocfs-001
   C:\Users\jenkins\workspace\Lucene-Solr-7.x-Windows\lucene\build\backward-codecs\test\J0\temp\lucene.index.TestBackwardsCompatibility_729E21FCBC6AE203-001\2.3.0-nocfs-001: java.nio.file.DirectoryNotEmptyException: C:\Users\jenkins\workspace\Lucene-Solr-7.x-Windows\lucene\build\backward-codecs\test\J0\temp\lucene.index.TestBackwardsCompatibility_729E21FCBC6AE203-001\2.3.0-nocfs-001
   C:\Users\jenkins\workspace\Lucene-Solr-7.x-Windows\lucene\build\backward-codecs\test\J0\temp\lucene.index.TestBackwardsCompatibility_729E21FCBC6AE203-001\2.0.0-nocfs-001: java.nio.file.DirectoryNotEmptyException: C:\Users\jenkins\workspace\Lucene-Solr-7.x-Windows\lucene\build\backward-codecs\test\J0\temp\lucene.index.TestBackwardsCompatibility_729E21FCBC6AE203-001\2.0.0-nocfs-001

	at __randomizedtesting.SeedInfo.seed([729E21FCBC6AE203]:0)
	at org.apache.lucene.util.IOUtils.rm(IOUtils.java:329)
	at org.apache.lucene.util.TestRuleTemporaryFilesCleanup.afterAlways(TestRuleTemporaryFilesCleanup.java:216)
	at com.carrotsearch.randomizedtesting.rules.TestRuleAdapter$1.afterAlways(TestRuleAdapter.java:31)
	at com.carrotsearch.randomizedtesting.rules.StatementAdapter.evaluate(StatementAdapter.java:43)
	at com.carrotsearch.randomizedtesting.rules.StatementAdapter.evaluate(StatementAdapter.java:36)
	at org.apache.lucene.util.TestRuleAssertionsRequired$1.evaluate(TestRuleAssertionsRequired.java:53)
	at org.apache.lucene.util.TestRuleMarkFailure$1.evaluate(TestRuleMarkFailure.java:47)
	at org.apache.lucene.util.TestRuleIgnoreAfterMaxFailures$1.evaluate(TestRuleIgnoreAfterMaxFailures.java:64)
	at org.apache.lucene.util.TestRuleIgnoreTestSuites$1.evaluate(TestRuleIgnoreTestSuites.java:54)
	at com.carrotsearch.randomizedtesting.rules.StatementAdapter.evaluate(StatementAdapter.java:36)
	at com.carrotsearch.randomizedtesting.ThreadLeakControl$StatementRunner.run(ThreadLeakControl.java:368)
	at java.base/java.lang.Thread.run(Thread.java:844)


FAILED:  junit.framework.TestSuite.org.apache.solr.TestDistributedMissingSort

Error Message:
Could not remove the following files (in the order of attempts):    C:\Users\jenkins\workspace\Lucene-Solr-7.x-Windows\solr\build\solr-core\test\J1\temp\solr.TestDistributedMissingSort_1347709A996A9A7B-001\tempDir-001\shard2\collection1: java.nio.file.DirectoryNotEmptyException: C:\Users\jenkins\workspace\Lucene-Solr-7.x-Windows\solr\build\solr-core\test\J1\temp\solr.TestDistributedMissingSort_1347709A996A9A7B-001\tempDir-001\shard2\collection1    C:\Users\jenkins\workspace\Lucene-Solr-7.x-Windows\solr\build\solr-core\test\J1\temp\solr.TestDistributedMissingSort_1347709A996A9A7B-001\tempDir-001\shard2: java.nio.file.DirectoryNotEmptyException: C:\Users\jenkins\workspace\Lucene-Solr-7.x-Windows\solr\build\solr-core\test\J1\temp\solr.TestDistributedMissingSort_1347709A996A9A7B-001\tempDir-001\shard2    C:\Users\jenkins\workspace\Lucene-Solr-7.x-Windows\solr\build\solr-core\test\J1\temp\solr.TestDistributedMissingSort_1347709A996A9A7B-001\tempDir-001: java.nio.file.DirectoryNotEmptyException: C:\Users\jenkins\workspace\Lucene-Solr-7.x-Windows\solr\build\solr-core\test\J1\temp\solr.TestDistributedMissingSort_1347709A996A9A7B-001\tempDir-001 

Stack Trace:
java.io.IOException: Could not remove the following files (in the order of attempts):
   C:\Users\jenkins\workspace\Lucene-Solr-7.x-Windows\solr\build\solr-core\test\J1\temp\solr.TestDistributedMissingSort_1347709A996A9A7B-001\tempDir-001\shard2\collection1: java.nio.file.DirectoryNotEmptyException: C:\Users\jenkins\workspace\Lucene-Solr-7.x-Windows\solr\build\solr-core\test\J1\temp\solr.TestDistributedMissingSort_1347709A996A9A7B-001\tempDir-001\shard2\collection1
   C:\Users\jenkins\workspace\Lucene-Solr-7.x-Windows\solr\build\solr-core\test\J1\temp\solr.TestDistributedMissingSort_1347709A996A9A7B-001\tempDir-001\shard2: java.nio.file.DirectoryNotEmptyException: C:\Users\jenkins\workspace\Lucene-Solr-7.x-Windows\solr\build\solr-core\test\J1\temp\solr.TestDistributedMissingSort_1347709A996A9A7B-001\tempDir-001\shard2
   C:\Users\jenkins\workspace\Lucene-Solr-7.x-Windows\solr\build\solr-core\test\J1\temp\solr.TestDistributedMissingSort_1347709A996A9A7B-001\tempDir-001: java.nio.file.DirectoryNotEmptyException: C:\Users\jenkins\workspace\Lucene-Solr-7.x-Windows\solr\build\solr-core\test\J1\temp\solr.TestDistributedMissingSort_1347709A996A9A7B-001\tempDir-001

	at __randomizedtesting.SeedInfo.seed([1347709A996A9A7B]:0)
	at org.apache.lucene.util.IOUtils.rm(IOUtils.java:329)
	at org.apache.lucene.util.TestRuleTemporaryFilesCleanup.afterAlways(TestRuleTemporaryFilesCleanup.java:216)
	at com.carrotsearch.randomizedtesting.rules.TestRuleAdapter$1.afterAlways(TestRuleAdapter.java:31)
	at com.carrotsearch.randomizedtesting.rules.StatementAdapter.evaluate(StatementAdapter.java:43)
	at com.carrotsearch.randomizedtesting.rules.StatementAdapter.evaluate(StatementAdapter.java:36)
	at org.apache.lucene.util.TestRuleAssertionsRequired$1.evaluate(TestRuleAssertionsRequired.java:53)
	at org.apache.lucene.util.TestRuleMarkFailure$1.evaluate(TestRuleMarkFailure.java:47)
	at org.apache.lucene.util.TestRuleIgnoreAfterMaxFailures$1.evaluate(TestRuleIgnoreAfterMaxFailures.java:64)
	at org.apache.lucene.util.TestRuleIgnoreTestSuites$1.evaluate(TestRuleIgnoreTestSuites.java:54)
	at com.carrotsearch.randomizedtesting.rules.StatementAdapter.evaluate(StatementAdapter.java:36)
	at com.carrotsearch.randomizedtesting.ThreadLeakControl$StatementRunner.run(ThreadLeakControl.java:368)
	at java.base/java.lang.Thread.run(Thread.java:844)


FAILED:  junit.framework.TestSuite.org.apache.solr.cloud.TestTlogReplica

Error Message:
ObjectTracker found 5 object(s) that were not released!!! [SolrCore, MockDirectoryWrapper, MockDirectoryWrapper, MockDirectoryWrapper, MockDirectoryWrapper] org.apache.solr.common.util.ObjectReleaseTracker$ObjectTrackerException: org.apache.solr.core.SolrCore  at org.apache.solr.common.util.ObjectReleaseTracker.track(ObjectReleaseTracker.java:42)  at org.apache.solr.core.SolrCore.<init>(SolrCore.java:1020)  at org.apache.solr.core.SolrCore.<init>(SolrCore.java:844)  at org.apache.solr.core.CoreContainer.createFromDescriptor(CoreContainer.java:1036)  at org.apache.solr.core.CoreContainer.create(CoreContainer.java:948)  at org.apache.solr.handler.admin.CoreAdminOperation.lambda$static$0(CoreAdminOperation.java:91)  at org.apache.solr.handler.admin.CoreAdminOperation.execute(CoreAdminOperation.java:384)  at org.apache.solr.handler.admin.CoreAdminHandler$CallInfo.call(CoreAdminHandler.java:389)  at org.apache.solr.handler.admin.CoreAdminHandler.handleRequestBody(CoreAdminHandler.java:174)  at org.apache.solr.handler.RequestHandlerBase.handleRequest(RequestHandlerBase.java:177)  at org.apache.solr.servlet.HttpSolrCall.handleAdmin(HttpSolrCall.java:735)  at org.apache.solr.servlet.HttpSolrCall.handleAdminRequest(HttpSolrCall.java:716)  at org.apache.solr.servlet.HttpSolrCall.call(HttpSolrCall.java:497)  at org.apache.solr.servlet.SolrDispatchFilter.doFilter(SolrDispatchFilter.java:382)  at org.apache.solr.servlet.SolrDispatchFilter.doFilter(SolrDispatchFilter.java:326)  at org.eclipse.jetty.servlet.ServletHandler$CachedChain.doFilter(ServletHandler.java:1759)  at org.apache.solr.client.solrj.embedded.JettySolrRunner$DebugFilter.doFilter(JettySolrRunner.java:139)  at org.eclipse.jetty.servlet.ServletHandler$CachedChain.doFilter(ServletHandler.java:1759)  at org.eclipse.jetty.servlet.ServletHandler.doHandle(ServletHandler.java:582)  at org.eclipse.jetty.server.session.SessionHandler.doHandle(SessionHandler.java:224)  at org.eclipse.jetty.server.handler.ContextHandler.doHandle(ContextHandler.java:1180)  at org.eclipse.jetty.servlet.ServletHandler.doScope(ServletHandler.java:512)  at org.eclipse.jetty.server.session.SessionHandler.doScope(SessionHandler.java:185)  at org.eclipse.jetty.server.handler.ContextHandler.doScope(ContextHandler.java:1112)  at org.eclipse.jetty.server.handler.ScopedHandler.handle(ScopedHandler.java:141)  at org.eclipse.jetty.server.handler.gzip.GzipHandler.handle(GzipHandler.java:426)  at org.eclipse.jetty.server.handler.HandlerWrapper.handle(HandlerWrapper.java:134)  at org.eclipse.jetty.server.Server.handle(Server.java:534)  at org.eclipse.jetty.server.HttpChannel.handle(HttpChannel.java:320)  at org.eclipse.jetty.server.HttpConnection.onFillable(HttpConnection.java:251)  at org.eclipse.jetty.io.AbstractConnection$ReadCallback.succeeded(AbstractConnection.java:283)  at org.eclipse.jetty.io.FillInterest.fillable(FillInterest.java:108)  at org.eclipse.jetty.io.SelectChannelEndPoint$2.run(SelectChannelEndPoint.java:93)  at org.eclipse.jetty.util.thread.strategy.ExecuteProduceConsume.executeProduceConsume(ExecuteProduceConsume.java:303)  at org.eclipse.jetty.util.thread.strategy.ExecuteProduceConsume.produceConsume(ExecuteProduceConsume.java:148)  at org.eclipse.jetty.util.thread.strategy.ExecuteProduceConsume.run(ExecuteProduceConsume.java:136)  at org.eclipse.jetty.util.thread.QueuedThreadPool.runJob(QueuedThreadPool.java:671)  at org.eclipse.jetty.util.thread.QueuedThreadPool$2.run(QueuedThreadPool.java:589)  at java.base/java.lang.Thread.run(Thread.java:844)  org.apache.solr.common.util.ObjectReleaseTracker$ObjectTrackerException: org.apache.lucene.store.MockDirectoryWrapper  at org.apache.solr.common.util.ObjectReleaseTracker.track(ObjectReleaseTracker.java:42)  at org.apache.solr.core.CachingDirectoryFactory.get(CachingDirectoryFactory.java:348)  at org.apache.solr.core.SolrCore.getNewIndexDir(SolrCore.java:350)  at org.apache.solr.core.SolrCore.initIndex(SolrCore.java:710)  at org.apache.solr.core.SolrCore.<init>(SolrCore.java:935)  at org.apache.solr.core.SolrCore.<init>(SolrCore.java:844)  at org.apache.solr.core.CoreContainer.createFromDescriptor(CoreContainer.java:1036)  at org.apache.solr.core.CoreContainer.create(CoreContainer.java:948)  at org.apache.solr.handler.admin.CoreAdminOperation.lambda$static$0(CoreAdminOperation.java:91)  at org.apache.solr.handler.admin.CoreAdminOperation.execute(CoreAdminOperation.java:384)  at org.apache.solr.handler.admin.CoreAdminHandler$CallInfo.call(CoreAdminHandler.java:389)  at org.apache.solr.handler.admin.CoreAdminHandler.handleRequestBody(CoreAdminHandler.java:174)  at org.apache.solr.handler.RequestHandlerBase.handleRequest(RequestHandlerBase.java:177)  at org.apache.solr.servlet.HttpSolrCall.handleAdmin(HttpSolrCall.java:735)  at org.apache.solr.servlet.HttpSolrCall.handleAdminRequest(HttpSolrCall.java:716)  at org.apache.solr.servlet.HttpSolrCall.call(HttpSolrCall.java:497)  at org.apache.solr.servlet.SolrDispatchFilter.doFilter(SolrDispatchFilter.java:382)  at org.apache.solr.servlet.SolrDispatchFilter.doFilter(SolrDispatchFilter.java:326)  at org.eclipse.jetty.servlet.ServletHandler$CachedChain.doFilter(ServletHandler.java:1759)  at org.apache.solr.client.solrj.embedded.JettySolrRunner$DebugFilter.doFilter(JettySolrRunner.java:139)  at org.eclipse.jetty.servlet.ServletHandler$CachedChain.doFilter(ServletHandler.java:1759)  at org.eclipse.jetty.servlet.ServletHandler.doHandle(ServletHandler.java:582)  at org.eclipse.jetty.server.session.SessionHandler.doHandle(SessionHandler.java:224)  at org.eclipse.jetty.server.handler.ContextHandler.doHandle(ContextHandler.java:1180)  at org.eclipse.jetty.servlet.ServletHandler.doScope(ServletHandler.java:512)  at org.eclipse.jetty.server.session.SessionHandler.doScope(SessionHandler.java:185)  at org.eclipse.jetty.server.handler.ContextHandler.doScope(ContextHandler.java:1112)  at org.eclipse.jetty.server.handler.ScopedHandler.handle(ScopedHandler.java:141)  at org.eclipse.jetty.server.handler.gzip.GzipHandler.handle(GzipHandler.java:426)  at org.eclipse.jetty.server.handler.HandlerWrapper.handle(HandlerWrapper.java:134)  at org.eclipse.jetty.server.Server.handle(Server.java:534)  at org.eclipse.jetty.server.HttpChannel.handle(HttpChannel.java:320)  at org.eclipse.jetty.server.HttpConnection.onFillable(HttpConnection.java:251)  at org.eclipse.jetty.io.AbstractConnection$ReadCallback.succeeded(AbstractConnection.java:283)  at org.eclipse.jetty.io.FillInterest.fillable(FillInterest.java:108)  at org.eclipse.jetty.io.SelectChannelEndPoint$2.run(SelectChannelEndPoint.java:93)  at org.eclipse.jetty.util.thread.strategy.ExecuteProduceConsume.executeProduceConsume(ExecuteProduceConsume.java:303)  at org.eclipse.jetty.util.thread.strategy.ExecuteProduceConsume.produceConsume(ExecuteProduceConsume.java:148)  at org.eclipse.jetty.util.thread.strategy.ExecuteProduceConsume.run(ExecuteProduceConsume.java:136)  at org.eclipse.jetty.util.thread.QueuedThreadPool.runJob(QueuedThreadPool.java:671)  at org.eclipse.jetty.util.thread.QueuedThreadPool$2.run(QueuedThreadPool.java:589)  at java.base/java.lang.Thread.run(Thread.java:844)  org.apache.solr.common.util.ObjectReleaseTracker$ObjectTrackerException: org.apache.lucene.store.MockDirectoryWrapper  at org.apache.solr.common.util.ObjectReleaseTracker.track(ObjectReleaseTracker.java:42)  at org.apache.solr.core.CachingDirectoryFactory.get(CachingDirectoryFactory.java:348)  at org.apache.solr.handler.IndexFetcher.fetchLatestIndex(IndexFetcher.java:501)  at org.apache.solr.handler.IndexFetcher.fetchLatestIndex(IndexFetcher.java:345)  at org.apache.solr.handler.ReplicationHandler.doFetch(ReplicationHandler.java:421)  at org.apache.solr.handler.ReplicationHandler.lambda$setupPolling$12(ReplicationHandler.java:1183)  at java.base/java.util.concurrent.Executors$RunnableAdapter.call(Executors.java:514)  at java.base/java.util.concurrent.FutureTask.runAndReset(FutureTask.java:305)  at java.base/java.util.concurrent.ScheduledThreadPoolExecutor$ScheduledFutureTask.run(ScheduledThreadPoolExecutor.java:300)  at java.base/java.util.concurrent.ThreadPoolExecutor.runWorker(ThreadPoolExecutor.java:1167)  at java.base/java.util.concurrent.ThreadPoolExecutor$Worker.run(ThreadPoolExecutor.java:641)  at java.base/java.lang.Thread.run(Thread.java:844)  org.apache.solr.common.util.ObjectReleaseTracker$ObjectTrackerException: org.apache.lucene.store.MockDirectoryWrapper  at org.apache.solr.common.util.ObjectReleaseTracker.track(ObjectReleaseTracker.java:42)  at org.apache.solr.core.CachingDirectoryFactory.get(CachingDirectoryFactory.java:348)  at org.apache.solr.update.SolrIndexWriter.create(SolrIndexWriter.java:92)  at org.apache.solr.core.SolrCore.initIndex(SolrCore.java:742)  at org.apache.solr.core.SolrCore.<init>(SolrCore.java:935)  at org.apache.solr.core.SolrCore.<init>(SolrCore.java:844)  at org.apache.solr.core.CoreContainer.createFromDescriptor(CoreContainer.java:1036)  at org.apache.solr.core.CoreContainer.create(CoreContainer.java:948)  at org.apache.solr.handler.admin.CoreAdminOperation.lambda$static$0(CoreAdminOperation.java:91)  at org.apache.solr.handler.admin.CoreAdminOperation.execute(CoreAdminOperation.java:384)  at org.apache.solr.handler.admin.CoreAdminHandler$CallInfo.call(CoreAdminHandler.java:389)  at org.apache.solr.handler.admin.CoreAdminHandler.handleRequestBody(CoreAdminHandler.java:174)  at org.apache.solr.handler.RequestHandlerBase.handleRequest(RequestHandlerBase.java:177)  at org.apache.solr.servlet.HttpSolrCall.handleAdmin(HttpSolrCall.java:735)  at org.apache.solr.servlet.HttpSolrCall.handleAdminRequest(HttpSolrCall.java:716)  at org.apache.solr.servlet.HttpSolrCall.call(HttpSolrCall.java:497)  at org.apache.solr.servlet.SolrDispatchFilter.doFilter(SolrDispatchFilter.java:382)  at org.apache.solr.servlet.SolrDispatchFilter.doFilter(SolrDispatchFilter.java:326)  at org.eclipse.jetty.servlet.ServletHandler$CachedChain.doFilter(ServletHandler.java:1759)  at org.apache.solr.client.solrj.embedded.JettySolrRunner$DebugFilter.doFilter(JettySolrRunner.java:139)  at org.eclipse.jetty.servlet.ServletHandler$CachedChain.doFilter(ServletHandler.java:1759)  at org.eclipse.jetty.servlet.ServletHandler.doHandle(ServletHandler.java:582)  at org.eclipse.jetty.server.session.SessionHandler.doHandle(SessionHandler.java:224)  at org.eclipse.jetty.server.handler.ContextHandler.doHandle(ContextHandler.java:1180)  at org.eclipse.jetty.servlet.ServletHandler.doScope(ServletHandler.java:512)  at org.eclipse.jetty.server.session.SessionHandler.doScope(SessionHandler.java:185)  at org.eclipse.jetty.server.handler.ContextHandler.doScope(ContextHandler.java:1112)  at org.eclipse.jetty.server.handler.ScopedHandler.handle(ScopedHandler.java:141)  at org.eclipse.jetty.server.handler.gzip.GzipHandler.handle(GzipHandler.java:426)  at org.eclipse.jetty.server.handler.HandlerWrapper.handle(HandlerWrapper.java:134)  at org.eclipse.jetty.server.Server.handle(Server.java:534)  at org.eclipse.jetty.server.HttpChannel.handle(HttpChannel.java:320)  at org.eclipse.jetty.server.HttpConnection.onFillable(HttpConnection.java:251)  at org.eclipse.jetty.io.AbstractConnection$ReadCallback.succeeded(AbstractConnection.java:283)  at org.eclipse.jetty.io.FillInterest.fillable(FillInterest.java:108)  at org.eclipse.jetty.io.SelectChannelEndPoint$2.run(SelectChannelEndPoint.java:93)  at org.eclipse.jetty.util.thread.strategy.ExecuteProduceConsume.executeProduceConsume(ExecuteProduceConsume.java:303)  at org.eclipse.jetty.util.thread.strategy.ExecuteProduceConsume.produceConsume(ExecuteProduceConsume.java:148)  at org.eclipse.jetty.util.thread.strategy.ExecuteProduceConsume.run(ExecuteProduceConsume.java:136)  at org.eclipse.jetty.util.thread.QueuedThreadPool.runJob(QueuedThreadPool.java:671)  at org.eclipse.jetty.util.thread.QueuedThreadPool$2.run(QueuedThreadPool.java:589)  at java.base/java.lang.Thread.run(Thread.java:844)  org.apache.solr.common.util.ObjectReleaseTracker$ObjectTrackerException: org.apache.lucene.store.MockDirectoryWrapper  at org.apache.solr.common.util.ObjectReleaseTracker.track(ObjectReleaseTracker.java:42)  at org.apache.solr.core.CachingDirectoryFactory.get(CachingDirectoryFactory.java:348)  at org.apache.solr.core.SolrCore.initSnapshotMetaDataManager(SolrCore.java:479)  at org.apache.solr.core.SolrCore.<init>(SolrCore.java:929)  at org.apache.solr.core.SolrCore.<init>(SolrCore.java:844)  at org.apache.solr.core.CoreContainer.createFromDescriptor(CoreContainer.java:1036)  at org.apache.solr.core.CoreContainer.create(CoreContainer.java:948)  at org.apache.solr.handler.admin.CoreAdminOperation.lambda$static$0(CoreAdminOperation.java:91)  at org.apache.solr.handler.admin.CoreAdminOperation.execute(CoreAdminOperation.java:384)  at org.apache.solr.handler.admin.CoreAdminHandler$CallInfo.call(CoreAdminHandler.java:389)  at org.apache.solr.handler.admin.CoreAdminHandler.handleRequestBody(CoreAdminHandler.java:174)  at org.apache.solr.handler.RequestHandlerBase.handleRequest(RequestHandlerBase.java:177)  at org.apache.solr.servlet.HttpSolrCall.handleAdmin(HttpSolrCall.java:735)  at org.apache.solr.servlet.HttpSolrCall.handleAdminRequest(HttpSolrCall.java:716)  at org.apache.solr.servlet.HttpSolrCall.call(HttpSolrCall.java:497)  at org.apache.solr.servlet.SolrDispatchFilter.doFilter(SolrDispatchFilter.java:382)  at org.apache.solr.servlet.SolrDispatchFilter.doFilter(SolrDispatchFilter.java:326)  at org.eclipse.jetty.servlet.ServletHandler$CachedChain.doFilter(ServletHandler.java:1759)  at org.apache.solr.client.solrj.embedded.JettySolrRunner$DebugFilter.doFilter(JettySolrRunner.java:139)  at org.eclipse.jetty.servlet.ServletHandler$CachedChain.doFilter(ServletHandler.java:1759)  at org.eclipse.jetty.servlet.ServletHandler.doHandle(ServletHandler.java:582)  at org.eclipse.jetty.server.session.SessionHandler.doHandle(SessionHandler.java:224)  at org.eclipse.jetty.server.handler.ContextHandler.doHandle(ContextHandler.java:1180)  at org.eclipse.jetty.servlet.ServletHandler.doScope(ServletHandler.java:512)  at org.eclipse.jetty.server.session.SessionHandler.doScope(SessionHandler.java:185)  at org.eclipse.jetty.server.handler.ContextHandler.doScope(ContextHandler.java:1112)  at org.eclipse.jetty.server.handler.ScopedHandler.handle(ScopedHandler.java:141)  at org.eclipse.jetty.server.handler.gzip.GzipHandler.handle(GzipHandler.java:426)  at org.eclipse.jetty.server.handler.HandlerWrapper.handle(HandlerWrapper.java:134)  at org.eclipse.jetty.server.Server.handle(Server.java:534)  at org.eclipse.jetty.server.HttpChannel.handle(HttpChannel.java:320)  at org.eclipse.jetty.server.HttpConnection.onFillable(HttpConnection.java:251)  at org.eclipse.jetty.io.AbstractConnection$ReadCallback.succeeded(AbstractConnection.java:283)  at org.eclipse.jetty.io.FillInterest.fillable(FillInterest.java:108)  at org.eclipse.jetty.io.SelectChannelEndPoint$2.run(SelectChannelEndPoint.java:93)  at org.eclipse.jetty.util.thread.strategy.ExecuteProduceConsume.executeProduceConsume(ExecuteProduceConsume.java:303)  at org.eclipse.jetty.util.thread.strategy.ExecuteProduceConsume.produceConsume(ExecuteProduceConsume.java:148)  at org.eclipse.jetty.util.thread.strategy.ExecuteProduceConsume.run(ExecuteProduceConsume.java:136)  at org.eclipse.jetty.util.thread.QueuedThreadPool.runJob(QueuedThreadPool.java:671)  at org.eclipse.jetty.util.thread.QueuedThreadPool$2.run(QueuedThreadPool.java:589)  at java.base/java.lang.Thread.run(Thread.java:844)  

Stack Trace:
java.lang.AssertionError: ObjectTracker found 5 object(s) that were not released!!! [SolrCore, MockDirectoryWrapper, MockDirectoryWrapper, MockDirectoryWrapper, MockDirectoryWrapper]
org.apache.solr.common.util.ObjectReleaseTracker$ObjectTrackerException: org.apache.solr.core.SolrCore
	at org.apache.solr.common.util.ObjectReleaseTracker.track(ObjectReleaseTracker.java:42)
	at org.apache.solr.core.SolrCore.<init>(SolrCore.java:1020)
	at org.apache.solr.core.SolrCore.<init>(SolrCore.java:844)
	at org.apache.solr.core.CoreContainer.createFromDescriptor(CoreContainer.java:1036)
	at org.apache.solr.core.CoreContainer.create(CoreContainer.java:948)
	at org.apache.solr.handler.admin.CoreAdminOperation.lambda$static$0(CoreAdminOperation.java:91)
	at org.apache.solr.handler.admin.CoreAdminOperation.execute(CoreAdminOperation.java:384)
	at org.apache.solr.handler.admin.CoreAdminHandler$CallInfo.call(CoreAdminHandler.java:389)
	at org.apache.solr.handler.admin.CoreAdminHandler.handleRequestBody(CoreAdminHandler.java:174)
	at org.apache.solr.handler.RequestHandlerBase.handleRequest(RequestHandlerBase.java:177)
	at org.apache.solr.servlet.HttpSolrCall.handleAdmin(HttpSolrCall.java:735)
	at org.apache.solr.servlet.HttpSolrCall.handleAdminRequest(HttpSolrCall.java:716)
	at org.apache.solr.servlet.HttpSolrCall.call(HttpSolrCall.java:497)
	at org.apache.solr.servlet.SolrDispatchFilter.doFilter(SolrDispatchFilter.java:382)
	at org.apache.solr.servlet.SolrDispatchFilter.doFilter(SolrDispatchFilter.java:326)
	at org.eclipse.jetty.servlet.ServletHandler$CachedChain.doFilter(ServletHandler.java:1759)
	at org.apache.solr.client.solrj.embedded.JettySolrRunner$DebugFilter.doFilter(JettySolrRunner.java:139)
	at org.eclipse.jetty.servlet.ServletHandler$CachedChain.doFilter(ServletHandler.java:1759)
	at org.eclipse.jetty.servlet.ServletHandler.doHandle(ServletHandler.java:582)
	at org.eclipse.jetty.server.session.SessionHandler.doHandle(SessionHandler.java:224)
	at org.eclipse.jetty.server.handler.ContextHandler.doHandle(ContextHandler.java:1180)
	at org.eclipse.jetty.servlet.ServletHandler.doScope(ServletHandler.java:512)
	at org.eclipse.jetty.server.session.SessionHandler.doScope(SessionHandler.java:185)
	at org.eclipse.jetty.server.handler.ContextHandler.doScope(ContextHandler.java:1112)
	at org.eclipse.jetty.server.handler.ScopedHandler.handle(ScopedHandler.java:141)
	at org.eclipse.jetty.server.handler.gzip.GzipHandler.handle(GzipHandler.java:426)
	at org.eclipse.jetty.server.handler.HandlerWrapper.handle(HandlerWrapper.java:134)
	at org.eclipse.jetty.server.Server.handle(Server.java:534)
	at org.eclipse.jetty.server.HttpChannel.handle(HttpChannel.java:320)
	at org.eclipse.jetty.server.HttpConnection.onFillable(HttpConnection.java:251)
	at org.eclipse.jetty.io.AbstractConnection$ReadCallback.succeeded(AbstractConnection.java:283)
	at org.eclipse.jetty.io.FillInterest.fillable(FillInterest.java:108)
	at org.eclipse.jetty.io.SelectChannelEndPoint$2.run(SelectChannelEndPoint.java:93)
	at org.eclipse.jetty.util.thread.strategy.ExecuteProduceConsume.executeProduceConsume(ExecuteProduceConsume.java:303)
	at org.eclipse.jetty.util.thread.strategy.ExecuteProduceConsume.produceConsume(ExecuteProduceConsume.java:148)
	at org.eclipse.jetty.util.thread.strategy.ExecuteProduceConsume.run(ExecuteProduceConsume.java:136)
	at org.eclipse.jetty.util.thread.QueuedThreadPool.runJob(QueuedThreadPool.java:671)
	at org.eclipse.jetty.util.thread.QueuedThreadPool$2.run(QueuedThreadPool.java:589)
	at java.base/java.lang.Thread.run(Thread.java:844)

org.apache.solr.common.util.ObjectReleaseTracker$ObjectTrackerException: org.apache.lucene.store.MockDirectoryWrapper
	at org.apache.solr.common.util.ObjectReleaseTracker.track(ObjectReleaseTracker.java:42)
	at org.apache.solr.core.CachingDirectoryFactory.get(CachingDirectoryFactory.java:348)
	at org.apache.solr.core.SolrCore.getNewIndexDir(SolrCore.java:350)
	at org.apache.solr.core.SolrCore.initIndex(SolrCore.java:710)
	at org.apache.solr.core.SolrCore.<init>(SolrCore.java:935)
	at org.apache.solr.core.SolrCore.<init>(SolrCore.java:844)
	at org.apache.solr.core.CoreContainer.createFromDescriptor(CoreContainer.java:1036)
	at org.apache.solr.core.CoreContainer.create(CoreContainer.java:948)
	at org.apache.solr.handler.admin.CoreAdminOperation.lambda$static$0(CoreAdminOperation.java:91)
	at org.apache.solr.handler.admin.CoreAdminOperation.execute(CoreAdminOperation.java:384)
	at org.apache.solr.handler.admin.CoreAdminHandler$CallInfo.call(CoreAdminHandler.java:389)
	at org.apache.solr.handler.admin.CoreAdminHandler.handleRequestBody(CoreAdminHandler.java:174)
	at org.apache.solr.handler.RequestHandlerBase.handleRequest(RequestHandlerBase.java:177)
	at org.apache.solr.servlet.HttpSolrCall.handleAdmin(HttpSolrCall.java:735)
	at org.apache.solr.servlet.HttpSolrCall.handleAdminRequest(HttpSolrCall.java:716)
	at org.apache.solr.servlet.HttpSolrCall.call(HttpSolrCall.java:497)
	at org.apache.solr.servlet.SolrDispatchFilter.doFilter(SolrDispatchFilter.java:382)
	at org.apache.solr.servlet.SolrDispatchFilter.doFilter(SolrDispatchFilter.java:326)
	at org.eclipse.jetty.servlet.ServletHandler$CachedChain.doFilter(ServletHandler.java:1759)
	at org.apache.solr.client.solrj.embedded.JettySolrRunner$DebugFilter.doFilter(JettySolrRunner.java:139)
	at org.eclipse.jetty.servlet.ServletHandler$CachedChain.doFilter(ServletHandler.java:1759)
	at org.eclipse.jetty.servlet.ServletHandler.doHandle(ServletHandler.java:582)
	at org.eclipse.jetty.server.session.SessionHandler.doHandle(SessionHandler.java:224)
	at org.eclipse.jetty.server.handler.ContextHandler.doHandle(ContextHandler.java:1180)
	at org.eclipse.jetty.servlet.ServletHandler.doScope(ServletHandler.java:512)
	at org.eclipse.jetty.server.session.SessionHandler.doScope(SessionHandler.java:185)
	at org.eclipse.jetty.server.handler.ContextHandler.doScope(ContextHandler.java:1112)
	at org.eclipse.jetty.server.handler.ScopedHandler.handle(ScopedHandler.java:141)
	at org.eclipse.jetty.server.handler.gzip.GzipHandler.handle(GzipHandler.java:426)
	at org.eclipse.jetty.server.handler.HandlerWrapper.handle(HandlerWrapper.java:134)
	at org.eclipse.jetty.server.Server.handle(Server.java:534)
	at org.eclipse.jetty.server.HttpChannel.handle(HttpChannel.java:320)
	at org.eclipse.jetty.server.HttpConnection.onFillable(HttpConnection.java:251)
	at org.eclipse.jetty.io.AbstractConnection$ReadCallback.succeeded(AbstractConnection.java:283)
	at org.eclipse.jetty.io.FillInterest.fillable(FillInterest.java:108)
	at org.eclipse.jetty.io.SelectChannelEndPoint$2.run(SelectChannelEndPoint.java:93)
	at org.eclipse.jetty.util.thread.strategy.ExecuteProduceConsume.executeProduceConsume(ExecuteProduceConsume.java:303)
	at org.eclipse.jetty.util.thread.strategy.ExecuteProduceConsume.produceConsume(ExecuteProduceConsume.java:148)
	at org.eclipse.jetty.util.thread.strategy.ExecuteProduceConsume.run(ExecuteProduceConsume.java:136)
	at org.eclipse.jetty.util.thread.QueuedThreadPool.runJob(QueuedThreadPool.java:671)
	at org.eclipse.jetty.util.thread.QueuedThreadPool$2.run(QueuedThreadPool.java:589)
	at java.base/java.lang.Thread.run(Thread.java:844)

org.apache.solr.common.util.ObjectReleaseTracker$ObjectTrackerException: org.apache.lucene.store.MockDirectoryWrapper
	at org.apache.solr.common.util.ObjectReleaseTracker.track(ObjectReleaseTracker.java:42)
	at org.apache.solr.core.CachingDirectoryFactory.get(CachingDirectoryFactory.java:348)
	at org.apache.solr.handler.IndexFetcher.fetchLatestIndex(IndexFetcher.java:501)
	at org.apache.solr.handler.IndexFetcher.fetchLatestIndex(IndexFetcher.java:345)
	at org.apache.solr.handler.ReplicationHandler.doFetch(ReplicationHandler.java:421)
	at org.apache.solr.handler.ReplicationHandler.lambda$setupPolling$12(ReplicationHandler.java:1183)
	at java.base/java.util.concurrent.Executors$RunnableAdapter.call(Executors.java:514)
	at java.base/java.util.concurrent.FutureTask.runAndReset(FutureTask.java:305)
	at java.base/java.util.concurrent.ScheduledThreadPoolExecutor$ScheduledFutureTask.run(ScheduledThreadPoolExecutor.java:300)
	at java.base/java.util.concurrent.ThreadPoolExecutor.runWorker(ThreadPoolExecutor.java:1167)
	at java.base/java.util.concurrent.ThreadPoolExecutor$Worker.run(ThreadPoolExecutor.java:641)
	at java.base/java.lang.Thread.run(Thread.java:844)

org.apache.solr.common.util.ObjectReleaseTracker$ObjectTrackerException: org.apache.lucene.store.MockDirectoryWrapper
	at org.apache.solr.common.util.ObjectReleaseTracker.track(ObjectReleaseTracker.java:42)
	at org.apache.solr.core.CachingDirectoryFactory.get(CachingDirectoryFactory.java:348)
	at org.apache.solr.update.SolrIndexWriter.create(SolrIndexWriter.java:92)
	at org.apache.solr.core.SolrCore.initIndex(SolrCore.java:742)
	at org.apache.solr.core.SolrCore.<init>(SolrCore.java:935)
	at org.apache.solr.core.SolrCore.<init>(SolrCore.java:844)
	at org.apache.solr.core.CoreContainer.createFromDescriptor(CoreContainer.java:1036)
	at org.apache.solr.core.CoreContainer.create(CoreContainer.java:948)
	at org.apache.solr.handler.admin.CoreAdminOperation.lambda$static$0(CoreAdminOperation.java:91)
	at org.apache.solr.handler.admin.CoreAdminOperation.execute(CoreAdminOperation.java:384)
	at org.apache.solr.handler.admin.CoreAdminHandler$CallInfo.call(CoreAdminHandler.java:389)
	at org.apache.solr.handler.admin.CoreAdminHandler.handleRequestBody(CoreAdminHandler.java:174)
	at org.apache.solr.handler.RequestHandlerBase.handleRequest(RequestHandlerBase.java:177)
	at org.apache.solr.servlet.HttpSolrCall.handleAdmin(HttpSolrCall.java:735)
	at org.apache.solr.servlet.HttpSolrCall.handleAdminRequest(HttpSolrCall.java:716)
	at org.apache.solr.servlet.HttpSolrCall.call(HttpSolrCall.java:497)
	at org.apache.solr.servlet.SolrDispatchFilter.doFilter(SolrDispatchFilter.java:382)
	at org.apache.solr.servlet.SolrDispatchFilter.doFilter(SolrDispatchFilter.java:326)
	at org.eclipse.jetty.servlet.ServletHandler$CachedChain.doFilter(ServletHandler.java:1759)
	at org.apache.solr.client.solrj.embedded.JettySolrRunner$DebugFilter.doFilter(JettySolrRunner.java:139)
	at org.eclipse.jetty.servlet.ServletHandler$CachedChain.doFilter(ServletHandler.java:1759)
	at org.eclipse.jetty.servlet.ServletHandler.doHandle(ServletHandler.java:582)
	at org.eclipse.jetty.server.session.SessionHandler.doHandle(SessionHandler.java:224)
	at org.eclipse.jetty.server.handler.ContextHandler.doHandle(ContextHandler.java:1180)
	at org.eclipse.jetty.servlet.ServletHandler.doScope(ServletHandler.java:512)
	at org.eclipse.jetty.server.session.SessionHandler.doScope(SessionHandler.java:185)
	at org.eclipse.jetty.server.handler.ContextHandler.doScope(ContextHandler.java:1112)
	at org.eclipse.jetty.server.handler.ScopedHandler.handle(ScopedHandler.java:141)
	at org.eclipse.jetty.server.handler.gzip.GzipHandler.handle(GzipHandler.java:426)
	at org.eclipse.jetty.server.handler.HandlerWrapper.handle(HandlerWrapper.java:134)
	at org.eclipse.jetty.server.Server.handle(Server.java:534)
	at org.eclipse.jetty.server.HttpChannel.handle(HttpChannel.java:320)
	at org.eclipse.jetty.server.HttpConnection.onFillable(HttpConnection.java:251)
	at org.eclipse.jetty.io.AbstractConnection$ReadCallback.succeeded(AbstractConnection.java:283)
	at org.eclipse.jetty.io.FillInterest.fillable(FillInterest.java:108)
	at org.eclipse.jetty.io.SelectChannelEndPoint$2.run(SelectChannelEndPoint.java:93)
	at org.eclipse.jetty.util.thread.strategy.ExecuteProduceConsume.executeProduceConsume(ExecuteProduceConsume.java:303)
	at org.eclipse.jetty.util.thread.strategy.ExecuteProduceConsume.produceConsume(ExecuteProduceConsume.java:148)
	at org.eclipse.jetty.util.thread.strategy.ExecuteProduceConsume.run(ExecuteProduceConsume.java:136)
	at org.eclipse.jetty.util.thread.QueuedThreadPool.runJob(QueuedThreadPool.java:671)
	at org.eclipse.jetty.util.thread.QueuedThreadPool$2.run(QueuedThreadPool.java:589)
	at java.base/java.lang.Thread.run(Thread.java:844)

org.apache.solr.common.util.ObjectReleaseTracker$ObjectTrackerException: org.apache.lucene.store.MockDirectoryWrapper
	at org.apache.solr.common.util.ObjectReleaseTracker.track(ObjectReleaseTracker.java:42)
	at org.apache.solr.core.CachingDirectoryFactory.get(CachingDirectoryFactory.java:348)
	at org.apache.solr.core.SolrCore.initSnapshotMetaDataManager(SolrCore.java:479)
	at org.apache.solr.core.SolrCore.<init>(SolrCore.java:929)
	at org.apache.solr.core.SolrCore.<init>(SolrCore.java:844)
	at org.apache.solr.core.CoreContainer.createFromDescriptor(CoreContainer.java:1036)
	at org.apache.solr.core.CoreContainer.create(CoreContainer.java:948)
	at org.apache.solr.handler.admin.CoreAdminOperation.lambda$static$0(CoreAdminOperation.java:91)
	at org.apache.solr.handler.admin.CoreAdminOperation.execute(CoreAdminOperation.java:384)
	at org.apache.solr.handler.admin.CoreAdminHandler$CallInfo.call(CoreAdminHandler.java:389)
	at org.apache.solr.handler.admin.CoreAdminHandler.handleRequestBody(CoreAdminHandler.java:174)
	at org.apache.solr.handler.RequestHandlerBase.handleRequest(RequestHandlerBase.java:177)
	at org.apache.solr.servlet.HttpSolrCall.handleAdmin(HttpSolrCall.java:735)
	at org.apache.solr.servlet.HttpSolrCall.handleAdminRequest(HttpSolrCall.java:716)
	at org.apache.solr.servlet.HttpSolrCall.call(HttpSolrCall.java:497)
	at org.apache.solr.servlet.SolrDispatchFilter.doFilter(SolrDispatchFilter.java:382)
	at org.apache.solr.servlet.SolrDispatchFilter.doFilter(SolrDispatchFilter.java:326)
	at org.eclipse.jetty.servlet.ServletHandler$CachedChain.doFilter(ServletHandler.java:1759)
	at org.apache.solr.client.solrj.embedded.JettySolrRunner$DebugFilter.doFilter(JettySolrRunner.java:139)
	at org.eclipse.jetty.servlet.ServletHandler$CachedChain.doFilter(ServletHandler.java:1759)
	at org.eclipse.jetty.servlet.ServletHandler.doHandle(ServletHandler.java:582)
	at org.eclipse.jetty.server.session.SessionHandler.doHandle(SessionHandler.java:224)
	at org.eclipse.jetty.server.handler.ContextHandler.doHandle(ContextHandler.java:1180)
	at org.eclipse.jetty.servlet.ServletHandler.doScope(ServletHandler.java:512)
	at org.eclipse.jetty.server.session.SessionHandler.doScope(SessionHandler.java:185)
	at org.eclipse.jetty.server.handler.ContextHandler.doScope(ContextHandler.java:1112)
	at org.eclipse.jetty.server.handler.ScopedHandler.handle(ScopedHandler.java:141)
	at org.eclipse.jetty.server.handler.gzip.GzipHandler.handle(GzipHandler.java:426)
	at org.eclipse.jetty.server.handler.HandlerWrapper.handle(HandlerWrapper.java:134)
	at org.eclipse.jetty.server.Server.handle(Server.java:534)
	at org.eclipse.jetty.server.HttpChannel.handle(HttpChannel.java:320)
	at org.eclipse.jetty.server.HttpConnection.onFillable(HttpConnection.java:251)
	at org.eclipse.jetty.io.AbstractConnection$ReadCallback.succeeded(AbstractConnection.java:283)
	at org.eclipse.jetty.io.FillInterest.fillable(FillInterest.java:108)
	at org.eclipse.jetty.io.SelectChannelEndPoint$2.run(SelectChannelEndPoint.java:93)
	at org.eclipse.jetty.util.thread.strategy.ExecuteProduceConsume.executeProduceConsume(ExecuteProduceConsume.java:303)
	at org.eclipse.jetty.util.thread.strategy.ExecuteProduceConsume.produceConsume(ExecuteProduceConsume.java:148)
	at org.eclipse.jetty.util.thread.strategy.ExecuteProduceConsume.run(ExecuteProduceConsume.java:136)
	at org.eclipse.jetty.util.thread.QueuedThreadPool.runJob(QueuedThreadPool.java:671)
	at org.eclipse.jetty.util.thread.QueuedThreadPool$2.run(QueuedThreadPool.java:589)
	at java.base/java.lang.Thread.run(Thread.java:844)


	at __randomizedtesting.SeedInfo.seed([1347709A996A9A7B]:0)
	at org.junit.Assert.fail(Assert.java:93)
	at org.junit.Assert.assertTrue(Assert.java:43)
	at org.junit.Assert.assertNull(Assert.java:551)
	at org.apache.solr.SolrTestCaseJ4.teardownTestCases(SolrTestCaseJ4.java:295)
	at java.base/jdk.internal.reflect.NativeMethodAccessorImpl.invoke0(Native Method)
	at java.base/jdk.internal.reflect.NativeMethodAccessorImpl.invoke(NativeMethodAccessorImpl.java:62)
	at java.base/jdk.internal.reflect.DelegatingMethodAccessorImpl.invoke(DelegatingMethodAccessorImpl.java:43)
	at java.base/java.lang.reflect.Method.invoke(Method.java:564)
	at com.carrotsearch.randomizedtesting.RandomizedRunner.invoke(RandomizedRunner.java:1737)
	at com.carrotsearch.randomizedtesting.RandomizedRunner$7.evaluate(RandomizedRunner.java:897)
	at com.carrotsearch.randomizedtesting.rules.StatementAdapter.evaluate(StatementAdapter.java:36)
	at com.carrotsearch.randomizedtesting.rules.SystemPropertiesRestoreRule$1.evaluate(SystemPropertiesRestoreRule.java:57)
	at org.apache.lucene.util.AbstractBeforeAfterRule$1.evaluate(AbstractBeforeAfterRule.java:45)
	at com.carrotsearch.randomizedtesting.rules.StatementAdapter.evaluate(StatementAdapter.java:36)
	at org.apache.lucene.util.TestRuleStoreClassName$1.evaluate(TestRuleStoreClassName.java:41)
	at com.carrotsearch.randomizedtesting.rules.NoShadowingOrOverridesOnMethodsRule$1.evaluate(NoShadowingOrOverridesOnMethodsRule.java:40)
	at com.carrotsearch.randomizedtesting.rules.NoShadowingOrOverridesOnMethodsRule$1.evaluate(NoShadowingOrOverridesOnMethodsRule.java:40)
	at com.carrotsearch.randomizedtesting.rules.StatementAdapter.evaluate(StatementAdapter.java:36)
	at com.carrotsearch.randomizedtesting.rules.StatementAdapter.evaluate(StatementAdapter.java:36)
	at org.apache.lucene.util.TestRuleAssertionsRequired$1.evaluate(TestRuleAssertionsRequired.java:53)
	at org.apache.lucene.util.TestRuleMarkFailure$1.evaluate(TestRuleMarkFailure.java:47)
	at org.apache.lucene.util.TestRuleIgnoreAfterMaxFailures$1.evaluate(TestRuleIgnoreAfterMaxFailures.java:64)
	at org.apache.lucene.util.TestRuleIgnoreTestSuites$1.evaluate(TestRuleIgnoreTestSuites.java:54)
	at com.carrotsearch.randomizedtesting.rules.StatementAdapter.evaluate(StatementAdapter.java:36)
	at com.carrotsearch.randomizedtesting.ThreadLeakControl$StatementRunner.run(ThreadLeakControl.java:368)
	at java.base/java.lang.Thread.run(Thread.java:844)


FAILED:  junit.framework.TestSuite.org.apache.solr.core.BlobRepositoryCloudTest

Error Message:
Could not remove the following files (in the order of attempts):    C:\Users\jenkins\workspace\Lucene-Solr-7.x-Windows\solr\build\solr-core\test\J0\temp\solr.core.BlobRepositoryCloudTest_1347709A996A9A7B-001\tempDir-001\zookeeper\server1\data\version-2: java.nio.file.DirectoryNotEmptyException: C:\Users\jenkins\workspace\Lucene-Solr-7.x-Windows\solr\build\solr-core\test\J0\temp\solr.core.BlobRepositoryCloudTest_1347709A996A9A7B-001\tempDir-001\zookeeper\server1\data\version-2    C:\Users\jenkins\workspace\Lucene-Solr-7.x-Windows\solr\build\solr-core\test\J0\temp\solr.core.BlobRepositoryCloudTest_1347709A996A9A7B-001\tempDir-001\zookeeper\server1\data: java.nio.file.DirectoryNotEmptyException: C:\Users\jenkins\workspace\Lucene-Solr-7.x-Windows\solr\build\solr-core\test\J0\temp\solr.core.BlobRepositoryCloudTest_1347709A996A9A7B-001\tempDir-001\zookeeper\server1\data    C:\Users\jenkins\workspace\Lucene-Solr-7.x-Windows\solr\build\solr-core\test\J0\temp\solr.core.BlobRepositoryCloudTest_1347709A996A9A7B-001\tempDir-001\zookeeper\server1: java.nio.file.DirectoryNotEmptyException: C:\Users\jenkins\workspace\Lucene-Solr-7.x-Windows\solr\build\solr-core\test\J0\temp\solr.core.BlobRepositoryCloudTest_1347709A996A9A7B-001\tempDir-001\zookeeper\server1    C:\Users\jenkins\workspace\Lucene-Solr-7.x-Windows\solr\build\solr-core\test\J0\temp\solr.core.BlobRepositoryCloudTest_1347709A996A9A7B-001\tempDir-001\zookeeper: java.nio.file.DirectoryNotEmptyException: C:\Users\jenkins\workspace\Lucene-Solr-7.x-Windows\solr\build\solr-core\test\J0\temp\solr.core.BlobRepositoryCloudTest_1347709A996A9A7B-001\tempDir-001\zookeeper    C:\Users\jenkins\workspace\Lucene-Solr-7.x-Windows\solr\build\solr-core\test\J0\temp\solr.core.BlobRepositoryCloudTest_1347709A996A9A7B-001\tempDir-001: java.nio.file.DirectoryNotEmptyException: C:\Users\jenkins\workspace\Lucene-Solr-7.x-Windows\solr\build\solr-core\test\J0\temp\solr.core.BlobRepositoryCloudTest_1347709A996A9A7B-001\tempDir-001 

Stack Trace:
java.io.IOException: Could not remove the following files (in the order of attempts):
   C:\Users\jenkins\workspace\Lucene-Solr-7.x-Windows\solr\build\solr-core\test\J0\temp\solr.core.BlobRepositoryCloudTest_1347709A996A9A7B-001\tempDir-001\zookeeper\server1\data\version-2: java.nio.file.DirectoryNotEmptyException: C:\Users\jenkins\workspace\Lucene-Solr-7.x-Windows\solr\build\solr-core\test\J0\temp\solr.core.BlobRepositoryCloudTest_1347709A996A9A7B-001\tempDir-001\zookeeper\server1\data\version-2
   C:\Users\jenkins\workspace\Lucene-Solr-7.x-Windows\solr\build\solr-core\test\J0\temp\solr.core.BlobRepositoryCloudTest_1347709A996A9A7B-001\tempDir-001\zookeeper\server1\data: java.nio.file.DirectoryNotEmptyException: C:\Users\jenkins\workspace\Lucene-Solr-7.x-Windows\solr\build\solr-core\test\J0\temp\solr.core.BlobRepositoryCloudTest_1347709A996A9A7B-001\tempDir-001\zookeeper\server1\data
   C:\Users\jenkins\workspace\Lucene-Solr-7.x-Windows\solr\build\solr-core\test\J0\temp\solr.core.BlobRepositoryCloudTest_1347709A996A9A7B-001\tempDir-001\zookeeper\server1: java.nio.file.DirectoryNotEmptyException: C:\Users\jenkins\workspace\Lucene-Solr-7.x-Windows\solr\build\solr-core\test\J0\temp\solr.core.BlobRepositoryCloudTest_1347709A996A9A7B-001\tempDir-001\zookeeper\server1
   C:\Users\jenkins\workspace\Lucene-Solr-7.x-Windows\solr\build\solr-core\test\J0\temp\solr.core.BlobRepositoryCloudTest_1347709A996A9A7B-001\tempDir-001\zookeeper: java.nio.file.DirectoryNotEmptyException: C:\Users\jenkins\workspace\Lucene-Solr-7.x-Windows\solr\build\solr-core\test\J0\temp\solr.core.BlobRepositoryCloudTest_1347709A996A9A7B-001\tempDir-001\zookeeper
   C:\Users\jenkins\workspace\Lucene-Solr-7.x-Windows\solr\build\solr-core\test\J0\temp\solr.core.BlobRepositoryCloudTest_1347709A996A9A7B-001\tempDir-001: java.nio.file.DirectoryNotEmptyException: C:\Users\jenkins\workspace\Lucene-Solr-7.x-Windows\solr\build\solr-core\test\J0\temp\solr.core.BlobRepositoryCloudTest_1347709A996A9A7B-001\tempDir-001

	at __randomizedtesting.SeedInfo.seed([1347709A996A9A7B]:0)
	at org.apache.lucene.util.IOUtils.rm(IOUtils.java:329)
	at org.apache.lucene.util.TestRuleTemporaryFilesCleanup.afterAlways(TestRuleTemporaryFilesCleanup.java:216)
	at com.carrotsearch.randomizedtesting.rules.TestRuleAdapter$1.afterAlways(TestRuleAdapter.java:31)
	at com.carrotsearch.randomizedtesting.rules.StatementAdapter.evaluate(StatementAdapter.java:43)
	at com.carrotsearch.randomizedtesting.rules.StatementAdapter.evaluate(StatementAdapter.java:36)
	at org.apache.lucene.util.TestRuleAssertionsRequired$1.evaluate(TestRuleAssertionsRequired.java:53)
	at org.apache.lucene.util.TestRuleMarkFailure$1.evaluate(TestRuleMarkFailure.java:47)
	at org.apache.lucene.util.TestRuleIgnoreAfterMaxFailures$1.evaluate(TestRuleIgnoreAfterMaxFailures.java:64)
	at org.apache.lucene.util.TestRuleIgnoreTestSuites$1.evaluate(TestRuleIgnoreTestSuites.java:54)
	at com.carrotsearch.randomizedtesting.rules.StatementAdapter.evaluate(StatementAdapter.java:36)
	at com.carrotsearch.randomizedtesting.ThreadLeakControl$StatementRunner.run(ThreadLeakControl.java:368)
	at java.base/java.lang.Thread.run(Thread.java:844)


FAILED:  junit.framework.TestSuite.org.apache.solr.core.OpenCloseCoreStressTest

Error Message:
Could not remove the following files (in the order of attempts):    C:\Users\jenkins\workspace\Lucene-Solr-7.x-Windows\solr\build\solr-core\test\J1\temp\solr.core.OpenCloseCoreStressTest_1347709A996A9A7B-001\tempDir-001\00002_core: java.nio.file.DirectoryNotEmptyException: C:\Users\jenkins\workspace\Lucene-Solr-7.x-Windows\solr\build\solr-core\test\J1\temp\solr.core.OpenCloseCoreStressTest_1347709A996A9A7B-001\tempDir-001\00002_core    C:\Users\jenkins\workspace\Lucene-Solr-7.x-Windows\solr\build\solr-core\test\J1\temp\solr.core.OpenCloseCoreStressTest_1347709A996A9A7B-001\tempDir-001: java.nio.file.DirectoryNotEmptyException: C:\Users\jenkins\workspace\Lucene-Solr-7.x-Windows\solr\build\solr-core\test\J1\temp\solr.core.OpenCloseCoreStressTest_1347709A996A9A7B-001\tempDir-001    C:\Users\jenkins\workspace\Lucene-Solr-7.x-Windows\solr\build\solr-core\test\J1\temp\solr.core.OpenCloseCoreStressTest_1347709A996A9A7B-001\tempDir-001\00002_core\conf: java.nio.file.AccessDeniedException: C:\Users\jenkins\workspace\Lucene-Solr-7.x-Windows\solr\build\solr-core\test\J1\temp\solr.core.OpenCloseCoreStressTest_1347709A996A9A7B-001\tempDir-001\00002_core\conf    C:\Users\jenkins\workspace\Lucene-Solr-7.x-Windows\solr\build\solr-core\test\J1\temp\solr.core.OpenCloseCoreStressTest_1347709A996A9A7B-001: java.nio.file.DirectoryNotEmptyException: C:\Users\jenkins\workspace\Lucene-Solr-7.x-Windows\solr\build\solr-core\test\J1\temp\solr.core.OpenCloseCoreStressTest_1347709A996A9A7B-001 

Stack Trace:
java.io.IOException: Could not remove the following files (in the order of attempts):
   C:\Users\jenkins\workspace\Lucene-Solr-7.x-Windows\solr\build\solr-core\test\J1\temp\solr.core.OpenCloseCoreStressTest_1347709A996A9A7B-001\tempDir-001\00002_core: java.nio.file.DirectoryNotEmptyException: C:\Users\jenkins\workspace\Lucene-Solr-7.x-Windows\solr\build\solr-core\test\J1\temp\solr.core.OpenCloseCoreStressTest_1347709A996A9A7B-001\tempDir-001\00002_core
   C:\Users\jenkins\workspace\Lucene-Solr-7.x-Windows\solr\build\solr-core\test\J1\temp\solr.core.OpenCloseCoreStressTest_1347709A996A9A7B-001\tempDir-001: java.nio.file.DirectoryNotEmptyException: C:\Users\jenkins\workspace\Lucene-Solr-7.x-Windows\solr\build\solr-core\test\J1\temp\solr.core.OpenCloseCoreStressTest_1347709A996A9A7B-001\tempDir-001
   C:\Users\jenkins\workspace\Lucene-Solr-7.x-Windows\solr\build\solr-core\test\J1\temp\solr.core.OpenCloseCoreStressTest_1347709A996A9A7B-001\tempDir-001\00002_core\conf: java.nio.file.AccessDeniedException: C:\Users\jenkins\workspace\Lucene-Solr-7.x-Windows\solr\build\solr-core\test\J1\temp\solr.core.OpenCloseCoreStressTest_1347709A996A9A7B-001\tempDir-001\00002_core\conf
   C:\Users\jenkins\workspace\Lucene-Solr-7.x-Windows\solr\build\solr-core\test\J1\temp\solr.core.OpenCloseCoreStressTest_1347709A996A9A7B-001: java.nio.file.DirectoryNotEmptyException: C:\Users\jenkins\workspace\Lucene-Solr-7.x-Windows\solr\build\solr-core\test\J1\temp\solr.core.OpenCloseCoreStressTest_1347709A996A9A7B-001

	at __randomizedtesting.SeedInfo.seed([1347709A996A9A7B]:0)
	at org.apache.lucene.util.IOUtils.rm(IOUtils.java:329)
	at org.apache.lucene.util.TestRuleTemporaryFilesCleanup.afterAlways(TestRuleTemporaryFilesCleanup.java:216)
	at com.carrotsearch.randomizedtesting.rules.TestRuleAdapter$1.afterAlways(TestRuleAdapter.java:31)
	at com.carrotsearch.randomizedtesting.rules.StatementAdapter.evaluate(StatementAdapter.java:43)
	at com.carrotsearch.randomizedtesting.rules.StatementAdapter.evaluate(StatementAdapter.java:36)
	at org.apache.lucene.util.TestRuleAssertionsRequired$1.evaluate(TestRuleAssertionsRequired.java:53)
	at org.apache.lucene.util.TestRuleMarkFailure$1.evaluate(TestRuleMarkFailure.java:47)
	at org.apache.lucene.util.TestRuleIgnoreAfterMaxFailures$1.evaluate(TestRuleIgnoreAfterMaxFailures.java:64)
	at org.apache.lucene.util.TestRuleIgnoreTestSuites$1.evaluate(TestRuleIgnoreTestSuites.java:54)
	at com.carrotsearch.randomizedtesting.rules.StatementAdapter.evaluate(StatementAdapter.java:36)
	at com.carrotsearch.randomizedtesting.ThreadLeakControl$StatementRunner.run(ThreadLeakControl.java:368)
	at java.base/java.lang.Thread.run(Thread.java:844)


FAILED:  junit.framework.TestSuite.org.apache.solr.search.QueryEqualityTest

Error Message:
Could not remove the following files (in the order of attempts):    C:\Users\jenkins\workspace\Lucene-Solr-7.x-Windows\solr\build\solr-core\test\J1\temp\solr.search.QueryEqualityTest_1347709A996A9A7B-001\init-core-data-001\tlog: java.nio.file.DirectoryNotEmptyException: C:\Users\jenkins\workspace\Lucene-Solr-7.x-Windows\solr\build\solr-core\test\J1\temp\solr.search.QueryEqualityTest_1347709A996A9A7B-001\init-core-data-001\tlog    C:\Users\jenkins\workspace\Lucene-Solr-7.x-Windows\solr\build\solr-core\test\J1\temp\solr.search.QueryEqualityTest_1347709A996A9A7B-001\init-core-data-001: java.nio.file.DirectoryNotEmptyException: C:\Users\jenkins\workspace\Lucene-Solr-7.x-Windows\solr\build\solr-core\test\J1\temp\solr.search.QueryEqualityTest_1347709A996A9A7B-001\init-core-data-001    C:\Users\jenkins\workspace\Lucene-Solr-7.x-Windows\solr\build\solr-core\test\J1\temp\solr.search.QueryEqualityTest_1347709A996A9A7B-001\init-core-data-001\tlog\tlog.0000000000000000000: java.nio.file.AccessDeniedException: C:\Users\jenkins\workspace\Lucene-Solr-7.x-Windows\solr\build\solr-core\test\J1\temp\solr.search.QueryEqualityTest_1347709A996A9A7B-001\init-core-data-001\tlog\tlog.0000000000000000000    C:\Users\jenkins\workspace\Lucene-Solr-7.x-Windows\solr\build\solr-core\test\J1\temp\solr.search.QueryEqualityTest_1347709A996A9A7B-001: java.nio.file.DirectoryNotEmptyException: C:\Users\jenkins\workspace\Lucene-Solr-7.x-Windows\solr\build\solr-core\test\J1\temp\solr.search.QueryEqualityTest_1347709A996A9A7B-001 

Stack Trace:
java.io.IOException: Could not remove the following files (in the order of attempts):
   C:\Users\jenkins\workspace\Lucene-Solr-7.x-Windows\solr\build\solr-core\test\J1\temp\solr.search.QueryEqualityTest_1347709A996A9A7B-001\init-core-data-001\tlog: java.nio.file.DirectoryNotEmptyException: C:\Users\jenkins\workspace\Lucene-Solr-7.x-Windows\solr\build\solr-core\test\J1\temp\solr.search.QueryEqualityTest_1347709A996A9A7B-001\init-core-data-001\tlog
   C:\Users\jenkins\workspace\Lucene-Solr-7.x-Windows\solr\build\solr-core\test\J1\temp\solr.search.QueryEqualityTest_1347709A996A9A7B-001\init-core-data-001: java.nio.file.DirectoryNotEmptyException: C:\Users\jenkins\workspace\Lucene-Solr-7.x-Windows\solr\build\solr-core\test\J1\temp\solr.search.QueryEqualityTest_1347709A996A9A7B-001\init-core-data-001
   C:\Users\jenkins\workspace\Lucene-Solr-7.x-Windows\solr\build\solr-core\test\J1\temp\solr.search.QueryEqualityTest_1347709A996A9A7B-001\init-core-data-001\tlog\tlog.0000000000000000000: java.nio.file.AccessDeniedException: C:\Users\jenkins\workspace\Lucene-Solr-7.x-Windows\solr\build\solr-core\test\J1\temp\solr.search.QueryEqualityTest_1347709A996A9A7B-001\init-core-data-001\tlog\tlog.0000000000000000000
   C:\Users\jenkins\workspace\Lucene-Solr-7.x-Windows\solr\build\solr-core\test\J1\temp\solr.search.QueryEqualityTest_1347709A996A9A7B-001: java.nio.file.DirectoryNotEmptyException: C:\Users\jenkins\workspace\Lucene-Solr-7.x-Windows\solr\build\solr-core\test\J1\temp\solr.search.QueryEqualityTest_1347709A996A9A7B-001

	at __randomizedtesting.SeedInfo.seed([1347709A996A9A7B]:0)
	at org.apache.lucene.util.IOUtils.rm(IOUtils.java:329)
	at org.apache.lucene.util.TestRuleTemporaryFilesCleanup.afterAlways(TestRuleTemporaryFilesCleanup.java:216)
	at com.carrotsearch.randomizedtesting.rules.TestRuleAdapter$1.afterAlways(TestRuleAdapter.java:31)
	at com.carrotsearch.randomizedtesting.rules.StatementAdapter.evaluate(StatementAdapter.java:43)
	at com.carrotsearch.randomizedtesting.rules.StatementAdapter.evaluate(StatementAdapter.java:36)
	at org.apache.lucene.util.TestRuleAssertionsRequired$1.evaluate(TestRuleAssertionsRequired.java:53)
	at org.apache.lucene.util.TestRuleMarkFailure$1.evaluate(TestRuleMarkFailure.java:47)
	at org.apache.lucene.util.TestRuleIgnoreAfterMaxFailures$1.evaluate(TestRuleIgnoreAfterMaxFailures.java:64)
	at org.apache.lucene.util.TestRuleIgnoreTestSuites$1.evaluate(TestRuleIgnoreTestSuites.java:54)
	at com.carrotsearch.randomizedtesting.rules.StatementAdapter.evaluate(StatementAdapter.java:36)
	at com.carrotsearch.randomizedtesting.ThreadLeakControl$StatementRunner.run(ThreadLeakControl.java:368)
	at java.base/java.lang.Thread.run(Thread.java:844)


FAILED:  junit.framework.TestSuite.org.apache.solr.client.solrj.response.TestSuggesterResponse

Error Message:
Could not remove the following files (in the order of attempts):    C:\Users\jenkins\workspace\Lucene-Solr-7.x-Windows\solr\build\solr-solrj\test\J1\temp\solr.client.solrj.response.TestSuggesterResponse_ED1C3AAE9DE5DBDA-001\init-core-data-001: java.nio.file.DirectoryNotEmptyException: C:\Users\jenkins\workspace\Lucene-Solr-7.x-Windows\solr\build\solr-solrj\test\J1\temp\solr.client.solrj.response.TestSuggesterResponse_ED1C3AAE9DE5DBDA-001\init-core-data-001    C:\Users\jenkins\workspace\Lucene-Solr-7.x-Windows\solr\build\solr-solrj\test\J1\temp\solr.client.solrj.response.TestSuggesterResponse_ED1C3AAE9DE5DBDA-001\init-core-data-001\tlog: java.nio.file.AccessDeniedException: C:\Users\jenkins\workspace\Lucene-Solr-7.x-Windows\solr\build\solr-solrj\test\J1\temp\solr.client.solrj.response.TestSuggesterResponse_ED1C3AAE9DE5DBDA-001\init-core-data-001\tlog    C:\Users\jenkins\workspace\Lucene-Solr-7.x-Windows\solr\build\solr-solrj\test\J1\temp\solr.client.solrj.response.TestSuggesterResponse_ED1C3AAE9DE5DBDA-001: java.nio.file.DirectoryNotEmptyException: C:\Users\jenkins\workspace\Lucene-Solr-7.x-Windows\solr\build\solr-solrj\test\J1\temp\solr.client.solrj.response.TestSuggesterResponse_ED1C3AAE9DE5DBDA-001 

Stack Trace:
java.io.IOException: Could not remove the following files (in the order of attempts):
   C:\Users\jenkins\workspace\Lucene-Solr-7.x-Windows\solr\build\solr-solrj\test\J1\temp\solr.client.solrj.response.TestSuggesterResponse_ED1C3AAE9DE5DBDA-001\init-core-data-001: java.nio.file.DirectoryNotEmptyException: C:\Users\jenkins\workspace\Lucene-Solr-7.x-Windows\solr\build\solr-solrj\test\J1\temp\solr.client.solrj.response.TestSuggesterResponse_ED1C3AAE9DE5DBDA-001\init-core-data-001
   C:\Users\jenkins\workspace\Lucene-Solr-7.x-Windows\solr\build\solr-solrj\test\J1\temp\solr.client.solrj.response.TestSuggesterResponse_ED1C3AAE9DE5DBDA-001\init-core-data-001\tlog: java.nio.file.AccessDeniedException: C:\Users\jenkins\workspace\Lucene-Solr-7.x-Windows\solr\build\solr-solrj\test\J1\temp\solr.client.solrj.response.TestSuggesterResponse_ED1C3AAE9DE5DBDA-001\init-core-data-001\tlog
   C:\Users\jenkins\workspace\Lucene-Solr-7.x-Windows\solr\build\solr-solrj\test\J1\temp\solr.client.solrj.response.TestSuggesterResponse_ED1C3AAE9DE5DBDA-001: java.nio.file.DirectoryNotEmptyException: C:\Users\jenkins\workspace\Lucene-Solr-7.x-Windows\solr\build\solr-solrj\test\J1\temp\solr.client.solrj.response.TestSuggesterResponse_ED1C3AAE9DE5DBDA-001

	at __randomizedtesting.SeedInfo.seed([ED1C3AAE9DE5DBDA]:0)
	at org.apache.lucene.util.IOUtils.rm(IOUtils.java:329)
	at org.apache.lucene.util.TestRuleTemporaryFilesCleanup.afterAlways(TestRuleTemporaryFilesCleanup.java:216)
	at com.carrotsearch.randomizedtesting.rules.TestRuleAdapter$1.afterAlways(TestRuleAdapter.java:31)
	at com.carrotsearch.randomizedtesting.rules.StatementAdapter.evaluate(StatementAdapter.java:43)
	at com.carrotsearch.randomizedtesting.rules.StatementAdapter.evaluate(StatementAdapter.java:36)
	at org.apache.lucene.util.TestRuleAssertionsRequired$1.evaluate(TestRuleAssertionsRequired.java:53)
	at org.apache.lucene.util.TestRuleMarkFailure$1.evaluate(TestRuleMarkFailure.java:47)
	at org.apache.lucene.util.TestRuleIgnoreAfterMaxFailures$1.evaluate(TestRuleIgnoreAfterMaxFailures.java:64)
	at org.apache.lucene.util.TestRuleIgnoreTestSuites$1.evaluate(TestRuleIgnoreTestSuites.java:54)
	at com.carrotsearch.randomizedtesting.rules.StatementAdapter.evaluate(StatementAdapter.java:36)
	at com.carrotsearch.randomizedtesting.ThreadLeakControl$StatementRunner.run(ThreadLeakControl.java:368)
	at java.base/java.lang.Thread.run(Thread.java:844)




Build Log:
[...truncated 2448 lines...]
   [junit4] Suite: org.apache.lucene.analysis.snowball.TestSnowballVocab
   [junit4]   2> NOTE: test params are: codec=Asserting(Lucene70): {}, docValues:{}, maxPointsInLeafNode=1050, maxMBSortInHeap=5.461319795112656, sim=RandomSimilarity(queryNorm=true): {}, locale=km, timezone=America/Thule
   [junit4]   2> NOTE: Windows 10 10.0 amd64/Oracle Corporation 9.0.1 (64-bit)/cpus=3,threads=1,free=181062312,total=229638144
   [junit4]   2> NOTE: All tests run in this JVM: [TestEmptyTokenStream, QueryAutoStopWordAnalyzerTest, TestConv, TestWikipediaTokenizerFactory, TestGreekStemFilterFactory, TestCapitalizationFilterFactory, TestRussianLightStemFilterFactory, TestTruncateTokenFilter, TestLatvianStemFilterFactory, TestFrenchLightStemFilter, TestNorwegianMinimalStemFilter, CommonGramsFilterTest, TestGalicianAnalyzer, DelimitedPayloadTokenFilterTest, TestMultiWordSynonyms, TestLithuanianStemming, TestLatvianAnalyzer, TestSnowballVocab]
   [junit4]   2> NOTE: reproduce with: ant test  -Dtestcase=TestSnowballVocab -Dtests.seed=2E16BA5728076CCD -Dtests.slow=true -Dtests.locale=km -Dtests.timezone=America/Thule -Dtests.asserts=true -Dtests.file.encoding=Cp1252
   [junit4] ERROR   0.00s J0 | TestSnowballVocab (suite) <<<
   [junit4]    > Throwable #1: java.io.IOException: Could not remove the following files (in the order of attempts):
   [junit4]    >    C:\Users\jenkins\workspace\Lucene-Solr-7.x-Windows\lucene\build\analysis\common\test\J0\temp\lucene.analysis.snowball.TestSnowballVocab_2E16BA5728076CCD-001\tempDir-015: java.nio.file.DirectoryNotEmptyException: C:\Users\jenkins\workspace\Lucene-Solr-7.x-Windows\lucene\build\analysis\common\test\J0\temp\lucene.analysis.snowball.TestSnowballVocab_2E16BA5728076CCD-001\tempDir-015
   [junit4]    > 	at __randomizedtesting.SeedInfo.seed([2E16BA5728076CCD]:0)
   [junit4]    > 	at org.apache.lucene.util.IOUtils.rm(IOUtils.java:329)
   [junit4]    > 	at java.base/java.lang.Thread.run(Thread.java:844)
   [junit4] Completed [64/284 (1!)] on J0 in 22.43s, 1 test, 1 error <<< FAILURES!

[...truncated 2152 lines...]
   [junit4] Suite: org.apache.lucene.index.TestBackwardsCompatibility
   [junit4] IGNOR/A 0.01s J0 | TestBackwardsCompatibility.testCreateNoCFS
   [junit4]    > Assumption #1: backcompat creation tests must be run with -Dtests.bwcdir=/path/to/write/indexes
   [junit4] IGNOR/A 0.00s J0 | TestBackwardsCompatibility.testCreateCFS
   [junit4]    > Assumption #1: backcompat creation tests must be run with -Dtests.bwcdir=/path/to/write/indexes
   [junit4] IGNOR/A 0.00s J0 | TestBackwardsCompatibility.testCreateSingleSegmentNoCFS
   [junit4]    > Assumption #1: backcompat creation tests must be run with -Dtests.bwcdir=/path/to/write/indexes
   [junit4] IGNOR/A 0.02s J0 | TestBackwardsCompatibility.testCreateIndexWithDocValuesUpdates
   [junit4]    > Assumption #1: backcompat creation tests must be run with -Dtests.bwcdir=/path/to/write/indexes
   [junit4] IGNOR/A 0.00s J0 | TestBackwardsCompatibility.testCreateMoreTermsIndex
   [junit4]    > Assumption #1: backcompat creation tests must be run with -Dtests.bwcdir=/path/to/write/indexes
   [junit4] IGNOR/A 0.00s J0 | TestBackwardsCompatibility.testCreateEmptyIndex
   [junit4]    > Assumption #1: backcompat creation tests must be run with -Dtests.bwcdir=/path/to/write/indexes
   [junit4] IGNOR/A 0.00s J0 | TestBackwardsCompatibility.testCreateSingleSegmentCFS
   [junit4]    > Assumption #1: backcompat creation tests must be run with -Dtests.bwcdir=/path/to/write/indexes
   [junit4] IGNOR/A 0.00s J0 | TestBackwardsCompatibility.testCreateSortedIndex
   [junit4]    > Assumption #1: backcompat creation tests must be run with -Dtests.bwcdir=/path/to/write/indexes
   [junit4]   2> NOTE: test params are: codec=Asserting(Lucene70), sim=RandomSimilarity(queryNorm=false): {content6=DFR I(n)3(800.0), content5=DFR I(ne)BZ(0.3), content2=DFI(Saturated), utf8=DFR I(ne)B2, fie?ld=BM25(k1=1.2,b=0.75), content=DFR I(ne)B1, autf8=IB LL-D3(800.0)}, locale=ar-SS, timezone=Brazil/Acre
   [junit4]   2> NOTE: Windows 10 10.0 amd64/Oracle Corporation 9.0.1 (64-bit)/cpus=3,threads=1,free=89901152,total=110100480
   [junit4]   2> NOTE: All tests run in this JVM: [TestLucene50SegmentInfoFormat, TestBackwardsCompatibility]
   [junit4]   2> NOTE: reproduce with: ant test  -Dtestcase=TestBackwardsCompatibility -Dtests.seed=729E21FCBC6AE203 -Dtests.slow=true -Dtests.locale=ar-SS -Dtests.timezone=Brazil/Acre -Dtests.asserts=true -Dtests.file.encoding=ISO-8859-1
   [junit4] ERROR   0.00s J0 | TestBackwardsCompatibility (suite) <<<
   [junit4]    > Throwable #1: java.io.IOException: Could not remove the following files (in the order of attempts):
   [junit4]    >    C:\Users\jenkins\workspace\Lucene-Solr-7.x-Windows\lucene\build\backward-codecs\test\J0\temp\lucene.index.TestBackwardsCompatibility_729E21FCBC6AE203-001\3.1.0-nocfs-001: java.nio.file.DirectoryNotEmptyException: C:\Users\jenkins\workspace\Lucene-Solr-7.x-Windows\lucene\build\backward-codecs\test\J0\temp\lucene.index.TestBackwardsCompatibility_729E21FCBC6AE203-001\3.1.0-nocfs-001
   [junit4]    >    C:\Users\jenkins\workspace\Lucene-Solr-7.x-Windows\lucene\build\backward-codecs\test\J0\temp\lucene.index.TestBackwardsCompatibility_729E21FCBC6AE203-001\2.3.0-nocfs-001: java.nio.file.DirectoryNotEmptyException: C:\Users\jenkins\workspace\Lucene-Solr-7.x-Windows\lucene\build\backward-codecs\test\J0\temp\lucene.index.TestBackwardsCompatibility_729E21FCBC6AE203-001\2.3.0-nocfs-001
   [junit4]    >    C:\Users\jenkins\workspace\Lucene-Solr-7.x-Windows\lucene\build\backward-codecs\test\J0\temp\lucene.index.TestBackwardsCompatibility_729E21FCBC6AE203-001\2.0.0-nocfs-001: java.nio.file.DirectoryNotEmptyException: C:\Users\jenkins\workspace\Lucene-Solr-7.x-Windows\lucene\build\backward-codecs\test\J0\temp\lucene.index.TestBackwardsCompatibility_729E21FCBC6AE203-001\2.0.0-nocfs-001
   [junit4]    > 	at __randomizedtesting.SeedInfo.seed([729E21FCBC6AE203]:0)
   [junit4]    > 	at org.apache.lucene.util.IOUtils.rm(IOUtils.java:329)
   [junit4]    > 	at java.base/java.lang.Thread.run(Thread.java:844)
   [junit4] Completed [7/8 (1!)] on J0 in 42.59s, 30 tests, 1 error, 8 skipped <<< FAILURES!

[...truncated 6973 lines...]
   [junit4] Suite: org.apache.solr.cloud.TestTlogReplica
   [junit4]   2> 5511 INFO  (SUITE-TestTlogReplica-seed#[1347709A996A9A7B]-worker) [    ] o.a.s.SolrTestCaseJ4 SecureRandom sanity checks: test.solr.allowed.securerandom=null & java.security.egd=file:/dev/./urandom
   [junit4]   2> Creating dataDir: C:\Users\jenkins\workspace\Lucene-Solr-7.x-Windows\solr\build\solr-core\test\J1\temp\solr.cloud.TestTlogReplica_1347709A996A9A7B-001\init-core-data-001
   [junit4]   2> 5513 INFO  (SUITE-TestTlogReplica-seed#[1347709A996A9A7B]-worker) [    ] o.a.s.SolrTestCaseJ4 Using PointFields (NUMERIC_POINTS_SYSPROP=true) w/NUMERIC_DOCVALUES_SYSPROP=false
   [junit4]   2> 5517 INFO  (SUITE-TestTlogReplica-seed#[1347709A996A9A7B]-worker) [    ] o.a.s.SolrTestCaseJ4 Randomized ssl (false) and clientAuth (true) via: @org.apache.solr.util.RandomizeSSL(reason="", value=0.0/0.0, ssl=0.0/0.0, clientAuth=0.0/0.0)
   [junit4]   2> 5520 INFO  (SUITE-TestTlogReplica-seed#[1347709A996A9A7B]-worker) [    ] o.a.s.c.MiniSolrCloudCluster Starting cluster of 2 servers in C:\Users\jenkins\workspace\Lucene-Solr-7.x-Windows\solr\build\solr-core\test\J1\temp\solr.cloud.TestTlogReplica_1347709A996A9A7B-001\tempDir-001
   [junit4]   2> 5526 INFO  (SUITE-TestTlogReplica-seed#[1347709A996A9A7B]-worker) [    ] o.a.s.c.ZkTestServer STARTING ZK TEST SERVER
   [junit4]   2> 5528 INFO  (Thread-2) [    ] o.a.s.c.ZkTestServer client port:0.0.0.0/0.0.0.0:0
   [junit4]   2> 5528 INFO  (Thread-2) [    ] o.a.s.c.ZkTestServer Starting server
   [junit4]   2> 5628 INFO  (SUITE-TestTlogReplica-seed#[1347709A996A9A7B]-worker) [    ] o.a.s.c.ZkTestServer start zk server on port:49822
   [junit4]   2> 5643 ERROR (Thread-2) [    ] o.a.z.s.ZooKeeperServer ZKShutdownHandler is not registered, so ZooKeeper server won't take any action on ERROR or SHUTDOWN server state changes
   [junit4]   2> 5796 INFO  (jetty-launcher-5-thread-1) [    ] o.e.j.s.Server jetty-9.3.20.v20170531
   [junit4]   2> 5796 INFO  (jetty-launcher-5-thread-2) [    ] o.e.j.s.Server jetty-9.3.20.v20170531
   [junit4]   2> 5814 INFO  (jetty-launcher-5-thread-2) [    ] o.e.j.s.h.ContextHandler Started o.e.j.s.ServletContextHandler@19a5f75a{/solr,null,AVAILABLE}
   [junit4]   2> 5814 INFO  (jetty-launcher-5-thread-1) [    ] o.e.j.s.h.ContextHandler Started o.e.j.s.ServletContextHandler@5eadbf1e{/solr,null,AVAILABLE}
   [junit4]   2> 5826 INFO  (jetty-launcher-5-thread-1) [    ] o.e.j.s.AbstractConnector Started ServerConnector@2a39530b{HTTP/1.1,[http/1.1]}{127.0.0.1:49826}
   [junit4]   2> 5826 INFO  (jetty-launcher-5-thread-2) [    ] o.e.j.s.AbstractConnector Started ServerConnector@1f210dec{HTTP/1.1,[http/1.1]}{127.0.0.1:49827}
   [junit4]   2> 5826 INFO  (jetty-launcher-5-thread-1) [    ] o.e.j.s.Server Started @15709ms
   [junit4]   2> 5827 INFO  (jetty-launcher-5-thread-2) [    ] o.e.j.s.Server Started @15709ms
   [junit4]   2> 5827 INFO  (jetty-launcher-5-thread-2) [    ] o.a.s.c.s.e.JettySolrRunner Jetty properties: {hostContext=/solr, hostPort=49827}
   [junit4]   2> 5827 INFO  (jetty-launcher-5-thread-1) [    ] o.a.s.c.s.e.JettySolrRunner Jetty properties: {hostContext=/solr, hostPort=49826}
   [junit4]   2> 5838 ERROR (jetty-launcher-5-thread-1) [    ] o.a.s.u.StartupLoggingUtils Missing Java Option solr.log.dir. Logging may be missing or incomplete.
   [junit4]   2> 5838 ERROR (jetty-launcher-5-thread-2) [    ] o.a.s.u.StartupLoggingUtils Missing Java Option solr.log.dir. Logging may be missing or incomplete.
   [junit4]   2> 5838 INFO  (jetty-launcher-5-thread-1) [    ] o.a.s.s.SolrDispatchFilter  ___      _       Welcome to Apache Solr™ version 7.2.0
   [junit4]   2> 5838 INFO  (jetty-launcher-5-thread-2) [    ] o.a.s.s.SolrDispatchFilter  ___      _       Welcome to Apache Solr™ version 7.2.0
   [junit4]   2> 5838 INFO  (jetty-launcher-5-thread-1) [    ] o.a.s.s.SolrDispatchFilter / __| ___| |_ _   Starting in cloud mode on port null
   [junit4]   2> 5838 INFO  (jetty-launcher-5-thread-2) [    ] o.a.s.s.SolrDispatchFilter / __| ___| |_ _   Starting in cloud mode on port null
   [junit4]   2> 5838 INFO  (jetty-launcher-5-thread-1) [    ] o.a.s.s.SolrDispatchFilter \__ \/ _ \ | '_|  Install dir: null
   [junit4]   2> 5838 INFO  (jetty-launcher-5-thread-2) [    ] o.a.s.s.SolrDispatchFilter \__ \/ _ \ | '_|  Install dir: null
   [junit4]   2> 5850 INFO  (jetty-launcher-5-thread-1) [    ] o.a.s.s.SolrDispatchFilter |___/\___/_|_|    Start time: 2017-10-31T15:04:15.499038500Z
   [junit4]   2> 5850 INFO  (jetty-launcher-5-thread-2) [    ] o.a.s.s.SolrDispatchFilter |___/\___/_|_|    Start time: 2017-10-31T15:04:15.499038500Z
   [junit4]   2> 5858 INFO  (jetty-launcher-5-thread-2) [    ] o.a.s.s.SolrDispatchFilter solr.xml found in ZooKeeper. Loading...
   [junit4]   2> 5858 INFO  (jetty-launcher-5-thread-1) [    ] o.a.s.s.SolrDispatchFilter solr.xml found in ZooKeeper. Loading...
   [junit4]   2> 5874 WARN  (NIOServerCxn.Factory:0.0.0.0/0.0.0.0:0) [    ] o.a.z.s.NIOServerCnxn caught end of stream exception
   [junit4]   2> EndOfStreamException: Unable to read additional data from client sessionid 0x15f72f626820002, likely client has closed socket
   [junit4]   2> 	at org.apache.zookeeper.server.NIOServerCnxn.doIO(NIOServerCnxn.java:239)
   [junit4]   2> 	at org.apache.zookeeper.server.NIOServerCnxnFactory.run(NIOServerCnxnFactory.java:203)
   [junit4]   2> 	at java.base/java.lang.Thread.run(Thread.java:844)
   [junit4]   2> 5886 INFO  (jetty-launcher-5-thread-1) [    ] o.a.s.c.ZkContainer Zookeeper client=127.0.0.1:49822/solr
   [junit4]   2> 5887 INFO  (jetty-launcher-5-thread-2) [    ] o.a.s.c.ZkContainer Zookeeper client=127.0.0.1:49822/solr
   [junit4]   2> 5900 WARN  (NIOServerCxn.Factory:0.0.0.0/0.0.0.0:0) [    ] o.a.z.s.NIOServerCnxn caught end of stream exception
   [junit4]   2> EndOfStreamException: Unable to read additional data from client sessionid 0x15f72f626820003, likely client has closed socket
   [junit4]   2> 	at org.apache.zookeeper.server.NIOServerCnxn.doIO(NIOServerCnxn.java:239)
   [junit4]   2> 	at org.apache.zookeeper.server.NIOServerCnxnFactory.run(NIOServerCnxnFactory.java:203)
   [junit4]   2> 	at java.base/java.lang.Thread.run(Thread.java:844)
   [junit4]   2> 6140 INFO  (jetty-launcher-5-thread-1) [n:127.0.0.1:49826_solr    ] o.a.s.c.Overseer Overseer (id=null) closing
   [junit4]   2> 6142 INFO  (jetty-launcher-5-thread-1) [n:127.0.0.1:49826_solr    ] o.a.s.c.OverseerElectionContext I am going to be the leader 127.0.0.1:49826_solr
   [junit4]   2> 6156 INFO  (jetty-launcher-5-thread-1) [n:127.0.0.1:49826_solr    ] o.a.s.c.Overseer Overseer (id=98924118359015429-127.0.0.1:49826_solr-n_0000000000) starting
   [junit4]   2> 6168 INFO  (jetty-launcher-5-thread-2) [n:127.0.0.1:49827_solr    ] o.a.s.c.Overseer Overseer (id=null) closing
   [junit4]   2> 6173 INFO  (jetty-launcher-5-thread-2) [n:127.0.0.1:49827_solr    ] o.a.s.c.ZkController Register node as live in ZooKeeper:/live_nodes/127.0.0.1:49827_solr
   [junit4]   2> 6189 INFO  (zkCallback-16-thread-1-processing-n:127.0.0.1:49826_solr) [n:127.0.0.1:49826_solr    ] o.a.s.c.c.ZkStateReader Updated live nodes from ZooKeeper... (0) -> (1)
   [junit4]   2> 6192 INFO  (zkCallback-17-thread-1-processing-n:127.0.0.1:49827_solr) [n:127.0.0.1:49827_solr    ] o.a.s.c.c.ZkStateReader Updated live nodes from ZooKeeper... (0) -> (1)
   [junit4]   2> 6272 INFO  (jetty-launcher-5-thread-1) [n:127.0.0.1:49826_solr    ] o.a.s.c.ZkController Register node as live in ZooKeeper:/live_nodes/127.0.0.1:49826_solr
   [junit4]   2> 6293 INFO  (zkCallback-17-thread-1-processing-n:127.0.0.1:49827_solr) [n:127.0.0.1:49827_solr    ] o.a.s.c.c.ZkStateReader Updated live nodes from ZooKeeper... (1) -> (2)
   [junit4]   2> 6361 INFO  (zkCallback-16-thread-1-processing-n:127.0.0.1:49826_solr) [n:127.0.0.1:49826_solr    ] o.a.s.c.c.ZkStateReader Updated live nodes from ZooKeeper... (1) -> (2)
   [junit4]   2> 6435 INFO  (jetty-launcher-5-thread-2) [n:127.0.0.1:49827_solr    ] o.a.s.m.r.SolrJmxReporter JMX monitoring for 'solr_49827.solr.node' (registry 'solr.node') enabled at server: com.sun.jmx.mbeanserver.JmxMBeanServer@4439baeb
   [junit4]   2> 6436 INFO  (jetty-launcher-5-thread-2) [n:127.0.0.1:49827_solr    ] o.a.s.m.r.SolrJmxReporter JMX monitoring for 'solr_49827.solr.jvm' (registry 'solr.jvm') enabled at server: com.sun.jmx.mbeanserver.JmxMBeanServer@4439baeb
   [junit4]   2> 6436 INFO  (jetty-launcher-5-thread-2) [n:127.0.0.1:49827_solr    ] o.a.s.m.r.SolrJmxReporter JMX monitoring for 'solr_49827.solr.jetty' (registry 'solr.jetty') enabled at server: com.sun.jmx.mbeanserver.JmxMBeanServer@4439baeb
   [junit4]   2> 6448 INFO  (jetty-launcher-5-thread-2) [n:127.0.0.1:49827_solr    ] o.a.s.c.CorePropertiesLocator Found 0 core definitions underneath C:\Users\jenkins\workspace\Lucene-Solr-7.x-Windows\solr\build\solr-core\test\J1\temp\solr.cloud.TestTlogReplica_1347709A996A9A7B-001\tempDir-001\node2\.
   [junit4]   2> 6568 INFO  (jetty-launcher-5-thread-1) [n:127.0.0.1:49826_solr    ] o.a.s.m.r.SolrJmxReporter JMX monitoring for 'solr_49826.solr.node' (registry 'solr.node') enabled at server: com.sun.jmx.mbeanserver.JmxMBeanServer@4439baeb
   [junit4]   2> 6570 INFO  (jetty-launcher-5-thread-1) [n:127.0.0.1:49826_solr    ] o.a.s.m.r.SolrJmxReporter JMX monitoring for 'solr_49826.solr.jvm' (registry 'solr.jvm') enabled at server: com.sun.jmx.mbeanserver.JmxMBeanServer@4439baeb
   [junit4]   2> 6571 INFO  (jetty-launcher-5-thread-1) [n:127.0.0.1:49826_solr    ] o.a.s.m.r.SolrJmxReporter JMX monitoring for 'solr_49826.solr.jetty' (registry 'solr.jetty') enabled at server: com.sun.jmx.mbeanserver.JmxMBeanServer@4439baeb
   [junit4]   2> 6575 INFO  (jetty-launcher-5-thread-1) [n:127.0.0.1:49826_solr    ] o.a.s.c.CorePropertiesLocator Found 0 core definitions underneath C:\Users\jenkins\workspace\Lucene-Solr-7.x-Windows\solr\build\solr-core\test\J1\temp\solr.cloud.TestTlogReplica_1347709A996A9A7B-001\tempDir-001\node1\.
   [junit4]   2> 6997 INFO  (SUITE-TestTlogReplica-seed#[1347709A996A9A7B]-worker) [    ] o.a.s.c.c.ZkStateReader Updated live nodes from ZooKeeper... (0) -> (2)
   [junit4]   2> 6999 INFO  (SUITE-TestTlogReplica-seed#[1347709A996A9A7B]-worker) [    ] o.a.s.c.s.i.ZkClientClusterStateProvider Cluster at 127.0.0.1:49822/solr ready
   [junit4]   2> 7004 INFO  (SUITE-TestTlogReplica-seed#[1347709A996A9A7B]-worker) [    ] o.a.s.c.TestTlogReplica Using legacyCloud?: false
   [junit4]   2> 7229 INFO  (qtp1570744449-121) [n:127.0.0.1:49826_solr    ] o.a.s.h.a.CollectionsHandler Invoked Collection Action :clusterprop with params val=false&name=legacyCloud&action=CLUSTERPROP&wt=javabin&version=2 and sendToOCPQueue=true
   [junit4]   2> 7233 INFO  (qtp1570744449-121) [n:127.0.0.1:49826_solr    ] o.a.s.s.HttpSolrCall [admin] webapp=null path=/admin/collections params={val=false&name=legacyCloud&action=CLUSTERPROP&wt=javabin&version=2} status=0 QTime=5
   [junit4]   2> 7284 INFO  (TEST-TestTlogReplica.testRemoveLeader-seed#[1347709A996A9A7B]) [    ] o.a.s.SolrTestCaseJ4 ###Starting testRemoveLeader
   [junit4]   2> 7292 INFO  (qtp1570744449-123) [n:127.0.0.1:49826_solr    ] o.a.s.h.a.CollectionsHandler Invoked Collection Action :create with params pullReplicas=0&replicationFactor=0&collection.configName=conf&maxShardsPerNode=100&name=tlog_replica_test_remove_leader&nrtReplicas=0&action=CREATE&numShards=1&tlogReplicas=2&wt=javabin&version=2 and sendToOCPQueue=true
   [junit4]   2> 7306 INFO  (OverseerThreadFactory-40-thread-1-processing-n:127.0.0.1:49826_solr) [n:127.0.0.1:49826_solr    ] o.a.s.c.CreateCollectionCmd Create collection tlog_replica_test_remove_leader
   [junit4]   2> 7453 INFO  (OverseerStateUpdate-98924118359015429-127.0.0.1:49826_solr-n_0000000000) [n:127.0.0.1:49826_solr    ] o.a.s.c.o.SliceMutator createReplica() {
   [junit4]   2>   "operation":"ADDREPLICA",
   [junit4]   2>   "collection":"tlog_replica_test_remove_leader",
   [junit4]   2>   "shard":"shard1",
   [junit4]   2>   "core":"tlog_replica_test_remove_leader_shard1_replica_t1",
   [junit4]   2>   "state":"down",
   [junit4]   2>   "base_url":"http://127.0.0.1:49826/solr",
   [junit4]   2>   "type":"TLOG",
   [junit4]   2>   "waitForFinalState":"false"} 
   [junit4]   2> 7476 INFO  (OverseerStateUpdate-98924118359015429-127.0.0.1:49826_solr-n_0000000000) [n:127.0.0.1:49826_solr    ] o.a.s.c.o.SliceMutator createReplica() {
   [junit4]   2>   "operation":"ADDREPLICA",
   [junit4]   2>   "collection":"tlog_replica_test_remove_leader",
   [junit4]   2>   "shard":"shard1",
   [junit4]   2>   "core":"tlog_replica_test_remove_leader_shard1_replica_t2",
   [junit4]   2>   "state":"down",
   [junit4]   2>   "base_url":"http://127.0.0.1:49827/solr",
   [junit4]   2>   "type":"TLOG",
   [junit4]   2>   "waitForFinalState":"false"} 
   [junit4]   2> 7662 INFO  (qtp1570744449-125) [n:127.0.0.1:49826_solr    ] o.a.s.h.a.CoreAdminOperation core create command qt=/admin/cores&coreNodeName=core_node3&collection.configName=conf&newCollection=true&name=tlog_replica_test_remove_leader_shard1_replica_t1&action=CREATE&numShards=1&collection=tlog_replica_test_remove_leader&shard=shard1&wt=javabin&version=2&replicaType=TLOG
   [junit4]   2> 7664 INFO  (qtp559545178-115) [n:127.0.0.1:49827_solr    ] o.a.s.h.a.CoreAdminOperation core create command qt=/admin/cores&coreNodeName=core_node4&collection.configName=conf&newCollection=true&name=tlog_replica_test_remove_leader_shard1_replica_t2&action=CREATE&numShards=1&collection=tlog_replica_test_remove_leader&shard=shard1&wt=javabin&version=2&replicaType=TLOG
   [junit4]   2> 7666 INFO  (qtp1570744449-125) [n:127.0.0.1:49826_solr    ] o.a.s.c.TransientSolrCoreCacheDefault Allocating transient cache for 2147483647 transient cores
   [junit4]   2> 7666 INFO  (qtp559545178-115) [n:127.0.0.1:49827_solr    ] o.a.s.c.TransientSolrCoreCacheDefault Allocating transient cache for 2147483647 transient cores
   [junit4]   2> 7785 INFO  (zkCallback-16-thread-1-processing-n:127.0.0.1:49826_solr) [n:127.0.0.1:49826_solr    ] o.a.s.c.c.ZkStateReader A cluster state change: [WatchedEvent state:SyncConnected type:NodeDataChanged path:/collections/tlog_replica_test_remove_leader/state.json] for collection [tlog_replica_test_remove_leader] has occurred - updating... (live nodes size: [2])
   [junit4]   2> 7785 INFO  (zkCallback-17-thread-1-processing-n:127.0.0.1:49827_solr) [n:127.0.0.1:49827_solr    ] o.a.s.c.c.ZkStateReader A cluster state change: [WatchedEvent state:SyncConnected type:NodeDataChanged path:/collections/tlog_replica_test_remove_leader/state.json] for collection [tlog_replica_test_remove_leader] has occurred - updating... (live nodes size: [2])
   [junit4]   2> 7787 INFO  (zkCallback-16-thread-2-processing-n:127.0.0.1:49826_solr) [n:127.0.0.1:49826_solr    ] o.a.s.c.c.ZkStateReader A cluster state change: [WatchedEvent state:SyncConnected type:NodeDataChanged path:/collections/tlog_replica_test_remove_leader/state.json] for collection [tlog_replica_test_remove_leader] has occurred - updating... (live nodes size: [2])
   [junit4]   2> 7788 INFO  (zkCallback-17-thread-2-processing-n:127.0.0.1:49827_solr) [n:127.0.0.1:49827_solr    ] o.a.s.c.c.ZkStateReader A cluster state change: [WatchedEvent state:SyncConnected type:NodeDataChanged path:/collections/tlog_replica_test_remove_leader/state.json] for collection [tlog_replica_test_remove_leader] has occurred - updating... (live nodes size: [2])
   [junit4]   2> 8698 INFO  (qtp559545178-115) [n:127.0.0.1:49827_solr c:tlog_replica_test_remove_leader s:shard1 r:core_node4 x:tlog_replica_test_remove_leader_shard1_replica_t2] o.a.s.c.SolrConfig Using Lucene MatchVersion: 7.2.0
   [junit4]   2> 8699 INFO  (qtp1570744449-125) [n:127.0.0.1:49826_solr c:tlog_replica_test_remove_leader s:shard1 r:core_node3 x:tlog_replica_test_remove_leader_shard1_replica_t1] o.a.s.c.SolrConfig Using Lucene MatchVersion: 7.2.0
   [junit4]   2> 8712 INFO  (qtp559545178-115) [n:127.0.0.1:49827_solr c:tlog_replica_test_remove_leader s:shard1 r:core_node4 x:tlog_replica_test_remove_leader_shard1_replica_t2] o.a.s.s.IndexSchema [tlog_replica_test_remove_leader_shard1_replica_t2] Schema name=minimal
   [junit4]   2> 8712 INFO  (qtp1570744449-125) [n:127.0.0.1:49826_solr c:tlog_replica_test_remove_leader s:shard1 r:core_node3 x:tlog_replica_test_remove_leader_shard1_replica_t1] o.a.s.s.IndexSchema [tlog_replica_test_remove_leader_shard1_replica_t1] Schema name=minimal
   [junit4]   2> 8718 INFO  (qtp1570744449-125) [n:127.0.0.1:49826_solr c:tlog_replica_test_remove_leader s:shard1 r:core_node3 x:tlog_replica_test_remove_leader_shard1_replica_t1] o.a.s.s.IndexSchema Loaded schema minimal/1.1 with uniqueid field id
   [junit4]   2> 8718 INFO  (qtp1570744449-125) [n:127.0.0.1:49826_solr c:tlog_replica_test_remove_leader s:shard1 r:core_node3 x:tlog_replica_test_remove_leader_shard1_replica_t1] o.a.s.c.CoreContainer Creating SolrCore 'tlog_replica_test_remove_leader_shard1_replica_t1' using configuration from collection tlog_replica_test_remove_leader, trusted=true
   [junit4]   2> 8721 INFO  (qtp559545178-115) [n:127.0.0.1:49827_solr c:tlog_replica_test_remove_leader s:shard1 r:core_node4 x:tlog_replica_test_remove_leader_shard1_replica_t2] o.a.s.s.IndexSchema Loaded schema minimal/1.1 with uniqueid field id
   [junit4]   2> 8721 INFO  (qtp559545178-115) [n:127.0.0.1:49827_solr c:tlog_replica_test_remove_leader s:shard1 r:core_node4 x:tlog_replica_test_remove_leader_shard1_replica_t2] o.a.s.c.CoreContainer Creating SolrCore 'tlog_replica_test_remove_leader_shard1_replica_t2' using configuration from collection tlog_replica_test_remove_leader, trusted=true
   [junit4]   2> 8723 INFO  (qtp1570744449-125) [n:127.0.0.1:49826_solr c:tlog_replica_test_remove_leader s:shard1 r:core_node3 x:tlog_replica_test_remove_leader_shard1_replica_t1] o.a.s.m.r.SolrJmxReporter JMX monitoring for 'solr_49826.solr.core.tlog_replica_test_remove_leader.shard1.replica_t1' (registry 'solr.core.tlog_replica_test_remove_leader.shard1.replica_t1') enabled at server: com.sun.jmx.mbeanserver.JmxMBeanServer@4439baeb
   [junit4]   2> 8723 INFO  (qtp559545178-115) [n:127.0.0.1:49827_solr c:tlog_replica_test_remove_leader s:shard1 r:core_node4 x:tlog_replica_test_remove_leader_shard1_replica_t2] o.a.s.m.r.SolrJmxReporter JMX monitoring for 'solr_49827.solr.core.tlog_replica_test_remove_leader.shard1.replica_t2' (registry 'solr.core.tlog_replica_test_remove_leader.shard1.replica_t2') enabled at server: com.sun.jmx.mbeanserver.JmxMBeanServer@4439baeb
   [junit4]   2> 8723 INFO  (qtp1570744449-125) [n:127.0.0.1:49826_solr c:tlog_replica_test_remove_leader s:shard1 r:core_node3 x:tlog_replica_test_remove_leader_shard1_replica_t1] o.a.s.c.SolrCore solr.RecoveryStrategy.Builder
   [junit4]   2> 8723 INFO  (qtp559545178-115) [n:127.0.0.1:49827_solr c:tlog_replica_test_remove_leader s:shard1 r:core_node4 x:tlog_replica_test_remove_leader_shard1_replica_t2] o.a.s.c.SolrCore solr.RecoveryStrategy.Builder
   [junit4]   2> 8723 INFO  (qtp559545178-115) [n:127.0.0.1:49827_solr c:tlog_replica_test_remove_leader s:shard1 r:core_node4 x:tlog_replica_test_remove_leader_shard1_replica_t2] o.a.s.c.SolrCore [[tlog_replica_test_remove_leader_shard1_replica_t2] ] Opening new SolrCore at [C:\Users\jenkins\workspace\Lucene-Solr-7.x-Windows\solr\build\solr-core\test\J1\temp\solr.cloud.TestTlogReplica_1347709A996A9A7B-001\tempDir-001\node2\tlog_replica_test_remove_leader_shard1_replica_t2], dataDir=[C:\Users\jenkins\workspace\Lucene-Solr-7.x-Windows\solr\build\solr-core\test\J1\temp\solr.cloud.TestTlogReplica_1347709A996A9A7B-001\tempDir-001\node2\.\tlog_replica_test_remove_leader_shard1_replica_t2\data\]
   [junit4]   2> 8724 INFO  (qtp1570744449-125) [n:127.0.0.1:49826_solr c:tlog_replica_test_remove_leader s:shard1 r:core_node3 x:tlog_replica_test_remove_leader_shard1_replica_t1] o.a.s.c.SolrCore [[tlog_replica_test_remove_leader_shard1_replica_t1] ] Opening new SolrCore at [C:\Users\jenkins\workspace\Lucene-Solr-7.x-Windows\solr\build\solr-core\test\J1\temp\solr.cloud.TestTlogReplica_1347709A996A9A7B-001\tempDir-001\node1\tlog_replica_test_remove_leader_shard1_replica_t1], dataDir=[C:\Users\jenkins\workspace\Lucene-Solr-7.x-Windows\solr\build\solr-core\test\J1\temp\solr.cloud.TestTlogReplica_1347709A996A9A7B-001\tempDir-001\node1\.\tlog_replica_test_remove_leader_shard1_replica_t1\data\]
   [junit4]   2> 8810 INFO  (qtp559545178-115) [n:127.0.0.1:49827_solr c:tlog_replica_test_remove_leader s:shard1 r:core_node4 x:tlog_replica_test_remove_leader_shard1_replica_t2] o.a.s.u.UpdateHandler Using UpdateLog implementation: org.apache.solr.update.UpdateLog
   [junit4]   2> 8810 INFO  (qtp559545178-115) [n:127.0.0.1:49827_solr c:tlog_replica_test_remove_leader s:shard1 r:core_node4 x:tlog_replica_test_remove_leader_shard1_replica_t2] o.a.s.u.UpdateLog Initializing UpdateLog: dataDir=null defaultSyncLevel=FLUSH numRecordsToKeep=100 maxNumLogsToKeep=10 numVersionBuckets=65536
   [junit4]   2> 8817 INFO  (qtp559545178-115) [n:127.0.0.1:49827_solr c:tlog_replica_test_remove_leader s:shard1 r:core_node4 x:tlog_replica_test_remove_leader_shard1_replica_t2] o.a.s.u.CommitTracker Hard AutoCommit: disabled
   [junit4]   2> 8817 INFO  (qtp559545178-115) [n:127.0.0.1:49827_solr c:tlog_replica_test_remove_leader s:shard1 r:core_node4 x:tlog_replica_test_remove_leader_shard1_replica_t2] o.a.s.u.CommitTracker Soft AutoCommit: disabled
   [junit4]   2> 8820 INFO  (qtp559545178-115) [n:127.0.0.1:49827_solr c:tlog_replica_test_remove_leader s:shard1 r:core_node4 x:tlog_replica_test_remove_leader_shard1_replica_t2] o.a.s.s.SolrIndexSearcher Opening [Searcher@416d8fad[tlog_replica_test_remove_leader_shard1_replica_t2] main]
   [junit4]   2> 8823 INFO  (qtp559545178-115) [n:127.0.0.1:49827_solr c:tlog_replica_test_remove_leader s:shard1 r:core_node4 x:tlog_replica_test_remove_leader_shard1_replica_t2] o.a.s.r.ManagedResourceStorage Configured ZooKeeperStorageIO with znodeBase: /configs/conf
   [junit4]   2> 8824 INFO  (qtp559545178-115) [n:127.0.0.1:49827_solr c:tlog_replica_test_remove_leader s:shard1 r:core_node4 x:tlog_replica_test_remove_leader_shard1_replica_t2] o.a.s.r.ManagedResourceStorage Loaded null at path _rest_managed.json using ZooKeeperStorageIO:path=/configs/conf
   [junit4]   2> 8825 INFO  (qtp559545178-115) [n:127.0.0.1:49827_solr c:tlog_replica_test_remove_leader s:shard1 r:core_node4 x:tlog_replica_test_remove_leader_shard1_replica_t2] o.a.s.h.ReplicationHandler Commits will be reserved for 10000ms.
   [junit4]   2> 8828 INFO  (sea

[...truncated too long message...]

ing reporter [org.apache.solr.metrics.reporters.SolrJmxReporter@7391dc1: rootName = null, domain = solr.jvm, service url = null, agent id = null] for registry solr.jvm / null
   [junit4]   2> 5806 INFO  (SUITE-TestSuggesterResponse-seed#[ED1C3AAE9DE5DBDA]-worker) [    ] o.a.s.m.SolrMetricManager Closing metric reporters for registry=solr.jetty, tag=null
   [junit4]   2> 5806 INFO  (SUITE-TestSuggesterResponse-seed#[ED1C3AAE9DE5DBDA]-worker) [    ] o.a.s.m.r.SolrJmxReporter Closing reporter [org.apache.solr.metrics.reporters.SolrJmxReporter@2fe5149: rootName = null, domain = solr.jetty, service url = null, agent id = null] for registry solr.jetty / null
   [junit4]   2> 5806 INFO  (coreCloseExecutor-12-thread-1) [    x:collection1] o.a.s.c.SolrCore [collection1]  CLOSING SolrCore org.apache.solr.core.SolrCore@2a659f80
   [junit4]   2> 5806 INFO  (coreCloseExecutor-12-thread-1) [    x:collection1] o.a.s.m.SolrMetricManager Closing metric reporters for registry=solr.core.collection1, tag=711303040
   [junit4]   2> 5806 INFO  (coreCloseExecutor-12-thread-1) [    x:collection1] o.a.s.m.r.SolrJmxReporter Closing reporter [org.apache.solr.metrics.reporters.SolrJmxReporter@43adcbf8: rootName = null, domain = solr.core.collection1, service url = null, agent id = null] for registry solr.core.collection1 / null
   [junit4]   2> 5833 INFO  (coreCloseExecutor-12-thread-1) [    x:collection1] o.a.s.u.LoggingInfoStream [IW][coreCloseExecutor-12-thread-1]: now flush at close
   [junit4]   2> 5833 INFO  (coreCloseExecutor-12-thread-1) [    x:collection1] o.a.s.u.LoggingInfoStream [IW][coreCloseExecutor-12-thread-1]:   start flush: applyAllDeletes=true
   [junit4]   2> 5833 INFO  (coreCloseExecutor-12-thread-1) [    x:collection1] o.a.s.u.LoggingInfoStream [IW][coreCloseExecutor-12-thread-1]:   index before flush _2(7.2.0):C3
   [junit4]   2> 5834 INFO  (coreCloseExecutor-12-thread-1) [    x:collection1] o.a.s.u.LoggingInfoStream [DW][coreCloseExecutor-12-thread-1]: startFullFlush
   [junit4]   2> 5834 INFO  (coreCloseExecutor-12-thread-1) [    x:collection1] o.a.s.u.LoggingInfoStream [DW][coreCloseExecutor-12-thread-1]: coreCloseExecutor-12-thread-1 finishFullFlush success=true
   [junit4]   2> 5834 INFO  (coreCloseExecutor-12-thread-1) [    x:collection1] o.a.s.u.LoggingInfoStream [IW][coreCloseExecutor-12-thread-1]: now apply all deletes for all segments buffered updates bytesUsed=0 reader pool bytesUsed=0
   [junit4]   2> 5834 INFO  (coreCloseExecutor-12-thread-1) [    x:collection1] o.a.s.u.LoggingInfoStream [BD][coreCloseExecutor-12-thread-1]: waitApply: no deletes to apply
   [junit4]   2> 5834 INFO  (coreCloseExecutor-12-thread-1) [    x:collection1] o.a.s.u.LoggingInfoStream [MS][coreCloseExecutor-12-thread-1]: updateMergeThreads ioThrottle=true targetMBPerSec=10240.0 MB/sec
   [junit4]   2> 5834 INFO  (coreCloseExecutor-12-thread-1) [    x:collection1] o.a.s.u.LoggingInfoStream [MS][coreCloseExecutor-12-thread-1]: now merge
   [junit4]   2> 5834 INFO  (coreCloseExecutor-12-thread-1) [    x:collection1] o.a.s.u.LoggingInfoStream [MS][coreCloseExecutor-12-thread-1]:   index: _2(7.2.0):C3
   [junit4]   2> 5834 INFO  (coreCloseExecutor-12-thread-1) [    x:collection1] o.a.s.u.LoggingInfoStream [MS][coreCloseExecutor-12-thread-1]:   no more merges pending; now return
   [junit4]   2> 5834 INFO  (coreCloseExecutor-12-thread-1) [    x:collection1] o.a.s.u.LoggingInfoStream [IW][coreCloseExecutor-12-thread-1]: waitForMerges
   [junit4]   2> 5834 INFO  (coreCloseExecutor-12-thread-1) [    x:collection1] o.a.s.u.LoggingInfoStream [IW][coreCloseExecutor-12-thread-1]: waitForMerges done
   [junit4]   2> 5834 INFO  (coreCloseExecutor-12-thread-1) [    x:collection1] o.a.s.u.LoggingInfoStream [IW][coreCloseExecutor-12-thread-1]: commit: start
   [junit4]   2> 5834 INFO  (coreCloseExecutor-12-thread-1) [    x:collection1] o.a.s.u.LoggingInfoStream [IW][coreCloseExecutor-12-thread-1]: commit: enter lock
   [junit4]   2> 5834 INFO  (coreCloseExecutor-12-thread-1) [    x:collection1] o.a.s.u.LoggingInfoStream [IW][coreCloseExecutor-12-thread-1]: commit: now prepare
   [junit4]   2> 5834 INFO  (coreCloseExecutor-12-thread-1) [    x:collection1] o.a.s.u.LoggingInfoStream [IW][coreCloseExecutor-12-thread-1]: prepareCommit: flush
   [junit4]   2> 5834 INFO  (coreCloseExecutor-12-thread-1) [    x:collection1] o.a.s.u.LoggingInfoStream [IW][coreCloseExecutor-12-thread-1]:   index before flush _2(7.2.0):C3
   [junit4]   2> 5834 INFO  (coreCloseExecutor-12-thread-1) [    x:collection1] o.a.s.u.LoggingInfoStream [DW][coreCloseExecutor-12-thread-1]: startFullFlush
   [junit4]   2> 5834 INFO  (coreCloseExecutor-12-thread-1) [    x:collection1] o.a.s.u.LoggingInfoStream [IW][coreCloseExecutor-12-thread-1]: now apply all deletes for all segments buffered updates bytesUsed=0 reader pool bytesUsed=0
   [junit4]   2> 5835 INFO  (coreCloseExecutor-12-thread-1) [    x:collection1] o.a.s.u.LoggingInfoStream [BD][coreCloseExecutor-12-thread-1]: waitApply: no deletes to apply
   [junit4]   2> 5835 INFO  (coreCloseExecutor-12-thread-1) [    x:collection1] o.a.s.u.LoggingInfoStream [DW][coreCloseExecutor-12-thread-1]: coreCloseExecutor-12-thread-1 finishFullFlush success=true
   [junit4]   2> 5838 INFO  (coreCloseExecutor-12-thread-1) [    x:collection1] o.a.s.u.LoggingInfoStream [IW][coreCloseExecutor-12-thread-1]: startCommit(): start
   [junit4]   2> 5838 INFO  (coreCloseExecutor-12-thread-1) [    x:collection1] o.a.s.u.LoggingInfoStream [IW][coreCloseExecutor-12-thread-1]:   skip startCommit(): no changes pending
   [junit4]   2> 5838 INFO  (coreCloseExecutor-12-thread-1) [    x:collection1] o.a.s.u.LoggingInfoStream [IW][coreCloseExecutor-12-thread-1]: commit: pendingCommit == null; skip
   [junit4]   2> 5838 INFO  (coreCloseExecutor-12-thread-1) [    x:collection1] o.a.s.u.LoggingInfoStream [IW][coreCloseExecutor-12-thread-1]: commit: took 3.4 msec
   [junit4]   2> 5838 INFO  (coreCloseExecutor-12-thread-1) [    x:collection1] o.a.s.u.LoggingInfoStream [IW][coreCloseExecutor-12-thread-1]: commit: done
   [junit4]   2> 5838 INFO  (coreCloseExecutor-12-thread-1) [    x:collection1] o.a.s.u.LoggingInfoStream [IW][coreCloseExecutor-12-thread-1]: rollback
   [junit4]   2> 5838 INFO  (coreCloseExecutor-12-thread-1) [    x:collection1] o.a.s.u.LoggingInfoStream [IW][coreCloseExecutor-12-thread-1]: all running merges have aborted
   [junit4]   2> 5838 INFO  (coreCloseExecutor-12-thread-1) [    x:collection1] o.a.s.u.LoggingInfoStream [IW][coreCloseExecutor-12-thread-1]: rollback: done finish merges
   [junit4]   2> 5838 INFO  (coreCloseExecutor-12-thread-1) [    x:collection1] o.a.s.u.LoggingInfoStream [DW][coreCloseExecutor-12-thread-1]: abort
   [junit4]   2> 5838 INFO  (coreCloseExecutor-12-thread-1) [    x:collection1] o.a.s.u.LoggingInfoStream [DW][coreCloseExecutor-12-thread-1]: done abort success=true
   [junit4]   2> 5838 INFO  (coreCloseExecutor-12-thread-1) [    x:collection1] o.a.s.u.LoggingInfoStream [IW][coreCloseExecutor-12-thread-1]: rollback: infos=_2(7.2.0):C3
   [junit4]   2> 5838 INFO  (coreCloseExecutor-12-thread-1) [    x:collection1] o.a.s.u.LoggingInfoStream [IFD][coreCloseExecutor-12-thread-1]: now checkpoint "_2(7.2.0):C3" [1 segments ; isCommit = false]
   [junit4]   2> 5838 INFO  (coreCloseExecutor-12-thread-1) [    x:collection1] o.a.s.u.LoggingInfoStream [IFD][coreCloseExecutor-12-thread-1]: 0 msec to checkpoint
   [junit4]   2> 5861 INFO  (SUITE-TestSuggesterResponse-seed#[ED1C3AAE9DE5DBDA]-worker) [    ] o.a.s.SolrTestCaseJ4 ------------------------------------------------------- Done waiting for tracked resources to be released
   [junit4]   2> NOTE: test params are: codec=CheapBastard, sim=RandomSimilarity(queryNorm=true): {}, locale=ko-KP, timezone=Asia/Tomsk
   [junit4]   2> NOTE: Windows 10 10.0 amd64/Oracle Corporation 9.0.1 (64-bit)/cpus=3,threads=1,free=120763568,total=233308160
   [junit4]   2> NOTE: All tests run in this JVM: [TestSuggesterResponse]
   [junit4]   2> NOTE: reproduce with: ant test  -Dtestcase=TestSuggesterResponse -Dtests.seed=ED1C3AAE9DE5DBDA -Dtests.slow=true -Dtests.locale=ko-KP -Dtests.timezone=Asia/Tomsk -Dtests.asserts=true -Dtests.file.encoding=ISO-8859-1
   [junit4] ERROR   0.00s J1 | TestSuggesterResponse (suite) <<<
   [junit4]    > Throwable #1: java.io.IOException: Could not remove the following files (in the order of attempts):
   [junit4]    >    C:\Users\jenkins\workspace\Lucene-Solr-7.x-Windows\solr\build\solr-solrj\test\J1\temp\solr.client.solrj.response.TestSuggesterResponse_ED1C3AAE9DE5DBDA-001\init-core-data-001: java.nio.file.DirectoryNotEmptyException: C:\Users\jenkins\workspace\Lucene-Solr-7.x-Windows\solr\build\solr-solrj\test\J1\temp\solr.client.solrj.response.TestSuggesterResponse_ED1C3AAE9DE5DBDA-001\init-core-data-001
   [junit4]    >    C:\Users\jenkins\workspace\Lucene-Solr-7.x-Windows\solr\build\solr-solrj\test\J1\temp\solr.client.solrj.response.TestSuggesterResponse_ED1C3AAE9DE5DBDA-001\init-core-data-001\tlog: java.nio.file.AccessDeniedException: C:\Users\jenkins\workspace\Lucene-Solr-7.x-Windows\solr\build\solr-solrj\test\J1\temp\solr.client.solrj.response.TestSuggesterResponse_ED1C3AAE9DE5DBDA-001\init-core-data-001\tlog
   [junit4]    >    C:\Users\jenkins\workspace\Lucene-Solr-7.x-Windows\solr\build\solr-solrj\test\J1\temp\solr.client.solrj.response.TestSuggesterResponse_ED1C3AAE9DE5DBDA-001: java.nio.file.DirectoryNotEmptyException: C:\Users\jenkins\workspace\Lucene-Solr-7.x-Windows\solr\build\solr-solrj\test\J1\temp\solr.client.solrj.response.TestSuggesterResponse_ED1C3AAE9DE5DBDA-001
   [junit4]    > 	at __randomizedtesting.SeedInfo.seed([ED1C3AAE9DE5DBDA]:0)
   [junit4]    > 	at org.apache.lucene.util.IOUtils.rm(IOUtils.java:329)
   [junit4]    > 	at java.base/java.lang.Thread.run(Thread.java:844)
   [junit4] Completed [2/146 (1!)] on J1 in 15.56s, 3 tests, 1 error <<< FAILURES!

[...truncated 39651 lines...]

Mime
View raw message