lucene-dev mailing list archives

Site index · List index
Message view « Date » · « Thread »
Top « Date » · « Thread »
From Policeman Jenkins Server <jenk...@thetaphi.de>
Subject [JENKINS] Lucene-Solr-5.5-Windows (64bit/jdk1.7.0_80) - Build # 147 - Still Unstable!
Date Fri, 20 Oct 2017 10:09:38 GMT
Build: https://jenkins.thetaphi.de/job/Lucene-Solr-5.5-Windows/147/
Java: 64bit/jdk1.7.0_80 -XX:+UseCompressedOops -XX:+UseSerialGC

2 tests failed.
FAILED:  org.apache.solr.cloud.PeerSyncReplicationTest.test

Error Message:
expected:<152> but was:<146>

Stack Trace:
java.lang.AssertionError: expected:<152> but was:<146>
	at __randomizedtesting.SeedInfo.seed([FE4650164CE8996B:76126FCCE214F493]:0)
	at org.junit.Assert.fail(Assert.java:93)
	at org.junit.Assert.failNotEquals(Assert.java:647)
	at org.junit.Assert.assertEquals(Assert.java:128)
	at org.junit.Assert.assertEquals(Assert.java:472)
	at org.junit.Assert.assertEquals(Assert.java:456)
	at org.apache.solr.cloud.PeerSyncReplicationTest.bringUpDeadNodeAndEnsureNoReplication(PeerSyncReplicationTest.java:278)
	at org.apache.solr.cloud.PeerSyncReplicationTest.forceNodeFailureAndDoPeerSync(PeerSyncReplicationTest.java:242)
	at org.apache.solr.cloud.PeerSyncReplicationTest.test(PeerSyncReplicationTest.java:125)
	at sun.reflect.NativeMethodAccessorImpl.invoke0(Native Method)
	at sun.reflect.NativeMethodAccessorImpl.invoke(NativeMethodAccessorImpl.java:57)
	at sun.reflect.DelegatingMethodAccessorImpl.invoke(DelegatingMethodAccessorImpl.java:43)
	at java.lang.reflect.Method.invoke(Method.java:606)
	at com.carrotsearch.randomizedtesting.RandomizedRunner.invoke(RandomizedRunner.java:1764)
	at com.carrotsearch.randomizedtesting.RandomizedRunner$8.evaluate(RandomizedRunner.java:871)
	at com.carrotsearch.randomizedtesting.RandomizedRunner$9.evaluate(RandomizedRunner.java:907)
	at com.carrotsearch.randomizedtesting.RandomizedRunner$10.evaluate(RandomizedRunner.java:921)
	at org.apache.solr.BaseDistributedSearchTestCase$ShardsRepeatRule$ShardsFixedStatement.callStatement(BaseDistributedSearchTestCase.java:996)
	at org.apache.solr.BaseDistributedSearchTestCase$ShardsRepeatRule$ShardsStatement.evaluate(BaseDistributedSearchTestCase.java:971)
	at com.carrotsearch.randomizedtesting.rules.SystemPropertiesRestoreRule$1.evaluate(SystemPropertiesRestoreRule.java:57)
	at org.apache.lucene.util.TestRuleSetupTeardownChained$1.evaluate(TestRuleSetupTeardownChained.java:49)
	at org.apache.lucene.util.AbstractBeforeAfterRule$1.evaluate(AbstractBeforeAfterRule.java:45)
	at org.apache.lucene.util.TestRuleThreadAndTestName$1.evaluate(TestRuleThreadAndTestName.java:48)
	at org.apache.lucene.util.TestRuleIgnoreAfterMaxFailures$1.evaluate(TestRuleIgnoreAfterMaxFailures.java:64)
	at org.apache.lucene.util.TestRuleMarkFailure$1.evaluate(TestRuleMarkFailure.java:47)
	at com.carrotsearch.randomizedtesting.rules.StatementAdapter.evaluate(StatementAdapter.java:36)
	at com.carrotsearch.randomizedtesting.ThreadLeakControl$StatementRunner.run(ThreadLeakControl.java:367)
	at com.carrotsearch.randomizedtesting.ThreadLeakControl.forkTimeoutingTask(ThreadLeakControl.java:809)
	at com.carrotsearch.randomizedtesting.ThreadLeakControl$3.evaluate(ThreadLeakControl.java:460)
	at com.carrotsearch.randomizedtesting.RandomizedRunner.runSingleTest(RandomizedRunner.java:880)
	at com.carrotsearch.randomizedtesting.RandomizedRunner$5.evaluate(RandomizedRunner.java:781)
	at com.carrotsearch.randomizedtesting.RandomizedRunner$6.evaluate(RandomizedRunner.java:816)
	at com.carrotsearch.randomizedtesting.RandomizedRunner$7.evaluate(RandomizedRunner.java:827)
	at com.carrotsearch.randomizedtesting.rules.StatementAdapter.evaluate(StatementAdapter.java:36)
	at com.carrotsearch.randomizedtesting.rules.SystemPropertiesRestoreRule$1.evaluate(SystemPropertiesRestoreRule.java:57)
	at org.apache.lucene.util.AbstractBeforeAfterRule$1.evaluate(AbstractBeforeAfterRule.java:45)
	at com.carrotsearch.randomizedtesting.rules.StatementAdapter.evaluate(StatementAdapter.java:36)
	at org.apache.lucene.util.TestRuleStoreClassName$1.evaluate(TestRuleStoreClassName.java:41)
	at com.carrotsearch.randomizedtesting.rules.NoShadowingOrOverridesOnMethodsRule$1.evaluate(NoShadowingOrOverridesOnMethodsRule.java:40)
	at com.carrotsearch.randomizedtesting.rules.NoShadowingOrOverridesOnMethodsRule$1.evaluate(NoShadowingOrOverridesOnMethodsRule.java:40)
	at com.carrotsearch.randomizedtesting.rules.StatementAdapter.evaluate(StatementAdapter.java:36)
	at com.carrotsearch.randomizedtesting.rules.StatementAdapter.evaluate(StatementAdapter.java:36)
	at com.carrotsearch.randomizedtesting.rules.StatementAdapter.evaluate(StatementAdapter.java:36)
	at org.apache.lucene.util.TestRuleAssertionsRequired$1.evaluate(TestRuleAssertionsRequired.java:53)
	at org.apache.lucene.util.TestRuleMarkFailure$1.evaluate(TestRuleMarkFailure.java:47)
	at org.apache.lucene.util.TestRuleIgnoreAfterMaxFailures$1.evaluate(TestRuleIgnoreAfterMaxFailures.java:64)
	at org.apache.lucene.util.TestRuleIgnoreTestSuites$1.evaluate(TestRuleIgnoreTestSuites.java:54)
	at com.carrotsearch.randomizedtesting.rules.StatementAdapter.evaluate(StatementAdapter.java:36)
	at com.carrotsearch.randomizedtesting.ThreadLeakControl$StatementRunner.run(ThreadLeakControl.java:367)
	at java.lang.Thread.run(Thread.java:745)


FAILED:  org.apache.solr.schema.TestManagedSchemaAPI.test

Error Message:
Error from server at http://127.0.0.1:62627/solr/testschemaapi_shard1_replica2: ERROR: [doc=2] unknown field 'myNewField1'

Stack Trace:
org.apache.solr.client.solrj.impl.CloudSolrClient$RouteException: Error from server at http://127.0.0.1:62627/solr/testschemaapi_shard1_replica2: ERROR: [doc=2] unknown field 'myNewField1'
	at __randomizedtesting.SeedInfo.seed([FE4650164CE8996B:76126FCCE214F493]:0)
	at org.apache.solr.client.solrj.impl.CloudSolrClient.directUpdate(CloudSolrClient.java:653)
	at org.apache.solr.client.solrj.impl.CloudSolrClient.sendRequest(CloudSolrClient.java:1002)
	at org.apache.solr.client.solrj.impl.CloudSolrClient.requestWithRetryOnStaleState(CloudSolrClient.java:891)
	at org.apache.solr.client.solrj.impl.CloudSolrClient.request(CloudSolrClient.java:827)
	at org.apache.solr.schema.TestManagedSchemaAPI.testAddFieldAndDocument(TestManagedSchemaAPI.java:101)
	at org.apache.solr.schema.TestManagedSchemaAPI.test(TestManagedSchemaAPI.java:69)
	at sun.reflect.NativeMethodAccessorImpl.invoke0(Native Method)
	at sun.reflect.NativeMethodAccessorImpl.invoke(NativeMethodAccessorImpl.java:57)
	at sun.reflect.DelegatingMethodAccessorImpl.invoke(DelegatingMethodAccessorImpl.java:43)
	at java.lang.reflect.Method.invoke(Method.java:606)
	at com.carrotsearch.randomizedtesting.RandomizedRunner.invoke(RandomizedRunner.java:1764)
	at com.carrotsearch.randomizedtesting.RandomizedRunner$8.evaluate(RandomizedRunner.java:871)
	at com.carrotsearch.randomizedtesting.RandomizedRunner$9.evaluate(RandomizedRunner.java:907)
	at com.carrotsearch.randomizedtesting.RandomizedRunner$10.evaluate(RandomizedRunner.java:921)
	at com.carrotsearch.randomizedtesting.rules.SystemPropertiesRestoreRule$1.evaluate(SystemPropertiesRestoreRule.java:57)
	at org.apache.lucene.util.TestRuleSetupTeardownChained$1.evaluate(TestRuleSetupTeardownChained.java:49)
	at org.apache.lucene.util.AbstractBeforeAfterRule$1.evaluate(AbstractBeforeAfterRule.java:45)
	at org.apache.lucene.util.TestRuleThreadAndTestName$1.evaluate(TestRuleThreadAndTestName.java:48)
	at org.apache.lucene.util.TestRuleIgnoreAfterMaxFailures$1.evaluate(TestRuleIgnoreAfterMaxFailures.java:64)
	at org.apache.lucene.util.TestRuleMarkFailure$1.evaluate(TestRuleMarkFailure.java:47)
	at com.carrotsearch.randomizedtesting.rules.StatementAdapter.evaluate(StatementAdapter.java:36)
	at com.carrotsearch.randomizedtesting.ThreadLeakControl$StatementRunner.run(ThreadLeakControl.java:367)
	at com.carrotsearch.randomizedtesting.ThreadLeakControl.forkTimeoutingTask(ThreadLeakControl.java:809)
	at com.carrotsearch.randomizedtesting.ThreadLeakControl$3.evaluate(ThreadLeakControl.java:460)
	at com.carrotsearch.randomizedtesting.RandomizedRunner.runSingleTest(RandomizedRunner.java:880)
	at com.carrotsearch.randomizedtesting.RandomizedRunner$5.evaluate(RandomizedRunner.java:781)
	at com.carrotsearch.randomizedtesting.RandomizedRunner$6.evaluate(RandomizedRunner.java:816)
	at com.carrotsearch.randomizedtesting.RandomizedRunner$7.evaluate(RandomizedRunner.java:827)
	at com.carrotsearch.randomizedtesting.rules.StatementAdapter.evaluate(StatementAdapter.java:36)
	at com.carrotsearch.randomizedtesting.rules.SystemPropertiesRestoreRule$1.evaluate(SystemPropertiesRestoreRule.java:57)
	at org.apache.lucene.util.AbstractBeforeAfterRule$1.evaluate(AbstractBeforeAfterRule.java:45)
	at com.carrotsearch.randomizedtesting.rules.StatementAdapter.evaluate(StatementAdapter.java:36)
	at org.apache.lucene.util.TestRuleStoreClassName$1.evaluate(TestRuleStoreClassName.java:41)
	at com.carrotsearch.randomizedtesting.rules.NoShadowingOrOverridesOnMethodsRule$1.evaluate(NoShadowingOrOverridesOnMethodsRule.java:40)
	at com.carrotsearch.randomizedtesting.rules.NoShadowingOrOverridesOnMethodsRule$1.evaluate(NoShadowingOrOverridesOnMethodsRule.java:40)
	at com.carrotsearch.randomizedtesting.rules.StatementAdapter.evaluate(StatementAdapter.java:36)
	at com.carrotsearch.randomizedtesting.rules.StatementAdapter.evaluate(StatementAdapter.java:36)
	at com.carrotsearch.randomizedtesting.rules.StatementAdapter.evaluate(StatementAdapter.java:36)
	at org.apache.lucene.util.TestRuleAssertionsRequired$1.evaluate(TestRuleAssertionsRequired.java:53)
	at org.apache.lucene.util.TestRuleMarkFailure$1.evaluate(TestRuleMarkFailure.java:47)
	at org.apache.lucene.util.TestRuleIgnoreAfterMaxFailures$1.evaluate(TestRuleIgnoreAfterMaxFailures.java:64)
	at org.apache.lucene.util.TestRuleIgnoreTestSuites$1.evaluate(TestRuleIgnoreTestSuites.java:54)
	at com.carrotsearch.randomizedtesting.rules.StatementAdapter.evaluate(StatementAdapter.java:36)
	at com.carrotsearch.randomizedtesting.ThreadLeakControl$StatementRunner.run(ThreadLeakControl.java:367)
	at java.lang.Thread.run(Thread.java:745)
Caused by: org.apache.solr.client.solrj.impl.HttpSolrClient$RemoteSolrException: Error from server at http://127.0.0.1:62627/solr/testschemaapi_shard1_replica2: ERROR: [doc=2] unknown field 'myNewField1'
	at org.apache.solr.client.solrj.impl.HttpSolrClient.executeMethod(HttpSolrClient.java:577)
	at org.apache.solr.client.solrj.impl.HttpSolrClient.request(HttpSolrClient.java:241)
	at org.apache.solr.client.solrj.impl.HttpSolrClient.request(HttpSolrClient.java:230)
	at org.apache.solr.client.solrj.impl.LBHttpSolrClient.doRequest(LBHttpSolrClient.java:372)
	at org.apache.solr.client.solrj.impl.LBHttpSolrClient.request(LBHttpSolrClient.java:325)
	at org.apache.solr.client.solrj.impl.CloudSolrClient$2.call(CloudSolrClient.java:628)
	at org.apache.solr.client.solrj.impl.CloudSolrClient$2.call(CloudSolrClient.java:625)
	at java.util.concurrent.FutureTask.run(FutureTask.java:262)
	at org.apache.solr.common.util.ExecutorUtil$MDCAwareThreadPoolExecutor$1.run(ExecutorUtil.java:231)
	at java.util.concurrent.ThreadPoolExecutor.runWorker(ThreadPoolExecutor.java:1145)
	at java.util.concurrent.ThreadPoolExecutor$Worker.run(ThreadPoolExecutor.java:615)
	... 1 more




Build Log:
[...truncated 11966 lines...]
   [junit4] Suite: org.apache.solr.cloud.PeerSyncReplicationTest
   [junit4]   2> Creating dataDir: C:\Users\jenkins\workspace\Lucene-Solr-5.5-Windows\solr\build\solr-core\test\J0\temp\solr.cloud.PeerSyncReplicationTest_FE4650164CE8996B-001\init-core-data-001
   [junit4]   2> 2273190 INFO  (SUITE-PeerSyncReplicationTest-seed#[FE4650164CE8996B]-worker) [    ] o.a.s.SolrTestCaseJ4 Randomized ssl (false) and clientAuth (false)
   [junit4]   2> 2273190 INFO  (SUITE-PeerSyncReplicationTest-seed#[FE4650164CE8996B]-worker) [    ] o.a.s.BaseDistributedSearchTestCase Setting hostContext system property: /
   [junit4]   2> 2273192 INFO  (TEST-PeerSyncReplicationTest.test-seed#[FE4650164CE8996B]) [    ] o.a.s.c.ZkTestServer STARTING ZK TEST SERVER
   [junit4]   2> 2273193 INFO  (Thread-7146) [    ] o.a.s.c.ZkTestServer client port:0.0.0.0/0.0.0.0:0
   [junit4]   2> 2273193 INFO  (Thread-7146) [    ] o.a.s.c.ZkTestServer Starting server
   [junit4]   2> 2273293 INFO  (TEST-PeerSyncReplicationTest.test-seed#[FE4650164CE8996B]) [    ] o.a.s.c.ZkTestServer start zk server on port:58884
   [junit4]   2> 2273293 INFO  (TEST-PeerSyncReplicationTest.test-seed#[FE4650164CE8996B]) [    ] o.a.s.c.c.SolrZkClient Using default ZkCredentialsProvider
   [junit4]   2> 2273295 INFO  (TEST-PeerSyncReplicationTest.test-seed#[FE4650164CE8996B]) [    ] o.a.s.c.c.ConnectionManager Waiting for client to connect to ZooKeeper
   [junit4]   2> 2273301 INFO  (zkCallback-2585-thread-1) [    ] o.a.s.c.c.ConnectionManager Watcher org.apache.solr.common.cloud.ConnectionManager@32eecdcd name:ZooKeeperConnection Watcher:127.0.0.1:58884 got event WatchedEvent state:SyncConnected type:None path:null path:null type:None
   [junit4]   2> 2273301 INFO  (TEST-PeerSyncReplicationTest.test-seed#[FE4650164CE8996B]) [    ] o.a.s.c.c.ConnectionManager Client is connected to ZooKeeper
   [junit4]   2> 2273301 INFO  (TEST-PeerSyncReplicationTest.test-seed#[FE4650164CE8996B]) [    ] o.a.s.c.c.SolrZkClient Using default ZkACLProvider
   [junit4]   2> 2273301 INFO  (TEST-PeerSyncReplicationTest.test-seed#[FE4650164CE8996B]) [    ] o.a.s.c.c.SolrZkClient makePath: /solr
   [junit4]   2> 2273307 INFO  (TEST-PeerSyncReplicationTest.test-seed#[FE4650164CE8996B]) [    ] o.a.s.c.c.SolrZkClient Using default ZkCredentialsProvider
   [junit4]   2> 2273308 INFO  (TEST-PeerSyncReplicationTest.test-seed#[FE4650164CE8996B]) [    ] o.a.s.c.c.ConnectionManager Waiting for client to connect to ZooKeeper
   [junit4]   2> 2273312 INFO  (zkCallback-2586-thread-1) [    ] o.a.s.c.c.ConnectionManager Watcher org.apache.solr.common.cloud.ConnectionManager@491ed564 name:ZooKeeperConnection Watcher:127.0.0.1:58884/solr got event WatchedEvent state:SyncConnected type:None path:null path:null type:None
   [junit4]   2> 2273312 INFO  (TEST-PeerSyncReplicationTest.test-seed#[FE4650164CE8996B]) [    ] o.a.s.c.c.ConnectionManager Client is connected to ZooKeeper
   [junit4]   2> 2273312 INFO  (TEST-PeerSyncReplicationTest.test-seed#[FE4650164CE8996B]) [    ] o.a.s.c.c.SolrZkClient Using default ZkACLProvider
   [junit4]   2> 2273312 INFO  (TEST-PeerSyncReplicationTest.test-seed#[FE4650164CE8996B]) [    ] o.a.s.c.c.SolrZkClient makePath: /collections/collection1
   [junit4]   2> 2273317 INFO  (TEST-PeerSyncReplicationTest.test-seed#[FE4650164CE8996B]) [    ] o.a.s.c.c.SolrZkClient makePath: /collections/collection1/shards
   [junit4]   2> 2273321 INFO  (TEST-PeerSyncReplicationTest.test-seed#[FE4650164CE8996B]) [    ] o.a.s.c.c.SolrZkClient makePath: /collections/control_collection
   [junit4]   2> 2273325 INFO  (TEST-PeerSyncReplicationTest.test-seed#[FE4650164CE8996B]) [    ] o.a.s.c.c.SolrZkClient makePath: /collections/control_collection/shards
   [junit4]   2> 2273330 INFO  (TEST-PeerSyncReplicationTest.test-seed#[FE4650164CE8996B]) [    ] o.a.s.c.AbstractZkTestCase put C:\Users\jenkins\workspace\Lucene-Solr-5.5-Windows\solr\core\src\test-files\solr\collection1\conf\solrconfig-tlog.xml to /configs/conf1/solrconfig.xml
   [junit4]   2> 2273330 INFO  (TEST-PeerSyncReplicationTest.test-seed#[FE4650164CE8996B]) [    ] o.a.s.c.c.SolrZkClient makePath: /configs/conf1/solrconfig.xml
   [junit4]   2> 2273336 INFO  (TEST-PeerSyncReplicationTest.test-seed#[FE4650164CE8996B]) [    ] o.a.s.c.AbstractZkTestCase put C:\Users\jenkins\workspace\Lucene-Solr-5.5-Windows\solr\core\src\test-files\solr\collection1\conf\schema.xml to /configs/conf1/schema.xml
   [junit4]   2> 2273337 INFO  (TEST-PeerSyncReplicationTest.test-seed#[FE4650164CE8996B]) [    ] o.a.s.c.c.SolrZkClient makePath: /configs/conf1/schema.xml
   [junit4]   2> 2273342 INFO  (TEST-PeerSyncReplicationTest.test-seed#[FE4650164CE8996B]) [    ] o.a.s.c.AbstractZkTestCase put C:\Users\jenkins\workspace\Lucene-Solr-5.5-Windows\solr\core\src\test-files\solr\collection1\conf\solrconfig.snippet.randomindexconfig.xml to /configs/conf1/solrconfig.snippet.randomindexconfig.xml
   [junit4]   2> 2273342 INFO  (TEST-PeerSyncReplicationTest.test-seed#[FE4650164CE8996B]) [    ] o.a.s.c.c.SolrZkClient makePath: /configs/conf1/solrconfig.snippet.randomindexconfig.xml
   [junit4]   2> 2273347 INFO  (TEST-PeerSyncReplicationTest.test-seed#[FE4650164CE8996B]) [    ] o.a.s.c.AbstractZkTestCase put C:\Users\jenkins\workspace\Lucene-Solr-5.5-Windows\solr\core\src\test-files\solr\collection1\conf\stopwords.txt to /configs/conf1/stopwords.txt
   [junit4]   2> 2273348 INFO  (TEST-PeerSyncReplicationTest.test-seed#[FE4650164CE8996B]) [    ] o.a.s.c.c.SolrZkClient makePath: /configs/conf1/stopwords.txt
   [junit4]   2> 2273352 INFO  (TEST-PeerSyncReplicationTest.test-seed#[FE4650164CE8996B]) [    ] o.a.s.c.AbstractZkTestCase put C:\Users\jenkins\workspace\Lucene-Solr-5.5-Windows\solr\core\src\test-files\solr\collection1\conf\protwords.txt to /configs/conf1/protwords.txt
   [junit4]   2> 2273352 INFO  (TEST-PeerSyncReplicationTest.test-seed#[FE4650164CE8996B]) [    ] o.a.s.c.c.SolrZkClient makePath: /configs/conf1/protwords.txt
   [junit4]   2> 2273356 INFO  (TEST-PeerSyncReplicationTest.test-seed#[FE4650164CE8996B]) [    ] o.a.s.c.AbstractZkTestCase put C:\Users\jenkins\workspace\Lucene-Solr-5.5-Windows\solr\core\src\test-files\solr\collection1\conf\currency.xml to /configs/conf1/currency.xml
   [junit4]   2> 2273356 INFO  (TEST-PeerSyncReplicationTest.test-seed#[FE4650164CE8996B]) [    ] o.a.s.c.c.SolrZkClient makePath: /configs/conf1/currency.xml
   [junit4]   2> 2273360 INFO  (TEST-PeerSyncReplicationTest.test-seed#[FE4650164CE8996B]) [    ] o.a.s.c.AbstractZkTestCase put C:\Users\jenkins\workspace\Lucene-Solr-5.5-Windows\solr\core\src\test-files\solr\collection1\conf\enumsConfig.xml to /configs/conf1/enumsConfig.xml
   [junit4]   2> 2273361 INFO  (TEST-PeerSyncReplicationTest.test-seed#[FE4650164CE8996B]) [    ] o.a.s.c.c.SolrZkClient makePath: /configs/conf1/enumsConfig.xml
   [junit4]   2> 2273365 INFO  (TEST-PeerSyncReplicationTest.test-seed#[FE4650164CE8996B]) [    ] o.a.s.c.AbstractZkTestCase put C:\Users\jenkins\workspace\Lucene-Solr-5.5-Windows\solr\core\src\test-files\solr\collection1\conf\open-exchange-rates.json to /configs/conf1/open-exchange-rates.json
   [junit4]   2> 2273366 INFO  (TEST-PeerSyncReplicationTest.test-seed#[FE4650164CE8996B]) [    ] o.a.s.c.c.SolrZkClient makePath: /configs/conf1/open-exchange-rates.json
   [junit4]   2> 2273370 INFO  (TEST-PeerSyncReplicationTest.test-seed#[FE4650164CE8996B]) [    ] o.a.s.c.AbstractZkTestCase put C:\Users\jenkins\workspace\Lucene-Solr-5.5-Windows\solr\core\src\test-files\solr\collection1\conf\mapping-ISOLatin1Accent.txt to /configs/conf1/mapping-ISOLatin1Accent.txt
   [junit4]   2> 2273370 INFO  (TEST-PeerSyncReplicationTest.test-seed#[FE4650164CE8996B]) [    ] o.a.s.c.c.SolrZkClient makePath: /configs/conf1/mapping-ISOLatin1Accent.txt
   [junit4]   2> 2273375 INFO  (TEST-PeerSyncReplicationTest.test-seed#[FE4650164CE8996B]) [    ] o.a.s.c.AbstractZkTestCase put C:\Users\jenkins\workspace\Lucene-Solr-5.5-Windows\solr\core\src\test-files\solr\collection1\conf\old_synonyms.txt to /configs/conf1/old_synonyms.txt
   [junit4]   2> 2273375 INFO  (TEST-PeerSyncReplicationTest.test-seed#[FE4650164CE8996B]) [    ] o.a.s.c.c.SolrZkClient makePath: /configs/conf1/old_synonyms.txt
   [junit4]   2> 2273379 INFO  (TEST-PeerSyncReplicationTest.test-seed#[FE4650164CE8996B]) [    ] o.a.s.c.AbstractZkTestCase put C:\Users\jenkins\workspace\Lucene-Solr-5.5-Windows\solr\core\src\test-files\solr\collection1\conf\synonyms.txt to /configs/conf1/synonyms.txt
   [junit4]   2> 2273379 INFO  (TEST-PeerSyncReplicationTest.test-seed#[FE4650164CE8996B]) [    ] o.a.s.c.c.SolrZkClient makePath: /configs/conf1/synonyms.txt
   [junit4]   2> 2273630 INFO  (TEST-PeerSyncReplicationTest.test-seed#[FE4650164CE8996B]) [    ] o.a.s.SolrTestCaseJ4 Writing core.properties file to C:\Users\jenkins\workspace\Lucene-Solr-5.5-Windows\solr\build\solr-core\test\J0\temp\solr.cloud.PeerSyncReplicationTest_FE4650164CE8996B-001\control-001\cores\collection1
   [junit4]   2> 2273632 INFO  (TEST-PeerSyncReplicationTest.test-seed#[FE4650164CE8996B]) [    ] o.e.j.s.Server jetty-9.2.13.v20150730
   [junit4]   2> 2273633 INFO  (TEST-PeerSyncReplicationTest.test-seed#[FE4650164CE8996B]) [    ] o.e.j.s.h.ContextHandler Started o.e.j.s.ServletContextHandler@1c978ead{/,null,AVAILABLE}
   [junit4]   2> 2273636 INFO  (TEST-PeerSyncReplicationTest.test-seed#[FE4650164CE8996B]) [    ] o.e.j.s.ServerConnector Started ServerConnector@22180e85{HTTP/1.1}{127.0.0.1:58895}
   [junit4]   2> 2273636 INFO  (TEST-PeerSyncReplicationTest.test-seed#[FE4650164CE8996B]) [    ] o.e.j.s.Server Started @2276587ms
   [junit4]   2> 2273636 INFO  (TEST-PeerSyncReplicationTest.test-seed#[FE4650164CE8996B]) [    ] o.a.s.c.s.e.JettySolrRunner Jetty properties: {hostContext=/, hostPort=58895, coreRootDirectory=C:\Users\jenkins\workspace\Lucene-Solr-5.5-Windows\solr\build\solr-core\test\J0\temp\solr.cloud.PeerSyncReplicationTest_FE4650164CE8996B-001\control-001\cores, solr.data.dir=C:\Users\jenkins\workspace\Lucene-Solr-5.5-Windows\solr\build\solr-core\test\J0\temp\solr.cloud.PeerSyncReplicationTest_FE4650164CE8996B-001\tempDir-001/control/data}
   [junit4]   2> 2273636 INFO  (TEST-PeerSyncReplicationTest.test-seed#[FE4650164CE8996B]) [    ] o.a.s.s.SolrDispatchFilter SolrDispatchFilter.init(): sun.misc.Launcher$AppClassLoader@4322394
   [junit4]   2> 2273636 INFO  (TEST-PeerSyncReplicationTest.test-seed#[FE4650164CE8996B]) [    ] o.a.s.c.SolrResourceLoader new SolrResourceLoader for directory: 'C:\Users\jenkins\workspace\Lucene-Solr-5.5-Windows\solr\build\solr-core\test\J0\temp\solr.cloud.PeerSyncReplicationTest_FE4650164CE8996B-001\control-001'
   [junit4]   2> 2273637 INFO  (TEST-PeerSyncReplicationTest.test-seed#[FE4650164CE8996B]) [    ] o.a.s.c.SolrResourceLoader JNDI not configured for solr (NoInitialContextEx)
   [junit4]   2> 2273637 INFO  (TEST-PeerSyncReplicationTest.test-seed#[FE4650164CE8996B]) [    ] o.a.s.c.SolrResourceLoader solr home defaulted to 'solr/' (could not find system property or JNDI)
   [junit4]   2> 2273637 INFO  (TEST-PeerSyncReplicationTest.test-seed#[FE4650164CE8996B]) [    ] o.a.s.c.c.SolrZkClient Using default ZkCredentialsProvider
   [junit4]   2> 2273638 INFO  (TEST-PeerSyncReplicationTest.test-seed#[FE4650164CE8996B]) [    ] o.a.s.c.c.ConnectionManager Waiting for client to connect to ZooKeeper
   [junit4]   2> 2273639 INFO  (zkCallback-2587-thread-1) [    ] o.a.s.c.c.ConnectionManager Watcher org.apache.solr.common.cloud.ConnectionManager@362befb3 name:ZooKeeperConnection Watcher:127.0.0.1:58884/solr got event WatchedEvent state:SyncConnected type:None path:null path:null type:None
   [junit4]   2> 2273639 INFO  (TEST-PeerSyncReplicationTest.test-seed#[FE4650164CE8996B]) [    ] o.a.s.c.c.ConnectionManager Client is connected to ZooKeeper
   [junit4]   2> 2273639 INFO  (TEST-PeerSyncReplicationTest.test-seed#[FE4650164CE8996B]) [    ] o.a.s.c.c.SolrZkClient Using default ZkACLProvider
   [junit4]   2> 2273640 INFO  (TEST-PeerSyncReplicationTest.test-seed#[FE4650164CE8996B]) [    ] o.a.s.s.SolrDispatchFilter Loading solr.xml from SolrHome (not found in ZooKeeper)
   [junit4]   2> 2273640 INFO  (TEST-PeerSyncReplicationTest.test-seed#[FE4650164CE8996B]) [    ] o.a.s.c.SolrXmlConfig Loading container configuration from C:\Users\jenkins\workspace\Lucene-Solr-5.5-Windows\solr\build\solr-core\test\J0\temp\solr.cloud.PeerSyncReplicationTest_FE4650164CE8996B-001\control-001\solr.xml
   [junit4]   2> 2273661 INFO  (TEST-PeerSyncReplicationTest.test-seed#[FE4650164CE8996B]) [    ] o.a.s.c.CorePropertiesLocator Config-defined core root directory: C:\Users\jenkins\workspace\Lucene-Solr-5.5-Windows\solr\build\solr-core\test\J0\temp\solr.cloud.PeerSyncReplicationTest_FE4650164CE8996B-001\control-001\cores
   [junit4]   2> 2273661 INFO  (TEST-PeerSyncReplicationTest.test-seed#[FE4650164CE8996B]) [    ] o.a.s.c.CoreContainer New CoreContainer 630965792
   [junit4]   2> 2273661 INFO  (TEST-PeerSyncReplicationTest.test-seed#[FE4650164CE8996B]) [    ] o.a.s.c.CoreContainer Loading cores into CoreContainer [instanceDir=C:\Users\jenkins\workspace\Lucene-Solr-5.5-Windows\solr\build\solr-core\test\J0\temp\solr.cloud.PeerSyncReplicationTest_FE4650164CE8996B-001\control-001]
   [junit4]   2> 2273661 WARN  (TEST-PeerSyncReplicationTest.test-seed#[FE4650164CE8996B]) [    ] o.a.s.c.CoreContainer Couldn't add files from C:\Users\jenkins\workspace\Lucene-Solr-5.5-Windows\solr\build\solr-core\test\J0\temp\solr.cloud.PeerSyncReplicationTest_FE4650164CE8996B-001\control-001\lib to classpath: C:\Users\jenkins\workspace\Lucene-Solr-5.5-Windows\solr\build\solr-core\test\J0\temp\solr.cloud.PeerSyncReplicationTest_FE4650164CE8996B-001\control-001\lib
   [junit4]   2> 2273661 INFO  (TEST-PeerSyncReplicationTest.test-seed#[FE4650164CE8996B]) [    ] o.a.s.h.c.HttpShardHandlerFactory created with socketTimeout : 90000,urlScheme : ,connTimeout : 15000,maxConnectionsPerHost : 20,maxConnections : 10000,corePoolSize : 0,maximumPoolSize : 2147483647,maxThreadIdleTime : 5,sizeOfQueue : -1,fairnessPolicy : false,useRetries : false,connectionsEvictorSleepDelay : 5000,maxConnectionIdleTime : 40000,
   [junit4]   2> 2273663 INFO  (TEST-PeerSyncReplicationTest.test-seed#[FE4650164CE8996B]) [    ] o.a.s.u.UpdateShardHandler Creating UpdateShardHandler HTTP client with params: socketTimeout=340000&connTimeout=45000&retry=true
   [junit4]   2> 2273664 INFO  (TEST-PeerSyncReplicationTest.test-seed#[FE4650164CE8996B]) [    ] o.a.s.l.LogWatcher SLF4J impl is org.slf4j.impl.Log4jLoggerFactory
   [junit4]   2> 2273664 INFO  (TEST-PeerSyncReplicationTest.test-seed#[FE4650164CE8996B]) [    ] o.a.s.l.LogWatcher Registering Log Listener [Log4j (org.slf4j.impl.Log4jLoggerFactory)]
   [junit4]   2> 2273664 INFO  (TEST-PeerSyncReplicationTest.test-seed#[FE4650164CE8996B]) [    ] o.a.s.c.ZkContainer Zookeeper client=127.0.0.1:58884/solr
   [junit4]   2> 2273664 INFO  (TEST-PeerSyncReplicationTest.test-seed#[FE4650164CE8996B]) [    ] o.a.s.c.ZkController zkHost includes chroot
   [junit4]   2> 2273664 INFO  (TEST-PeerSyncReplicationTest.test-seed#[FE4650164CE8996B]) [    ] o.a.s.c.c.SolrZkClient Using default ZkCredentialsProvider
   [junit4]   2> 2273665 INFO  (TEST-PeerSyncReplicationTest.test-seed#[FE4650164CE8996B]) [    ] o.a.s.c.c.ConnectionManager Waiting for client to connect to ZooKeeper
   [junit4]   2> 2273667 INFO  (zkCallback-2590-thread-1) [    ] o.a.s.c.c.ConnectionManager Watcher org.apache.solr.common.cloud.ConnectionManager@147065ec name:ZooKeeperConnection Watcher:127.0.0.1:58884 got event WatchedEvent state:SyncConnected type:None path:null path:null type:None
   [junit4]   2> 2273667 INFO  (TEST-PeerSyncReplicationTest.test-seed#[FE4650164CE8996B]) [    ] o.a.s.c.c.ConnectionManager Client is connected to ZooKeeper
   [junit4]   2> 2273667 INFO  (TEST-PeerSyncReplicationTest.test-seed#[FE4650164CE8996B]) [    ] o.a.s.c.c.SolrZkClient Using default ZkACLProvider
   [junit4]   2> 2273668 INFO  (TEST-PeerSyncReplicationTest.test-seed#[FE4650164CE8996B]) [n:127.0.0.1:58895_    ] o.a.s.c.ZkController Added new OnReconnect listener org.apache.solr.cloud.ZkController$6@42e695c8
   [junit4]   2> 2273669 INFO  (TEST-PeerSyncReplicationTest.test-seed#[FE4650164CE8996B]) [n:127.0.0.1:58895_    ] o.a.s.c.c.ConnectionManager Waiting for client to connect to ZooKeeper
   [junit4]   2> 2273670 INFO  (zkCallback-2591-thread-1-processing-n:127.0.0.1:58895_) [n:127.0.0.1:58895_    ] o.a.s.c.c.ConnectionManager Watcher org.apache.solr.common.cloud.ConnectionManager@62afc379 name:ZooKeeperConnection Watcher:127.0.0.1:58884/solr got event WatchedEvent state:SyncConnected type:None path:null path:null type:None
   [junit4]   2> 2273670 INFO  (TEST-PeerSyncReplicationTest.test-seed#[FE4650164CE8996B]) [n:127.0.0.1:58895_    ] o.a.s.c.c.ConnectionManager Client is connected to ZooKeeper
   [junit4]   2> 2273671 INFO  (TEST-PeerSyncReplicationTest.test-seed#[FE4650164CE8996B]) [n:127.0.0.1:58895_    ] o.a.s.c.c.SolrZkClient makePath: /overseer/queue
   [junit4]   2> 2273673 INFO  (TEST-PeerSyncReplicationTest.test-seed#[FE4650164CE8996B]) [n:127.0.0.1:58895_    ] o.a.s.c.c.SolrZkClient makePath: /overseer/collection-queue-work
   [junit4]   2> 2273675 INFO  (TEST-PeerSyncReplicationTest.test-seed#[FE4650164CE8996B]) [n:127.0.0.1:58895_    ] o.a.s.c.c.SolrZkClient makePath: /overseer/collection-map-running
   [junit4]   2> 2273676 INFO  (TEST-PeerSyncReplicationTest.test-seed#[FE4650164CE8996B]) [n:127.0.0.1:58895_    ] o.a.s.c.c.SolrZkClient makePath: /overseer/collection-map-completed
   [junit4]   2> 2273678 INFO  (TEST-PeerSyncReplicationTest.test-seed#[FE4650164CE8996B]) [n:127.0.0.1:58895_    ] o.a.s.c.c.SolrZkClient makePath: /overseer/collection-map-failure
   [junit4]   2> 2273679 INFO  (TEST-PeerSyncReplicationTest.test-seed#[FE4650164CE8996B]) [n:127.0.0.1:58895_    ] o.a.s.c.c.SolrZkClient makePath: /live_nodes
   [junit4]   2> 2273680 INFO  (TEST-PeerSyncReplicationTest.test-seed#[FE4650164CE8996B]) [n:127.0.0.1:58895_    ] o.a.s.c.c.SolrZkClient makePath: /aliases.json
   [junit4]   2> 2273681 INFO  (TEST-PeerSyncReplicationTest.test-seed#[FE4650164CE8996B]) [n:127.0.0.1:58895_    ] o.a.s.c.c.SolrZkClient makePath: /clusterstate.json
   [junit4]   2> 2273682 INFO  (TEST-PeerSyncReplicationTest.test-seed#[FE4650164CE8996B]) [n:127.0.0.1:58895_    ] o.a.s.c.c.SolrZkClient makePath: /security.json
   [junit4]   2> 2273683 INFO  (TEST-PeerSyncReplicationTest.test-seed#[FE4650164CE8996B]) [n:127.0.0.1:58895_    ] o.a.s.c.ZkController Register node as live in ZooKeeper:/live_nodes/127.0.0.1:58895_
   [junit4]   2> 2273683 INFO  (TEST-PeerSyncReplicationTest.test-seed#[FE4650164CE8996B]) [n:127.0.0.1:58895_    ] o.a.s.c.c.SolrZkClient makePath: /live_nodes/127.0.0.1:58895_
   [junit4]   2> 2273684 INFO  (TEST-PeerSyncReplicationTest.test-seed#[FE4650164CE8996B]) [n:127.0.0.1:58895_    ] o.a.s.c.c.SolrZkClient makePath: /overseer_elect
   [junit4]   2> 2273685 INFO  (TEST-PeerSyncReplicationTest.test-seed#[FE4650164CE8996B]) [n:127.0.0.1:58895_    ] o.a.s.c.c.SolrZkClient makePath: /overseer_elect/election
   [junit4]   2> 2273686 INFO  (TEST-PeerSyncReplicationTest.test-seed#[FE4650164CE8996B]) [n:127.0.0.1:58895_    ] o.a.s.c.Overseer Overseer (id=null) closing
   [junit4]   2> 2273687 INFO  (TEST-PeerSyncReplicationTest.test-seed#[FE4650164CE8996B]) [n:127.0.0.1:58895_    ] o.a.s.c.LeaderElector Joined leadership election with path: /overseer_elect/election/98860518353338372-127.0.0.1:58895_-n_0000000000
   [junit4]   2> 2273687 INFO  (TEST-PeerSyncReplicationTest.test-seed#[FE4650164CE8996B]) [n:127.0.0.1:58895_    ] o.a.s.c.OverseerElectionContext I am going to be the leader 127.0.0.1:58895_
   [junit4]   2> 2273687 INFO  (TEST-PeerSyncReplicationTest.test-seed#[FE4650164CE8996B]) [n:127.0.0.1:58895_    ] o.a.s.c.c.SolrZkClient makePath: /overseer_elect/leader
   [junit4]   2> 2273688 INFO  (TEST-PeerSyncReplicationTest.test-seed#[FE4650164CE8996B]) [n:127.0.0.1:58895_    ] o.a.s.c.Overseer Overseer (id=98860518353338372-127.0.0.1:58895_-n_0000000000) starting
   [junit4]   2> 2273689 INFO  (TEST-PeerSyncReplicationTest.test-seed#[FE4650164CE8996B]) [n:127.0.0.1:58895_    ] o.a.s.c.c.SolrZkClient makePath: /overseer/queue-work
   [junit4]   2> 2273693 INFO  (TEST-PeerSyncReplicationTest.test-seed#[FE4650164CE8996B]) [n:127.0.0.1:58895_    ] o.a.s.c.OverseerAutoReplicaFailoverThread Starting OverseerAutoReplicaFailoverThread autoReplicaFailoverWorkLoopDelay=10000 autoReplicaFailoverWaitAfterExpiration=30000 autoReplicaFailoverBadNodeExpiration=60000
   [junit4]   2> 2273693 INFO  (TEST-PeerSyncReplicationTest.test-seed#[FE4650164CE8996B]) [n:127.0.0.1:58895_    ] o.a.s.c.c.ZkStateReader Updating cluster state from ZooKeeper... 
   [junit4]   2> 2273694 INFO  (OverseerCollectionConfigSetProcessor-98860518353338372-127.0.0.1:58895_-n_0000000000) [n:127.0.0.1:58895_    ] o.a.s.c.OverseerTaskProcessor Process current queue of overseer operations
   [junit4]   2> 2273694 INFO  (OverseerStateUpdate-98860518353338372-127.0.0.1:58895_-n_0000000000) [n:127.0.0.1:58895_    ] o.a.s.c.Overseer Starting to work on the main queue
   [junit4]   2> 2273702 INFO  (TEST-PeerSyncReplicationTest.test-seed#[FE4650164CE8996B]) [n:127.0.0.1:58895_    ] o.a.s.c.CoreContainer Security conf doesn't exist. Skipping setup for authorization module.
   [junit4]   2> 2273702 INFO  (TEST-PeerSyncReplicationTest.test-seed#[FE4650164CE8996B]) [n:127.0.0.1:58895_    ] o.a.s.c.CoreContainer No authentication plugin used.
   [junit4]   2> 2273703 INFO  (TEST-PeerSyncReplicationTest.test-seed#[FE4650164CE8996B]) [n:127.0.0.1:58895_    ] o.a.s.c.CorePropertiesLocator Looking for core definitions underneath C:\Users\jenkins\workspace\Lucene-Solr-5.5-Windows\solr\build\solr-core\test\J0\temp\solr.cloud.PeerSyncReplicationTest_FE4650164CE8996B-001\control-001\cores
   [junit4]   2> 2273704 INFO  (TEST-PeerSyncReplicationTest.test-seed#[FE4650164CE8996B]) [n:127.0.0.1:58895_    ] o.a.s.c.CoreDescriptor Created CoreDescriptor: {name=collection1, transient=false, collection=control_collection, configSetProperties=configsetprops.json, loadOnStartup=true, config=solrconfig.xml, schema=schema.xml, coreNodeName=, dataDir=data\, shard=}
   [junit4]   2> 2273704 INFO  (TEST-PeerSyncReplicationTest.test-seed#[FE4650164CE8996B]) [n:127.0.0.1:58895_    ] o.a.s.c.CorePropertiesLocator Found core collection1 in C:\Users\jenkins\workspace\Lucene-Solr-5.5-Windows\solr\build\solr-core\test\J0\temp\solr.cloud.PeerSyncReplicationTest_FE4650164CE8996B-001\control-001\cores\collection1
   [junit4]   2> 2273704 INFO  (TEST-PeerSyncReplicationTest.test-seed#[FE4650164CE8996B]) [n:127.0.0.1:58895_    ] o.a.s.c.CorePropertiesLocator Found 1 core definitions
   [junit4]   2> 2273705 INFO  (TEST-PeerSyncReplicationTest.test-seed#[FE4650164CE8996B]) [n:127.0.0.1:58895_    ] o.a.s.s.SolrDispatchFilter user.dir=C:\Users\jenkins\workspace\Lucene-Solr-5.5-Windows\solr\build\solr-core\test\J0
   [junit4]   2> 2273705 INFO  (TEST-PeerSyncReplicationTest.test-seed#[FE4650164CE8996B]) [n:127.0.0.1:58895_    ] o.a.s.s.SolrDispatchFilter SolrDispatchFilter.init() done
   [junit4]   2> 2273705 INFO  (coreLoadExecutor-8799-thread-1-processing-n:127.0.0.1:58895_) [n:127.0.0.1:58895_ c:control_collection   x:collection1] o.a.s.c.ZkController publishing state=down
   [junit4]   2> 2273705 INFO  (coreLoadExecutor-8799-thread-1-processing-n:127.0.0.1:58895_) [n:127.0.0.1:58895_ c:control_collection   x:collection1] o.a.s.c.ZkController numShards not found on descriptor - reading it from system property
   [junit4]   2> 2273706 INFO  (coreLoadExecutor-8799-thread-1-processing-n:127.0.0.1:58895_) [n:127.0.0.1:58895_ c:control_collection   x:collection1] o.a.s.c.ZkController Collection control_collection not visible yet, but flagging it so a watch is registered when it becomes visible
   [junit4]   2> 2273706 INFO  (coreLoadExecutor-8799-thread-1-processing-n:127.0.0.1:58895_) [n:127.0.0.1:58895_ c:control_collection   x:collection1] o.a.s.c.c.ZkStateReader addZkWatch [control_collection]
   [junit4]   2> 2273707 INFO  (OverseerStateUpdate-98860518353338372-127.0.0.1:58895_-n_0000000000) [n:127.0.0.1:58895_    ] o.a.s.c.Overseer processMessage: queueSize: 1, message = {
   [junit4]   2>   "shard":null,
   [junit4]   2>   "base_url":"http://127.0.0.1:58895",
   [junit4]   2>   "collection":"control_collection",
   [junit4]   2>   "node_name":"127.0.0.1:58895_",
   [junit4]   2>   "core":"collection1",
   [junit4]   2>   "numShards":"1",
   [junit4]   2>   "state":"down",
   [junit4]   2>   "roles":null,
   [junit4]   2>   "operation":"state"} current state version: 0
   [junit4]   2> 2273707 INFO  (coreLoadExecutor-8799-thread-1-processing-n:127.0.0.1:58895_) [n:127.0.0.1:58895_ c:control_collection   x:collection1] o.a.s.c.c.ZkStateReader Deleting data for [control_collection]
   [junit4]   2> 2273707 INFO  (OverseerStateUpdate-98860518353338372-127.0.0.1:58895_-n_0000000000) [n:127.0.0.1:58895_    ] o.a.s.c.o.ReplicaMutator Update state numShards=1 message={
   [junit4]   2>   "shard":null,
   [junit4]   2>   "base_url":"http://127.0.0.1:58895",
   [junit4]   2>   "collection":"control_collection",
   [junit4]   2>   "node_name":"127.0.0.1:58895_",
   [junit4]   2>   "core":"collection1",
   [junit4]   2>   "numShards":"1",
   [junit4]   2>   "state":"down",
   [junit4]   2>   "roles":null,
   [junit4]   2>   "operation":"state"}
   [junit4]   2> 2273707 INFO  (OverseerStateUpdate-98860518353338372-127.0.0.1:58895_-n_0000000000) [n:127.0.0.1:58895_    ] o.a.s.c.o.ClusterStateMutator building a new cName: control_collection
   [junit4]   2> 2273707 INFO  (OverseerStateUpdate-98860518353338372-127.0.0.1:58895_-n_0000000000) [n:127.0.0.1:58895_    ] o.a.s.c.o.ReplicaMutator Assigning new node to shard shard=shard1
   [junit4]   2> 2273708 INFO  (coreLoadExecutor-8799-thread-1-processing-n:127.0.0.1:58895_) [n:127.0.0.1:58895_ c:control_collection   x:collection1] o.a.s.c.ZkController look for our core node name
   [junit4]   2> 2273708 INFO  (zkCallback-2591-thread-1-processing-n:127.0.0.1:58895_) [n:127.0.0.1:58895_    ] o.a.s.c.c.ZkStateReader A cluster state change: [WatchedEvent state:SyncConnected type:NodeDataChanged path:/clusterstate.json], has occurred - updating... (live nodes size: [1])
   [junit4]   2> 2274726 INFO  (coreLoadExecutor-8799-thread-1-processing-n:127.0.0.1:58895_) [n:127.0.0.1:58895_ c:control_collection   x:collection1] o.a.s.c.ZkController waiting to find shard id in clusterstate for collection1
   [junit4]   2> 2274726 INFO  (coreLoadExecutor-8799-thread-1-processing-n:127.0.0.1:58895_) [n:127.0.0.1:58895_ c:control_collection   x:collection1] o.a.s.c.ZkController Check for collection zkNode:control_collection
   [junit4]   2> 2274727 INFO  (coreLoadExecutor-8799-thread-1-processing-n:127.0.0.1:58895_) [n:127.0.0.1:58895_ c:control_collection   x:collection1] o.a.s.c.ZkController Collection zkNode exists
   [junit4]   2> 2274727 INFO  (coreLoadExecutor-8799-thread-1-processing-n:127.0.0.1:58895_) [n:127.0.0.1:58895_ c:control_collection   x:collection1] o.a.s.c.c.ZkStateReader Load collection config from: [/collections/control_collection]
   [junit4]   2> 2274727 INFO  (coreLoadExecutor-8799-thread-1-processing-n:127.0.0.1:58895_) [n:127.0.0.1:58895_ c:control_collection   x:collection1] o.a.s.c.c.ZkStateReader path=[/collections/control_collection] [configName]=[conf1] specified config exists in ZooKeeper
   [junit4]   2> 2274727 INFO  (coreLoadExecutor-8799-thread-1-processing-n:127.0.0.1:58895_) [n:127.0.0.1:58895_ c:control_collection   x:collection1] o.a.s.c.SolrResourceLoader new SolrResourceLoader for directory: 'C:\Users\jenkins\workspace\Lucene-Solr-5.5-Windows\solr\build\solr-core\test\J0\temp\solr.cloud.PeerSyncReplicationTest_FE4650164CE8996B-001\control-001\cores\collection1'
   [junit4]   2> 2274728 INFO  (coreLoadExecutor-8799-thread-1-processing-n:127.0.0.1:58895_) [n:127.0.0.1:58895_ c:control_collection   x:collection1] o.a.s.c.SolrResourceLoader JNDI not configured for solr (NoInitialContextEx)
   [junit4]   2> 2274728 INFO  (coreLoadExecutor-8799-thread-1-processing-n:127.0.0.1:58895_) [n:127.0.0.1:58895_ c:control_collection   x:collection1] o.a.s.c.SolrResourceLoader solr home defaulted to 'solr/' (could not find system property or JNDI)
   [junit4]   2> 2274732 INFO  (coreLoadExecutor-8799-thread-1-processing-n:127.0.0.1:58895_) [n:127.0.0.1:58895_ c:control_collection   x:collection1] o.a.s.c.Config loaded config solrconfig.xml with version 0 
   [junit4]   2> 2274740 INFO  (coreLoadExecutor-8799-thread-1-processing-n:127.0.0.1:58895_) [n:127.0.0.1:58895_ c:control_collection   x:collection1] o.a.s.c.SolrConfig current version of requestparams : -1
   [junit4]   2> 2274752 INFO  (coreLoadExecutor-8799-thread-1-processing-n:127.0.0.1:58895_) [n:127.0.0.1:58895_ c:control_collection   x:collection1] o.a.s.c.SolrConfig Using Lucene MatchVersion: 5.5.5
   [junit4]   2> 2274780 INFO  (coreLoadExecutor-8799-thread-1-processing-n:127.0.0.1:58895_) [n:127.0.0.1:58895_ c:control_collection   x:collection1] o.a.s.c.SolrConfig Loaded SolrConfig: solrconfig.xml
   [junit4]   2> 2274785 INFO  (coreLoadExecutor-8799-thread-1-processing-n:127.0.0.1:58895_) [n:127.0.0.1:58895_ c:control_collection   x:collection1] o.a.s.s.IndexSchema [collection1] Schema name=test
   [junit4]   2> 2275009 INFO  (coreLoadExecutor-8799-thread-1-processing-n:127.0.0.1:58895_) [n:127.0.0.1:58895_ c:control_collection   x:collection1] o.a.s.s.OpenExchangeRatesOrgProvider Initialized with rates=open-exchange-rates.json, refreshInterval=1440.
   [junit4]   2> 2275017 INFO  (coreLoadExecutor-8799-thread-1-processing-n:127.0.0.1:58895_) [n:127.0.0.1:58895_ c:control_collection   x:collection1] o.a.s.s.IndexSchema default search field in schema is text
   [junit4]   2> 2275019 INFO  (coreLoadExecutor-8799-thread-1-processing-n:127.0.0.1:58895_) [n:127.0.0.1:58895_ c:control_collection   x:collection1] o.a.s.s.IndexSchema unique key field: id
   [junit4]   2> 2275024 INFO  (coreLoadExecutor-8799-thread-1-processing-n:127.0.0.1:58895_) [n:127.0.0.1:58895_ c:control_collection   x:collection1] o.a.s.s.FileExchangeRateProvider Reloading exchange rates from file currency.xml
   [junit4]   2> 2275028 INFO  (coreLoadExecutor-8799-thread-1-processing-n:127.0.0.1:58895_) [n:127.0.0.1:58895_ c:control_collection   x:collection1] o.a.s.s.FileExchangeRateProvider Reloading exchange rates from file currency.xml
   [junit4]   2> 2275031 INFO  (coreLoadExecutor-8799-thread-1-processing-n:127.0.0.1:58895_) [n:127.0.0.1:58895_ c:control_collection   x:collection1] o.a.s.s.OpenExchangeRatesOrgProvider Reloading exchange rates from open-exchange-rates.json
   [junit4]   2> 2275031 INFO  (coreLoadExecutor-8799-thread-1-processing-n:127.0.0.1:58895_) [n:127.0.0.1:58895_ c:control_collection   x:collection1] o.a.s.s.OpenExchangeRatesOrgProvider Reloading exchange rates from open-exchange-rates.json
   [junit4]   2> 2275035 INFO  (coreLoadExecutor-8799-thread-1-processing-n:127.0.0.1:58895_) [n:127.0.0.1:58895_ c:control_collection   x:collection1] o.a.s.c.ConfigSetProperties Did not find ConfigSet properties, assuming default properties: Can't find resource 'configsetprops.json' in classpath or '/configs/conf1', cwd=C:\Users\jenkins\workspace\Lucene-Solr-5.5-Windows\solr\build\solr-core\test\J0
   [junit4]   2> 2275035 INFO  (coreLoadExecutor-8799-thread-1-processing-n:127.0.0.1:58895_) [n:127.0.0.1:58895_ c:control_collection   x:collection1] o.a.s.c.CoreContainer Creating SolrCore 'collection1' using configuration from collection control_collection
   [junit4]   2> 2275035 INFO  (coreLoadExecutor-8799-thread-1-processing-n:127.0.0.1:58895_) [n:127.0.0.1:58895_ c:control_collection s:shard1 r:core_node1 x:collection1] o.a.s.c.SolrCore solr.StandardDirectoryFactory
   [junit4]   2> 2275036 INFO  (coreLoadExecutor-8799-thread-1-processing-n:127.0.0.1:58895_) [n:127.0.0.1:58895_ c:control_collection s:shard1 r:core_node1 x:collection1] o.a.s.c.SolrCore [[collection1] ] Opening new SolrCore at [C:\Users\jenkins\workspace\Lucene-Solr-5.5-Windows\solr\build\solr-core\test\J0\temp\solr.cloud.PeerSyncReplicationTest_FE4650164CE8996B-001\control-001\cores\collection1], dataDir=[C:\Users\jenkins\workspace\Lucene-Solr-5.5-Windows\solr\build\solr-core\test\J0\temp\solr.cloud.PeerSyncReplicationTest_FE4650164CE8996B-001\control-001\cores\collection1\data\]
   [junit4]   2> 2275036 INFO  (coreLoadExecutor-8799-thread-1-processing-n:127.0.0.1:58895_) [n:127.0.0.1:58895_ c:control_collection s:shard1 r:core_node1 x:collection1] o.a.s.c.JmxMonitoredMap JMX monitoring is enabled. Adding Solr mbeans to JMX Server: com.sun.jmx.mbeanserver.JmxMBeanServer@287a364b
   [junit4]   2> 2275037 INFO  (coreLoadExecutor-8799-thread-1-processing-n:127.0.0.1:58895_) [n:127.0.0.1:58895_ c:control_collection s:shard1 r:core_node1 x:collection1] o.a.s.c.CachingDirectoryFactory return new directory for C:\Users\jenkins\workspace\Lucene-Solr-5.5-Windows\solr\build\solr-core\test\J0\temp\solr.cloud.PeerSyncReplicationTest_FE4650164CE8996B-001\control-001\cores\collection1\data
   [junit4]   2> 2275037 INFO  (coreLoadExecutor-8799-thread-1-processing-n:127.0.0.1:58895_) [n:127.0.0.1:58895_ c:control_collection s:shard1 r:core_node1 x:collection1] o.a.s.c.SolrCore New index directory detected: old=null new=C:\Users\jenkins\workspace\Lucene-Solr-5.5-Windows\solr\build\solr-core\test\J0\temp\solr.cloud.PeerSyncReplicationTest_FE4650164CE8996B-001\control-001\cores\collection1\data\index/
   [junit4]   2> 2275038 WARN  (coreLoadExecutor-8799-thread-1-processing-n:127.0.0.1:58895_) [n:127.0.0.1:58895_ c:control_collection s:shard1 r:core_node1 x:collection1] o.a.s.c.SolrCore [collection1] Solr index directory 'C:\Users\jenkins\workspace\Lucene-Solr-5.5-Windows\solr\build\solr-core\test\J0\temp\solr.cloud.PeerSyncReplicationTest_FE4650164CE8996B-001\control-001\cores\collection1\data\index' doesn't exist. Creating new index...
   [junit4]   2> 2275039 INFO  (coreLoadExecutor-8799-thread-1-processing-n:127.0.0.1:58895_) [n:127.0.0.1:58895_ c:control_collection s:shard1 r:core_node1 x:collection1] o.a.s.c.CachingDirectoryFactory return new directory for C:\Users\jenkins\workspace\Lucene-Solr-5.5-Windows\solr\build\solr-core\test\J0\temp\solr.cloud.PeerSyncReplicationTest_FE4650164CE8996B-001\control-001\cores\collection1\data\index
   [junit4]   2> 2275039 INFO  (coreLoadExecutor-8799-thread-1-processing-n:127.0.0.1:58895_) [n:127.0.0.1:58895_ c:control_collection s:shard1 r:core_node1 x:collection1] o.a.s.u.RandomMergePolicy RandomMergePolicy wrapping class org.apache.lucene.index.TieredMergePolicy: [TieredMergePolicy: maxMergeAtOnce=21, maxMergeAtOnceExplicit=18, maxMergedSegmentMB=8.4580078125, floorSegmentMB=0.3525390625, forceMergeDeletesPctAllowed=17.040317984804968, segmentsPerTier=21.0, maxCFSSegmentSizeMB=8.796093022207999E12, noCFSRatio=0.6660037001473162
   [junit4]   2> 2275041 INFO  (coreLoadExecutor-8799-thread-1-processing-n:127.0.0.1:58895_) [n:127.0.0.1:58895_ c:control_collection s:shard1 r:core_node1 x:collection1] o.a.s.c.SolrDeletionPolicy SolrDeletionPolicy.onCommit: commits: num=1
   [junit4]   2> 	commit{dir=C:\Users\jenkins\workspace\Lucene-Solr-5.5-Windows\solr\build\solr-core\test\J0\temp\solr.cloud.PeerSyncReplicationTest_FE4650164CE8996B-001\control-001\cores\collection1\data\index,segFN=segments_1,generation=1}
   [junit4]   2> 2275042 INFO  (coreLoadExecutor-8799-thread-1-processing-n:127.0.0.1:58895_) [n:127.0.0.1:58895_ c:control_collection s:shard1 r:core_node1 x:collection1] o.a.s.c.SolrDeletionPolicy newest commit generation = 1
   [junit4]   2> 2275042 INFO  (OldIndexDirectoryCleanupThreadForCore-collection1) [n:127.0.0.1:58895_ c:control_collection s:shard1 r:core_node1 x:collection1] o.a.s.c.SolrCore Looking for old index directories to cleanup for core collection1 in C:\Users\jenkins\workspace\Lucene-Solr-5.5-Windows\solr\build\solr-core\test\J0\temp\solr.cloud.PeerSyncReplicationTest_FE4650164CE8996B-001\control-001\cores\collection1\data\
   [junit4]   2> 2275044 INFO  (coreLoadExecutor-8799-thread-1-processing-n:127.0.0.1:58895_) [n:127.0.0.1:58895_ c:control_collection s:shard1 r:core_node1 x:collection1] o.a.s.u.p.UpdateRequestProcessorChain creating updateRequestProcessorChain "nodistrib"
   [junit4]   2> 2275044 INFO  (coreLoadExecutor-8799-thread-1-processing-n:127.0.0.1:58895_) [n:127.0.0.1:58895_ c:control_collection s:shard1 r:core_node1 x:collection1] o.a.s.u.p.UpdateRequestProcessorChain creating updateRequestProcessorChain "dedupe"
   [junit4]   2> 2275044 INFO  (coreLoadExecutor-8799-thread-1-processing-n:127.0.0.1:58895_) [n:127.0.0.1:58895_ c:control_collection s:shard1 r:core_node1 x:collection1] o.a.s.u.p.UpdateRequestProcessorChain inserting DistributedUpdateProcessorFactory into updateRequestProcessorChain "dedupe"
   [junit4]   2> 2275044 INFO  (coreLoadExecutor-8799-thread-1-processing-n:127.0.0.1:58895_) [n:127.0.0.1:58895_ c:control_collection s:shard1 r:core_node1 x:collection1] o.a.s.u.p.UpdateRequestProcessorChain creating updateRequestProcessorChain "stored_sig"
   [junit4]   2> 2275044 INFO  (coreLoadExecutor-8799-thread-1-processing-n:127.0.0.1:58895_) [n:127.0.0.1:58895_ c:control_collection s:shard1 r:core_node1 x:collection1] o.a.s.u.p.UpdateRequestProcessorChain inserting DistributedUpdateProcessorFactory into updateRequestProcessorChain "stored_sig"
   [junit4]   2> 2275044 INFO  (coreLoadExecutor-8799-thread-1-processing-n:127.0.0.1:58895_) [n:127.0.0.1:58895_ c:control_collection s:shard1 r:core_node1 x:collection1] o.a.s.u.p.UpdateRequestProcessorChain creating updateRequestProcessorChain "distrib-dup-test-chain-explicit"
   [junit4]   2> 2275044 INFO  (coreLoadExecutor-8799-thread-1-processing-n:127.0.0.1:58895_) [n:127.0.0.1:58895_ c:control_collection s:shard1 r:core_node1 x:collection1] o.a.s.u.p.UpdateRequestProcessorChain creating updateRequestProcessorChain "distrib-dup-test-chain-implicit"
   [junit4]   2> 2275044 INFO  (coreLoadExecutor-8799-thread-1-processing-n:127.0.0.1:58895_) [n:127.0.0.1:58895_ c:control_collection s:shard1 r:core_node1 x:collection1] o.a.s.u.p.UpdateRequestProcessorChain inserting DistributedUpdateProcessorFactory into updateRequestProcessorChain "distrib-dup-test-chain-implicit"
   [junit4]   2> 2275044 INFO  (coreLoadExecutor-8799-thread-1-processing-n:127.0.0.1:58895_) [n:127.0.0.1:58895_ c:control_collection s:shard1 r:core_node1 x:collection1] o.a.s.c.SolrCore no updateRequestProcessorChain defined as default, creating implicit default
   [junit4]   2> 2275044 WARN  (coreLoadExecutor-8799-thread-1-processing-n:127.0.0.1:58895_) [n:127.0.0.1:58895_ c:control_collection s:shard1 r:core_node1 x:collection1] o.a.s.c.RequestHandlers INVALID paramSet a in requestHandler {type = requestHandler,name = /dump,class = DumpRequestHandler,args = {defaults={a=A,b=B}}}
   [junit4]   2> 2275051 INFO  (coreLoadExecutor-8799-thread-1-processing-n:127.0.0.1:58895_) [n:127.0.0.1:58895_ c:control_collection s:shard1 r:core_node1 x:collection1] o.a.s.h.l.XMLLoader xsltCacheLifetimeSeconds=60
   [junit4]   2> 2275052 INFO  (coreLoadExecutor-8799-thread-1-processing-n:127.0.0.1:58895_) [n:127.0.0.1:58895_ c:control_collection s:shard1 r:core_node1 x:collection1] o.a.s.h.l.XMLLoader xsltCacheLifetimeSeconds=60
   [junit4]   2> 2275053 INFO  (coreLoadExecutor-8799-thread-1-processing-n:127.0.0.1:58895_) [n:127.0.0.1:58895_ c:control_collection s:shard1 r:core_node1 x:collection1] o.a.s.h.l.XMLLoader xsltCacheLifetimeSeconds=60
   [junit4]   2> 2275055 INFO  (coreLoadExecutor-8799-thread-1-processing-n:127.0.0.1:58895_) [n:127.0.0.1:58895_ c:control_collection s:shard1 r:core_node1 x:collection1] o.a.s.h.l.XMLLoader xsltCacheLifetimeSeconds=60
   [junit4]   2> 2275058 INFO  (coreLoadExecutor-8799-thread-1-processing-n:127.0.0.1:58895_) [n:127.0.0.1:58895_ c:control_collection s:shard1 r:core_node1 x:collection1] o.a.s.c.RequestHandlers Registered paths: /replication,/update/json/docs,/get,/config,/update/csv,/update,/admin/segments,/admin/ping,/admin/threads,/admin/properties,/schema,/admin/logging,/admin/plugins,standard,/dump,/admin/system,/admin/luke,/admin/mbeans,/update/json,/admin/file
   [junit4]   2> 2275059 INFO  (coreLoadExecutor-8799-thread-1-processing-n:127.0.0.1:58895_) [n:127.0.0.1:58895_ c:control_collection s:shard1 r:core_node1 x:collection1] o.a.s.c.SolrCore Using default statsCache cache: org.apache.solr.search.stats.LocalStatsCache
   [junit4]   2> 2275059 INFO  (coreLoadExecutor-8799-thread-1-processing-n:127.0.0.1:58895_) [n:127.0.0.1:58895_ c:control_collection s:shard1 r:core_node1 x:collection1] o.a.s.u.UpdateHandler Using UpdateLog implementation: org.apache.solr.update.UpdateLog
   [junit4]   2> 2275059 INFO  (coreLoadExecutor-8799-thread-1-processing-n:127.0.0.1:58895_) [n:127.0.0.1:58895_ c:control_collection s:shard1 r:core_node1 x:collection1] o.a.s.u.UpdateLog Initializing UpdateLog: dataDir= defaultSyncLevel=FLUSH numRecordsToKeep=1000 maxNumLogsToKeep=10 numVersionBuckets=65536
   [junit4]   2> 2275060 INFO  (coreLoadExecutor-8799-thread-1-processing-n:127.0.0.1:58895_) [n:127.0.0.1:58895_ c:control_collection s:shard1 r:core_node1 x:collection1] o.a.s.u.CommitTracker Hard AutoCommit: disabled
   [junit4]   2> 2275060 INFO  (coreLoadExecutor-8799-thread-1-processing-n:127.0.0.1:58895_) [n:127.0.0.1:58895_ c:control_collection s:shard1 r:core_node1 x:collection1] o.a.s.u.CommitTracker Soft AutoCommit: disabled
   [junit4]   2> 2275061 INFO  (coreLoadExecutor-8799-thread-1-processing-n:127.0.0.1:58895_) [n:127.0.0.1:58895_ c:control_collection s:shard1 r:core_node1 x:collection1] o.a.s.u.RandomMergePolicy RandomMergePolicy wrapping class org.apache.lucene.index.LogByteSizeMergePolicy: [LogByteSizeMergePolicy: minMergeSize=1677721, mergeFactor=29, maxMergeSize=2147483648, maxMergeSizeForForcedMerge=9223372036854775807, calibrateSizeByDeletes=true, maxMergeDocs=2147483647, maxCFSSegmentSizeMB=8.796093022207999E12, noCFSRatio=1.0]
   [junit4]   2> 2275061 INFO  (coreLoadExecutor-8799-thread-1-processing-n:127.0.0.1:58895_) [n:127.0.0.1:58895_ c:control_collection s:shard1 r:core_node1 x:collection1] o.a.s.c.SolrDeletionPolicy SolrDeletionPolicy.onInit: commits: num=1
   [junit4]   2> 	commit{dir=C:\Users\jenkins\workspace\Lucene-Solr-5.5-Windows\solr\build\solr-core\test\J0\temp\solr.cloud.PeerSyncReplicationTest_FE4650164CE8996B-001\control-001\cores\collection1\data\index,segFN=segments_1,generation=1}
   [junit4]   2> 2275061 INFO  (coreLoadExecutor-8799-thread-1-processing-n:127.0.0.1:58895_) [n:127.0.0.1:58895_ c:control_collection s:shard1 r:core_node1 x:collection1] o.a.s.c.SolrDeletionPolicy newest commit generation = 1
   [junit4]   2> 2275061 INFO  (coreLoadExecutor-8799-thread-1-processing-n:127.0.0.1:58895_) [n:127.0.0.1:58895_ c:control_collection s:shard1 r:core_node1 x:collection1] o.a.s.s.SolrIndexSearcher Opening Searcher@18257b54[collection1] main
   [junit4]   2> 2275062 INFO  (coreLoadExecutor-8799-thread-1-processing-n:127.0.0.1:58895_) [n:127.0.0.1:58895_ c:control_collection s:shard1 r:core_node1 x:collection1] o.a.s.c.c.ZkStateReader Load collection config from: [/collections/control_collection]
   [junit4]   2> 2275062 INFO  (coreLoadExecutor-8799-thread-1-processing-n:127.0.0.1:58895_) [n:127.0.0.1:58895_ c:control_collection s:shard1 r:core_node1 x:collection1] o.a.s.c.c.ZkStateReader path=[/collections/control_collection] [configName]=[conf1] specified config exists in ZooKeeper
   [junit4]   2> 2275062 INFO  (coreLoadExecutor-8799-thread-1-processing-n:127.0.0.1:58895_) [n:127.0.0.1:58895_ c:control_collection s:shard1 r:core_node1 x:collection1] o.a.s.r.ManagedResourceStorage Setting up ZooKeeper-based storage for the RestManager with znodeBase: /configs/conf1
   [junit4]   2> 2275063 INFO  (coreLoadExecutor-8799-thread-1-processing-n:127.0.0.1:58895_) [n:127.0.0.1:58895_ c:control_collection s:shard1 r:core_node1 x:collection1] o.a.s.r.ManagedResourceStorage Configured ZooKeeperStorageIO with znodeBase: /configs/conf1
   [junit4]   2> 2275063 INFO  (coreLoadExecutor-8799-thread-1-processing-n:127.0.0.1:58895_) [n:127.0.0.1:58895_ c:control_collection s:shard1 r:core_node1 x:collection1] o.a.s.r.RestManager Initializing RestManager with initArgs: {}
   [junit4]   2> 2275063 INFO  (coreLoadExecutor-8799-thread-1-processing-n:127.0.0.1:58895_) [n:127.0.0.1:58895_ c:control_collection s:shard1 r:core_node1 x:collection1] o.a.s.r.ManagedResourceStorage Reading _rest_managed.json using ZooKeeperStorageIO:path=/configs/conf1
   [junit4]   2> 2275063 INFO  (coreLoadExecutor-8799-thread-1-processing-n:127.0.0.1:58895_) [n:127.0.0.1:58895_ c:control_collection s:shard1 r:core_node1 x:collection1] o.a.s.r.ManagedResourceStorage No data found for znode /configs/conf1/_rest_managed.json
   [junit4]   2> 2275063 INFO  (coreLoadExecutor-8799-thread-1-processing-n:127.0.0.1:58895_) [n:127.0.0.1:58895_ c:control_collection s:shard1 r:core_node1 x:collection1] o.a.s.r.ManagedResourceStorage Loaded null at path _rest_managed.json using ZooKeeperStorageIO:path=/configs/conf1
   [junit4]   2> 2275063 INFO  (coreLoadExecutor-8799-thread-1-processing-n:127.0.0.1:58895_) [n:127.0.0.1:58895_ c:control_collection s:shard1 r:core_node1 x:collection1] o.a.s.r.RestManager Initializing 0 registered ManagedResources
   [junit4]   2> 2275063 INFO  (coreLoadExecutor-8799-thread-1-processing-n:127.0.0.1:58895_) [n:127.0.0.1:58895_ c:control_collection s:shard1 r:core_node1 x:collection1] o.a.s.h.ReplicationHandler Commits will be reserved for  10000
   [junit4]   2> 2275064 INFO  (searcherExecutor-8800-thread-1-processing-s:shard1 c:control_collection r:core_node1 x:collection1 n:127.0.0.1:58895_) [n:127.0.0.1:58895_ c:control_collection s:shard1 r:core_node1 x:collection1] o.a.s.c.SolrCore [collection1] Registered new searcher Searcher@18257b54[collection1] main{ExitableDirectoryReader(UninvertingDirectoryReader())}
   [junit4]   2> 2275064 INFO  (coreLoadExecutor-8799-thread-1-processing-n:127.0.0.1:58895_) [n:127.0.0.1:58895_ c:control_collection s:shard1 r:core_node1 x:collection1] o.a.s.u.UpdateLog Looking up max value of version field to seed version buckets
   [junit4]   2> 2275064 INFO  (coreLoadExecutor-8799-thread-1-processing-n:127.0.0.1:58895_) [n:127.0.0.1:58895_ c:control_collection s:shard1 r:core_node1 x:collection1] o.a.s.u.VersionInfo Refreshing highest value of _version_ for 65536 version buckets from index
   [junit4]   2> 2275064 INFO  (coreLoadExecutor-8799-thread-1-processing-n:127.0.0.1:58895_) [n:127.0.0.1:58895_ c:control_collection s:shard1 r:core_node1 x:collection1] o.a.s.u.VersionInfo No terms found for _version_, cannot seed version bucket highest value from index
   [junit4]   2> 2275064 INFO  (coreLoadExecutor-8799-thread-1-processing-n:127.0.0.1:58895_) [n:127.0.0.1:58895_ c:control_collection s:shard1 r:core_node1 x:collection1] o.a.s.u.UpdateLog Could not find max version in index or recent updates, using new clock 1581768295611105280
   [junit4]   2> 2275064 INFO  (coreLoadExecutor-8799-thread-1-processing-n:127.0.0.1:58895_) [n:127.0.0.1:58895_ c:control_collection s:shard1 r:core_node1 x:collection1] o.a.s.u.UpdateLog Took 1.0ms to seed version buckets with highest version 1581768295611105280
   [junit4]   2> 2275066 INFO  (coreLoadExecutor-8799-thread-1-processing-n:127.0.0.1:58895_) [n:127.0.0.1:58895_ c:control_collection s:shard1 r:core_node1 x:collection1] o.a.s.c.ZkController watch zkdir /configs/conf1
   [junit4]   2> 2275066 INFO  (coreLoadExecutor-8799-thread-1-processing-n:127.0.0.1:58895_) [n:127.0.0.1:58895_ c:control_collection s:shard1 r:core_node1 x:collection1] o.a.s.c.CoreContainer registering core: collection1
   [junit4]   2> 2275067 INFO  (coreZkRegister-8793-thread-1-processing-s:shard1 c:control_collection r:core_node1 x:collection1 n:127.0.0.1:58895_) [n:127.0.0.1:58895_ c:control_collection s:shard1 r:core_node1 x:collection1] o.a.s.c.ZkController Register replica - core:collection1 address:http://127.0.0.1:58895 collection:control_collection shard:shard1
   [junit4]   2> 2275067 INFO  (coreZkRegister-8793-thread-1-processing-s:shard1 c:control_collection r:core_node1 x:collection1 n:127.0.0.1:58895_) [n:127.0.0.1:58895_ c:control_collection s:shard1 r:core_node1 x:collection1] o.a.s.c.c.SolrZkClient makePath: /collections/control_collection/leader_elect/shard1/election
   [junit4]   2> 2275070 INFO  (coreZkRegister-8793-thread-1-processing-s:shard1 c:control_collection r:core_node1 x:collection1 n:127.0.0.1:58895_) [n:127.0.0.1:58895_ c:control_collection s:shard1 r:core_node1 x:collection1] o.a.s.c.LeaderElector Joined leadership election with path: /collections/control_collection/leader_elect/shard1/election/98860518353338372-core_node1-n_0000000000
   [junit4]   2> 2275070 INFO  (coreZkRegister-8793-thread-1-processing-s:shard1 c:control_collection r:core_node1 x:collection1 n:127.0.0.1:58895_) [n:127.0.0.1:58895_ c:control_collection s:shard1 r:core_node1 x:collection1] o.a.s.c.ShardLeaderElectionContext Running the leader process for shard=shard1 and weAreReplacement=false and leaderVoteWait=10000
   [junit4]   2> 2275072 INFO  (coreZkRegister-8793-thread-1-processing-s:shard1 c:control_collection r:core_node1 x:collection1 n:127.0.0.1:58895_) [n:127.0.0.1:58895_ c:control_collection s:shard1 r:core_node1 x:collection1] o.a.s.c.ShardLeaderElectionContext Enough replicas found to continue.
   [junit4]   2> 2275072 INFO  (coreZkRegister-8793-thread-1-processing-s:shard1 c:control_collection r:core_node1 x:collection1 n:127.0.0.1:58895_) [n:127.0.0.1:58895_ c:control_collection s:shard1 r:core_node1 x:collection1] o.a.s.c.ShardLeaderElectionContext I may be the new leader - try and sync
   [junit4]   2> 2275072 INFO  (coreZkRegister-8793-thread-1-processing-s:shard1 c:control_collection r:core_node1 x:collection1 n:127.0.0.1:58895_) [n:127.0.0.1:58895_ c:control_collection s:shard1 r:core_node1 x:collection1] o.a.s.c.SyncStrategy Sync replicas to http://127.0.0.1:58895/collection1/
   [junit4]   2> 2275072 INFO  (coreZkRegister-8793-thread-1-processing-s:shard1 c:control_collection r:core_node1 x:collection1 n:127.0.0.1:58895_) [n:127.0.0.1:58895_ c:control_collection s:shard1 r:core_node1 x:collection1] o.a.s.c.SyncStrategy Sync Success - now sync replicas to me
   [junit4]   2> 2275072 INFO  (coreZkRegister-8793-thread-1-processing-s:shard1 c:control_collection r:core_node1 x:collection1 n:127.0.0.1:58895_) [n:127.0.0.1:58895_ c:control_collection s:shard1 r:core_node1 x:collection1] o.a.s.c.SyncStrategy http://127.0.0.1:58895/collection1/ has no replicas
   [junit4]   2> 2275072 INFO  (OverseerStateUpdate-98860518353338372-127.0.0.1:58895_-n_0000000000) [n:127.0.0.1:58895_    ] o.a.s.c.Overseer processMessage: queueSize: 1, message = {
   [junit4]   2>   "operation":"leader",
   [junit4]   2>   "shard":"shard1",
   [junit4]   2>   "collection":"control_collection"} current state version: 1
   [junit4]   2> 2275072 INFO  (coreZkRegister-8793-thread-1-processing-s:shard1 c:control_collection r:core_node1 x:collection1 n:127.0.0.1:58895_) [n:127.0.0.1:58895_ c:control_collection s:shard1 r:core_node1 x:collection1] o.a.s.c.c.SolrZkClient makePath: /collections/control_collection/leaders/shard1
   [junit4]   2> 2275074 INFO  (coreZkRegister-8793-thread-1-processing-s:shard1 c:control_collection r:core_node1 x:collection1 n:127.0.0.1:58895_) [n:127.0.0.1:58895_ c:control_collection s:shard1 r:core_node1 x:collection1] o.a.s.c.ShardLeaderElectionContextBase Creating leader registration node /collections/control_collection/leaders/shard1/leader after winning as /collections/control_collection/leader_elect/shard1/election/98860518353338372-core_node1-n_0000000000
   [junit4]   2> 2275075 INFO  (coreZkRegister-8793-thread-1-processing-s:shard1 c:control_collection r:core_node1 x:collection1 n:127.0.0.1:58895_) [n:127.0.0.1:58895_ c:control_collection s:shard1 r:core_node1 x:collection1] o.a.s.c.ShardLeaderElectionContext I am the new leader: http://127.0.0.1:58895/collection1/ shard1
   [junit4]   2> 2275075 INFO  (OverseerStateUpdate-98860518353338372-127.0.0.1:58895_-n_0000000000) [n:127.0.0.1:58895_    ] o.a.s.c.Overseer processMessage: queueSize: 1, message = {
   [junit4]   2>   "operation":"leader",
   [junit4]   2>   "shard":"shard1",
   [junit4]   2>   "collection":"control_collection",
   [junit4]   2>   "base_url":"http://127.0.0.1:58895",
   [junit4]   2>   "core":"collection1",
   [junit4]   2>   "state":"active"} current state version: 1
   [junit4]   2> 2275178 INFO  (zkCallback-2591-thread-1-processing-n:127.0.0.1:58895_) [n:127.0.0.1:58895_    ] o.a.s.c.c.ZkStateReader A cluster state change: [WatchedEvent state:SyncConnected type:NodeDataChanged path:/clusterstate.json], has occurred - updating... (live nodes size: [1])
   [junit4]   2> 2275226 INFO  (coreZkRegister-8793-thread-1-processing-s:shard1 c:control_collection r:core_node1 x:collection1 n:127.0.0.1:58895_) [n:127.0.0.1:58895_ c:control_collection s:shard1 r:core_node1 x:collection1] o.a.s.c.ZkController We are http://127.0.0.1:58895/collection1/ and leader is http://127.0.0.1:58895/collection1/
   [junit4]   2> 2275226 INFO  (coreZkRegister-8793-thread-1-processing-s:shard1 c:control_collection r:core_node1 x:collection1 n:127.0.0.1:58895_) [n:127.0.0.1:58895_ c:control_collection s:shard1 r:core_node1 x:collection1] o.a.s.c.ZkController No LogReplay needed for core=collection1 baseURL=http://127.0.0.1:58895
   [junit4]   2> 2275226 INFO  (coreZkRegister-8793-thread-1-processing-s:shard1 c:control_collection r:core_node1 x:collection1 n:127.0.0.1:58895_) [n:127.0.0.1:58895_ c:control_collection s:shard1 r:core_node1 x:collection1] o.a.s.c.ZkController I am the leader, no recovery necessary
   [junit4]   2> 2275226 INFO  (coreZkRegister-8793-thread-1-processing-s:shard1 c:control_collection r:core_node1 x:collection1 n:127.0.0.1:58895_) [n:127.0.0.1:58895_ c:control_collection s:shard1 r:core_node1 x:collection1] o.a.s.c.ZkController publishing state=active
   [junit4]   2> 2275226 INFO  (coreZkRegister-8793-thread-1-processing-s:shard1 c:control_collection r:core_node1 x:collection1 n:127.0.0.1:58895_) [n:127.0.0.1:58895_ c:control_collection s:shard1 r:core_node1 x:collection1] o.a.s.c.ZkController numShards not found on descriptor - reading it from system property
   [junit4]   2> 2275227 INFO  (TEST-PeerSyncReplicationTest.test-seed#[FE4650164CE8996B]) [    ] o.a.s.c.c.SolrZkClient Using default ZkCredentialsProvider
   [junit4]   2> 2275227 INFO  (OverseerStateUpdate-98860518353338372-127.0.0.1:58895_-n_0000000000) [n:127.0.0.1:58895_    ] o.a.s.c.Overseer processMessage: queueSize: 1, message = {
   [junit4]   2>   "shard":"shard1",
   [junit4]   2>   "base_url":"http://127.0.0.1:58895",
   [junit4]   2>   "collection":"control_collection",
   [junit4]   2>   "node_name":"127.0.0.1:58895_",
   [junit4]   2>   "core":"collection1",
   [junit4]   2>   "core_node_name":"core_node1",
   [junit4]   2>   "numShards":"1",
   [junit4]   2>   "state":"active",
   [junit4]   2>   "roles":null,
   [junit4]   2>   "operation":"state"} current state version: 2
   [junit4]   2> 2275227 INFO  (OverseerStateUpdate-98860518353338372-127.0.0.1:58895_-n_0000000000) [n:127.0.0.1:58895_    ] o.a.s.c.o.ReplicaMutator Update state numShards=1 message={
   [junit4]   2>   "shard":"shard1",
   [junit4]   2>   "base_url":"http://127.0.0.1:58895",
   [junit4]   2>   "collection":"control_collection",
   [junit4]   2>   "node_name":"127.0.0.1:58895_",
   [junit4]   2>   "core":"collection1",
   [junit4]   2>   "core_node_name":"core_node1",
   [junit4]   2>   "numShards":"1",
   [junit4]   2>   "state":"active",
   [junit4]   2>   "roles":null,
   [junit4]   2>   "operation":"state"}
   [junit4]   2> 2275228 INFO  (TEST-PeerSyncReplicationTest.test-seed#[FE4650164CE8996B]) [    ] o.a.s.c.c.ConnectionManager Waiting for client to connect to ZooKeeper
   [junit4]   2> 2275230 INFO  (zkCallback-2593-thread-1) [    ] o.a.s.c.c.ConnectionManager Watcher org.apache.solr.common.cloud.ConnectionManager@4b32a6e4 name:ZooKeeperConnection Watcher:127.0.0.1:58884/solr got event WatchedEvent state:SyncConnected type:None path:null path:null type:None
   [junit4]   2> 2275230 INFO  (TEST-PeerSyncReplicationTest.test-seed#[FE4650164CE8996B]) [    ] o.a.s.c.c.ConnectionManager Client is connected to ZooKeeper
   [junit4]   2> 2275231 INFO  (TEST-PeerSyncReplicationTest.test-seed#[FE4650164CE8996B]) [    ] o.a.s.c.c.SolrZkClient Using default ZkACLProvider
   [junit4]   2> 2275231 INFO  (TEST-PeerSyncReplicationTest.test-seed#[FE4650164CE8996B]) [    ] o.a.s.c.c.ZkStateReader Updating cluster state from ZooKeeper... 
   [junit4]   2> 2275232 INFO  (TEST-PeerSyncReplicationTest.test-seed#[FE4650164CE8996B]) [    ] o.a.s.c.ChaosMonkey monkey: init - expire sessions:false cause connection loss:false
   [junit4]   2> 2275331 INFO  (zkCallback-2591-thread-1-processing-n:127.0.0.1:58895_) [n:127.0.0.1:58895_    ] o.a.s.c.c.ZkStateReader A cluster state change: [WatchedEvent state:SyncConnected type:NodeDataChanged path:/clusterstate.json], has occurred - updating... (live nodes size: [1])
   [junit4]   2> 2275331 INFO  (zkCallback-2593-thread-1) [    ] o.a.s.c.c.ZkStateReader A cluster state change: [WatchedEvent state:SyncConnected type:NodeDataChanged path:/clusterstate.json], has occurred - updating... (live nodes size: [1])
   [junit4]   2> 2275476 INFO  (TEST-PeerSyncReplicationTest.test-seed#[FE4650164CE8996B]) [    ] o.a.s.SolrTestCaseJ4 Writing core.properties file to C:\Users\jenkins\workspace\Lucene-Solr-5.5-Windows\solr\build\solr-core\test\J0\temp\solr.cloud.PeerSyncReplicationTest_FE4650164CE8996B-001\shard-1-001\cores\collection1
   [junit4]   2> 2275478 INFO  (TEST-PeerSyncReplicationTest.test-seed#[FE4650164CE8996B]) [    ] o.a.s.c.AbstractFullDistribZkTestBase create jetty 1 in directory C:\Users\jenkins\workspace\Lucene-Solr-5.5-Windows\solr\build\solr-core\test\J0\temp\solr.cloud.PeerSyncReplicationTest_FE4650164CE8996B-001\shard-1-001
   [junit4]   2> 2275479 INFO  (TEST-PeerSyncReplicationTest.test-seed#[FE4650164CE8996B]) [    ] o.e.j.s.Server jetty-9.2.13.v20150730
   [junit4]   2> 2275479 INFO  (TEST-PeerSyncReplicationTest.test-seed#[FE4650164CE8996B]) [    ] o.e.j.s.h.ContextHandler Started o.e.j.s.ServletContextHandler@2d22b047{/,null,AVAILABLE}
   [junit4]   2> 2275480 INFO  (TEST-PeerSyncReplicationTest.test-seed#[FE4650164CE8996B]) [    ] o.e.j.s.ServerConnector Started ServerConnector@40631c77{HTTP/1.1}{127.0.0.1:58914}
   [junit4]   2> 2275480 INFO  (TEST-PeerSyncReplicationTest.test-seed#[FE4650164CE8996B]) [    ] o.e.j.s.Server Started @2278431ms
   [junit4]   2> 2275480 INFO  (TEST-PeerSyncReplicationTest.test-seed#[FE4650164CE8996B]) [    ] o.a.s.c.s.e.JettySolrRunner Jetty properties: {coreRootDirectory=C:\Users\jenkins\workspace\Lucene-Solr-5.5-Windows\solr\build\solr-core\test\J0\temp\solr.cloud.PeerSyncReplicationTest_FE4650164CE8996B-001\shard-1-001\cores, hostContext=/, solrconfig=solrconfig.xml, solr.data.dir=C:\Users\jenkins\workspace\Lucene-Solr-5.5-Windows\solr\build\solr-core\test\J0\temp\solr.cloud.PeerSyncReplicationTest_FE4650164CE8996B-001\tempDir-001/jetty1, hostPort=58914}
   [junit4]   2> 2275480 INFO  (TEST-PeerSyncReplicationTest.test-seed#[FE4650164CE8996B]) [    ] o.a.s.s.SolrDispatchFilter SolrDispatchFilter.init(): sun.misc.Launcher$AppClassLoader@4322394
   [junit4]   2> 2275480 INFO  (TEST-PeerSyncReplicationTest.test-seed#[FE4650164CE8996B]) [    ] o.a.s.c.SolrResourceLoader new SolrResourceLoader for directory: 'C:\Users\jenkins\workspace\Lucene-Solr-5.5-Windows\solr\build\solr-core\test\J0\temp\solr.cloud.PeerSyncReplicationTest_FE4650164CE8996B-001\shard-1-001'
   [junit4]   2> 2275481 INFO  (TEST-PeerSyncReplicationTest.test-seed#[FE4650164CE8996B]) [    ] o.a.s.c.SolrResourceLoader JNDI not configured for solr (NoInitialContextEx)
   [junit4]   2> 2275481 INFO  (TEST-PeerSyncReplicationTest.test-seed#[FE4650164CE8996B]) [    ] o.a.s.c.SolrResourceLoader solr home defaulted to 'solr/' (could not find system property or JNDI)
   [junit4]   2> 2275481 INFO  (TEST-PeerSyncReplicationTest.test-seed#[FE4650164CE8996B]) [    ] o.a.s.c.c.SolrZkClient Using default ZkCredentialsProvider
   [junit4]   2> 2275482 INFO  (TEST-PeerSyncReplicationTest.test-seed#[FE4650164CE8996B]) [    ] o.a.s.c.c.ConnectionManager Waiting for client to connect to ZooKeeper
   [junit4]   2> 2275483 INFO  (zkCallback-2594-thread-1) [    ] o.a.s.c.c.ConnectionManager Watcher org.apache.solr.common.cloud.ConnectionManager@4e41aa02 name:ZooKeeperConnection Watcher:127.0.0.1:58884/solr got event WatchedEvent state:SyncConnected type:None path:null path:null type:None
   [junit4]   2> 2275483 INFO  (TEST-PeerSyncReplicationTest.test-seed#[FE4650164CE8996B]) [    ] o.a.s.c.c.ConnectionManager Client is connected to ZooKeeper
   [junit4]   2> 2275484 INFO  (TEST-PeerSyncReplicationTest.test-seed#[FE4650164CE8996B]) [    ] o.a.s.c.c.SolrZkClient Using default ZkACLProvider
   [junit4]   2> 2275485 INFO  (TEST-PeerSyncReplicationTest.test-seed#[FE4650164CE8996B]) [    ] o.a.s.s.SolrDispatchFilter Loading solr.xml from SolrHome (not found in ZooKeeper)
   [junit4]   2> 2275485 INFO  (TEST-PeerSyncReplicationTest.test-seed#[FE4650164CE8996B]) [    ] o.a.s.c.SolrXmlConfig Loading container configuration from C:\Users\jenkins\workspace\Lucene-Solr-5.5-Windows\solr\build\solr-core\test\J0\temp\solr.cloud.PeerSyncReplicationTest_FE4650164CE8996B-001\shard-1-001\solr.xml
   [junit4]   2> 2275504 INFO  (TEST-PeerSyncReplicationTest.test-seed#[FE4650164CE8996B]) [    ] o.a.s.c.CorePropertiesLocator Config-defined core root directory: C:\Users\jenkins\workspace\Lucene-Solr-5.5-Windows\solr\build\solr-core\test\J0\temp\solr.cloud.PeerSyncReplicationTest_FE4650164CE8996B-001\shard-1-001\cores
   [junit4]   2> 2275504 INFO  (TEST-PeerSyncReplicationTest.test-seed#[FE4650164CE8996B]) [    ] o.a.s.c.CoreContainer New CoreContainer 1698937554
   [junit4]   2> 2275504 INFO  (TEST-PeerSyncReplicationTest.test-seed#[FE4650164CE8996B]) [    ] o.a.s.c.CoreContainer Loading cores into CoreContainer [instanceDir=C:\Users\jenkins\workspace\Lucene-Solr-5.5-Windows\solr\build\solr-core\test\J0\temp\solr.cloud.PeerSyncReplicationTest_FE4650164CE8996B-001\shard-1-001]
   [junit4]   2> 2275504 WARN  (TEST-PeerSyncReplicationTest.test-seed#[FE4650164CE8996B]) [    ] o.a.s.c.CoreContainer Couldn't add files from C:\Users\jenkins\workspace\Lucene-Solr-5.5-Windows\solr\build\solr-core\test\J0\temp\solr.cloud.PeerSyncReplicationTest_FE4650164CE8996B-001\shard-1-001\lib to classpath: C:\Users\jenkins\workspace\Lucene-Solr-5.5-Windows\solr\build\solr-core\test\J0\temp\solr.cloud.PeerSyncReplicationTest_FE4650164CE8996B-001\shard-1-001\lib
   [junit4]   2> 2275504 INFO  (TEST-PeerSyncReplicationTest.test-seed#[FE4650164CE8996B]) [    ] o.a.s.h.c.HttpShardHandlerFactory created with socketTimeout : 90000,urlScheme : ,connTimeout : 15000,maxConnectionsPerHost : 20,maxConnections : 10000,corePoolSize : 0,maximumPoolSize : 2147483647,maxThreadIdleTime : 5,sizeOfQueue : -1,fairnessPolicy : false,useRetries : false,connectionsEvictorSleepDelay : 5000,maxConnectionIdleTime : 40000,
   [junit4]   2> 2275507 INFO  (TEST-PeerSyncReplicationTest.test-seed#[FE4650164CE8996B]) [    ] o.a.s.u.UpdateShardHandler Creating UpdateShardHandler HTTP client with params: socketTimeout=340000&connTimeout=45000&retry=true
   [junit4]   2> 2275507 INFO  (TEST-PeerSyncReplicationTest.test-seed#[FE4650164CE8996B]) [    ] o.a.s.l.LogWatcher SLF4J impl is org.slf4j.impl.Log4jLoggerFactory
   [junit4]   2> 2275507 INFO  (TEST-PeerSyncReplicationTest.test-seed#[FE4650164CE8996B]) [    ] o.a.s.l.LogWatcher Registering Log Listener [Log4j (org.slf4j.impl.Log4jLoggerFactory)]
   [junit4]   2> 2275507 INFO  (TEST-PeerSyncReplicationTest.test-seed#[FE4650164CE8996B]) [    ] o.a.s.c.ZkContainer Zookeeper client=127.0.0.1:58884/solr
   [junit4]   2> 2275507 INFO  (TEST-PeerSyncReplicationTest.test-seed#[FE4650164CE8996B]) [    ] o.a.s.c.ZkController zkHost includes chroot
   [junit4]   2> 2275507 INFO  (TEST-PeerSyncReplicationTest.test-seed#[FE4650164CE8996B]) [    ] o.a.s.c.c.SolrZkClient Using default ZkCredentialsProvider
   [junit4]   2> 2275509 INFO  (TEST-PeerSyncReplicationTest.test-seed#[FE4650164CE8996B]) [    ] o.a.s.c.c.ConnectionManager Waiting for client to connect to ZooKeeper
   [junit4]   2> 2275510 INFO  (zkCallback-2597-thread-1) [    ] o.a.s.c.c.ConnectionManager Watcher org.apache.solr.common.cloud.ConnectionManager@536e4ac3 name:ZooKeeperConnection Watcher:127.0.0.1:58884 got event WatchedEvent state:SyncConnected type:None path:null path:null type:None
   [junit4]   2> 2275510 INFO  (TEST-PeerSyncReplicationTest.test-seed#[FE4650164CE8996B]) [    ] o.a.s.c.c.ConnectionManager Client is connected to ZooKeeper
   [junit4]   2> 2275510 INFO  (TEST-PeerSyncReplicationTest.test-seed#[FE4650164CE8996B]) [    ] o.a.s.c.c.SolrZkClient Using default ZkACLProvider
   [junit4]   2> 2275512 INFO  (TEST-PeerSyncReplicationTest.test-seed#[FE4650164CE8996B]) [n:127.0.0.1:58914_    ] o.a.s.c.ZkController Added new OnReconnect listener org.apache.solr.cloud.ZkController$6@2327d3b6
   [junit4]   2> 2275512 INFO  (TEST-PeerSyncReplicationTest.test-seed#[FE4650164CE8996B]) [n:127.0.0.1:58914_    ] o.a.s.c.c.ConnectionManager Waiting for client to connect to ZooKeeper
   [junit4]   2> 2275514 INFO  (zkCallback-2598-thread-1-processing-n:127.0.0.1:58914_) [n:127.0.0.1:58914_    ] o.a.s.c.c.ConnectionManager Watcher org.apache.solr.common.cloud.ConnectionManager@1a7937dd name:ZooKeeperConnection Watcher:127.0.0.1:58884/solr got event WatchedEvent state:SyncConnected type:None path:null path:null type:None
   [junit4]   2> 2275514 INFO  (TEST-PeerSyncReplicationTest.test-seed#[FE4650164CE8996B]) [n:127.0.0.1:58914_    ] o.a.s.c.c.ConnectionManager Client is connected to ZooKeeper
   [junit4]   2> 2275518 INFO  (TEST-PeerSyncReplicationTest.test-seed#[FE4650164CE8996B]) [n:127.0.0.1:58914_    ] o.a.s.c.c.ZkStateReader Updating cluster state from ZooKeeper... 
   [junit4]   2> 2276521 INFO  (TEST-PeerSyncReplicationTest.test-seed#[FE4650164CE8996B]) [n:127.0.0.1:58914_    ] o.a.s.c.ZkController Register node as live in ZooKeeper:/live_nodes/127.0.0.1:58914_
   [junit4]   2> 2276522 INFO  (TEST-PeerSyncReplicationTest.test-seed#[FE4650164CE8996B]) [n:127.0.0.1:58914_    ] o.a.s.c.c.SolrZkClient makePath: /live_nodes/127.0.0.1:58914_
   [junit4]   2> 2276522 INFO  (zkCallback-2598-thread-1-processing-n:127.0.0.1:58914_) [n:127.0.0.1:58914_    ] o.a.s.c.c.ZkStateReader A live node change: [WatchedEvent state:SyncConnected type:NodeChildrenChanged path:/live_nodes], has occurred - updating... (live nodes size: [1])
   [junit4]   2> 2276522 INFO  (zkCallback-2591-thread-1-processing-n:127.0.0.1:58895_) [n:127.0.0.1:58895_    ] o.a.s.c.c.ZkStateReader A live node change: [WatchedEvent state:SyncConnected type:NodeChildrenChanged path:/live_nodes], has occurred - updating... (live nodes size: [1])
   [junit4]   2> 2276522 INFO  (zkCallback-2593-thread-1) [    ] o.a.s.c.c.ZkStateReader A live node change: [WatchedEvent state:SyncConnected type:NodeChildrenChanged path:/live_nodes], has occurred - updating... (live nodes size: [1])
   [junit4]   2> 2276524 INFO  (TEST-PeerSyncReplicationTest.test-seed#[FE4650164CE8996B]) [n:127.0.0.1:58914_    ] o.a.s.c.Overseer Overseer (id=null) closing
   [junit4]   2> 2276524 INFO  (TEST-PeerSyncReplicationTest.test-seed#[FE4650164CE8996B]) [n:127.0.0.1:58914_    ] o.a.s.c.LeaderElector Joined leadership election with path: /overseer_elect/election/98860518353338376-127.0.0.1:58914_-n_0000000001
   [junit4]   2> 2276524 INFO  (TEST-PeerSyncReplicationTest.test-seed#[FE4650164CE8996B]) [n:127.0.0.1:58914_    ] o.a.s.c.LeaderElector Watching path /overseer_elect/election/98860518353338372-127.0.0.1:58895_-n_0000000000 to know if I could be the leader
   [junit4]   2> 2276529 INFO  (TEST-PeerSyncReplicationTest.test-seed#[FE4650164CE8996B]) [n:127.0.0.1:58914_    ] o.a.s.c.CoreContainer Security conf doesn't exist. Skipping setup for authorization module.
   [junit4]   2> 2276529 INFO  (TEST-PeerSyncReplicationTest.test-seed#[FE4650164CE8996B]) [n:127.0.0.1:58914_    ] o.a.s.c.CoreContainer No authentication plugin used.
   [junit4]   2> 2276530 INFO  (TEST-PeerSyncReplicationTest.test-seed#[FE4650164CE8996B]) [n:127.0.0.1:58914_    ] o.a.s.c.CorePropertiesLocator Looking for core definitions underneath C:\Users\jenkins\workspace\Lucene-Solr-5.5-Windows\solr\build\solr-core\test\J0\temp\solr.cloud.PeerSyncReplicationTest_FE4650164CE8996B-001\shard-1-001\cores
   [junit4]   2> 2276531 INFO  (TEST-PeerSyncReplicationTest.test-seed#[FE4650164CE8996B]) [n:127.0.0.1:58914_    ] o.a.s.c.CoreDescriptor Created CoreDescriptor: {name=collection1, dataDir=data\, coreNodeName=, loadOnStartup=true, collection=collection1, configSetProperties=configsetprops.json, config=solrconfig.xml, shard=, transient=false, schema=schema.xml}
   [junit4]   2> 2276531 INFO  (TEST-PeerSyncReplicationTest.test-seed#[FE4650164CE8996B]) [n:127.0.0.1:58914_    ] o.a.s.c.CorePropertiesLocator Found core collection1 in C:\Users\jenkins\workspace\Lucene-Solr-5.5-Windows\solr\build\solr-core\test\J0\temp\solr.cloud.PeerSyncReplicationTest_FE4650164CE8996B-001\shard-1-001\cores\collection1
   [junit4]   2> 2276531 INFO  (TEST-PeerSyncReplicationTest.test-seed#[FE4650164CE8996B]) [n:127.0.0.1:58914_    ] o.a.s.c.CorePropertiesLocator Found 1 core definitions
   [junit4]   2> 2276531 INFO  (TEST-PeerSyncReplicationTest.test-seed#[FE4650164CE8996B]) [n:127.0.0.1:58914_    ] o.a.s.s.SolrDispatchFilter user.dir=C:\Users\jenkins\workspace\Lucene-Solr-5.5-Windows\solr\build\solr-core\test\J0
   [junit4]   2> 2276531 INFO  (TEST-PeerSyncReplicationTest.test-seed#[FE4650164CE8996B]) [n:127.0.0.1:58914_    ] o.a.s.s.SolrDispatchFilter SolrDispatchFilter.init() done
   [junit4]   2> 2276532 INFO  (coreLoadExecutor-8810-thread-1-processing-n:127.0.0.1:58914_) [n:127.0.0.1:58914_ c:collection1   x:collection1] o.a.s.c.ZkController publishing state=down
   [junit4]   2> 2276532 INFO  (coreLoadExecutor-8810-thread-1-processing-n:127.0.0.1:58914_) [n:127.0.0.1:58914_ c:collection1   x:collection1] o.a.s.c.ZkController numShards not found on descriptor - reading it from system property
   [junit4]   2> 2276532 INFO  (coreLoadExecutor-8810-thread-1-processing-n:127.0.0.1:58914_) [n:127.0.0.1:58914_ c:collection1   x:collection1] o.a.s.c.ZkController Collection collection1 not visible yet, but flagging it so a watch is registered when it becomes visible
   [junit4]   2> 2276532 INFO  (coreLoadExecutor-8810-thread-1-processing-n:127.0.0.1:58914_) [n:127.0.0.1:58914_ c:collection1   x:collection1] o.a.s.c.c.ZkStateReader addZkWatch [collection1]
   [junit4]   2> 2276532 INFO  (OverseerStateUpdate-98860518353338372-127.0.0.1:58895_-n_0000000000) [n:127.0.0.1:58895_    ] o.a.s.c.Overseer processMessage: queueSize: 1, message = {
   [junit4]   2>   "shard":null,
   [junit4]   2>   "base_url":"http://127.0.0.1:58914",
   [junit4]   2>   "collection":"collection1",
   [junit4]   2>   "node_name":"127.0.0.1:58914_",
   [junit4]   2>   "core":"collection1",
   [junit4]   2>   "numShards":"1",
   [junit4]   2>   "state":"down",
   [junit4]   2>   "roles":null,
   [junit4]   2>   "operation":"state"} current state version: 3
   [junit4]   2> 2276533 INFO  (coreLoadExecutor-8810-thread-1-processing-n:127.0.0.1:58914_) [n:127.0.0.1:58914_ c:collection1   x:collection1] o.a.s.c.c.ZkStateReader Deleting data for [collection1]
   [junit4]   2> 2276533 INFO  (OverseerStateUpdate-98860518353338372-127.0.0.1:58895_-n_0000000000) [n:127.0.0.1:58895_    ] o.a.s.c.o.ReplicaMutator Update state numShards=1 message={
   [junit4]   2>   "shard":null,
   [junit4]   2>   "base_url":"http://127.0.0.1:58914",
   [junit4]   2>   "collection":"collection1",
   [junit4]   2>   "node_name":"127.0.0.1:58914_",
   [junit4]   2>   "core":"collection1",
   [junit4]   2>   "numShards":"1",
   [junit4]   2>   "state":"down",
   [junit4]   2>   "roles":null,
   [junit4]   2>   "operation":"state"}
   [junit4]   2> 2276533 INFO  (OverseerStateUpdate-98860518353338372-127.0.0.1:58895_-n_0000000000) [n:127.0.0.1:58895_    ] o.a.s.c.o.ClusterStateMutator building a new cName: collection1
   [junit4]   2> 2276533 INFO  (OverseerStateUpdate-98860518353338372-127.0.0.1:58895_-n_0000000000) [n:127.0.0.1:58895_    ] o.a.s.c.o.ReplicaMutator Assigning new node to shard shard=shard1
   [junit4]   2> 2276533 INFO  (coreLoadExecutor-8810-thread-1-processing-n:127.0.0.1:58914_) [n:127.0.0.1:58914_ c:collection1   x:collection1] o.a.s.c.ZkController look for our core node name
   [junit4]   2> 2276635 INFO  (zkCallback-2593-thread-1) [    ] o.a.s.c.c.ZkStateReader A cluster state change: [WatchedEvent state:SyncConnected type:NodeDataChanged path:/clusterstate.json], has occurred - updating... (live nodes size: [2])
   [junit4]   2> 2276635 INFO  (zkCallback-2591-thread-1-processing-n:127.0.0.1:58895_) [n:127.0.0.1:58895_    ] o.a.s.c.c.ZkStateReader A cluster state change: [WatchedEvent state:SyncConnected type:NodeDataChanged path:/clusterstate.json], has occurred - updating... (live nodes size: [2])
   [junit4]   2> 2276635 INFO  (zkCallback-2598-thread-1-processing-n:127.0.0.1:58914_) [n:127.0.0.1:58914_    ] o.a.s.c.c.ZkStateReader A cluster state change: [WatchedEvent state:SyncConnected type:NodeDataChanged path:/clusterstate.json], has occurred - updating... (live nodes size: [2])
   [junit4]   2> 2277534 INFO  (coreLoadExecutor-8810-thread-1-processing-n:127.0.0.1:58914_) [n:127.0.0.1:58914_ c:collection1   x:collection1] o.a.s.c.ZkController waiting to find shard id in clusterstate for collection1
   [junit4]   2> 2277534 INFO  (coreLoadExecutor-8810-thread-1-processing-n:127.0.0.1:58914_) [n:127.0.0.1:58914_ c:collection1   x:collection1] o.a.s.c.ZkController Check for collection zkNode:collection1
   [junit4]   2> 2277534 INFO  (coreLoadExecutor-8810-thread-1-processing-n:127.0.0.1:58914_) [n:127.0.0.1:58914_ c:collection1   x:collection1] o.a.s.c.ZkController Collection zkNode exists
   [junit4]   2> 2277534 INFO  (coreLoadExecutor-8810-thread-1-processing-n:127.0.0.1:58914_) [n:127.0.0.1:58914_ c:collection1   x:collection1] o.a.s.c.c.ZkStateReader Load collection config from: [/collections/collection1]
   [junit4]   2> 2277535 INFO  (coreLoadExecutor-8810-thread-1-processing-n:127.0.0.1:58914_) [n:127.0.0.1:58914_ c:collection1   x:collection1] o.a.s.c.c.ZkStateReader path=[/collections/collection1] [configName]=[conf1] specified config exists in ZooKeeper
   [junit4]   2> 2277535 INFO  (coreLoadExecutor-8810-thread-1-processing-n:127.0.0.1:58914_) [n:127.0.0.1:58914_ c:collection1   x:collection1] o.a.s.c.SolrResourceLoader new SolrResourceLoader for directory: 'C:\Users\jenkins\workspace\Lucene-Solr-5.5-Windows\solr\build\solr-core\test\J0\temp\solr.cloud.PeerSyncReplicationTest_FE4650164CE8996B-001\shard-1-001\cores\collection1'
   [junit4]   2> 2277535 INFO  (coreLoadExecutor-8810-thread-1-processing-n:127.0.0.1:58914_) [n:127.0.0.1:58914_ c:collection1   x:collection1] o.a.s.c.SolrResourceLoader JNDI not configured for solr (NoInitialContextEx)
   [junit4]   2> 2277535 INFO  (coreLoadExecutor-8810-thread-1-processing-n:127.0.0.1:58914_) [n:127.0.0.1:58914_ c:collection1   x:collection1] o.a.s.c.SolrResourceLoader solr home defaulted to 'solr/' (could not find system property or JNDI)
   [junit4]   2> 2277537 INFO  (coreLoadExecutor-8810-thread-1-processing-n:127.0.0.1:58914_) [n:127.0.0.1:58914_ c:collection1   x:collection1] o.a.s.c.Config loaded config solrconfig.xml with version 0 
   [junit4]   2> 2277545 INFO  (coreLoadExecutor-8810-thread-1-processing-n:127.0.0.1:58914_) [n:127.0.0.1:58914_ c:collection1   x:collection1] o.a.s.c.SolrConfig current version of requestparams : -1
   [junit4]   2> 2277556 INFO  (coreLoadExecutor-8810-thread-1-processing-n:127.0.0.1:58914_) [n:127.0.0.1:58914_ c:collection1   x:collection1] o.a.s.c.SolrConfig Using Lucene MatchVersion: 5.5.5
   [junit4]   2> 2277577 INFO  (coreLoadExecutor-8810-thread-1-processing-n:127.0.0.1:58914_) [n:127.0.0.1:58914_ c:collection1   x:collection1] o.a.s.c.SolrConfig Loaded SolrConfig: solrconfig.xml
   [junit4]   2> 2277584 INFO  (coreLoadExecutor-8810-thread-1-processing-n:127.0.0.1:58914_) [n:127.0.0.1:58914_ c:collection1   x:collection1] o.a.s.s.IndexSchema [collection1] Schema name=test
   [junit4]   2> 2277789 INFO  (coreLoadExecutor-8810-thread-1-processing-n:127.0.0.1:58914_) [n:127.0.0.1:58914_ c:collection1   x:collection1] o.a.s.s.OpenExchangeRatesOrgProvider Initialized with rates=open-exchange-rates.json, refreshInterval=1440.
   [junit4]   2> 2277796 INFO  (coreLoadExecutor-8810-thread-1-processing-n:127.0.0.1:58914_) [n:127.0.0.1:58914_ c:collection1   x:collection1] o.a.s.s.IndexSchema default search field in schema is text
   [junit4]   2> 2277798 INFO  (coreLoadExecutor-8810-thread-1-processing-n:127.0.0.1:58914_) [n:127.0.0.1:58914_ c:collection1   x:collection1] o.a.s.s.IndexSchema unique key field: id
   [junit4]   2> 2277805 INFO  (coreLoadExecutor-8810-thread-1-processing-n:127.0.0.1:58914_) [n:127.0.0.1:58914_ c:collection1   x:collection1] o.a.s.s.FileExchangeRateProvider Reloading exchange rates from file currency.xml
   [junit4]   2> 2277808 INFO  (coreLoadExecutor-8810-thread-1-processing-n:127.0.0.1:58914_) [n:127.0.0.1:58914_ c:collection1   x:collection1] o.a.s.s.FileExchangeRateProvider Reloading exchange rates from file currency.xml
   [junit4]   2> 2277810 INFO  (coreLoadExecutor-8810-thread-1-processing-n:127.0.0.1:58914_) [n:127.0.0.1:58914_ c:collection1   x:collection1] o.a.s.s.OpenExchangeRatesOrgProvider Reloading exchange rates from open-exchange-rates.json
   [junit4]   2> 2277811 INFO  (coreLoadExecutor-8810-thread-1-processing-n:127.0.0.1:58914_) [n:127.0.0.1:58914_ c:collection1   x:collection1] o.a.s.s.OpenExchangeRatesOrgProvider Reloading exchange rates from open-exchange-rates.json
   [junit4]   2> 2277814 INFO  (coreLoadExecutor-8810-thread-1-processing-n:127.0.0.1:58914_) [n:127.0.0.1:58914_ 

[...truncated too long message...]

e(ManagedIndexSchemaFactory.java:47)
   [junit4]   2> 	at org.apache.solr.schema.IndexSchemaFactory.buildIndexSchema(IndexSchemaFactory.java:70)
   [junit4]   2> 	at org.apache.solr.core.ConfigSetService.createIndexSchema(ConfigSetService.java:108)
   [junit4]   2> 	at org.apache.solr.core.ConfigSetService.getConfig(ConfigSetService.java:79)
   [junit4]   2> 	at org.apache.solr.core.CoreContainer.reload(CoreContainer.java:920)
   [junit4]   2> 	at org.apache.solr.core.SolrCore$11.run(SolrCore.java:2623)
   [junit4]   2> 	at org.apache.solr.cloud.ZkController$5.run(ZkController.java:2480)
   [junit4]   2> 2851345 WARN  (Thread-6836) [n:127.0.0.1:62627_solr    ] o.a.s.c.ZkController listener throws error
   [junit4]   2> org.apache.solr.common.SolrException: Unable to reload core [testschemaapi_shard1_replica2]
   [junit4]   2> 	at org.apache.solr.core.CoreContainer.reload(CoreContainer.java:927)
   [junit4]   2> 	at org.apache.solr.core.SolrCore$11.run(SolrCore.java:2623)
   [junit4]   2> 	at org.apache.solr.cloud.ZkController$5.run(ZkController.java:2480)
   [junit4]   2> Caused by: org.apache.solr.common.SolrException: Could not load conf for core testschemaapi_shard1_replica2: Error attempting to access /configs/conf1/managed-schema
   [junit4]   2> 	at org.apache.solr.core.ConfigSetService.getConfig(ConfigSetService.java:84)
   [junit4]   2> 	at org.apache.solr.core.CoreContainer.reload(CoreContainer.java:920)
   [junit4]   2> 	... 2 more
   [junit4]   2> Caused by: org.apache.solr.common.SolrException: Error attempting to access /configs/conf1/managed-schema
   [junit4]   2> 	at org.apache.solr.schema.ManagedIndexSchemaFactory.create(ManagedIndexSchemaFactory.java:143)
   [junit4]   2> 	at org.apache.solr.schema.ManagedIndexSchemaFactory.create(ManagedIndexSchemaFactory.java:47)
   [junit4]   2> 	at org.apache.solr.schema.IndexSchemaFactory.buildIndexSchema(IndexSchemaFactory.java:70)
   [junit4]   2> 	at org.apache.solr.core.ConfigSetService.createIndexSchema(ConfigSetService.java:108)
   [junit4]   2> 	at org.apache.solr.core.ConfigSetService.getConfig(ConfigSetService.java:79)
   [junit4]   2> 	... 3 more
   [junit4]   2> Caused by: org.apache.zookeeper.KeeperException$SessionExpiredException: KeeperErrorCode = Session expired for /configs/conf1/managed-schema
   [junit4]   2> 	at org.apache.zookeeper.KeeperException.create(KeeperException.java:127)
   [junit4]   2> 	at org.apache.zookeeper.KeeperException.create(KeeperException.java:51)
   [junit4]   2> 	at org.apache.zookeeper.ZooKeeper.getData(ZooKeeper.java:1155)
   [junit4]   2> 	at org.apache.solr.common.cloud.SolrZkClient$7.execute(SolrZkClient.java:345)
   [junit4]   2> 	at org.apache.solr.common.cloud.SolrZkClient$7.execute(SolrZkClient.java:342)
   [junit4]   2> 	at org.apache.solr.common.cloud.ZkCmdExecutor.retryOperation(ZkCmdExecutor.java:60)
   [junit4]   2> 	at org.apache.solr.common.cloud.SolrZkClient.getData(SolrZkClient.java:342)
   [junit4]   2> 	at org.apache.solr.schema.ManagedIndexSchemaFactory.create(ManagedIndexSchemaFactory.java:128)
   [junit4]   2> 	... 7 more
   [junit4]   2> Oct 20, 2017 9:39:34 AM com.carrotsearch.randomizedtesting.ThreadLeakControl checkThreadLeaks
   [junit4]   2> WARNING: Will linger awaiting termination of 2 leaked thread(s).
   [junit4]   2> NOTE: test params are: codec=CheapBastard, sim=DefaultSimilarity, locale=fr-BE, timezone=America/Rainy_River
   [junit4]   2> NOTE: Windows 8.1 6.3 amd64/Oracle Corporation 1.7.0_80 (64-bit)/cpus=3,threads=1,free=200166224,total=405495808
   [junit4]   2> NOTE: All tests run in this JVM: [TestRTGBase, BlockDirectoryTest, VMParamsZkACLAndCredentialsProvidersTest, DistribCursorPagingTest, TestCrossCoreJoin, TestBinaryField, DistributedIntervalFacetingTest, TestConfigSetProperties, TestMiniSolrCloudCluster, DistributedQueryComponentOptimizationTest, RemoteQueryErrorTest, SuggesterTSTTest, TestSortingResponseWriter, HttpPartitionTest, CopyFieldTest, MigrateRouteKeyTest, TestManagedResourceStorage, UpdateRequestProcessorFactoryTest, BasicAuthIntegrationTest, DirectUpdateHandlerOptimizeTest, BasicDistributedZk2Test, TestMacros, DistributedFacetPivotLargeTest, TestLMJelinekMercerSimilarityFactory, LukeRequestHandlerTest, CollectionsAPIDistributedZkTest, TestRequestForwarding, SuggesterWFSTTest, TermVectorComponentTest, TestCustomSort, HdfsBasicDistributedZkTest, SecurityConfHandlerTest, TestRangeQuery, AddBlockUpdateTest, SparseHLLTest, TestNoOpRegenerator, TestCopyFieldCollectionResource, AliasIntegrationTest, SuggesterTest, LeaderElectionIntegrationTest, TestCSVResponseWriter, ShardRoutingCustomTest, DistanceUnitsTest, SpellPossibilityIteratorTest, TestCryptoKeys, TestStressRecovery, RestartWhileUpdatingTest, AsyncCallRequestStatusResponseTest, TestJoin, TestPerFieldSimilarity, TestTestInjection, NumericFieldsTest, HLLSerializationTest, CurrencyFieldOpenExchangeTest, BasicZkTest, DeleteLastCustomShardedReplicaTest, CoreMergeIndexesAdminHandlerTest, TestBadConfig, FieldAnalysisRequestHandlerTest, TestRecovery, ResponseLogComponentTest, DocExpirationUpdateProcessorFactoryTest, TestTrie, TestIndexingPerformance, TestReload, TestSolrIndexConfig, TestInfoStreamLogging, TestDistributedStatsComponentCardinality, ShowFileRequestHandlerTest, NotRequiredUniqueKeyTest, TestCloudManagedSchemaConcurrent, TestQuerySenderListener, SpellCheckCollatorTest, BigEndianAscendingWordSerializerTest, TestReqParamsAPI, SolrIndexSplitterTest, BadIndexSchemaTest, TestReversedWildcardFilterFactory, DirectSolrConnectionTest, FacetPivotSmallTest, CloudMLTQParserTest, CollectionsAPIAsyncDistributedZkTest, DistribJoinFromCollectionTest, TestDownShardTolerantSearch, TestRawTransformer, OpenCloseCoreStressTest, TestSolr4Spatial2, TestReloadDeadlock, BasicFunctionalityTest, TestSolrCoreProperties, TestCollationFieldDocValues, WordBreakSolrSpellCheckerTest, TestCharFilters, HdfsSyncSliceTest, SortByFunctionTest, TestAuthorizationFramework, TestReRankQParserPlugin, TestAnalyzeInfixSuggestions, TestStressLiveNodes, HighlighterConfigTest, TestDistributedMissingSort, TestRealTimeGet, ZkNodePropsTest, ResponseHeaderTest, TestValueSourceCache, HdfsRecoveryZkTest, TestRandomCollapseQParserPlugin, TestCollapseQParserPlugin, OutOfBoxZkACLAndCredentialsProvidersTest, TestFileDictionaryLookup, DirectoryFactoryTest, TestOnReconnectListenerSupport, TestRTimerTree, SolrCoreCheckLockOnStartupTest, CachingDirectoryFactoryTest, TestStressUserVersions, CursorMarkTest, CacheHeaderTest, ZkStateReaderTest, OverseerStatusTest, ChaosMonkeySafeLeaderTest, DateFieldTest, SharedFSAutoReplicaFailoverUtilsTest, UniqFieldsUpdateProcessorFactoryTest, TestJettySolrRunner, DistributedFacetPivotSmallAdvancedTest, ConvertedLegacyTest, RequestLoggingTest, SuggestComponentContextFilterQueryTest, TestNamedUpdateProcessors, TestRuleBasedAuthorizationPlugin, VersionInfoTest, TestShardHandlerFactory, TestManagedSchemaFieldTypeResource, TestFieldTypeCollectionResource, SpellingQueryConverterTest, JavabinLoaderTest, ZkSolrClientTest, AutoCommitTest, TestFaceting, TermVectorComponentDistributedTest, TestCoreContainer, TestSolr4Spatial, StatsComponentTest, SoftAutoCommitTest, CurrencyFieldXmlFileTest, TestCoreDiscovery, AnalysisAfterCoreReloadTest, SolrRequestParserTest, TestFoldingMultitermQuery, DocValuesTest, TestSolrQueryParser, LoggingHandlerTest, SolrPluginUtilsTest, JSONWriterTest, TestAnalyzedSuggestions, BinaryUpdateRequestHandlerTest, TestPHPSerializedResponseWriter, TestComponentsName, TestBinaryResponseWriter, TestQuerySenderNoQuery, SolrIndexConfigTest, BadComponentTest, TestSolrDeletionPolicy2, MultiTermTest, SampleTest, TestDocSet, TestSearchPerf, MinimalSchemaTest, OutputWriterTest, TestFuzzyAnalyzedSuggestions, ExternalFileFieldSortTest, TestCodecSupport, TestDFRSimilarityFactory, TestBM25SimilarityFactory, ResourceLoaderTest, ScriptEngineTest, URLClassifyProcessorTest, DateMathParserTest, TestSystemIdResolver, TestSuggestSpellingConverter, RAMDirectoryFactoryTest, TestSolrJ, TestUtils, SystemInfoHandlerTest, FileUtilsTest, DistributedMLTComponentTest, TestHighlightDedupGrouping, TestSimpleTrackingShardHandler, TestEmbeddedSolrServerConstructors, ActionThrottleTest, CloudExitableDirectoryReaderTest, CollectionsAPISolrJTest, DeleteReplicaTest, DeleteShardTest, DistributedQueueTest, DistributedVersionInfoTest, LeaderFailoverAfterPartitionTest, LeaderInitiatedRecoveryOnCommitTest, SSLMigrationTest, SaslZkACLProviderTest, ShardSplitTest, TestLeaderInitiatedRecoveryThread, TestReplicaProperties, TestShortCircuitedRequests, ExitableDirectoryReaderTest, HdfsDirectoryFactoryTest, QueryResultKeyTest, TestConfigOverlay, TestConfigSets, TestDynamicLoading, TestImplicitCoreProperties, TestInitParams, TestNRTOpen, TestSolrDynamicMBean, TestConfigReload, CoreAdminCreateDiscoverTest, CoreAdminRequestStatusTest, InfoHandlerTest, SegmentsInfoRequestHandlerTest, DistributedDebugComponentTest, DistributedExpandComponentTest, DistributedFacetPivotLongTailTest, DistributedFacetPivotSmallTest, DistributedFacetPivotWhiteBoxTest, TestPivotHelperCode, WrapperMergePolicyFactoryTest, CheckHdfsIndexTest, TestIntervalFaceting, TestCustomDocTransformer, TestRawResponseWriter, TestManagedResource, TestBulkSchemaAPI, TestClassNameShortening, TestDefaultSearchFieldResource, TestDynamicFieldCollectionResource, TestDynamicFieldResource, TestFieldCollectionResource, TestManagedSchemaDynamicFieldResource, TestManagedSchemaFieldResource, TestSchemaNameResource, TestSchemaResource, TestSchemaSimilarityResource, TestSerializedLuceneMatchVersion, TestSolrQueryParserDefaultOperatorResource, TestSolrQueryParserResource, TestManagedStopFilterFactory, TestManagedSynonymFilterFactory, BadCopyFieldTest, DateRangeFieldTest, EnumFieldTest, SpatialRPTFieldTypeTest, TestCloudManagedSchema, TestManagedSchema, TestManagedSchemaAPI]
   [junit4] Completed [524/575 (2!)] on J1 in 13.92s, 1 test, 1 error <<< FAILURES!

[...truncated 56817 lines...]

Mime
View raw message