lucene-dev mailing list archives

Site index · List index
Message view « Date » · « Thread »
Top « Date » · « Thread »
From Apache Jenkins Server <jenk...@builds.apache.org>
Subject [JENKINS] Lucene-Solr-Tests-7.x - Build # 195 - Failure
Date Fri, 27 Oct 2017 11:46:14 GMT
Build: https://builds.apache.org/job/Lucene-Solr-Tests-7.x/195/

4 tests failed.
FAILED:  org.apache.solr.cloud.PeerSyncReplicationTest.test

Error Message:
expected:<0> but was:<1>

Stack Trace:
java.lang.AssertionError: expected:<0> but was:<1>
	at __randomizedtesting.SeedInfo.seed([F937FCE697463010:7163C33C39BA5DE8]:0)
	at org.junit.Assert.fail(Assert.java:93)
	at org.junit.Assert.failNotEquals(Assert.java:647)
	at org.junit.Assert.assertEquals(Assert.java:128)
	at org.junit.Assert.assertEquals(Assert.java:472)
	at org.junit.Assert.assertEquals(Assert.java:456)
	at org.apache.solr.cloud.PeerSyncReplicationTest.test(PeerSyncReplicationTest.java:202)
	at sun.reflect.NativeMethodAccessorImpl.invoke0(Native Method)
	at sun.reflect.NativeMethodAccessorImpl.invoke(NativeMethodAccessorImpl.java:62)
	at sun.reflect.DelegatingMethodAccessorImpl.invoke(DelegatingMethodAccessorImpl.java:43)
	at java.lang.reflect.Method.invoke(Method.java:498)
	at com.carrotsearch.randomizedtesting.RandomizedRunner.invoke(RandomizedRunner.java:1737)
	at com.carrotsearch.randomizedtesting.RandomizedRunner$8.evaluate(RandomizedRunner.java:934)
	at com.carrotsearch.randomizedtesting.RandomizedRunner$9.evaluate(RandomizedRunner.java:970)
	at com.carrotsearch.randomizedtesting.RandomizedRunner$10.evaluate(RandomizedRunner.java:984)
	at org.apache.solr.BaseDistributedSearchTestCase$ShardsRepeatRule$ShardsFixedStatement.callStatement(BaseDistributedSearchTestCase.java:993)
	at org.apache.solr.BaseDistributedSearchTestCase$ShardsRepeatRule$ShardsStatement.evaluate(BaseDistributedSearchTestCase.java:968)
	at com.carrotsearch.randomizedtesting.rules.SystemPropertiesRestoreRule$1.evaluate(SystemPropertiesRestoreRule.java:57)
	at org.apache.lucene.util.TestRuleSetupTeardownChained$1.evaluate(TestRuleSetupTeardownChained.java:49)
	at org.apache.lucene.util.AbstractBeforeAfterRule$1.evaluate(AbstractBeforeAfterRule.java:45)
	at org.apache.lucene.util.TestRuleThreadAndTestName$1.evaluate(TestRuleThreadAndTestName.java:48)
	at org.apache.lucene.util.TestRuleIgnoreAfterMaxFailures$1.evaluate(TestRuleIgnoreAfterMaxFailures.java:64)
	at org.apache.lucene.util.TestRuleMarkFailure$1.evaluate(TestRuleMarkFailure.java:47)
	at com.carrotsearch.randomizedtesting.rules.StatementAdapter.evaluate(StatementAdapter.java:36)
	at com.carrotsearch.randomizedtesting.ThreadLeakControl$StatementRunner.run(ThreadLeakControl.java:368)
	at com.carrotsearch.randomizedtesting.ThreadLeakControl.forkTimeoutingTask(ThreadLeakControl.java:817)
	at com.carrotsearch.randomizedtesting.ThreadLeakControl$3.evaluate(ThreadLeakControl.java:468)
	at com.carrotsearch.randomizedtesting.RandomizedRunner.runSingleTest(RandomizedRunner.java:943)
	at com.carrotsearch.randomizedtesting.RandomizedRunner$5.evaluate(RandomizedRunner.java:829)
	at com.carrotsearch.randomizedtesting.RandomizedRunner$6.evaluate(RandomizedRunner.java:879)
	at com.carrotsearch.randomizedtesting.RandomizedRunner$7.evaluate(RandomizedRunner.java:890)
	at com.carrotsearch.randomizedtesting.rules.StatementAdapter.evaluate(StatementAdapter.java:36)
	at com.carrotsearch.randomizedtesting.rules.SystemPropertiesRestoreRule$1.evaluate(SystemPropertiesRestoreRule.java:57)
	at org.apache.lucene.util.AbstractBeforeAfterRule$1.evaluate(AbstractBeforeAfterRule.java:45)
	at com.carrotsearch.randomizedtesting.rules.StatementAdapter.evaluate(StatementAdapter.java:36)
	at org.apache.lucene.util.TestRuleStoreClassName$1.evaluate(TestRuleStoreClassName.java:41)
	at com.carrotsearch.randomizedtesting.rules.NoShadowingOrOverridesOnMethodsRule$1.evaluate(NoShadowingOrOverridesOnMethodsRule.java:40)
	at com.carrotsearch.randomizedtesting.rules.NoShadowingOrOverridesOnMethodsRule$1.evaluate(NoShadowingOrOverridesOnMethodsRule.java:40)
	at com.carrotsearch.randomizedtesting.rules.StatementAdapter.evaluate(StatementAdapter.java:36)
	at com.carrotsearch.randomizedtesting.rules.StatementAdapter.evaluate(StatementAdapter.java:36)
	at com.carrotsearch.randomizedtesting.rules.StatementAdapter.evaluate(StatementAdapter.java:36)
	at org.apache.lucene.util.TestRuleAssertionsRequired$1.evaluate(TestRuleAssertionsRequired.java:53)
	at org.apache.lucene.util.TestRuleMarkFailure$1.evaluate(TestRuleMarkFailure.java:47)
	at org.apache.lucene.util.TestRuleIgnoreAfterMaxFailures$1.evaluate(TestRuleIgnoreAfterMaxFailures.java:64)
	at org.apache.lucene.util.TestRuleIgnoreTestSuites$1.evaluate(TestRuleIgnoreTestSuites.java:54)
	at com.carrotsearch.randomizedtesting.rules.StatementAdapter.evaluate(StatementAdapter.java:36)
	at com.carrotsearch.randomizedtesting.ThreadLeakControl$StatementRunner.run(ThreadLeakControl.java:368)
	at java.lang.Thread.run(Thread.java:748)


FAILED:  org.apache.solr.schema.TestCloudSchemaless.test

Error Message:


Stack Trace:
java.lang.NullPointerException
	at __randomizedtesting.SeedInfo.seed([F937FCE697463010:7163C33C39BA5DE8]:0)
	at org.apache.solr.client.solrj.impl.CloudSolrClient.requestWithRetryOnStaleState(CloudSolrClient.java:925)
	at org.apache.solr.client.solrj.impl.CloudSolrClient.request(CloudSolrClient.java:808)
	at org.apache.solr.client.solrj.SolrRequest.process(SolrRequest.java:178)
	at org.apache.solr.client.solrj.SolrClient.add(SolrClient.java:106)
	at org.apache.solr.client.solrj.SolrClient.add(SolrClient.java:71)
	at org.apache.solr.client.solrj.SolrClient.add(SolrClient.java:85)
	at org.apache.solr.schema.TestCloudSchemaless.test(TestCloudSchemaless.java:171)
	at sun.reflect.NativeMethodAccessorImpl.invoke0(Native Method)
	at sun.reflect.NativeMethodAccessorImpl.invoke(NativeMethodAccessorImpl.java:62)
	at sun.reflect.DelegatingMethodAccessorImpl.invoke(DelegatingMethodAccessorImpl.java:43)
	at java.lang.reflect.Method.invoke(Method.java:498)
	at com.carrotsearch.randomizedtesting.RandomizedRunner.invoke(RandomizedRunner.java:1737)
	at com.carrotsearch.randomizedtesting.RandomizedRunner$8.evaluate(RandomizedRunner.java:934)
	at com.carrotsearch.randomizedtesting.RandomizedRunner$9.evaluate(RandomizedRunner.java:970)
	at com.carrotsearch.randomizedtesting.RandomizedRunner$10.evaluate(RandomizedRunner.java:984)
	at org.apache.solr.BaseDistributedSearchTestCase$ShardsRepeatRule$ShardsFixedStatement.callStatement(BaseDistributedSearchTestCase.java:993)
	at org.apache.solr.BaseDistributedSearchTestCase$ShardsRepeatRule$ShardsStatement.evaluate(BaseDistributedSearchTestCase.java:968)
	at com.carrotsearch.randomizedtesting.rules.SystemPropertiesRestoreRule$1.evaluate(SystemPropertiesRestoreRule.java:57)
	at org.apache.lucene.util.TestRuleSetupTeardownChained$1.evaluate(TestRuleSetupTeardownChained.java:49)
	at org.apache.lucene.util.AbstractBeforeAfterRule$1.evaluate(AbstractBeforeAfterRule.java:45)
	at org.apache.lucene.util.TestRuleThreadAndTestName$1.evaluate(TestRuleThreadAndTestName.java:48)
	at org.apache.lucene.util.TestRuleIgnoreAfterMaxFailures$1.evaluate(TestRuleIgnoreAfterMaxFailures.java:64)
	at org.apache.lucene.util.TestRuleMarkFailure$1.evaluate(TestRuleMarkFailure.java:47)
	at com.carrotsearch.randomizedtesting.rules.StatementAdapter.evaluate(StatementAdapter.java:36)
	at com.carrotsearch.randomizedtesting.ThreadLeakControl$StatementRunner.run(ThreadLeakControl.java:368)
	at com.carrotsearch.randomizedtesting.ThreadLeakControl.forkTimeoutingTask(ThreadLeakControl.java:817)
	at com.carrotsearch.randomizedtesting.ThreadLeakControl$3.evaluate(ThreadLeakControl.java:468)
	at com.carrotsearch.randomizedtesting.RandomizedRunner.runSingleTest(RandomizedRunner.java:943)
	at com.carrotsearch.randomizedtesting.RandomizedRunner$5.evaluate(RandomizedRunner.java:829)
	at com.carrotsearch.randomizedtesting.RandomizedRunner$6.evaluate(RandomizedRunner.java:879)
	at com.carrotsearch.randomizedtesting.RandomizedRunner$7.evaluate(RandomizedRunner.java:890)
	at com.carrotsearch.randomizedtesting.rules.StatementAdapter.evaluate(StatementAdapter.java:36)
	at com.carrotsearch.randomizedtesting.rules.SystemPropertiesRestoreRule$1.evaluate(SystemPropertiesRestoreRule.java:57)
	at org.apache.lucene.util.AbstractBeforeAfterRule$1.evaluate(AbstractBeforeAfterRule.java:45)
	at com.carrotsearch.randomizedtesting.rules.StatementAdapter.evaluate(StatementAdapter.java:36)
	at org.apache.lucene.util.TestRuleStoreClassName$1.evaluate(TestRuleStoreClassName.java:41)
	at com.carrotsearch.randomizedtesting.rules.NoShadowingOrOverridesOnMethodsRule$1.evaluate(NoShadowingOrOverridesOnMethodsRule.java:40)
	at com.carrotsearch.randomizedtesting.rules.NoShadowingOrOverridesOnMethodsRule$1.evaluate(NoShadowingOrOverridesOnMethodsRule.java:40)
	at com.carrotsearch.randomizedtesting.rules.StatementAdapter.evaluate(StatementAdapter.java:36)
	at com.carrotsearch.randomizedtesting.rules.StatementAdapter.evaluate(StatementAdapter.java:36)
	at com.carrotsearch.randomizedtesting.rules.StatementAdapter.evaluate(StatementAdapter.java:36)
	at org.apache.lucene.util.TestRuleAssertionsRequired$1.evaluate(TestRuleAssertionsRequired.java:53)
	at org.apache.lucene.util.TestRuleMarkFailure$1.evaluate(TestRuleMarkFailure.java:47)
	at org.apache.lucene.util.TestRuleIgnoreAfterMaxFailures$1.evaluate(TestRuleIgnoreAfterMaxFailures.java:64)
	at org.apache.lucene.util.TestRuleIgnoreTestSuites$1.evaluate(TestRuleIgnoreTestSuites.java:54)
	at com.carrotsearch.randomizedtesting.rules.StatementAdapter.evaluate(StatementAdapter.java:36)
	at com.carrotsearch.randomizedtesting.ThreadLeakControl$StatementRunner.run(ThreadLeakControl.java:368)
	at java.lang.Thread.run(Thread.java:748)


FAILED:  org.apache.solr.update.TestInPlaceUpdatesDistrib.test

Error Message:
inplace_updatable_float didn't match for replica at client: https://127.0.0.1:36896/_/collection1 expected:<102.0> but was:<101.0>

Stack Trace:
java.lang.AssertionError: inplace_updatable_float didn't match for replica at client: https://127.0.0.1:36896/_/collection1 expected:<102.0> but was:<101.0>
	at __randomizedtesting.SeedInfo.seed([F937FCE697463010:7163C33C39BA5DE8]:0)
	at org.junit.Assert.fail(Assert.java:93)
	at org.junit.Assert.failNotEquals(Assert.java:647)
	at org.junit.Assert.assertEquals(Assert.java:128)
	at org.apache.solr.update.TestInPlaceUpdatesDistrib.assertReplicaValue(TestInPlaceUpdatesDistrib.java:980)
	at org.apache.solr.update.TestInPlaceUpdatesDistrib.delayedReorderingFetchesMissingUpdateFromLeaderTest(TestInPlaceUpdatesDistrib.java:875)
	at org.apache.solr.update.TestInPlaceUpdatesDistrib.test(TestInPlaceUpdatesDistrib.java:145)
	at sun.reflect.NativeMethodAccessorImpl.invoke0(Native Method)
	at sun.reflect.NativeMethodAccessorImpl.invoke(NativeMethodAccessorImpl.java:62)
	at sun.reflect.DelegatingMethodAccessorImpl.invoke(DelegatingMethodAccessorImpl.java:43)
	at java.lang.reflect.Method.invoke(Method.java:498)
	at com.carrotsearch.randomizedtesting.RandomizedRunner.invoke(RandomizedRunner.java:1737)
	at com.carrotsearch.randomizedtesting.RandomizedRunner$8.evaluate(RandomizedRunner.java:934)
	at com.carrotsearch.randomizedtesting.RandomizedRunner$9.evaluate(RandomizedRunner.java:970)
	at com.carrotsearch.randomizedtesting.RandomizedRunner$10.evaluate(RandomizedRunner.java:984)
	at org.apache.solr.BaseDistributedSearchTestCase$ShardsRepeatRule$ShardsFixedStatement.callStatement(BaseDistributedSearchTestCase.java:993)
	at org.apache.solr.BaseDistributedSearchTestCase$ShardsRepeatRule$ShardsStatement.evaluate(BaseDistributedSearchTestCase.java:968)
	at com.carrotsearch.randomizedtesting.rules.SystemPropertiesRestoreRule$1.evaluate(SystemPropertiesRestoreRule.java:57)
	at org.apache.lucene.util.TestRuleSetupTeardownChained$1.evaluate(TestRuleSetupTeardownChained.java:49)
	at org.apache.lucene.util.AbstractBeforeAfterRule$1.evaluate(AbstractBeforeAfterRule.java:45)
	at org.apache.lucene.util.TestRuleThreadAndTestName$1.evaluate(TestRuleThreadAndTestName.java:48)
	at org.apache.lucene.util.TestRuleIgnoreAfterMaxFailures$1.evaluate(TestRuleIgnoreAfterMaxFailures.java:64)
	at org.apache.lucene.util.TestRuleMarkFailure$1.evaluate(TestRuleMarkFailure.java:47)
	at com.carrotsearch.randomizedtesting.rules.StatementAdapter.evaluate(StatementAdapter.java:36)
	at com.carrotsearch.randomizedtesting.ThreadLeakControl$StatementRunner.run(ThreadLeakControl.java:368)
	at com.carrotsearch.randomizedtesting.ThreadLeakControl.forkTimeoutingTask(ThreadLeakControl.java:817)
	at com.carrotsearch.randomizedtesting.ThreadLeakControl$3.evaluate(ThreadLeakControl.java:468)
	at com.carrotsearch.randomizedtesting.RandomizedRunner.runSingleTest(RandomizedRunner.java:943)
	at com.carrotsearch.randomizedtesting.RandomizedRunner$5.evaluate(RandomizedRunner.java:829)
	at com.carrotsearch.randomizedtesting.RandomizedRunner$6.evaluate(RandomizedRunner.java:879)
	at com.carrotsearch.randomizedtesting.RandomizedRunner$7.evaluate(RandomizedRunner.java:890)
	at com.carrotsearch.randomizedtesting.rules.StatementAdapter.evaluate(StatementAdapter.java:36)
	at com.carrotsearch.randomizedtesting.rules.SystemPropertiesRestoreRule$1.evaluate(SystemPropertiesRestoreRule.java:57)
	at org.apache.lucene.util.AbstractBeforeAfterRule$1.evaluate(AbstractBeforeAfterRule.java:45)
	at com.carrotsearch.randomizedtesting.rules.StatementAdapter.evaluate(StatementAdapter.java:36)
	at org.apache.lucene.util.TestRuleStoreClassName$1.evaluate(TestRuleStoreClassName.java:41)
	at com.carrotsearch.randomizedtesting.rules.NoShadowingOrOverridesOnMethodsRule$1.evaluate(NoShadowingOrOverridesOnMethodsRule.java:40)
	at com.carrotsearch.randomizedtesting.rules.NoShadowingOrOverridesOnMethodsRule$1.evaluate(NoShadowingOrOverridesOnMethodsRule.java:40)
	at com.carrotsearch.randomizedtesting.rules.StatementAdapter.evaluate(StatementAdapter.java:36)
	at com.carrotsearch.randomizedtesting.rules.StatementAdapter.evaluate(StatementAdapter.java:36)
	at com.carrotsearch.randomizedtesting.rules.StatementAdapter.evaluate(StatementAdapter.java:36)
	at org.apache.lucene.util.TestRuleAssertionsRequired$1.evaluate(TestRuleAssertionsRequired.java:53)
	at org.apache.lucene.util.TestRuleMarkFailure$1.evaluate(TestRuleMarkFailure.java:47)
	at org.apache.lucene.util.TestRuleIgnoreAfterMaxFailures$1.evaluate(TestRuleIgnoreAfterMaxFailures.java:64)
	at org.apache.lucene.util.TestRuleIgnoreTestSuites$1.evaluate(TestRuleIgnoreTestSuites.java:54)
	at com.carrotsearch.randomizedtesting.rules.StatementAdapter.evaluate(StatementAdapter.java:36)
	at com.carrotsearch.randomizedtesting.ThreadLeakControl$StatementRunner.run(ThreadLeakControl.java:368)
	at java.lang.Thread.run(Thread.java:748)


FAILED:  org.apache.solr.handler.admin.AutoscalingHistoryHandlerTest.testHistory

Error Message:
expected:<8> but was:<10>

Stack Trace:
java.lang.AssertionError: expected:<8> but was:<10>
	at __randomizedtesting.SeedInfo.seed([F937FCE697463010:94CB581B2D0ECF17]:0)
	at org.junit.Assert.fail(Assert.java:93)
	at org.junit.Assert.failNotEquals(Assert.java:647)
	at org.junit.Assert.assertEquals(Assert.java:128)
	at org.junit.Assert.assertEquals(Assert.java:472)
	at org.junit.Assert.assertEquals(Assert.java:456)
	at org.apache.solr.handler.admin.AutoscalingHistoryHandlerTest.testHistory(AutoscalingHistoryHandlerTest.java:262)
	at sun.reflect.NativeMethodAccessorImpl.invoke0(Native Method)
	at sun.reflect.NativeMethodAccessorImpl.invoke(NativeMethodAccessorImpl.java:62)
	at sun.reflect.DelegatingMethodAccessorImpl.invoke(DelegatingMethodAccessorImpl.java:43)
	at java.lang.reflect.Method.invoke(Method.java:498)
	at com.carrotsearch.randomizedtesting.RandomizedRunner.invoke(RandomizedRunner.java:1737)
	at com.carrotsearch.randomizedtesting.RandomizedRunner$8.evaluate(RandomizedRunner.java:934)
	at com.carrotsearch.randomizedtesting.RandomizedRunner$9.evaluate(RandomizedRunner.java:970)
	at com.carrotsearch.randomizedtesting.RandomizedRunner$10.evaluate(RandomizedRunner.java:984)
	at com.carrotsearch.randomizedtesting.rules.SystemPropertiesRestoreRule$1.evaluate(SystemPropertiesRestoreRule.java:57)
	at org.apache.lucene.util.TestRuleSetupTeardownChained$1.evaluate(TestRuleSetupTeardownChained.java:49)
	at org.apache.lucene.util.AbstractBeforeAfterRule$1.evaluate(AbstractBeforeAfterRule.java:45)
	at org.apache.lucene.util.TestRuleThreadAndTestName$1.evaluate(TestRuleThreadAndTestName.java:48)
	at org.apache.lucene.util.TestRuleIgnoreAfterMaxFailures$1.evaluate(TestRuleIgnoreAfterMaxFailures.java:64)
	at org.apache.lucene.util.TestRuleMarkFailure$1.evaluate(TestRuleMarkFailure.java:47)
	at com.carrotsearch.randomizedtesting.rules.StatementAdapter.evaluate(StatementAdapter.java:36)
	at com.carrotsearch.randomizedtesting.ThreadLeakControl$StatementRunner.run(ThreadLeakControl.java:368)
	at com.carrotsearch.randomizedtesting.ThreadLeakControl.forkTimeoutingTask(ThreadLeakControl.java:817)
	at com.carrotsearch.randomizedtesting.ThreadLeakControl$3.evaluate(ThreadLeakControl.java:468)
	at com.carrotsearch.randomizedtesting.RandomizedRunner.runSingleTest(RandomizedRunner.java:943)
	at com.carrotsearch.randomizedtesting.RandomizedRunner$5.evaluate(RandomizedRunner.java:829)
	at com.carrotsearch.randomizedtesting.RandomizedRunner$6.evaluate(RandomizedRunner.java:879)
	at com.carrotsearch.randomizedtesting.RandomizedRunner$7.evaluate(RandomizedRunner.java:890)
	at com.carrotsearch.randomizedtesting.rules.StatementAdapter.evaluate(StatementAdapter.java:36)
	at com.carrotsearch.randomizedtesting.rules.SystemPropertiesRestoreRule$1.evaluate(SystemPropertiesRestoreRule.java:57)
	at org.apache.lucene.util.AbstractBeforeAfterRule$1.evaluate(AbstractBeforeAfterRule.java:45)
	at com.carrotsearch.randomizedtesting.rules.StatementAdapter.evaluate(StatementAdapter.java:36)
	at org.apache.lucene.util.TestRuleStoreClassName$1.evaluate(TestRuleStoreClassName.java:41)
	at com.carrotsearch.randomizedtesting.rules.NoShadowingOrOverridesOnMethodsRule$1.evaluate(NoShadowingOrOverridesOnMethodsRule.java:40)
	at com.carrotsearch.randomizedtesting.rules.NoShadowingOrOverridesOnMethodsRule$1.evaluate(NoShadowingOrOverridesOnMethodsRule.java:40)
	at com.carrotsearch.randomizedtesting.rules.StatementAdapter.evaluate(StatementAdapter.java:36)
	at com.carrotsearch.randomizedtesting.rules.StatementAdapter.evaluate(StatementAdapter.java:36)
	at com.carrotsearch.randomizedtesting.rules.StatementAdapter.evaluate(StatementAdapter.java:36)
	at org.apache.lucene.util.TestRuleAssertionsRequired$1.evaluate(TestRuleAssertionsRequired.java:53)
	at org.apache.lucene.util.TestRuleMarkFailure$1.evaluate(TestRuleMarkFailure.java:47)
	at org.apache.lucene.util.TestRuleIgnoreAfterMaxFailures$1.evaluate(TestRuleIgnoreAfterMaxFailures.java:64)
	at org.apache.lucene.util.TestRuleIgnoreTestSuites$1.evaluate(TestRuleIgnoreTestSuites.java:54)
	at com.carrotsearch.randomizedtesting.rules.StatementAdapter.evaluate(StatementAdapter.java:36)
	at com.carrotsearch.randomizedtesting.ThreadLeakControl$StatementRunner.run(ThreadLeakControl.java:368)
	at java.lang.Thread.run(Thread.java:748)




Build Log:
[...truncated 12243 lines...]
   [junit4] Suite: org.apache.solr.cloud.PeerSyncReplicationTest
   [junit4]   2> Creating dataDir: /home/jenkins/jenkins-slave/workspace/Lucene-Solr-Tests-7.x/solr/build/solr-core/test/J0/temp/solr.cloud.PeerSyncReplicationTest_F937FCE697463010-001/init-core-data-001
   [junit4]   2> 1984751 INFO  (SUITE-PeerSyncReplicationTest-seed#[F937FCE697463010]-worker) [    ] o.a.s.SolrTestCaseJ4 Using PointFields (NUMERIC_POINTS_SYSPROP=true) w/NUMERIC_DOCVALUES_SYSPROP=true
   [junit4]   2> 1984752 INFO  (SUITE-PeerSyncReplicationTest-seed#[F937FCE697463010]-worker) [    ] o.a.s.SolrTestCaseJ4 Randomized ssl (true) and clientAuth (true) via: @org.apache.solr.util.RandomizeSSL(reason=, ssl=NaN, value=NaN, clientAuth=NaN)
   [junit4]   2> 1984752 INFO  (SUITE-PeerSyncReplicationTest-seed#[F937FCE697463010]-worker) [    ] o.a.s.SolrTestCaseJ4 SecureRandom sanity checks: test.solr.allowed.securerandom=null & java.security.egd=file:/dev/./urandom
   [junit4]   2> 1984752 INFO  (SUITE-PeerSyncReplicationTest-seed#[F937FCE697463010]-worker) [    ] o.a.s.BaseDistributedSearchTestCase Setting hostContext system property: /
   [junit4]   2> 1984771 INFO  (TEST-PeerSyncReplicationTest.test-seed#[F937FCE697463010]) [    ] o.a.s.c.ZkTestServer STARTING ZK TEST SERVER
   [junit4]   2> 1984778 INFO  (Thread-2895) [    ] o.a.s.c.ZkTestServer client port:0.0.0.0/0.0.0.0:0
   [junit4]   2> 1984778 INFO  (Thread-2895) [    ] o.a.s.c.ZkTestServer Starting server
   [junit4]   2> 1984778 INFO  (TEST-PeerSyncReplicationTest.test-seed#[F937FCE697463010]) [    ] o.a.s.c.ZkTestServer start zk server on port:33010
   [junit4]   2> 1984884 ERROR (Thread-2895) [    ] o.a.z.s.ZooKeeperServer ZKShutdownHandler is not registered, so ZooKeeper server won't take any action on ERROR or SHUTDOWN server state changes
   [junit4]   2> 1985226 INFO  (TEST-PeerSyncReplicationTest.test-seed#[F937FCE697463010]) [    ] o.a.s.c.AbstractZkTestCase put /home/jenkins/jenkins-slave/workspace/Lucene-Solr-Tests-7.x/solr/core/src/test-files/solr/collection1/conf/solrconfig-tlog.xml to /configs/conf1/solrconfig.xml
   [junit4]   2> 1985227 INFO  (TEST-PeerSyncReplicationTest.test-seed#[F937FCE697463010]) [    ] o.a.s.c.AbstractZkTestCase put /home/jenkins/jenkins-slave/workspace/Lucene-Solr-Tests-7.x/solr/core/src/test-files/solr/collection1/conf/schema.xml to /configs/conf1/schema.xml
   [junit4]   2> 1985228 INFO  (TEST-PeerSyncReplicationTest.test-seed#[F937FCE697463010]) [    ] o.a.s.c.AbstractZkTestCase put /home/jenkins/jenkins-slave/workspace/Lucene-Solr-Tests-7.x/solr/core/src/test-files/solr/collection1/conf/solrconfig.snippet.randomindexconfig.xml to /configs/conf1/solrconfig.snippet.randomindexconfig.xml
   [junit4]   2> 1985229 INFO  (TEST-PeerSyncReplicationTest.test-seed#[F937FCE697463010]) [    ] o.a.s.c.AbstractZkTestCase put /home/jenkins/jenkins-slave/workspace/Lucene-Solr-Tests-7.x/solr/core/src/test-files/solr/collection1/conf/stopwords.txt to /configs/conf1/stopwords.txt
   [junit4]   2> 1985242 INFO  (TEST-PeerSyncReplicationTest.test-seed#[F937FCE697463010]) [    ] o.a.s.c.AbstractZkTestCase put /home/jenkins/jenkins-slave/workspace/Lucene-Solr-Tests-7.x/solr/core/src/test-files/solr/collection1/conf/protwords.txt to /configs/conf1/protwords.txt
   [junit4]   2> 1985242 INFO  (TEST-PeerSyncReplicationTest.test-seed#[F937FCE697463010]) [    ] o.a.s.c.AbstractZkTestCase put /home/jenkins/jenkins-slave/workspace/Lucene-Solr-Tests-7.x/solr/core/src/test-files/solr/collection1/conf/currency.xml to /configs/conf1/currency.xml
   [junit4]   2> 1985243 INFO  (TEST-PeerSyncReplicationTest.test-seed#[F937FCE697463010]) [    ] o.a.s.c.AbstractZkTestCase put /home/jenkins/jenkins-slave/workspace/Lucene-Solr-Tests-7.x/solr/core/src/test-files/solr/collection1/conf/enumsConfig.xml to /configs/conf1/enumsConfig.xml
   [junit4]   2> 1985243 INFO  (TEST-PeerSyncReplicationTest.test-seed#[F937FCE697463010]) [    ] o.a.s.c.AbstractZkTestCase put /home/jenkins/jenkins-slave/workspace/Lucene-Solr-Tests-7.x/solr/core/src/test-files/solr/collection1/conf/open-exchange-rates.json to /configs/conf1/open-exchange-rates.json
   [junit4]   2> 1985244 INFO  (TEST-PeerSyncReplicationTest.test-seed#[F937FCE697463010]) [    ] o.a.s.c.AbstractZkTestCase put /home/jenkins/jenkins-slave/workspace/Lucene-Solr-Tests-7.x/solr/core/src/test-files/solr/collection1/conf/mapping-ISOLatin1Accent.txt to /configs/conf1/mapping-ISOLatin1Accent.txt
   [junit4]   2> 1985244 INFO  (TEST-PeerSyncReplicationTest.test-seed#[F937FCE697463010]) [    ] o.a.s.c.AbstractZkTestCase put /home/jenkins/jenkins-slave/workspace/Lucene-Solr-Tests-7.x/solr/core/src/test-files/solr/collection1/conf/old_synonyms.txt to /configs/conf1/old_synonyms.txt
   [junit4]   2> 1985245 INFO  (TEST-PeerSyncReplicationTest.test-seed#[F937FCE697463010]) [    ] o.a.s.c.AbstractZkTestCase put /home/jenkins/jenkins-slave/workspace/Lucene-Solr-Tests-7.x/solr/core/src/test-files/solr/collection1/conf/synonyms.txt to /configs/conf1/synonyms.txt
   [junit4]   2> 1985279 WARN  (NIOServerCxn.Factory:0.0.0.0/0.0.0.0:0) [    ] o.a.z.s.NIOServerCnxn caught end of stream exception
   [junit4]   2> EndOfStreamException: Unable to read additional data from client sessionid 0x15f5d0a2bca0001, likely client has closed socket
   [junit4]   2> 	at org.apache.zookeeper.server.NIOServerCnxn.doIO(NIOServerCnxn.java:239)
   [junit4]   2> 	at org.apache.zookeeper.server.NIOServerCnxnFactory.run(NIOServerCnxnFactory.java:203)
   [junit4]   2> 	at java.lang.Thread.run(Thread.java:748)
   [junit4]   2> 1985444 INFO  (TEST-PeerSyncReplicationTest.test-seed#[F937FCE697463010]) [    ] o.a.s.c.AbstractFullDistribZkTestBase Will use NRT replicas unless explicitly asked otherwise
   [junit4]   2> 1986250 INFO  (TEST-PeerSyncReplicationTest.test-seed#[F937FCE697463010]) [    ] o.e.j.s.Server jetty-9.3.20.v20170531
   [junit4]   2> 1986341 INFO  (TEST-PeerSyncReplicationTest.test-seed#[F937FCE697463010]) [    ] o.e.j.s.h.ContextHandler Started o.e.j.s.ServletContextHandler@191ee19f{/,null,AVAILABLE}
   [junit4]   2> 1986342 INFO  (TEST-PeerSyncReplicationTest.test-seed#[F937FCE697463010]) [    ] o.e.j.s.AbstractConnector Started ServerConnector@312b369f{SSL,[ssl, http/1.1]}{127.0.0.1:33900}
   [junit4]   2> 1986342 INFO  (TEST-PeerSyncReplicationTest.test-seed#[F937FCE697463010]) [    ] o.e.j.s.Server Started @2002731ms
   [junit4]   2> 1986342 INFO  (TEST-PeerSyncReplicationTest.test-seed#[F937FCE697463010]) [    ] o.a.s.c.s.e.JettySolrRunner Jetty properties: {solr.data.dir=/home/jenkins/jenkins-slave/workspace/Lucene-Solr-Tests-7.x/solr/build/solr-core/test/J0/temp/solr.cloud.PeerSyncReplicationTest_F937FCE697463010-001/tempDir-001/control/data, hostContext=/, hostPort=33900, coreRootDirectory=/home/jenkins/jenkins-slave/workspace/Lucene-Solr-Tests-7.x/solr/build/solr-core/test/J0/temp/solr.cloud.PeerSyncReplicationTest_F937FCE697463010-001/control-001/cores}
   [junit4]   2> 1986342 ERROR (TEST-PeerSyncReplicationTest.test-seed#[F937FCE697463010]) [    ] o.a.s.u.StartupLoggingUtils Missing Java Option solr.log.dir. Logging may be missing or incomplete.
   [junit4]   2> 1986342 INFO  (TEST-PeerSyncReplicationTest.test-seed#[F937FCE697463010]) [    ] o.a.s.s.SolrDispatchFilter  ___      _       Welcome to Apache Solr? version 7.2.0
   [junit4]   2> 1986342 INFO  (TEST-PeerSyncReplicationTest.test-seed#[F937FCE697463010]) [    ] o.a.s.s.SolrDispatchFilter / __| ___| |_ _   Starting in cloud mode on port null
   [junit4]   2> 1986342 INFO  (TEST-PeerSyncReplicationTest.test-seed#[F937FCE697463010]) [    ] o.a.s.s.SolrDispatchFilter \__ \/ _ \ | '_|  Install dir: null, Default config dir: null
   [junit4]   2> 1986342 INFO  (TEST-PeerSyncReplicationTest.test-seed#[F937FCE697463010]) [    ] o.a.s.s.SolrDispatchFilter |___/\___/_|_|    Start time: 2017-10-27T08:54:30.065Z
   [junit4]   2> 1986446 INFO  (TEST-PeerSyncReplicationTest.test-seed#[F937FCE697463010]) [    ] o.a.s.s.SolrDispatchFilter Loading solr.xml from SolrHome (not found in ZooKeeper)
   [junit4]   2> 1986446 INFO  (TEST-PeerSyncReplicationTest.test-seed#[F937FCE697463010]) [    ] o.a.s.c.SolrXmlConfig Loading container configuration from /home/jenkins/jenkins-slave/workspace/Lucene-Solr-Tests-7.x/solr/build/solr-core/test/J0/temp/solr.cloud.PeerSyncReplicationTest_F937FCE697463010-001/control-001/solr.xml
   [junit4]   2> 1986496 INFO  (TEST-PeerSyncReplicationTest.test-seed#[F937FCE697463010]) [    ] o.a.s.c.SolrXmlConfig Configuration parameter autoReplicaFailoverWorkLoopDelay is ignored
   [junit4]   2> 1986496 INFO  (TEST-PeerSyncReplicationTest.test-seed#[F937FCE697463010]) [    ] o.a.s.c.SolrXmlConfig Configuration parameter autoReplicaFailoverBadNodeExpiration is ignored
   [junit4]   2> 1986497 INFO  (TEST-PeerSyncReplicationTest.test-seed#[F937FCE697463010]) [    ] o.a.s.c.SolrXmlConfig MBean server found: com.sun.jmx.mbeanserver.JmxMBeanServer@245c85f6, but no JMX reporters were configured - adding default JMX reporter.
   [junit4]   2> 1986568 INFO  (TEST-PeerSyncReplicationTest.test-seed#[F937FCE697463010]) [    ] o.a.s.c.ZkContainer Zookeeper client=127.0.0.1:33010/solr
   [junit4]   2> 1986644 WARN  (NIOServerCxn.Factory:0.0.0.0/0.0.0.0:0) [    ] o.a.z.s.NIOServerCnxn caught end of stream exception
   [junit4]   2> EndOfStreamException: Unable to read additional data from client sessionid 0x15f5d0a2bca0004, likely client has closed socket
   [junit4]   2> 	at org.apache.zookeeper.server.NIOServerCnxn.doIO(NIOServerCnxn.java:239)
   [junit4]   2> 	at org.apache.zookeeper.server.NIOServerCnxnFactory.run(NIOServerCnxnFactory.java:203)
   [junit4]   2> 	at java.lang.Thread.run(Thread.java:748)
   [junit4]   2> 1988484 INFO  (TEST-PeerSyncReplicationTest.test-seed#[F937FCE697463010]) [n:127.0.0.1:33900_    ] o.a.s.c.Overseer Overseer (id=null) closing
   [junit4]   2> 1988485 INFO  (TEST-PeerSyncReplicationTest.test-seed#[F937FCE697463010]) [n:127.0.0.1:33900_    ] o.a.s.c.OverseerElectionContext I am going to be the leader 127.0.0.1:33900_
   [junit4]   2> 1988485 INFO  (TEST-PeerSyncReplicationTest.test-seed#[F937FCE697463010]) [n:127.0.0.1:33900_    ] o.a.s.c.Overseer Overseer (id=98900015091154949-127.0.0.1:33900_-n_0000000000) starting
   [junit4]   2> 1988537 INFO  (TEST-PeerSyncReplicationTest.test-seed#[F937FCE697463010]) [n:127.0.0.1:33900_    ] o.a.s.c.ZkController Register node as live in ZooKeeper:/live_nodes/127.0.0.1:33900_
   [junit4]   2> 1988598 INFO  (OverseerStateUpdate-98900015091154949-127.0.0.1:33900_-n_0000000000) [n:127.0.0.1:33900_    ] o.a.s.c.c.ZkStateReader Updated live nodes from ZooKeeper... (0) -> (1)
   [junit4]   2> 1989050 INFO  (TEST-PeerSyncReplicationTest.test-seed#[F937FCE697463010]) [n:127.0.0.1:33900_    ] o.a.s.m.r.SolrJmxReporter JMX monitoring for 'solr.node' (registry 'solr.node') enabled at server: com.sun.jmx.mbeanserver.JmxMBeanServer@245c85f6
   [junit4]   2> 1989103 INFO  (TEST-PeerSyncReplicationTest.test-seed#[F937FCE697463010]) [n:127.0.0.1:33900_    ] o.a.s.m.r.SolrJmxReporter JMX monitoring for 'solr.jvm' (registry 'solr.jvm') enabled at server: com.sun.jmx.mbeanserver.JmxMBeanServer@245c85f6
   [junit4]   2> 1989103 INFO  (TEST-PeerSyncReplicationTest.test-seed#[F937FCE697463010]) [n:127.0.0.1:33900_    ] o.a.s.m.r.SolrJmxReporter JMX monitoring for 'solr.jetty' (registry 'solr.jetty') enabled at server: com.sun.jmx.mbeanserver.JmxMBeanServer@245c85f6
   [junit4]   2> 1989104 INFO  (TEST-PeerSyncReplicationTest.test-seed#[F937FCE697463010]) [n:127.0.0.1:33900_    ] o.a.s.c.CorePropertiesLocator Found 0 core definitions underneath /home/jenkins/jenkins-slave/workspace/Lucene-Solr-Tests-7.x/solr/build/solr-core/test/J0/temp/solr.cloud.PeerSyncReplicationTest_F937FCE697463010-001/control-001/cores
   [junit4]   2> 1989436 INFO  (TEST-PeerSyncReplicationTest.test-seed#[F937FCE697463010]) [    ] o.a.s.c.c.ZkStateReader Updated live nodes from ZooKeeper... (0) -> (1)
   [junit4]   2> 1989436 INFO  (TEST-PeerSyncReplicationTest.test-seed#[F937FCE697463010]) [    ] o.a.s.c.s.i.ZkClientClusterStateProvider Cluster at 127.0.0.1:33010/solr ready
   [junit4]   2> 1989730 INFO  (qtp882637231-6693) [n:127.0.0.1:33900_    ] o.a.s.h.a.CollectionsHandler Invoked Collection Action :create with params replicationFactor=1&collection.configName=conf1&name=control_collection&nrtReplicas=1&action=CREATE&numShards=1&createNodeSet=127.0.0.1:33900_&wt=javabin&version=2 and sendToOCPQueue=true
   [junit4]   2> 1989781 INFO  (OverseerThreadFactory-2236-thread-1-processing-n:127.0.0.1:33900_) [n:127.0.0.1:33900_    ] o.a.s.c.CreateCollectionCmd Create collection control_collection
   [junit4]   2> 1989981 INFO  (qtp882637231-6690) [n:127.0.0.1:33900_    ] o.a.s.h.a.CoreAdminOperation core create command qt=/admin/cores&collection.configName=conf1&newCollection=true&name=control_collection_shard1_replica_n1&action=CREATE&numShards=1&collection=control_collection&shard=shard1&wt=javabin&version=2&replicaType=NRT
   [junit4]   2> 1989982 INFO  (qtp882637231-6690) [n:127.0.0.1:33900_    ] o.a.s.c.TransientSolrCoreCacheDefault Allocating transient cache for 4 transient cores
   [junit4]   2> 1990091 INFO  (zkCallback-784-thread-1-processing-n:127.0.0.1:33900_) [n:127.0.0.1:33900_    ] o.a.s.c.c.ZkStateReader A cluster state change: [WatchedEvent state:SyncConnected type:NodeDataChanged path:/collections/control_collection/state.json] for collection [control_collection] has occurred - updating... (live nodes size: [1])
   [junit4]   2> 1991287 INFO  (qtp882637231-6690) [n:127.0.0.1:33900_ c:control_collection s:shard1  x:control_collection_shard1_replica_n1] o.a.s.c.SolrConfig Using Lucene MatchVersion: 7.2.0
   [junit4]   2> 1991413 INFO  (qtp882637231-6690) [n:127.0.0.1:33900_ c:control_collection s:shard1  x:control_collection_shard1_replica_n1] o.a.s.s.IndexSchema [control_collection_shard1_replica_n1] Schema name=test
   [junit4]   2> 1992262 INFO  (qtp882637231-6690) [n:127.0.0.1:33900_ c:control_collection s:shard1  x:control_collection_shard1_replica_n1] o.a.s.s.IndexSchema Loaded schema test/1.0 with uniqueid field id
   [junit4]   2> 1992351 INFO  (qtp882637231-6690) [n:127.0.0.1:33900_ c:control_collection s:shard1  x:control_collection_shard1_replica_n1] o.a.s.c.CoreContainer Creating SolrCore 'control_collection_shard1_replica_n1' using configuration from collection control_collection, trusted=true
   [junit4]   2> 1992351 INFO  (qtp882637231-6690) [n:127.0.0.1:33900_ c:control_collection s:shard1  x:control_collection_shard1_replica_n1] o.a.s.m.r.SolrJmxReporter JMX monitoring for 'solr.core.control_collection.shard1.replica_n1' (registry 'solr.core.control_collection.shard1.replica_n1') enabled at server: com.sun.jmx.mbeanserver.JmxMBeanServer@245c85f6
   [junit4]   2> 1992351 INFO  (qtp882637231-6690) [n:127.0.0.1:33900_ c:control_collection s:shard1  x:control_collection_shard1_replica_n1] o.a.s.c.SolrCore solr.RecoveryStrategy.Builder
   [junit4]   2> 1992351 INFO  (qtp882637231-6690) [n:127.0.0.1:33900_ c:control_collection s:shard1  x:control_collection_shard1_replica_n1] o.a.s.c.SolrCore [[control_collection_shard1_replica_n1] ] Opening new SolrCore at [/home/jenkins/jenkins-slave/workspace/Lucene-Solr-Tests-7.x/solr/build/solr-core/test/J0/temp/solr.cloud.PeerSyncReplicationTest_F937FCE697463010-001/control-001/cores/control_collection_shard1_replica_n1], dataDir=[/home/jenkins/jenkins-slave/workspace/Lucene-Solr-Tests-7.x/solr/build/solr-core/test/J0/temp/solr.cloud.PeerSyncReplicationTest_F937FCE697463010-001/control-001/cores/control_collection_shard1_replica_n1/data/]
   [junit4]   2> 1992386 INFO  (qtp882637231-6690) [n:127.0.0.1:33900_ c:control_collection s:shard1  x:control_collection_shard1_replica_n1] o.a.s.u.RandomMergePolicy RandomMergePolicy wrapping class org.apache.lucene.index.TieredMergePolicy: [TieredMergePolicy: maxMergeAtOnce=27, maxMergeAtOnceExplicit=37, maxMergedSegmentMB=32.7412109375, floorSegmentMB=0.9931640625, forceMergeDeletesPctAllowed=4.645882138600275, segmentsPerTier=33.0, maxCFSSegmentSizeMB=8.796093022207999E12, noCFSRatio=0.4070763039360047
   [junit4]   2> 1992462 WARN  (qtp882637231-6690) [n:127.0.0.1:33900_ c:control_collection s:shard1  x:control_collection_shard1_replica_n1] o.a.s.c.RequestHandlers INVALID paramSet a in requestHandler {type = requestHandler,name = /dump,class = DumpRequestHandler,attributes = {initParams=a, name=/dump, class=DumpRequestHandler},args = {defaults={a=A,b=B}}}
   [junit4]   2> 1992736 INFO  (qtp882637231-6690) [n:127.0.0.1:33900_ c:control_collection s:shard1  x:control_collection_shard1_replica_n1] o.a.s.u.UpdateHandler Using UpdateLog implementation: org.apache.solr.update.UpdateLog
   [junit4]   2> 1992736 INFO  (qtp882637231-6690) [n:127.0.0.1:33900_ c:control_collection s:shard1  x:control_collection_shard1_replica_n1] o.a.s.u.UpdateLog Initializing UpdateLog: dataDir= defaultSyncLevel=FLUSH numRecordsToKeep=1000 maxNumLogsToKeep=10 numVersionBuckets=65536
   [junit4]   2> 1992737 INFO  (qtp882637231-6690) [n:127.0.0.1:33900_ c:control_collection s:shard1  x:control_collection_shard1_replica_n1] o.a.s.u.CommitTracker Hard AutoCommit: disabled
   [junit4]   2> 1992737 INFO  (qtp882637231-6690) [n:127.0.0.1:33900_ c:control_collection s:shard1  x:control_collection_shard1_replica_n1] o.a.s.u.CommitTracker Soft AutoCommit: disabled
   [junit4]   2> 1992739 INFO  (qtp882637231-6690) [n:127.0.0.1:33900_ c:control_collection s:shard1  x:control_collection_shard1_replica_n1] o.a.s.u.RandomMergePolicy RandomMergePolicy wrapping class org.apache.lucene.index.TieredMergePolicy: [TieredMergePolicy: maxMergeAtOnce=19, maxMergeAtOnceExplicit=27, maxMergedSegmentMB=16.9990234375, floorSegmentMB=1.7177734375, forceMergeDeletesPctAllowed=29.80170751436371, segmentsPerTier=17.0, maxCFSSegmentSizeMB=8.796093022207999E12, noCFSRatio=0.25869791656211993
   [junit4]   2> 1992739 INFO  (qtp882637231-6690) [n:127.0.0.1:33900_ c:control_collection s:shard1  x:control_collection_shard1_replica_n1] o.a.s.s.SolrIndexSearcher Opening [Searcher@63671baf[control_collection_shard1_replica_n1] main]
   [junit4]   2> 1992740 INFO  (qtp882637231-6690) [n:127.0.0.1:33900_ c:control_collection s:shard1  x:control_collection_shard1_replica_n1] o.a.s.r.ManagedResourceStorage Configured ZooKeeperStorageIO with znodeBase: /configs/conf1
   [junit4]   2> 1992753 INFO  (qtp882637231-6690) [n:127.0.0.1:33900_ c:control_collection s:shard1  x:control_collection_shard1_replica_n1] o.a.s.r.ManagedResourceStorage Loaded null at path _rest_managed.json using ZooKeeperStorageIO:path=/configs/conf1
   [junit4]   2> 1992753 INFO  (qtp882637231-6690) [n:127.0.0.1:33900_ c:control_collection s:shard1  x:control_collection_shard1_replica_n1] o.a.s.h.ReplicationHandler Commits will be reserved for 10000ms.
   [junit4]   2> 1992753 INFO  (qtp882637231-6690) [n:127.0.0.1:33900_ c:control_collection s:shard1  x:control_collection_shard1_replica_n1] o.a.s.u.UpdateLog Could not find max version in index or recent updates, using new clock 1582400249765298176
   [junit4]   2> 1992774 INFO  (searcherExecutor-2239-thread-1-processing-n:127.0.0.1:33900_ x:control_collection_shard1_replica_n1 s:shard1 c:control_collection) [n:127.0.0.1:33900_ c:control_collection s:shard1  x:control_collection_shard1_replica_n1] o.a.s.c.SolrCore [control_collection_shard1_replica_n1] Registered new searcher Searcher@63671baf[control_collection_shard1_replica_n1] main{ExitableDirectoryReader(UninvertingDirectoryReader())}
   [junit4]   2> 1992775 INFO  (qtp882637231-6690) [n:127.0.0.1:33900_ c:control_collection s:shard1  x:control_collection_shard1_replica_n1] o.a.s.c.ShardLeaderElectionContext Enough replicas found to continue.
   [junit4]   2> 1992775 INFO  (qtp882637231-6690) [n:127.0.0.1:33900_ c:control_collection s:shard1  x:control_collection_shard1_replica_n1] o.a.s.c.ShardLeaderElectionContext I may be the new leader - try and sync
   [junit4]   2> 1992775 INFO  (qtp882637231-6690) [n:127.0.0.1:33900_ c:control_collection s:shard1  x:control_collection_shard1_replica_n1] o.a.s.c.SyncStrategy Sync replicas to https://127.0.0.1:33900/control_collection_shard1_replica_n1/
   [junit4]   2> 1992775 INFO  (qtp882637231-6690) [n:127.0.0.1:33900_ c:control_collection s:shard1  x:control_collection_shard1_replica_n1] o.a.s.c.SyncStrategy Sync Success - now sync replicas to me
   [junit4]   2> 1992775 INFO  (qtp882637231-6690) [n:127.0.0.1:33900_ c:control_collection s:shard1  x:control_collection_shard1_replica_n1] o.a.s.c.SyncStrategy https://127.0.0.1:33900/control_collection_shard1_replica_n1/ has no replicas
   [junit4]   2> 1992775 INFO  (qtp882637231-6690) [n:127.0.0.1:33900_ c:control_collection s:shard1  x:control_collection_shard1_replica_n1] o.a.s.c.ShardLeaderElectionContext Found all replicas participating in election, clear LIR
   [junit4]   2> 1992789 INFO  (qtp882637231-6690) [n:127.0.0.1:33900_ c:control_collection s:shard1  x:control_collection_shard1_replica_n1] o.a.s.c.ShardLeaderElectionContext I am the new leader: https://127.0.0.1:33900/control_collection_shard1_replica_n1/ shard1
   [junit4]   2> 1992790 INFO  (zkCallback-784-thread-2-processing-n:127.0.0.1:33900_) [n:127.0.0.1:33900_    ] o.a.s.c.c.ZkStateReader A cluster state change: [WatchedEvent state:SyncConnected type:NodeDataChanged path:/collections/control_collection/state.json] for collection [control_collection] has occurred - updating... (live nodes size: [1])
   [junit4]   2> 1992846 INFO  (qtp882637231-6690) [n:127.0.0.1:33900_ c:control_collection s:shard1  x:control_collection_shard1_replica_n1] o.a.s.c.ZkController I am the leader, no recovery necessary
   [junit4]   2> 1992847 INFO  (qtp882637231-6690) [n:127.0.0.1:33900_ c:control_collection s:shard1  x:control_collection_shard1_replica_n1] o.a.s.s.HttpSolrCall [admin] webapp=null path=/admin/cores params={qt=/admin/cores&collection.configName=conf1&newCollection=true&name=control_collection_shard1_replica_n1&action=CREATE&numShards=1&collection=control_collection&shard=shard1&wt=javabin&version=2&replicaType=NRT} status=0 QTime=2865
   [junit4]   2> 1992849 INFO  (qtp882637231-6693) [n:127.0.0.1:33900_    ] o.a.s.h.a.CollectionsHandler Wait for new collection to be active for at most 30 seconds. Check all shard replicas
   [junit4]   2> 1992956 INFO  (zkCallback-784-thread-2-processing-n:127.0.0.1:33900_) [n:127.0.0.1:33900_    ] o.a.s.c.c.ZkStateReader A cluster state change: [WatchedEvent state:SyncConnected type:NodeDataChanged path:/collections/control_collection/state.json] for collection [control_collection] has occurred - updating... (live nodes size: [1])
   [junit4]   2> 1993799 INFO  (OverseerCollectionConfigSetProcessor-98900015091154949-127.0.0.1:33900_-n_0000000000) [n:127.0.0.1:33900_    ] o.a.s.c.OverseerTaskQueue Response ZK path: /overseer/collection-queue-work/qnr-0000000000 doesn't exist.  Requestor may have disconnected from ZooKeeper
   [junit4]   2> 1993856 INFO  (qtp882637231-6693) [n:127.0.0.1:33900_    ] o.a.s.s.HttpSolrCall [admin] webapp=null path=/admin/collections params={replicationFactor=1&collection.configName=conf1&name=control_collection&nrtReplicas=1&action=CREATE&numShards=1&createNodeSet=127.0.0.1:33900_&wt=javabin&version=2} status=0 QTime=4126
   [junit4]   2> 1993974 INFO  (TEST-PeerSyncReplicationTest.test-seed#[F937FCE697463010]) [    ] o.a.s.c.c.ZkStateReader Updated live nodes from ZooKeeper... (0) -> (1)
   [junit4]   2> 1994003 INFO  (TEST-PeerSyncReplicationTest.test-seed#[F937FCE697463010]) [    ] o.a.s.c.s.i.ZkClientClusterStateProvider Cluster at 127.0.0.1:33010/solr ready
   [junit4]   2> 1994003 INFO  (TEST-PeerSyncReplicationTest.test-seed#[F937FCE697463010]) [    ] o.a.s.c.ChaosMonkey monkey: init - expire sessions:false cause connection loss:false
   [junit4]   2> 1994018 INFO  (qtp882637231-6694) [n:127.0.0.1:33900_    ] o.a.s.h.a.CollectionsHandler Invoked Collection Action :create with params replicationFactor=1&collection.configName=conf1&name=collection1&nrtReplicas=1&action=CREATE&numShards=1&createNodeSet=&stateFormat=1&wt=javabin&version=2 and sendToOCPQueue=true
   [junit4]   2> 1994092 INFO  (OverseerThreadFactory-2236-thread-2-processing-n:127.0.0.1:33900_) [n:127.0.0.1:33900_    ] o.a.s.c.CreateCollectionCmd Create collection collection1
   [junit4]   2> 1994093 WARN  (OverseerThreadFactory-2236-thread-2-processing-n:127.0.0.1:33900_) [n:127.0.0.1:33900_    ] o.a.s.c.CreateCollectionCmd It is unusual to create a collection (collection1) without cores.
   [junit4]   2> 1994397 INFO  (qtp882637231-6694) [n:127.0.0.1:33900_    ] o.a.s.h.a.CollectionsHandler Wait for new collection to be active for at most 30 seconds. Check all shard replicas
   [junit4]   2> 1994397 INFO  (qtp882637231-6694) [n:127.0.0.1:33900_    ] o.a.s.s.HttpSolrCall [admin] webapp=null path=/admin/collections params={replicationFactor=1&collection.configName=conf1&name=collection1&nrtReplicas=1&action=CREATE&numShards=1&createNodeSet=&stateFormat=1&wt=javabin&version=2} status=0 QTime=378
   [junit4]   2> 1995416 INFO  (TEST-PeerSyncReplicationTest.test-seed#[F937FCE697463010]) [    ] o.a.s.c.AbstractFullDistribZkTestBase create jetty 1 in directory /home/jenkins/jenkins-slave/workspace/Lucene-Solr-Tests-7.x/solr/build/solr-core/test/J0/temp/solr.cloud.PeerSyncReplicationTest_F937FCE697463010-001/shard-1-001 of type NRT
   [junit4]   2> 1995430 INFO  (TEST-PeerSyncReplicationTest.test-seed#[F937FCE697463010]) [    ] o.e.j.s.Server jetty-9.3.20.v20170531
   [junit4]   2> 1995490 INFO  (TEST-PeerSyncReplicationTest.test-seed#[F937FCE697463010]) [    ] o.e.j.s.h.ContextHandler Started o.e.j.s.ServletContextHandler@43f243f0{/,null,AVAILABLE}
   [junit4]   2> 1995491 INFO  (TEST-PeerSyncReplicationTest.test-seed#[F937FCE697463010]) [    ] o.e.j.s.AbstractConnector Started ServerConnector@3f094b93{SSL,[ssl, http/1.1]}{127.0.0.1:33495}
   [junit4]   2> 1995491 INFO  (TEST-PeerSyncReplicationTest.test-seed#[F937FCE697463010]) [    ] o.e.j.s.Server Started @2011880ms
   [junit4]   2> 1995491 INFO  (TEST-PeerSyncReplicationTest.test-seed#[F937FCE697463010]) [    ] o.a.s.c.s.e.JettySolrRunner Jetty properties: {solr.data.dir=/home/jenkins/jenkins-slave/workspace/Lucene-Solr-Tests-7.x/solr/build/solr-core/test/J0/temp/solr.cloud.PeerSyncReplicationTest_F937FCE697463010-001/tempDir-001/jetty1, solrconfig=solrconfig.xml, hostContext=/, hostPort=33495, coreRootDirectory=/home/jenkins/jenkins-slave/workspace/Lucene-Solr-Tests-7.x/solr/build/solr-core/test/J0/temp/solr.cloud.PeerSyncReplicationTest_F937FCE697463010-001/shard-1-001/cores}
   [junit4]   2> 1995491 ERROR (TEST-PeerSyncReplicationTest.test-seed#[F937FCE697463010]) [    ] o.a.s.u.StartupLoggingUtils Missing Java Option solr.log.dir. Logging may be missing or incomplete.
   [junit4]   2> 1995491 INFO  (TEST-PeerSyncReplicationTest.test-seed#[F937FCE697463010]) [    ] o.a.s.s.SolrDispatchFilter  ___      _       Welcome to Apache Solr? version 7.2.0
   [junit4]   2> 1995491 INFO  (TEST-PeerSyncReplicationTest.test-seed#[F937FCE697463010]) [    ] o.a.s.s.SolrDispatchFilter / __| ___| |_ _   Starting in cloud mode on port null
   [junit4]   2> 1995491 INFO  (TEST-PeerSyncReplicationTest.test-seed#[F937FCE697463010]) [    ] o.a.s.s.SolrDispatchFilter \__ \/ _ \ | '_|  Install dir: null, Default config dir: null
   [junit4]   2> 1995491 INFO  (TEST-PeerSyncReplicationTest.test-seed#[F937FCE697463010]) [    ] o.a.s.s.SolrDispatchFilter |___/\___/_|_|    Start time: 2017-10-27T08:54:39.214Z
   [junit4]   2> 1995566 INFO  (TEST-PeerSyncReplicationTest.test-seed#[F937FCE697463010]) [    ] o.a.s.s.SolrDispatchFilter Loading solr.xml from SolrHome (not found in ZooKeeper)
   [junit4]   2> 1995566 INFO  (TEST-PeerSyncReplicationTest.test-seed#[F937FCE697463010]) [    ] o.a.s.c.SolrXmlConfig Loading container configuration from /home/jenkins/jenkins-slave/workspace/Lucene-Solr-Tests-7.x/solr/build/solr-core/test/J0/temp/solr.cloud.PeerSyncReplicationTest_F937FCE697463010-001/shard-1-001/solr.xml
   [junit4]   2> 1995602 INFO  (TEST-PeerSyncReplicationTest.test-seed#[F937FCE697463010]) [    ] o.a.s.c.SolrXmlConfig Configuration parameter autoReplicaFailoverWorkLoopDelay is ignored
   [junit4]   2> 1995602 INFO  (TEST-PeerSyncReplicationTest.test-seed#[F937FCE697463010]) [    ] o.a.s.c.SolrXmlConfig Configuration parameter autoReplicaFailoverBadNodeExpiration is ignored
   [junit4]   2> 1995603 INFO  (TEST-PeerSyncReplicationTest.test-seed#[F937FCE697463010]) [    ] o.a.s.c.SolrXmlConfig MBean server found: com.sun.jmx.mbeanserver.JmxMBeanServer@245c85f6, but no JMX reporters were configured - adding default JMX reporter.
   [junit4]   2> 1995637 INFO  (TEST-PeerSyncReplicationTest.test-seed#[F937FCE697463010]) [    ] o.a.s.c.ZkContainer Zookeeper client=127.0.0.1:33010/solr
   [junit4]   2> 1995745 INFO  (TEST-PeerSyncReplicationTest.test-seed#[F937FCE697463010]) [n:127.0.0.1:33495_    ] o.a.s.c.c.ZkStateReader Updated live nodes from ZooKeeper... (0) -> (1)
   [junit4]   2> 1995746 INFO  (TEST-PeerSyncReplicationTest.test-seed#[F937FCE697463010]) [n:127.0.0.1:33495_    ] o.a.s.c.Overseer Overseer (id=null) closing
   [junit4]   2> 1995759 INFO  (TEST-PeerSyncReplicationTest.test-seed#[F937FCE697463010]) [n:127.0.0.1:33495_    ] o.a.s.c.ZkController Register node as live in ZooKeeper:/live_nodes/127.0.0.1:33495_
   [junit4]   2> 1995836 INFO  (zkCallback-792-thread-1) [    ] o.a.s.c.c.ZkStateReader Updated live nodes from ZooKeeper... (1) -> (2)
   [junit4]   2> 1995963 INFO  (zkCallback-797-thread-1-processing-n:127.0.0.1:33495_) [n:127.0.0.1:33495_    ] o.a.s.c.c.ZkStateReader Updated live nodes from ZooKeeper... (1) -> (2)
   [junit4]   2> 1995963 INFO  (zkCallback-784-thread-1-processing-n:127.0.0.1:33900_) [n:127.0.0.1:33900_    ] o.a.s.c.c.ZkStateReader Updated live nodes from ZooKeeper... (1) -> (2)
   [junit4]   2> 1996129 INFO  (OverseerCollectionConfigSetProcessor-98900015091154949-127.0.0.1:33900_-n_0000000000) [n:127.0.0.1:33900_    ] o.a.s.c.OverseerTaskQueue Response ZK path: /overseer/collection-queue-work/qnr-0000000002 doesn't exist.  Requestor may have disconnected from ZooKeeper
   [junit4]   2> 1996276 INFO  (TEST-PeerSyncReplicationTest.test-seed#[F937FCE697463010]) [n:127.0.0.1:33495_    ] o.a.s.m.r.SolrJmxReporter JMX monitoring for 'solr.node' (registry 'solr.node') enabled at server: com.sun.jmx.mbeanserver.JmxMBeanServer@245c85f6
   [junit4]   2> 1996346 INFO  (TEST-PeerSyncReplicationTest.test-seed#[F937FCE697463010]) [n:127.0.0.1:33495_    ] o.a.s.m.r.SolrJmxReporter JMX monitoring for 'solr.jvm' (registry 'solr.jvm') enabled at server: com.sun.jmx.mbeanserver.JmxMBeanServer@245c85f6
   [junit4]   2> 1996346 INFO  (TEST-PeerSyncReplicationTest.test-seed#[F937FCE697463010]) [n:127.0.0.1:33495_    ] o.a.s.m.r.SolrJmxReporter JMX monitoring for 'solr.jetty' (registry 'solr.jetty') enabled at server: com.sun.jmx.mbeanserver.JmxMBeanServer@245c85f6
   [junit4]   2> 1996348 INFO  (TEST-PeerSyncReplicationTest.test-seed#[F937FCE697463010]) [n:127.0.0.1:33495_    ] o.a.s.c.CorePropertiesLocator Found 0 core definitions underneath /home/jenkins/jenkins-slave/workspace/Lucene-Solr-Tests-7.x/solr/build/solr-core/test/J0/temp/solr.cloud.PeerSyncReplicationTest_F937FCE697463010-001/shard-1-001/cores
   [junit4]   2> 1996622 INFO  (qtp1900424130-6741) [n:127.0.0.1:33495_    ] o.a.s.h.a.CollectionsHandler Invoked Collection Action :addreplica with params node=127.0.0.1:33495_&action=ADDREPLICA&collection=collection1&shard=shard1&type=NRT&wt=javabin&version=2 and sendToOCPQueue=true
   [junit4]   2> 1996624 INFO  (OverseerThreadFactory-2236-thread-3-processing-n:127.0.0.1:33900_) [n:127.0.0.1:33900_    ] o.a.s.c.AddReplicaCmd Node Identified 127.0.0.1:33495_ for creating new replica
   [junit4]   2> 1996734 INFO  (qtp1900424130-6735) [n:127.0.0.1:33495_    ] o.a.s.h.a.CoreAdminOperation core create command qt=/admin/cores&collection.configName=conf1&name=collection1_shard1_replica_n21&action=CREATE&collection=collection1&shard=shard1&wt=javabin&version=2&replicaType=NRT
   [junit4]   2> 1996734 INFO  (qtp1900424130-6735) [n:127.0.0.1:33495_    ] o.a.s.c.TransientSolrCoreCacheDefault Allocating transient cache for 4 transient cores
   [junit4]   2> 1997868 INFO  (qtp1900424130-6735) [n:127.0.0.1:33495_ c:collection1 s:shard1  x:collection1_shard1_replica_n21] o.a.s.c.SolrConfig Using Lucene MatchVersion: 7.2.0
   [junit4]   2> 1997994 INFO  (qtp1900424130-6735) [n:127.0.0.1:33495_ c:collection1 s:shard1  x:collection1_shard1_replica_n21] o.a.s.s.IndexSchema [collection1_shard1_replica_n21] Schema name=test
   [junit4]   2> 1999145 INFO  (qtp1900424130-6735) [n:127.0.0.1:33495_ c:collection1 s:shard1  x:collection1_shard1_replica_n21] o.a.s.s.IndexSchema Loaded schema test/1.0 with uniqueid field id
   [junit4]   2> 1999275 INFO  (qtp1900424130-6735) [n:127.0.0.1:33495_ c:collection1 s:shard1  x:collection1_shard1_replica_n21] o.a.s.c.CoreContainer Creating SolrCore 'collection1_shard1_replica_n21' using configuration from collection collection1, trusted=true
   [junit4]   2> 1999275 INFO  (qtp1900424130-6735) [n:127.0.0.1:33495_ c:collection1 s:shard1  x:collection1_shard1_replica_n21] o.a.s.m.r.SolrJmxReporter JMX monitoring for 'solr.core.collection1.shard1.replica_n21' (registry 'solr.core.collection1.shard1.replica_n21') enabled at server: com.sun.jmx.mbeanserver.JmxMBeanServer@245c85f6
   [junit4]   2> 1999275 INFO  (qtp1900424130-6735) [n:127.0.0.1:33495_ c:collection1 s:shard1  x:collection1_shard1_replica_n21] o.a.s.c.SolrCore solr.RecoveryStrategy.Builder
   [junit4]   2> 1999275 INFO  (qtp1900424130-6735) [n:127.0.0.1:33495_ c:collection1 s:shard1  x:collection1_shard1_replica_n21] o.a.s.c.SolrCore [[collection1_shard1_replica_n21] ] Opening new SolrCore at [/home/jenkins/jenkins-slave/workspace/Lucene-Solr-Tests-7.x/solr/build/solr-core/test/J0/temp/solr.cloud.PeerSyncReplicationTest_F937FCE697463010-001/shard-1-001/cores/collection1_shard1_replica_n21], dataDir=[/home/jenkins/jenkins-slave/workspace/Lucene-Solr-Tests-7.x/solr/build/solr-core/test/J0/temp/solr.cloud.PeerSyncReplicationTest_F937FCE697463010-001/shard-1-001/cores/collection1_shard1_replica_n21/data/]
   [junit4]   2> 1999347 INFO  (qtp1900424130-6735) [n:127.0.0.1:33495_ c:collection1 s:shard1  x:collection1_shard1_replica_n21] o.a.s.u.RandomMergePolicy RandomMergePolicy wrapping class org.apache.lucene.index.TieredMergePolicy: [TieredMergePolicy: maxMergeAtOnce=27, maxMergeAtOnceExplicit=37, maxMergedSegmentMB=32.7412109375, floorSegmentMB=0.9931640625, forceMergeDeletesPctAllowed=4.645882138600275, segmentsPerTier=33.0, maxCFSSegmentSizeMB=8.796093022207999E12, noCFSRatio=0.4070763039360047
   [junit4]   2> 1999386 WARN  (qtp1900424130-6735) [n:127.0.0.1:33495_ c:collection1 s:shard1  x:collection1_shard1_replica_n21] o.a.s.c.RequestHandlers INVALID paramSet a in requestHandler {type = requestHandler,name = /dump,class = DumpRequestHandler,attributes = {initParams=a, name=/dump, class=DumpRequestHandler},args = {defaults={a=A,b=B}}}
   [junit4]   2> 1999844 INFO  (qtp1900424130-6735) [n:127.0.0.1:33495_ c:collection1 s:shard1  x:collection1_shard1_replica_n21] o.a.s.u.UpdateHandler Using UpdateLog implementation: org.apache.solr.update.UpdateLog
   [junit4]   2> 1999844 INFO  (qtp1900424130-6735) [n:127.0.0.1:33495_ c:collection1 s:shard1  x:collection1_shard1_replica_n21] o.a.s.u.UpdateLog Initializing UpdateLog: dataDir= defaultSyncLevel=FLUSH numRecordsToKeep=1000 maxNumLogsToKeep=10 numVersionBuckets=65536
   [junit4]   2> 1999845 INFO  (qtp1900424130-6735) [n:127.0.0.1:33495_ c:collection1 s:shard1  x:collection1_shard1_replica_n21] o.a.s.u.CommitTracker Hard AutoCommit: disabled
   [junit4]   2> 1999845 INFO  (qtp1900424130-6735) [n:127.0.0.1:33495_ c:collection1 s:shard1  x:collection1_shard1_replica_n21] o.a.s.u.CommitTracker Soft AutoCommit: disabled
   [junit4]   2> 1999846 INFO  (qtp1900424130-6735) [n:127.0.0.1:33495_ c:collection1 s:shard1  x:collection1_shard1_replica_n21] o.a.s.u.RandomMergePolicy RandomMergePolicy wrapping class org.apache.lucene.index.TieredMergePolicy: [TieredMergePolicy: maxMergeAtOnce=19, maxMergeAtOnceExplicit=27, maxMergedSegmentMB=16.9990234375, floorSegmentMB=1.7177734375, forceMergeDeletesPctAllowed=29.80170751436371, segmentsPerTier=17.0, maxCFSSegmentSizeMB=8.796093022207999E12, noCFSRatio=0.25869791656211993
   [junit4]   2> 1999847 INFO  (qtp1900424130-6735) [n:127.0.0.1:33495_ c:collection1 s:shard1  x:collection1_shard1_replica_n21] o.a.s.s.SolrIndexSearcher Opening [Searcher@52595c65[collection1_shard1_replica_n21] main]
   [junit4]   2> 1999848 INFO  (qtp1900424130-6735) [n:127.0.0.1:33495_ c:collection1 s:shard1  x:collection1_shard1_replica_n21] o.a.s.r.ManagedResourceStorage Configured ZooKeeperStorageIO with znodeBase: /configs/conf1
   [junit4]   2> 1999862 INFO  (qtp1900424130-6735) [n:127.0.0.1:33495_ c:collection1 s:shard1  x:collection1_shard1_replica_n21] o.a.s.r.ManagedResourceStorage Loaded null at path _rest_managed.json using ZooKeeperStorageIO:path=/configs/conf1
   [junit4]   2> 1999863 INFO  (qtp1900424130-6735) [n:127.0.0.1:33495_ c:collection1 s:shard1  x:collection1_shard1_replica_n21] o.a.s.h.ReplicationHandler Commits will be reserved for 10000ms.
   [junit4]   2> 1999897 INFO  (searcherExecutor-2250-thread-1-processing-n:127.0.0.1:33495_ x:collection1_shard1_replica_n21 s:shard1 c:collection1) [n:127.0.0.1:33495_ c:collection1 s:shard1  x:collection1_shard1_replica_n21] o.a.s.c.SolrCore [collection1_shard1_replica_n21] Registered new searcher Searcher@52595c65[collection1_shard1_replica_n21] main{ExitableDirectoryReader(UninvertingDirectoryReader())}
   [junit4]   2> 1999897 INFO  (qtp1900424130-6735) [n:127.0.0.1:33495_ c:collection1 s:shard1  x:collection1_shard1_replica_n21] o.a.s.u.UpdateLog Could not find max version in index or recent updates, using new clock 1582400257256325120
   [junit4]   2> 1999900 INFO  (qtp1900424130-6735) [n:127.0.0.1:33495_ c:collection1 s:shard1  x:collection1_shard1_replica_n21] o.a.s.c.ShardLeaderElectionContext Enough replicas found to continue.
   [junit4]   2> 1999900 INFO  (qtp1900424130-6735) [n:127.0.0.1:33495_ c:collection1 s:shard1  x:collection1_shard1_replica_n21] o.a.s.c.ShardLeaderElectionContext I may be the new leader - try and sync
   [junit4]   2> 1999900 INFO  (qtp1900424130-6735) [n:127.0.0.1:33495_ c:collection1 s:shard1  x:collection1_shard1_replica_n21] o.a.s.c.SyncStrategy Sync replicas to https://127.0.0.1:33495/collection1_shard1_replica_n21/
   [junit4]   2> 1999900 INFO  (qtp1900424130-6735) [n:127.0.0.1:33495_ c:collection1 s:shard1  x:collection1_shard1_replica_n21] o.a.s.c.SyncStrategy Sync Success - now sync replicas to me
   [junit4]   2> 1999900 INFO  (qtp1900424130-6735) [n:127.0.0.1:33495_ c:collection1 s:shard1  x:collection1_shard1_replica_n21] o.a.s.c.SyncStrategy https://127.0.0.1:33495/collection1_shard1_replica_n21/ has no replicas
   [junit4]   2> 1999900 INFO  (qtp1900424130-6735) [n:127.0.0.1:33495_ c:collection1 s:shard1  x:collection1_shard1_replica_n21] o.a.s.c.ShardLeaderElectionContext Found all replicas participating in election, clear LIR
   [junit4]   2> 1999918 INFO  (qtp1900424130-6735) [n:127.0.0.1:33495_ c:collection1 s:shard1  x:collection1_shard1_replica_n21] o.a.s.c.ShardLeaderElectionContext I am the new leader: https://127.0.0.1:33495/collection1_shard1_replica_n21/ shard1
   [junit4]   2> 1999970 INFO  (qtp1900424130-6735) [n:127.0.0.1:33495_ c:collection1 s:shard1  x:collection1_shard1_replica_n21] o.a.s.c.ZkController I am the leader, no recovery necessary
   [junit4]   2> 1999971 INFO  (qtp1900424130-6735) [n:127.0.0.1:33495_ c:collection1 s:shard1  x:collection1_shard1_replica_n21] o.a.s.s.HttpSolrCall [admin] webapp=null path=/admin/cores params={qt=/admin/cores&collection.configName=conf1&name=collection1_shard1_replica_n21&action=CREATE&collection=collection1&shard=shard1&wt=javabin&version=2&replicaType=NRT} status=0 QTime=3237
   [junit4]   2> 1999973 INFO  (qtp1900424130-6741) [n:127.0.0.1:33495_    ] o.a.s.s.HttpSolrCall [admin] webapp=null path=/admin/collections params={node=127.0.0.1:33495_&action=ADDREPLICA&collection=collection1&shard=shard1&type=NRT&wt=javabin&version=2} status=0 QTime=3350
   [junit4]   2> 2000646 INFO  (OverseerCollectionConfigSetProcessor-98900015091154949-127.0.0.1:33900_-n_0000000000) [n:127.0.0.1:33900_    ] o.a.s.c.OverseerTaskQueue Response ZK path: /overseer/collection-queue-work/qnr-0000000004 doesn't exist.  Requestor may have disconnected from ZooKeeper
   [junit4]   2> 2000724 INFO  (TEST-PeerSyncReplicationTest.test-seed#[F937FCE697463010]) [    ] o.a.s.c.AbstractFullDistribZkTestBase create jetty 2 in directory /home/jenkins/jenkins-slave/workspace/Lucene-Solr-Tests-7.x/solr/build/solr-core/test/J0/temp/solr.cloud.PeerSyncReplicationTest_F937FCE697463010-001/shard-2-001 of type NRT
   [junit4]   2> 2000725 INFO  (TEST-PeerSyncReplicationTest.test-seed#[F937FCE697463010]) [    ] o.e.j.s.Server jetty-9.3.20.v20170531
   [junit4]   2> 2000886 INFO  (TEST-PeerSyncReplicationTest.test-seed#[F937FCE697463010]) [    ] o.e.j.s.h.ContextHandler Started o.e.j.s.ServletContextHandler@14b74cae{/,null,AVAILABLE}
   [junit4]   2> 2000886 INFO  (TEST-PeerSyncReplicationTest.test-seed#[F937FCE697463010]) [    ] o.e.j.s.AbstractConnector Started ServerConnector@504f126f{SSL,[ssl, http/1.1]}{127.0.0.1:35892}
   [junit4]   2> 2000886 INFO  (TEST-PeerSyncReplicationTest.test-seed#[F937FCE697463010]) [    ] o.e.j.s.Server Started @2017275ms
   [junit4]   2> 2000886 INFO  (TEST-PeerSyncReplicationTest.test-seed#[F937FCE697463010]) [    ] o.a.s.c.s.e.JettySolrRunner Jetty properties: {solr.data.dir=/home/jenkins/jenkins-slave/workspace/Lucene-Solr-Tests-7.x/solr/build/solr-core/test/J0/temp/solr.cloud.PeerSyncReplicationTest_F937FCE697463010-001/tempDir-001/jetty2, solrconfig=solrconfig.xml, hostContext=/, hostPort=35892, coreRootDirectory=/home/jenkins/jenkins-slave/workspace/Lucene-Solr-Tests-7.x/solr/build/solr-core/test/J0/temp/solr.cloud.PeerSyncReplicationTest_F937FCE697463010-001/shard-2-001/cores}
   [junit4]   2> 2000887 ERROR (TEST-PeerSyncReplicationTest.test-seed#[F937FCE697463010]) [    ] o.a.s.u.StartupLoggingUtils Missing Java Option solr.log.dir. Logging may be missing or incomplete.
   [junit4]   2> 2000887 INFO  (TEST-PeerSyncReplicationTest.test-seed#[F937FCE697463010]) [    ] o.a.s.s.SolrDispatchFilter  ___      _       Welcome to Apache Solr? version 7.2.0
   [junit4]   2> 2000887 INFO  (TEST-PeerSyncReplicationTest.test-seed#[F937FCE697463010]) [    ] o.a.s.s.SolrDispatchFilter / __| ___| |_ _   Starting in cloud mode on port null
   [junit4]   2> 2000887 INFO  (TEST-PeerSyncReplicationTest.test-seed#[F937FCE697463010]) [    ] o.a.s.s.SolrDispatchFilter \__ \/ _ \ | '_|  Install dir: null, Default config dir: null
   [junit4]   2> 2000887 INFO  (TEST-PeerSyncReplicationTest.test-seed#[F937FCE697463010]) [    ] o.a.s.s.SolrDispatchFilter |___/\___/_|_|    Start time: 2017-10-27T08:54:44.610Z
   [junit4]   2> 2000975 INFO  (TEST-PeerSyncReplicationTest.test-seed#[F937FCE697463010]) [    ] o.a.s.s.SolrDispatchFilter Loading solr.xml from SolrHome (not found in ZooKeeper)
   [junit4]   2> 2000975 INFO  (TEST-PeerSyncReplicationTest.test-seed#[F937FCE697463010]) [    ] o.a.s.c.SolrXmlConfig Loading container configuration from /home/jenkins/jenkins-slave/workspace/Lucene-Solr-Tests-7.x/solr/build/solr-core/test/J0/temp/solr.cloud.PeerSyncReplicationTest_F937FCE697463010-001/shard-2-001/solr.xml
   [junit4]   2> 2000979 INFO  (TEST-PeerSyncReplicationTest.test-seed#[F937FCE697463010]) [    ] o.a.s.c.SolrXmlConfig Configuration parameter autoReplicaFailoverWorkLoopDelay is ignored
   [junit4]   2> 2000979 INFO  (TEST-PeerSyncReplicationTest.test-seed#[F937FCE697463010]) [    ] o.a.s.c.SolrXmlConfig Configuration parameter autoReplicaFailoverBadNodeExpiration is ignored
   [junit4]   2> 2001012 INFO  (TEST-PeerSyncReplicationTest.test-seed#[F937FCE697463010]) [    ] o.a.s.c.SolrXmlConfig MBean server found: com.sun.jmx.mbeanserver.JmxMBeanServer@245c85f6, but no JMX reporters were configured - adding default JMX reporter.
   [junit4]   2> 2001049 INFO  (TEST-PeerSyncReplicationTest.test-seed#[F937FCE697463010]) [    ] o.a.s.c.ZkContainer Zookeeper client=127.0.0.1:33010/solr
   [junit4]   2> 2001108 INFO  (TEST-PeerSyncReplicationTest.test-seed#[F937FCE697463010]) [n:127.0.0.1:35892_    ] o.a.s.c.c.ZkStateReader Updated live nodes from ZooKeeper... (0) -> (2)
   [junit4]   2> 2001143 INFO  (TEST-PeerSyncReplicationTest.test-seed#[F937FCE697463010]) [n:127.0.0.1:35892_    ] o.a.s.c.Overseer Overseer (id=null) closing
   [junit4]   2> 2001145 INFO  (TEST-PeerSyncReplicationTest.test-seed#[F937FCE697463010]) [n:127.0.0.1:35892_    ] o.a.s.c.ZkController Register node as live in ZooKeeper:/live_nodes/127.0.0.1:35892_
   [junit4]   2> 2001145 INFO  (zkCallback-792-thread-1) [    ] o.a.s.c.c.ZkStateReader Updated live nodes from ZooKeeper... (2) -> (3)
   [junit4]   2> 2001145 INFO  (zkCallback-797-thread-1-processing-n:127.0.0.1:33495_) [n:127.0.0.1:33495_    ] o.a.s.c.c.ZkStateReader Updated live nodes from ZooKeeper... (2) -> (3)
   [junit4]   2> 2001158 INFO  (zkCallback-784-thread-1-processing-n:127.0.0.1:33900_) [n:127.0.0.1:33900_    ] o.a.s.c.c.ZkStateReader Updated live nodes from ZooKeeper... (2) -> (3)
   [junit4]   2> 2001216 INFO  (zkCallback-803-thread-1-processing-n:127.0.0.1:35892_) [n:127.0.0.1:35892_    ] o.a.s.c.c.ZkStateReader Updated live nodes from ZooKeeper... (2) -> (3)
   [junit4]   2> 2002031 INFO  (TEST-PeerSyncReplicationTest.test-seed#[F937FCE697463010]) [n:127.0.0.1:35892_    ] o.a.s.m.r.SolrJmxReporter JMX monitoring for 'solr.node' (registry 'solr.node') enabled at server: com.sun.jmx.mbeanserver.JmxMBeanServer@245c85f6
   [junit4]   2> 2002127 INFO  (TEST-PeerSyncReplicationTest.test-seed#[F937FCE697463010]) [n:127.0.0.1:35892_    ] o.a.s.m.r.SolrJmxReporter JMX monitoring for 'solr.jvm' (registry 'solr.jvm') enabled at server: com.sun.jmx.mbeanserver.JmxMBeanServer@245c85f6
   [junit4]   2> 2002127 INFO  (TEST-PeerSyncReplicationTest.test-seed#[F937FCE697463010]) [n:127.0.0.1:35892_    ] o.a.s.m.r.SolrJmxReporter JMX monitoring for 'solr.jetty' (registry 'solr.jetty') enabled at server: com.sun.jmx.mbeanserver.JmxMBeanServer@245c85f6
   [junit4]   2> 2002129 INFO  (TEST-PeerSyncReplicationTest.test-seed#[F937FCE697463010]) [n:127.0.0.1:35892_    ] o.a.s.c.CorePropertiesLocator Found 0 core definitions underneath /home/jenkins/jenkins-slave/workspace/Lucene-Solr-Tests-7.x/solr/build/solr-core/test/J0/temp/solr.cloud.PeerSyncReplicationTest_F937FCE697463010-001/shard-2-001/cores
   [junit4]   2> 2002733 INFO  (qtp1900424130-6734) [n:127.0.0.1:33495_    ] o.a.s.h.a.CollectionsHandler Invoked Collection Action :addreplica with params node=127.0.0.1:35892_&action=ADDREPLICA&collection=collection1&shard=shard1&type=NRT&wt=javabin&version=2 and sendToOCPQueue=true
   [junit4]   2> 2002735 INFO  (OverseerThreadFactory-2236-thread-4-processing-n:127.0.0.1:33900_) [n:127.0.0.1:33900_    ] o.a.s.c.AddReplicaCmd Node Identified 127.0.0.1:35892_ for creating new replica
   [junit4]   2> 2003168 INFO  (qtp301720388-6770) [n:127.0.0.1:35892_    ] o.a.s.h.a.CoreAdminOperation core create command qt=/admin/cores&collection.configName=conf1&name=collection1_shard1_replica_n23&action=CREATE&collection=collection1&shard=shard1&wt=javabin&version=2&replicaType=NRT
   [junit4]   2> 2003168 INFO  (qtp301720388-6770) [n:127.0.0.1:35892_    ] o.a.s.c.TransientSolrCoreCacheDefault Allocating transient cache for 4 transient cores
   [junit4]   2> 2004304 INFO  (qtp301720388-6770) [n:127.0.0.1:35892_ c:collection1 s:shard1  x:collection1_shard1_replica_n23] o.a.s.c.SolrConfig Using Lucene MatchVersion: 7.2.0
   [junit4]   2> 2004466 INFO  (qtp301720388-6770) [n:127.0.0.1:35892_ c:collection1 s:shard1  x:collection1_shard1_replica_n23] o.a.s.s.IndexSchema [collection1_shard1_replica_n23] Schema name=test
   [junit4]   2> 2005369 INFO  (qtp301720388-6770) [n:127.0.0.1:35892_ c:collection1 s:shard1  x:collection1_shard1_replica_n23] o.a.s.s.IndexSchema Loaded schema test/1.0 with uniqueid field id
   [junit4]   2> 2005408 INFO  (qtp301720388-6770) [n:127.0.0.1:35892_ c:collection1 s:shard1  x:collection1_shard1_replica_n23] o.a.s.c.CoreContainer Creating SolrCore 'collection1_shard1_replica_n23' using configuration from collection collection1, trusted=true
   [junit4]   2> 2005408 INFO  (qtp301720388-6770) [n:127.0.0.1:35892_ c:collection1 s:shard1  x:collection1_shard1_replica_n23] o.a.s.m.r.SolrJmxReporter JMX monitoring for 'solr.core.collection1.shard1.replica_n23' (registry 'solr.core.collection1.shard1.replica_n23') enabled at server: com.sun.jmx.mbeanserver.JmxMBeanServer@245c85f6
   [junit4]   2> 2005408 INFO  (qtp301720388-6770) [n:127.0.0.1:35892_ c:collection1 s:shard1  x:collection1_shard1_replica_n23] o.a.s.c.SolrCore solr.RecoveryStrategy.Builder
   [junit4]   2> 2005408 INFO  (qtp301720388-6770) [n:127.0.0.1:35892_ c:collection1 s:shard1  x:collection1_shard1_replica_n23] o.a.s.c.SolrCore [[collection1_shard1_replica_n23] ] Opening new SolrCore at [/home/jenkins/jenkins-slave/workspace/Lucene-Solr-Tests-7.x/solr/build/solr-core/test/J0/temp/solr.cloud.PeerSyncReplicationTest_F937FCE697463010-001/shard-2-001/cores/collection1_shard1_replica_n23], dataDir=[/home/jenkins/jenkins-slave/workspace/Lucene-Solr-Tests-7.x/solr/build/solr-core/test/J0/temp/solr.cloud.PeerSyncReplicationTest_F937FCE697463010-001/shard-2-001/cores/collection1_shard1_replica_n23/data/]
   [junit4]   2> 2005444 INFO  (qtp301720388-6770) [n:127.0.0.1:35892_ c:collection1 s:shard1  x:collection1_shard1_replica_n23] o.a.s.u.RandomMergePolicy RandomMergePolicy wrapping class org.apache.lucene.index.TieredMergePolicy: [TieredMergePolicy: maxMergeAtOnce=27, maxMergeAtOnceExplicit=37, maxMergedSegmentMB=32.7412109375, floorSegmentMB=0.9931640625, forceMergeDeletesPctAllowed=4.645882138600275, segmentsPerTier=33.0, maxCFSSegmentSizeMB=8.796093022207999E12, noCFSRatio=0.4070763039360047
   [junit4]   2> 2005508 WARN  (qtp301720388-6770) [n:127.0.0.1:35892_ c:collection1 s:shard1  x:collection1_shard1_replica_n23] o.a.s.c.RequestHandlers INVALID paramSet a in requestHandler {type = requestHandler,name = /dump,class = DumpRequestHandler,attributes = {initParams=a, name=/dump, class=DumpRequestHandler},args = {defaults={a=A,b=B}}}
   [junit4]   2> 2005984 INFO  (qtp301720388-6770) [n:127.0.0.1:35892_ c:collection1 s:shard1  x:collection1_shard1_replica_n23] o.a.s.u.UpdateHandler Using UpdateLog implementation: org.apache.solr.update.UpdateLog
   [junit4]   2> 2005984 INFO  (qtp301720388-6770) [n:127.0.0.1:35892_ c:collection1 s:shard1  x:collection1_shard1_replica_n23] o.a.s.u.UpdateLog Initializing UpdateLog: dataDir= defaultSyncLevel=FLUSH numRecordsToKeep=1000 maxNumLogsToKeep=10 numVersionBuckets=65536
   [junit4]   2> 2005985 INFO  (qtp301720388-6770) [n:127.0.0.1:35892_ c:collection1 s:shard1  x:collection1_shard1_replica_n23] o.a.s.u.CommitTracker Hard AutoCommit: disabled
   [junit4]   2> 2005985 INFO  (qtp301720388-6770) [n:127.0.0.1:35892_ c:collection1 s:shard1  x:collection1_shard1_replica_n23] o.a.s.u.CommitTracker Soft AutoCommit: disabled
   [junit4]   2> 2005986 INFO  (qtp301720388-6770) [n:127.0.0.1:35892_ c:collection1 s:shard1  x:collection1_shard1_replica_n23] o.a.s.u.RandomMergePolicy RandomMergePolicy wrapping class org.apache.lucene.index.TieredMergePolicy: [TieredMergePolicy: maxMergeAtOnce=19, maxMergeAtOnceExplicit=27, maxMergedSegmentMB=16.9990234375, floorSegmentMB=1.7177734375, forceMergeDeletesPctAllowed=29.80170751436371, segmentsPerTier=17.0, maxCFSSegmentSizeMB=8.796093022207999E12, noCFSRatio=0.25869791656211993
   [junit4]   2> 2006021 INFO  (qtp301720388-6770) [n:127.0.0.1:35892_ c:collection1 s:shard1  x:collection1_shard1_replica_n23] o.a.s.s.SolrIndexSearcher Opening [Searcher@cd9f940[collection1_shard1_replica_n23] main]
   [junit4]   2> 2006022 INFO  (qtp301720388-6770) [n:127.0.0.1:35892_ c:collection1 s:shard1  x:collection1_shard1_replica_n23] o.a.s.r.ManagedResourceStorage Configured ZooKeeperStorageIO with znodeBase: /configs/conf1
   [junit4]   2> 2006023 INFO  (qtp301720388-6770) [n:127.0.0.1:35892_ c:collection1 s:shard1  x:collection1_shard1_replica_n23] o.a.s.r.ManagedResourceStorage Loaded null at path _rest_managed.json using ZooKeeperStorageIO:path=/configs/conf1
   [junit4]   2> 2006057 INFO  (qtp301720388-6770) [n:127.0.0.1:35892_ c:collection1 s:shard1  x:collection1_shard1_replica_n23] o.a.s.h.ReplicationHandler Commits will be reserved for 10000ms.
   [junit4]   2> 2006059 INFO  (searcherExecutor-2261-thread-1-processing-n:127.0.0.1:35892_ x:collection1_shard1_replica_n23 s:shard1 c:collection1) [n:127.0.0.1:35892_ c:collection1 s:shard1  x:collection1_shard1_replica_n23] o.a.s.c.SolrCore [collection1_shard1_replica_n23] Registered new searcher Searcher@cd9f940[collection1_shard1_replica_n23] main{ExitableDirectoryReader(UninvertingDirectoryReader())}
   [junit4]   2> 2006059 INFO  (qtp301720388-6770) [n:127.0.0.1:35892_ c:collection1 s:shard1  x:collection1_shard1_replica_n23] o.a.s.u.UpdateLog Could not find max version in index or recent updates, using new clock 1582400263717650432
   [junit4]   2> 2006116 INFO  (qtp301720388-6770) [n:127.0.0.1:35892_ c:collection1 s:shard1  x:collection1_shard1_replica_n23] o.a.s.c.ZkController Core needs to recover:collection1_shard1_replica_n23
   [junit4]   2> 2006116 INFO  (qtp301720388-6770) [n:127.0.0.1:35892_ c:collection1 s:shard1  x:collection1_shard1_replica_n23] o.a.s.s.HttpSolrCall [admin] webapp=null path=/admin/cores params={qt=/admin/cores&collection.configName=conf1&name=collection1_shard1_replica_n23&action=CREATE&collection=collection1&shard=shard1&wt=javabin&version=2&replicaType=NRT} status=0 QTime=2997
   [junit4]   2> 2006131 INFO  (qtp1900424130-6734) [n:127.0.0.1:33495_    ] o.a.s.s.HttpSolrCall [admin] webapp=null path=/admin/collections params={node=127.0.0.1:35892_&action=ADDREPLICA&collection=collection1&shard=shard1&type=NRT&wt=javabin&version=2} status=0 QTime=3398
   [junit4]   2> 2006133 INFO  (updateExecutor-800-thread-1-processing-n:127.0.0.1:35892_ x:collection1_shard1_replica_n23 s:shard1 c:collection1) [n:127.0.0.1:35892_ c:collection1 s:shard1 r:core_node24 x:collection1_shard1_replica_n23] o.a.s.u.DefaultSolrCoreState Running recovery
   [junit4]   2> 2006133 INFO  (recoveryExecutor-801-thread-1-processing-n:127.0.0.1:35892_ x:collection1_shard1_replica_n23 s:shard1 c:collection1 r:core_node24) [n:127.0.0.1:35892_ c:collection1 s:shard1 r:core_node24 x:collection1_shard1_replica_n23] o.a.s.c.RecoveryStrategy Starting recovery process. recoveringAfterStartup=true
   [junit4]   2> 2006194 INFO  (recoveryExecutor-801-thread-1-processing-n:127.0.0.1:35892_ x:collection1_shard1_replica_n23 s:shard1 c:collection1 r:core_node24) [n:127.0.0.1:35892_ c:collection1 s:shard1 r:core_node24 x:collection1_shard1_replica_n23] o.a.s.c.RecoveryStrategy ###### startupVersions=[[]]
   [junit4]   2> 2006195 INFO  (recoveryExecutor-801-thread-1-processing-n:127.0.0.1:35892_ x:collection1_shard1_replica_n23 s:shard1 c:collection1 r:core_node24) [n:127.0.0.1:35892_ c:collection1 s:shard1 r:core_node24 x:collection1_shard1_replica_n23] o.a.s.c.RecoveryStrategy Begin buffering updates. core=[collection1_shard1_replica_n23]
   [junit4]   2> 2006195 INFO  (recoveryExecutor-801-thread-1-processing-n:127.0.0.1:35892_ x:collection1_shard1_replica_n23 s:shard1 c:collection1 r:core_node24) [n:127.0.0.1:35892_ c:collection1 s:shard1 r:core_node24 x:collection1_shard1_replica_n23] o.a.s.u.UpdateLog Starting to buffer updates. FSUpdateLog{state=ACTIVE, tlog=null}
   [junit4]   2> 2006195 INFO  (recoveryExecutor-801-thread-1-processing-n:127.0.0.1:35892_ x:collection1_shard1_replica_n23 s:shard1 c:collection1 r:core_node24) [n:127.0.0.1:35892_ c:collection1 s:shard1 r:core_node24 x:collection1_shard1_replica_n23] o.a.s.c.RecoveryStrategy Publishing state of core [collection1_shard1_replica_n23] as recovering, leader is [https://127.0.0.1:33495/collection1_shard1_replica_n21/] and I am [https://127.0.0.1:35892/collection1_shard1_replica_n23/]
   [junit4]   2> 2006236 INFO  (recoveryExecutor-801-thread-1-processing-n:127.0.0.1:35892_ x:collection1_shard1_replica_n23 s:shard1 c:collection1 r:core_node24) [n:127.0.0.1:35892_ c:collection1 s:shard1 r:core_node24 x:collection1_shard1_replica_n23] o.a.s.c.RecoveryStrategy Sending prep recovery command to [https://127.0.0.1:33495]; [WaitForState: action=PREPRECOVERY&core=collection1_shard1_replica_n21&nodeName=127.0.0.1:35892_&coreNodeName=core_node24&state=recovering&checkLive=true&onlyIfLeader=true&onlyIfLeaderActive=true]
   [junit4]   2> 2006272 INFO  (qtp1900424130-6738) [n:127.0.0.1:33495_    ] o.a.s.h.a.PrepRecoveryOp Going to wait for coreNodeName: core_node24, state: recovering, checkLive: true, onlyIfLeader: true, onlyIfLeaderActive: true, maxTime: 183 s
   [junit4]   2> 2006272 INFO  (qtp1900424130-6738) [n:127.0.0.1:33495_    ] o.a.s.h.a.PrepRecoveryOp In WaitForState(recovering): collection=collection1, shard=shard1, thisCore=collection1_shard1_replica_n21, leaderDoesNotNeedRecovery=false, isLeader? true, live=true, checkLive=true, currentState=recovering, localState=active, nodeName=127.0.0.1:35892_, coreNodeName=core_node24, onlyIfActiveCheckResult=false, nodeProps: core_node24:{"core":"collection1_shard1_replica_n23","base_url":"https://127.0.0.1:35892","node_name":"127.0.0.1:35892_","state":"recovering","type":"NRT"}
   [junit4]   2> 2006272 INFO  (qtp1900424130-6738) [n:127.0.0.1:33495_    ] o.a.s.h.a.PrepRecoveryOp Waited coreNodeName: core_node24, state: recovering, checkLive: true, onlyIfLeader: true for: 0 seconds.
   [junit4]   2> 2006272 INFO  (qtp1900424130-6738) [n:127.0.0.1:33495_    ] o.a.s.s.HttpSolrCall [admin] webapp=null path=/admin/cores params={nodeName=127.0.0.1:35892_&onlyIfLeaderActive=true&core=collection1_shard1_replica_n21&coreNodeName=core_node24&action=PREPRECOVERY&checkLive=true&state=recovering&onlyIfLeader=true&wt=javabin&version=2} status=0 QTime=0
   [junit4]   2> 2006777 INFO  (OverseerCollectionConfigSetProcessor-98900015091154949-127.0.0.1:33900_-n_0000000000) [n:127.0.0.1:33900_    ] o.a.s.c.OverseerTaskQueue Response ZK path: /overseer/collection-queue-work/qnr-0000000006 doesn't exist.  Requestor may have disconnected from ZooKeeper
   [junit4]   2> 2006971 INFO  (recoveryExecutor-801-thread-1-processing-n:127.0.0.1:35892_ x:collection1_shard1_replica_n23 s:shard1 c:collection1 r:core_node24) [n:127.0.0.1:35892_ c:collection1 s:shard1 r:core_node24 x:collection1_shard1_replica_n23] o.a.s.c.RecoveryStrategy Attempting to PeerSync from [https://127.0.0.1:33495/collection1_shard1_replica_n21/] - recoveringAfterStartup=[true]
   [junit4]   2> 2006972 INFO  (recoveryExecutor-801-thread-1-processing-n:127.0.0.1:35892_ x:collection1_shard1_replica_n23 s:shard1 c:collection1 r:core_node24) [n:127.0.0.1:35892_ c:collection1 s:shard1 r:core_node24 x:collection1_shard1_replica_n23] o.a.s.u.PeerSync PeerSync: core=collection1_shard1_replica_n23 url=https://127.0.0.1:35892 START replicas=[https://127.0.0.1:33495/collection1_shard1_replica_n21/] nUpdates=1000
   [junit4]   2> 2007102 INFO  (qtp1900424130-6739) [n:127.0.0.1:33495_ c:collection1 s:shard1 r:core_node22 x:collection1_shard1_replica_n21] o.a.s.u.IndexFingerprint IndexFingerprint millis:56.0 result:{maxVersionSpecified=9223372036854775807, maxVersionEncountered=0, maxInHash=0, versionsHash=0, numVersions=0, numDocs=0, maxDoc=0}
   [junit4]   2> 2007102 INFO  (qtp1900424130-6739) [n:127.0.0.1:33495_ c:collection1 s:shard1 r:core_node22 x:collection1_shard1_replica_n21] o.a.s.c.S.Request [collection1_shard1_replica_n21]  webapp= path=/get params={distrib=false&qt=/get&getFingerprint=9223372036854775807&wt=javabin&version=2} status=0 QTime=86
   [junit4]   2> 2007119 INFO  (recoveryExecutor-801-thread-1-processing-n:127.0.0.1:35892_ x:collection1_shard1_replica_n23 s:shard1 c:collection1 r:core_node24) [n:127.0.0.1:35892_ c:collection1 s:shard1 r:core_node24 x:collection1_shard1_replica_n23] o.a.s.u.IndexFingerprint IndexFingerprint millis:0.0 result:{maxVersionSpecified=9223372036854775807, maxVersionEncountered=0, maxInHash=0, versionsHash=0, numVersions=0, numDocs=0, maxDoc=0}
   [junit4]   2> 2007119 INFO  (recoveryExecutor-801-thread-1-processing-n:127.0.0.1:35892_ x:collection1_shard1_replica_n23 s:shard1 c:collection1 r:core_node24) [n:127.0.0.1:35892_ c:collection1 s:shard1 r:core_node24 x:collection1_shard1_replica_n23] o.a.s.u.PeerSync We are already in sync. No need to do a PeerSync 
   [junit4]   2> 2007119 INFO  (recoveryExecutor-801-thread-1-processing-n:127.0.0.1:35892_ x:collection1_shard1_replica_n23 s:shard1 c:collection1 r:core_node24) [n:127.0.0.1:35892_ c:collection1 s:shard1 r:core_node24 x:collection1_shard1_replica_n23] o.a.s.u.DirectUpdateHandler2 start commit{,optimize=false,openSearcher=true,waitSearcher=true,expungeDeletes=false,softCommit=false,prepareCommit=false}
   [junit4]   2> 2007119 INFO  (recoveryExecutor-801-thread-1-processing-n:127.0.0.1:35892_ x:collection1_shard1_replica_n23 s:shard1 c:collection1 r:core_node24) [n:127.0.0.1:35892_ c:collection1 s:shard1 r:core_node24 x:collection1_shard1_replica_n23] o.a.s.u.DirectUpdateHandler2 No uncommitted changes. Skipping IW.commit.
   [junit4]   2> 2007191 INFO  (recoveryExecutor-801-thread-1-processing-n:127.0.0.1:35892_ x:collection1_shard1_replica_n23 s:shard1 c:collection1 r:core_node24) [n:127.0.0.1:35892_ c:collection1 s:shard1 r:core_node24 x:collection1_shard1_replica_n23] o.a.s.u.DirectUpdateHandler2 end_commit_flush
   [junit4]   2> 2007191 INFO  (recoveryExecutor-801-thread-1-processing-n:127.0.0.1:35892_ x:collection1_shard1_replica_n23 s:shard1 c:collection1 r:core_node24) [n:127.0.0.1:35892_ c:collection1 s:shard1 r:core_node24 x:collection1_shard1_replica_n23] o.a.s.c.RecoveryStrategy PeerSync stage of recovery was successful.
   [junit4]   2> 2007191 INFO  (recoveryExecutor-801-thread-1-processing-n:127.0.0.1:35892_ x:collection1_shard1_replica_n23 s:shard1 c:collection1 r:core_node24) [n:127.0.0.1:35892_ c:collection1 s:shard1 r:core_node24 x:collection1_shard1_replica_n23] o.a.s.c.RecoveryStrategy Replaying updates buffered during PeerSync.
   [junit4]   2> 2007191 INFO  (recoveryExecutor-801-thread-1-processing-n:127.0.0.1:35892_ x:collection1_shard1_replica_n23 s:shard1 c:collection1 r:core_node24) [n:127.0.0.1:35892_ c:collection1 s:shard1 r:core_node24 x:collection1_shard1_replica_n23] o.a.s.c.RecoveryStrategy No replay needed.
   [junit4]   2> 2007192 INFO  (recoveryExecutor-801-thread-1-processing-n:127.0.0.1:35892_ x:collection1_shard1_replica_n23 s:shard1 c:collection1 r:core_node24) [n:127.0.0.1:35892_ c:collection1 s:shard1 r:core_node24 x:collection1_shard1_replica_n23] o.a.s.c.RecoveryStrategy Registering as Active after recovery.
   [junit4]   2> 2007268 INFO  (TEST-PeerSyncReplicationTest.test-seed#[F937FCE697463010]) [    ] o.a.s.c.AbstractFullDistribZkTestBase create jetty 3 in directory /home/jenkins/jenkins-slave/workspace/Lucene-Solr-Tests-7.x/solr/build/solr-core/test/J0/temp/solr.cloud.PeerSyncReplicationTest_F937FCE697463010-001/shard-3-001 of type NRT
   [junit4]   2> 2007317 INFO  (TEST-PeerSyncReplicationTest.test-seed#[F937FCE697463010]) [    ] o.e.j.s.Server jetty-9.3.20.v20170531
   [junit4]   2> 2007427 INFO  (TEST-PeerSyncReplicationTest.test-seed#[F937FCE697463010]) [    ] o.e.j.s.h.ContextHandler Started o.e.j.s.ServletContextHandler@20a6a8d0{/,null,AVAILABLE}
   [junit4]   2> 2007430 INFO  (TEST-PeerSyncReplicationTest.test-seed#[F937FCE697463010]) [    ] o.e.j.s.AbstractConnector Started ServerConnector@76aeb631{SSL,[ssl, http/1.1]}{127.0.0.1:41808}
   [junit4]   2> 2007430 INFO  (TEST-PeerSyncReplicationTest.test-seed#[F937FCE697463010]) [    ] o.e.j.s.Server Started @2023819ms
   [junit4]   2> 2007430 INFO  (TEST-PeerSyncReplicationTest.test-seed#[F937FCE697463010]) [    ] o.a.s.c.s.e.JettySolrRunner Jetty properties: {solr.data.dir=/home/jenkins/jenkins-slave/workspace/Lucene-Solr-Tests-7.x/solr/build/solr-core/test/J0/temp/solr.cloud.PeerSyncReplicationTest_F937FCE697463010-001/tempDir-001/jetty3, solrconfig=solrconfig.xml, hostContext=/, hostPort=41808, coreRootDirectory=/home/jenkins/jenkins-slave/workspace/Lucene-Solr-Tests-7.x/solr/build/solr-core/test/J0/../../../../../../../../../../home/jenkins/jenkins-slave/workspace/Lucene-Solr-Tests-7.x/solr/build/solr-core/test/J0/temp/solr.cloud.PeerSyncReplicationTest_F937FCE697463010-001/shard-3-001/cores}
   [junit4]   2> 2007430 ERROR (TEST-PeerSyncReplicationTest.test-seed#[F937FCE697463010]) [    ] o.a.s.u.StartupLoggingUtils Missing Java Option solr.log.dir. Logging may be missing or incomplete.
   [junit4]   2> 2007447 INFO  (TEST-PeerSyncReplicationTest.test-seed#[F937FCE697463010]) [    ] o.a.s.s.SolrDispatchFilter  ___      _       Welcome to Apache Solr? version 7.2.0
   [junit4]   2> 2007448 INFO  (TEST-PeerSyncReplicationTest.test-seed#[F937FCE697463010]) [    ] o.a.s.s.SolrDispatchFilter / __| ___| |_ _   Starting in cloud mode on port null
   [junit4]   2> 2007448 INFO  (TEST-PeerSyncReplicationTest.test-seed#[F937FCE697463010]) [    ] o.a.s.s.SolrDispatchFilter \__ \/ _ \ | '_|  Install dir: null, Default config dir: null
   [junit4]   2> 2007448 INFO  (TEST-PeerSyncReplicationTest.test-seed#[F937FCE697463010]) [    ] o.a.s.s.SolrDispatchFilter |___/\___/_|_|    Start time: 2017-10-27T08:54:51.171Z
   [junit4]   2> 2007533 INFO  (TEST-PeerSyncReplicationTest.test-seed#[F937FCE697463010]) [    ] o.a.s.s.SolrDispatchFilter Loading solr.xml from SolrHome (not found in ZooKeeper)
   [junit4]   2> 2007533 INFO  (TEST-PeerSyncReplicationTest.test-seed#[F937FCE697463010]) [    ] o.a.s.c.SolrXmlConfig Loading container configuration from /home/jenkins/jenkins-slave/workspace/Lucene-Solr-Tests-7.x/solr/build/solr-core/test/J0/temp/solr.cloud.PeerSyncReplicationTest_F937FCE697463010-001/shard-3-001/solr.xml
   [junit4]   2> 2007536 INFO  (TEST-PeerSyncReplicationTest.test-seed#[F937FCE697463010]) [    ] o.a.s.c.SolrXmlConfig Configuration parameter autoReplicaFailoverWorkLoopDelay is ignored
   [junit4]   2> 2007536 INFO  (TEST-PeerSyncReplicationTest.test-seed#[F937FCE697463010]) [    ] o.a.s.c.SolrXmlConfig Configuration parameter autoReplicaFailoverBadNodeExpiration is ignored
   [junit4]   2> 2007570 INFO  (TEST-PeerSyncReplicationTest.test-seed#[F937FCE697463010]) [    ] o.a.s.c.SolrXmlConfig MBean server found: com.sun.jmx.mbeanserver.JmxMBeanServer@245c85f6, but no JMX reporters were configured - adding default JMX reporter.
   [junit4]   2> 2007628 INFO  (TEST-PeerSyncReplicationTest.test-seed#[F937FCE697463010]) [    ] o.a.s.c.ZkContainer Zookeeper client=127.0.0.1:33010/solr
   [junit4]   2> 2007685 INFO  (TEST-PeerSyncReplicationTest.test-seed#[F937FCE697463010]) [n:127.0.0.1:41808_    ] o.a.s.c.c.ZkStateReader Updated live nodes from ZooKeeper... (0) -> (3)
   [junit4]   2> 2007686 INFO  (TEST-PeerSyncReplicationTest.test-seed#[F937FCE697463010]) [n:127.0.0.1:41808_    ] o.a.s.c.Overseer Overseer (id=null) closing
   [junit4]   2> 2007687 INFO  (TEST-PeerSyncReplicationTest.test-seed#[F937FCE697463010]) [n:127.0.0.1:41808_    ] o.a.s.c.ZkController Register node as live in ZooKeeper:/live_nodes/127.0.0.1:41808_
   [junit4]   2> 2007720 INFO  (zkCallback-784-thread-1-processing-n:127.0.0.1:33900_) [n:127.0.0.1:33900_    ] o.a.s.c.c.ZkStateReader Updated live nodes from ZooKeeper... (3) -> (4)
   [junit4]   2> 2007793 INFO  (zkCallback-810-thread-1-processing-n:127.0.0.1:41808_) [n:127.0.0.1:41808_    ] o.a.s.c.c.ZkStateReader Updated live nodes from ZooKeeper... (3) -> (4)
   [junit4]   2> 2007793 INFO  (zkCallback-803-thread-1-processing-n:127.0.0.1:35892_) [n:127.0.0.1:35892_    ] o.a.s.c.c.ZkStateReader Updated live nodes from ZooKeeper... (3) -> (4)
   [junit4]   2> 2007720 INFO  (zkCallback-792-thread-1) [    ] o.a.s.c.c.ZkStateReader Updated live nodes from ZooKeeper... (3) -> (4)
   [junit4]   2> 2007821 INFO  (zkCallback-797-thread-1-processing-n:127.0.0.1:33495_) [n:127.0.0.1:33495_    ] o.a.s.c.c.ZkStateReader Updated live nodes from ZooKeeper... (3) -> (4)
   [junit4]   2> 2008401 INFO  (TEST-PeerSyncReplicationTest.test-seed#[F937FCE697463010]) [n:127.0.0.1:41808_    ] o.a.s.m.r.SolrJmxReporter JMX monitoring for 'solr.node' (registry 'solr.node') enabled at server: com.sun.jmx.mbeanserver.JmxMBeanServer@245c85f6
   [junit4]   2> 2008563 INFO  (TEST-PeerSyncReplicationTest.test-seed#[F937FCE697463010]) [n:127.0.0.1:41808_    ] o.a.s.m.r.SolrJmxReporter JMX monitoring for 'solr.jvm' (registry 'solr.jvm') enabled at server: com.sun.jmx.mbeanserver.JmxMBeanServer@245c85f6
   [junit4]   2> 2008563 INFO  (TEST-PeerSyncReplicationTest.test-seed#[F937FCE697463010]) [n:127.0.0.1:41808_    ] o.a.s.m.r.SolrJmxReporter JMX monitoring for 'solr.jetty' (registry 'solr.jetty') enabled at server: com.sun.jmx.mbeanserver.JmxMBeanServer@245c85f6
   [junit4]   2> 2008564 INFO  (TEST-PeerSyncReplicationTest.test-seed#[F937FCE697463010]) [n:127.0.0.1:41808_    ] o.a.s.c.CorePropertiesLocator Found 0 core definitions underneath /home/jenkins/jenkins-slave/workspace/Lucene-Solr-Tests-7.x/solr/build/solr-core/test/J0/../../../../../../../../../../home/jenkins/jenkins-slave/workspace/Lucene-Solr-Tests-7.x/solr/build/solr-core/test/J0/temp/solr.cloud.PeerSyncReplicationTest_F937FCE697463010-001/shard-3-001/cores
   [junit4]   2> 2008856 INFO  (qtp1900424130-6740) [n:127.0.0.1:33495_    ] o.a.s.h.a.CollectionsHandler Invoked Collection Action :addreplica with params node=127.0.0.1:41808_&action=ADDREPLICA&collection=collection1&shard=shard1&type=NRT&wt=javabin&version=2 and sendToOCPQueue=true
   [junit4]   2> 2008892 INFO  (OverseerThreadFactory-2236-thread-5-processing-n:127.0.0.1:33900_) [n:127.0.0.1:33900_    ] o.a.s.c.AddReplicaCmd Node Identified 127.0.0.1:41808_ for creating new replica
   [junit4]   2> 2009207 INFO  (qtp950198755-6802) [n:127.0.0.1:41808_    ] o.a.s.h.a.CoreAdminOperation core create command qt=/admin/cores&collection.configName=conf1&name=collection1_shard1_replica_n25&action=CREATE&collection=collection1&shard=shard1&wt=javabin&version=2&replicaType=NRT
   [junit4]   2> 2009207 INFO  (qtp950198755-6802) [n:127.0.0.1:41808_    ] o.a.s.c.TransientSolrCoreCacheDefault Allocating transient cache for 4 transient cores
   [junit4]   2> 2010447 INFO  (qtp950198755-6802) [n:127.0.0.1:41808_ c:collection1 s:shard1  x:collection1_shard1_replica_n25] o.a.s.c.SolrConfig Using Lucene MatchVersion: 7.2.0
   [junit4]   2> 2010722 INFO  (qtp950198755-6802) [n:127.0.0.1:41808_ c:collection1 s:shard1  x:collection1_shard1_rep

[...truncated too long message...]

ng() + ": " + e.getMessage(), e);
 [ecj-lint] 	^^^^^^^^^^^^^^^^^^^^^^^^^^^^^^^^^^^^^^^^^^^^^^^^^^^^^^^^^^^^^^^^^^
 [ecj-lint] Resource leak: 'client' is not closed at this location
 [ecj-lint] ----------
 [ecj-lint] ----------
 [ecj-lint] 11. WARNING in /home/jenkins/jenkins-slave/workspace/Lucene-Solr-Tests-7.x/solr/core/src/test/org/apache/solr/highlight/HighlighterTest.java (at line 204)
 [ecj-lint] 	Analyzer a1 = new WhitespaceAnalyzer();
 [ecj-lint] 	         ^^
 [ecj-lint] Resource leak: 'a1' is never closed
 [ecj-lint] ----------
 [ecj-lint] 12. WARNING in /home/jenkins/jenkins-slave/workspace/Lucene-Solr-Tests-7.x/solr/core/src/test/org/apache/solr/highlight/HighlighterTest.java (at line 207)
 [ecj-lint] 	OffsetWindowTokenFilter tots = new OffsetWindowTokenFilter(tokenStream);
 [ecj-lint] 	                        ^^^^
 [ecj-lint] Resource leak: 'tots' is never closed
 [ecj-lint] ----------
 [ecj-lint] 13. WARNING in /home/jenkins/jenkins-slave/workspace/Lucene-Solr-Tests-7.x/solr/core/src/test/org/apache/solr/highlight/HighlighterTest.java (at line 211)
 [ecj-lint] 	Analyzer a2 = new WhitespaceAnalyzer();
 [ecj-lint] 	         ^^
 [ecj-lint] Resource leak: 'a2' is never closed
 [ecj-lint] ----------
 [ecj-lint] ----------
 [ecj-lint] 14. WARNING in /home/jenkins/jenkins-slave/workspace/Lucene-Solr-Tests-7.x/solr/core/src/test/org/apache/solr/response/TestJavabinTupleStreamParser.java (at line 72)
 [ecj-lint] 	JavabinTupleStreamParser parser = new JavabinTupleStreamParser(new ByteArrayInputStream(bytes), true);
 [ecj-lint] 	                         ^^^^^^
 [ecj-lint] Resource leak: 'parser' is never closed
 [ecj-lint] ----------
 [ecj-lint] ----------
 [ecj-lint] 15. WARNING in /home/jenkins/jenkins-slave/workspace/Lucene-Solr-Tests-7.x/solr/core/src/test/org/apache/solr/search/TestDocSet.java (at line 243)
 [ecj-lint] 	return loadfactor!=0 ? new HashDocSet(a,0,n,1/loadfactor) : new HashDocSet(a,0,n);
 [ecj-lint] 	                       ^^^^^^^^^^^^^^^^^^^^^^^^^^^^^^^^^^
 [ecj-lint] Resource leak: '<unassigned Closeable value>' is never closed
 [ecj-lint] ----------
 [ecj-lint] 16. WARNING in /home/jenkins/jenkins-slave/workspace/Lucene-Solr-Tests-7.x/solr/core/src/test/org/apache/solr/search/TestDocSet.java (at line 528)
 [ecj-lint] 	DocSet a = new BitDocSet(bs);
 [ecj-lint] 	       ^
 [ecj-lint] Resource leak: 'a' is never closed
 [ecj-lint] ----------
 [ecj-lint] ----------
 [ecj-lint] 17. WARNING in /home/jenkins/jenkins-slave/workspace/Lucene-Solr-Tests-7.x/solr/core/src/test/org/apache/solr/security/TestPKIAuthenticationPlugin.java (at line 76)
 [ecj-lint] 	final MockPKIAuthenticationPlugin mock = new MockPKIAuthenticationPlugin(null, nodeName);
 [ecj-lint] 	                                  ^^^^
 [ecj-lint] Resource leak: 'mock' is never closed
 [ecj-lint] ----------
 [ecj-lint] 18. WARNING in /home/jenkins/jenkins-slave/workspace/Lucene-Solr-Tests-7.x/solr/core/src/test/org/apache/solr/security/TestPKIAuthenticationPlugin.java (at line 131)
 [ecj-lint] 	MockPKIAuthenticationPlugin mock1 = new MockPKIAuthenticationPlugin(null, nodeName) {
 [ecj-lint] 	                            ^^^^^
 [ecj-lint] Resource leak: 'mock1' is never closed
 [ecj-lint] ----------
 [ecj-lint] ----------
 [ecj-lint] 19. WARNING in /home/jenkins/jenkins-slave/workspace/Lucene-Solr-Tests-7.x/solr/core/src/test/org/apache/solr/security/TestRuleBasedAuthorizationPlugin.java (at line 380)
 [ecj-lint] 	RuleBasedAuthorizationPlugin plugin = new RuleBasedAuthorizationPlugin();
 [ecj-lint] 	                             ^^^^^^
 [ecj-lint] Resource leak: 'plugin' is never closed
 [ecj-lint] ----------
 [ecj-lint] ----------
 [ecj-lint] 20. WARNING in /home/jenkins/jenkins-slave/workspace/Lucene-Solr-Tests-7.x/solr/core/src/test/org/apache/solr/security/TestSha256AuthenticationProvider.java (at line 49)
 [ecj-lint] 	BasicAuthPlugin basicAuthPlugin = new BasicAuthPlugin();
 [ecj-lint] 	                ^^^^^^^^^^^^^^^
 [ecj-lint] Resource leak: 'basicAuthPlugin' is never closed
 [ecj-lint] ----------
 [ecj-lint] ----------
 [ecj-lint] 21. WARNING in /home/jenkins/jenkins-slave/workspace/Lucene-Solr-Tests-7.x/solr/core/src/test/org/apache/solr/spelling/SimpleQueryConverter.java (at line 42)
 [ecj-lint] 	WhitespaceAnalyzer analyzer = new WhitespaceAnalyzer();
 [ecj-lint] 	                   ^^^^^^^^
 [ecj-lint] Resource leak: 'analyzer' is never closed
 [ecj-lint] ----------
 [ecj-lint] ----------
 [ecj-lint] 22. WARNING in /home/jenkins/jenkins-slave/workspace/Lucene-Solr-Tests-7.x/solr/core/src/test/org/apache/solr/uninverting/TestFieldCacheVsDocValues.java (at line 139)
 [ecj-lint] 	IndexWriter w = new IndexWriter(d, newIndexWriterConfig(analyzer));
 [ecj-lint] 	            ^
 [ecj-lint] Resource leak: 'w' is never closed
 [ecj-lint] ----------
 [ecj-lint] 23. WARNING in /home/jenkins/jenkins-slave/workspace/Lucene-Solr-Tests-7.x/solr/core/src/test/org/apache/solr/uninverting/TestFieldCacheVsDocValues.java (at line 172)
 [ecj-lint] 	throw iae;
 [ecj-lint] 	^^^^^^^^^^
 [ecj-lint] Resource leak: 'w' is not closed at this location
 [ecj-lint] ----------
 [ecj-lint] 24. WARNING in /home/jenkins/jenkins-slave/workspace/Lucene-Solr-Tests-7.x/solr/core/src/test/org/apache/solr/uninverting/TestFieldCacheVsDocValues.java (at line 178)
 [ecj-lint] 	return;
 [ecj-lint] 	^^^^^^^
 [ecj-lint] Resource leak: 'w' is not closed at this location
 [ecj-lint] ----------
 [ecj-lint] ----------
 [ecj-lint] 25. WARNING in /home/jenkins/jenkins-slave/workspace/Lucene-Solr-Tests-7.x/solr/core/src/test/org/apache/solr/update/SolrCmdDistributorTest.java (at line 134)
 [ecj-lint] 	SolrCmdDistributor cmdDistrib = new SolrCmdDistributor(updateShardHandler);
 [ecj-lint] 	                   ^^^^^^^^^^
 [ecj-lint] Resource leak: 'cmdDistrib' is never closed
 [ecj-lint] ----------
 [ecj-lint] 26. WARNING in /home/jenkins/jenkins-slave/workspace/Lucene-Solr-Tests-7.x/solr/core/src/test/org/apache/solr/update/SolrCmdDistributorTest.java (at line 333)
 [ecj-lint] 	SolrCmdDistributor cmdDistrib = new SolrCmdDistributor(streamingClients, 5, 0);
 [ecj-lint] 	                   ^^^^^^^^^^
 [ecj-lint] Resource leak: 'cmdDistrib' is never closed
 [ecj-lint] ----------
 [ecj-lint] 27. WARNING in /home/jenkins/jenkins-slave/workspace/Lucene-Solr-Tests-7.x/solr/core/src/test/org/apache/solr/update/SolrCmdDistributorTest.java (at line 367)
 [ecj-lint] 	SolrCmdDistributor cmdDistrib = new SolrCmdDistributor(streamingClients, 5, 0);
 [ecj-lint] 	                   ^^^^^^^^^^
 [ecj-lint] Resource leak: 'cmdDistrib' is never closed
 [ecj-lint] ----------
 [ecj-lint] 28. WARNING in /home/jenkins/jenkins-slave/workspace/Lucene-Solr-Tests-7.x/solr/core/src/test/org/apache/solr/update/SolrCmdDistributorTest.java (at line 413)
 [ecj-lint] 	SolrCmdDistributor cmdDistrib = new SolrCmdDistributor(streamingClients, 5, 0);
 [ecj-lint] 	                   ^^^^^^^^^^
 [ecj-lint] Resource leak: 'cmdDistrib' is never closed
 [ecj-lint] ----------
 [ecj-lint] 29. WARNING in /home/jenkins/jenkins-slave/workspace/Lucene-Solr-Tests-7.x/solr/core/src/test/org/apache/solr/update/SolrCmdDistributorTest.java (at line 458)
 [ecj-lint] 	SolrCmdDistributor cmdDistrib = new SolrCmdDistributor(updateShardHandler);
 [ecj-lint] 	                   ^^^^^^^^^^
 [ecj-lint] Resource leak: 'cmdDistrib' is never closed
 [ecj-lint] ----------
 [ecj-lint] 30. WARNING in /home/jenkins/jenkins-slave/workspace/Lucene-Solr-Tests-7.x/solr/core/src/test/org/apache/solr/update/SolrCmdDistributorTest.java (at line 516)
 [ecj-lint] 	SolrCmdDistributor cmdDistrib = new SolrCmdDistributor(updateShardHandler);
 [ecj-lint] 	                   ^^^^^^^^^^
 [ecj-lint] Resource leak: 'cmdDistrib' is never closed
 [ecj-lint] ----------
 [ecj-lint] ----------
 [ecj-lint] 31. WARNING in /home/jenkins/jenkins-slave/workspace/Lucene-Solr-Tests-7.x/solr/core/src/test/org/apache/solr/update/SolrIndexSplitterTest.java (at line 181)
 [ecj-lint] 	EmbeddedSolrServer server1 = new EmbeddedSolrServer(h.getCoreContainer(), "split1");
 [ecj-lint] 	                   ^^^^^^^
 [ecj-lint] Resource leak: 'server1' is never closed
 [ecj-lint] ----------
 [ecj-lint] 32. WARNING in /home/jenkins/jenkins-slave/workspace/Lucene-Solr-Tests-7.x/solr/core/src/test/org/apache/solr/update/SolrIndexSplitterTest.java (at line 182)
 [ecj-lint] 	EmbeddedSolrServer server2 = new EmbeddedSolrServer(h.getCoreContainer(), "split2");
 [ecj-lint] 	                   ^^^^^^^
 [ecj-lint] Resource leak: 'server2' is never closed
 [ecj-lint] ----------
 [ecj-lint] ----------
 [ecj-lint] 33. WARNING in /home/jenkins/jenkins-slave/workspace/Lucene-Solr-Tests-7.x/solr/core/src/test/org/apache/solr/update/processor/RecordingUpdateProcessorFactory.java (at line 67)
 [ecj-lint] 	return recording ? new RecordingUpdateRequestProcessor(commandQueue, next) : next;
 [ecj-lint] 	                   ^^^^^^^^^^^^^^^^^^^^^^^^^^^^^^^^^^^^^^^^^^^^^^^^^^^^^^^
 [ecj-lint] Resource leak: '<unassigned Closeable value>' is never closed
 [ecj-lint] ----------
 [ecj-lint] 33 problems (1 error, 32 warnings)

BUILD FAILED
/home/jenkins/jenkins-slave/workspace/Lucene-Solr-Tests-7.x/build.xml:826: The following error occurred while executing this line:
/home/jenkins/jenkins-slave/workspace/Lucene-Solr-Tests-7.x/build.xml:101: The following error occurred while executing this line:
/home/jenkins/jenkins-slave/workspace/Lucene-Solr-Tests-7.x/solr/build.xml:684: The following error occurred while executing this line:
/home/jenkins/jenkins-slave/workspace/Lucene-Solr-Tests-7.x/lucene/common-build.xml:2093: The following error occurred while executing this line:
/home/jenkins/jenkins-slave/workspace/Lucene-Solr-Tests-7.x/lucene/common-build.xml:2126: Compile failed; see the compiler error output for details.

Total time: 344 minutes 57 seconds
Build step 'Invoke Ant' marked build as failure
Archiving artifacts
Recording test results
Email was triggered for: Failure - Any
Sending email for trigger: Failure - Any

Mime
View raw message