lucene-dev mailing list archives

Site index · List index
Message view « Date » · « Thread »
Top « Date » · « Thread »
From Policeman Jenkins Server <jenk...@thetaphi.de>
Subject [JENKINS] Lucene-Solr-master-MacOSX (64bit/jdk1.8.0) - Build # 4239 - Still Unstable!
Date Fri, 20 Oct 2017 01:36:19 GMT
Build: https://jenkins.thetaphi.de/job/Lucene-Solr-master-MacOSX/4239/
Java: 64bit/jdk1.8.0 -XX:+UseCompressedOops -XX:+UseG1GC

2 tests failed.
FAILED:  org.apache.solr.cloud.FullSolrCloudDistribCmdsTest.test

Error Message:
Could not find collection:collection2

Stack Trace:
java.lang.AssertionError: Could not find collection:collection2
	at __randomizedtesting.SeedInfo.seed([7E5149FDAD2529A4:F605762703D9445C]:0)
	at org.junit.Assert.fail(Assert.java:93)
	at org.junit.Assert.assertTrue(Assert.java:43)
	at org.junit.Assert.assertNotNull(Assert.java:526)
	at org.apache.solr.cloud.AbstractDistribZkTestBase.waitForRecoveriesToFinish(AbstractDistribZkTestBase.java:155)
	at org.apache.solr.cloud.AbstractDistribZkTestBase.waitForRecoveriesToFinish(AbstractDistribZkTestBase.java:140)
	at org.apache.solr.cloud.AbstractDistribZkTestBase.waitForRecoveriesToFinish(AbstractDistribZkTestBase.java:135)
	at org.apache.solr.cloud.AbstractFullDistribZkTestBase.waitForRecoveriesToFinish(AbstractFullDistribZkTestBase.java:908)
	at org.apache.solr.cloud.FullSolrCloudDistribCmdsTest.testIndexingBatchPerRequestWithHttpSolrClient(FullSolrCloudDistribCmdsTest.java:612)
	at org.apache.solr.cloud.FullSolrCloudDistribCmdsTest.test(FullSolrCloudDistribCmdsTest.java:152)
	at sun.reflect.NativeMethodAccessorImpl.invoke0(Native Method)
	at sun.reflect.NativeMethodAccessorImpl.invoke(NativeMethodAccessorImpl.java:62)
	at sun.reflect.DelegatingMethodAccessorImpl.invoke(DelegatingMethodAccessorImpl.java:43)
	at java.lang.reflect.Method.invoke(Method.java:498)
	at com.carrotsearch.randomizedtesting.RandomizedRunner.invoke(RandomizedRunner.java:1737)
	at com.carrotsearch.randomizedtesting.RandomizedRunner$8.evaluate(RandomizedRunner.java:934)
	at com.carrotsearch.randomizedtesting.RandomizedRunner$9.evaluate(RandomizedRunner.java:970)
	at com.carrotsearch.randomizedtesting.RandomizedRunner$10.evaluate(RandomizedRunner.java:984)
	at org.apache.solr.BaseDistributedSearchTestCase$ShardsRepeatRule$ShardsFixedStatement.callStatement(BaseDistributedSearchTestCase.java:993)
	at org.apache.solr.BaseDistributedSearchTestCase$ShardsRepeatRule$ShardsStatement.evaluate(BaseDistributedSearchTestCase.java:968)
	at com.carrotsearch.randomizedtesting.rules.SystemPropertiesRestoreRule$1.evaluate(SystemPropertiesRestoreRule.java:57)
	at org.apache.lucene.util.TestRuleSetupTeardownChained$1.evaluate(TestRuleSetupTeardownChained.java:49)
	at org.apache.lucene.util.AbstractBeforeAfterRule$1.evaluate(AbstractBeforeAfterRule.java:45)
	at org.apache.lucene.util.TestRuleThreadAndTestName$1.evaluate(TestRuleThreadAndTestName.java:48)
	at org.apache.lucene.util.TestRuleIgnoreAfterMaxFailures$1.evaluate(TestRuleIgnoreAfterMaxFailures.java:64)
	at org.apache.lucene.util.TestRuleMarkFailure$1.evaluate(TestRuleMarkFailure.java:47)
	at com.carrotsearch.randomizedtesting.rules.StatementAdapter.evaluate(StatementAdapter.java:36)
	at com.carrotsearch.randomizedtesting.ThreadLeakControl$StatementRunner.run(ThreadLeakControl.java:368)
	at com.carrotsearch.randomizedtesting.ThreadLeakControl.forkTimeoutingTask(ThreadLeakControl.java:817)
	at com.carrotsearch.randomizedtesting.ThreadLeakControl$3.evaluate(ThreadLeakControl.java:468)
	at com.carrotsearch.randomizedtesting.RandomizedRunner.runSingleTest(RandomizedRunner.java:943)
	at com.carrotsearch.randomizedtesting.RandomizedRunner$5.evaluate(RandomizedRunner.java:829)
	at com.carrotsearch.randomizedtesting.RandomizedRunner$6.evaluate(RandomizedRunner.java:879)
	at com.carrotsearch.randomizedtesting.RandomizedRunner$7.evaluate(RandomizedRunner.java:890)
	at com.carrotsearch.randomizedtesting.rules.StatementAdapter.evaluate(StatementAdapter.java:36)
	at com.carrotsearch.randomizedtesting.rules.SystemPropertiesRestoreRule$1.evaluate(SystemPropertiesRestoreRule.java:57)
	at org.apache.lucene.util.AbstractBeforeAfterRule$1.evaluate(AbstractBeforeAfterRule.java:45)
	at com.carrotsearch.randomizedtesting.rules.StatementAdapter.evaluate(StatementAdapter.java:36)
	at org.apache.lucene.util.TestRuleStoreClassName$1.evaluate(TestRuleStoreClassName.java:41)
	at com.carrotsearch.randomizedtesting.rules.NoShadowingOrOverridesOnMethodsRule$1.evaluate(NoShadowingOrOverridesOnMethodsRule.java:40)
	at com.carrotsearch.randomizedtesting.rules.NoShadowingOrOverridesOnMethodsRule$1.evaluate(NoShadowingOrOverridesOnMethodsRule.java:40)
	at com.carrotsearch.randomizedtesting.rules.StatementAdapter.evaluate(StatementAdapter.java:36)
	at com.carrotsearch.randomizedtesting.rules.StatementAdapter.evaluate(StatementAdapter.java:36)
	at com.carrotsearch.randomizedtesting.rules.StatementAdapter.evaluate(StatementAdapter.java:36)
	at org.apache.lucene.util.TestRuleAssertionsRequired$1.evaluate(TestRuleAssertionsRequired.java:53)
	at org.apache.lucene.util.TestRuleMarkFailure$1.evaluate(TestRuleMarkFailure.java:47)
	at org.apache.lucene.util.TestRuleIgnoreAfterMaxFailures$1.evaluate(TestRuleIgnoreAfterMaxFailures.java:64)
	at org.apache.lucene.util.TestRuleIgnoreTestSuites$1.evaluate(TestRuleIgnoreTestSuites.java:54)
	at com.carrotsearch.randomizedtesting.rules.StatementAdapter.evaluate(StatementAdapter.java:36)
	at com.carrotsearch.randomizedtesting.ThreadLeakControl$StatementRunner.run(ThreadLeakControl.java:368)
	at java.lang.Thread.run(Thread.java:748)


FAILED:  org.apache.solr.cloud.autoscaling.ExecutePlanActionTest.testIntegration

Error Message:
Timed out waiting for replicas of collection to be 2 again null Live Nodes: [127.0.0.1:58384_solr] Last available state: DocCollection(testIntegration//collections/testIntegration/state.json/8)={   "pullReplicas":"0",   "replicationFactor":"2",   "shards":{"shard1":{       "range":"80000000-7fffffff",       "state":"active",       "replicas":{         "core_node3":{           "core":"testIntegration_shard1_replica_n1",           "base_url":"http://127.0.0.1:58384/solr",           "node_name":"127.0.0.1:58384_solr",           "state":"active",           "type":"NRT",           "leader":"true"},         "core_node4":{           "core":"testIntegration_shard1_replica_n2",           "base_url":"http://127.0.0.1:58383/solr",           "node_name":"127.0.0.1:58383_solr",           "state":"down",           "type":"NRT"}}}},   "router":{"name":"compositeId"},   "maxShardsPerNode":"1",   "autoAddReplicas":"false",   "nrtReplicas":"2",   "tlogReplicas":"0"}

Stack Trace:
java.lang.AssertionError: Timed out waiting for replicas of collection to be 2 again
null
Live Nodes: [127.0.0.1:58384_solr]
Last available state: DocCollection(testIntegration//collections/testIntegration/state.json/8)={
  "pullReplicas":"0",
  "replicationFactor":"2",
  "shards":{"shard1":{
      "range":"80000000-7fffffff",
      "state":"active",
      "replicas":{
        "core_node3":{
          "core":"testIntegration_shard1_replica_n1",
          "base_url":"http://127.0.0.1:58384/solr",
          "node_name":"127.0.0.1:58384_solr",
          "state":"active",
          "type":"NRT",
          "leader":"true"},
        "core_node4":{
          "core":"testIntegration_shard1_replica_n2",
          "base_url":"http://127.0.0.1:58383/solr",
          "node_name":"127.0.0.1:58383_solr",
          "state":"down",
          "type":"NRT"}}}},
  "router":{"name":"compositeId"},
  "maxShardsPerNode":"1",
  "autoAddReplicas":"false",
  "nrtReplicas":"2",
  "tlogReplicas":"0"}
	at __randomizedtesting.SeedInfo.seed([7E5149FDAD2529A4:CE3047D1881A8881]:0)
	at org.junit.Assert.fail(Assert.java:93)
	at org.apache.solr.cloud.SolrCloudTestCase.waitForState(SolrCloudTestCase.java:269)
	at org.apache.solr.cloud.autoscaling.ExecutePlanActionTest.testIntegration(ExecutePlanActionTest.java:209)
	at sun.reflect.NativeMethodAccessorImpl.invoke0(Native Method)
	at sun.reflect.NativeMethodAccessorImpl.invoke(NativeMethodAccessorImpl.java:62)
	at sun.reflect.DelegatingMethodAccessorImpl.invoke(DelegatingMethodAccessorImpl.java:43)
	at java.lang.reflect.Method.invoke(Method.java:498)
	at com.carrotsearch.randomizedtesting.RandomizedRunner.invoke(RandomizedRunner.java:1737)
	at com.carrotsearch.randomizedtesting.RandomizedRunner$8.evaluate(RandomizedRunner.java:934)
	at com.carrotsearch.randomizedtesting.RandomizedRunner$9.evaluate(RandomizedRunner.java:970)
	at com.carrotsearch.randomizedtesting.RandomizedRunner$10.evaluate(RandomizedRunner.java:984)
	at com.carrotsearch.randomizedtesting.rules.SystemPropertiesRestoreRule$1.evaluate(SystemPropertiesRestoreRule.java:57)
	at org.apache.lucene.util.TestRuleSetupTeardownChained$1.evaluate(TestRuleSetupTeardownChained.java:49)
	at org.apache.lucene.util.AbstractBeforeAfterRule$1.evaluate(AbstractBeforeAfterRule.java:45)
	at org.apache.lucene.util.TestRuleThreadAndTestName$1.evaluate(TestRuleThreadAndTestName.java:48)
	at org.apache.lucene.util.TestRuleIgnoreAfterMaxFailures$1.evaluate(TestRuleIgnoreAfterMaxFailures.java:64)
	at org.apache.lucene.util.TestRuleMarkFailure$1.evaluate(TestRuleMarkFailure.java:47)
	at com.carrotsearch.randomizedtesting.rules.StatementAdapter.evaluate(StatementAdapter.java:36)
	at com.carrotsearch.randomizedtesting.ThreadLeakControl$StatementRunner.run(ThreadLeakControl.java:368)
	at com.carrotsearch.randomizedtesting.ThreadLeakControl.forkTimeoutingTask(ThreadLeakControl.java:817)
	at com.carrotsearch.randomizedtesting.ThreadLeakControl$3.evaluate(ThreadLeakControl.java:468)
	at com.carrotsearch.randomizedtesting.RandomizedRunner.runSingleTest(RandomizedRunner.java:943)
	at com.carrotsearch.randomizedtesting.RandomizedRunner$5.evaluate(RandomizedRunner.java:829)
	at com.carrotsearch.randomizedtesting.RandomizedRunner$6.evaluate(RandomizedRunner.java:879)
	at com.carrotsearch.randomizedtesting.RandomizedRunner$7.evaluate(RandomizedRunner.java:890)
	at com.carrotsearch.randomizedtesting.rules.StatementAdapter.evaluate(StatementAdapter.java:36)
	at com.carrotsearch.randomizedtesting.rules.SystemPropertiesRestoreRule$1.evaluate(SystemPropertiesRestoreRule.java:57)
	at org.apache.lucene.util.AbstractBeforeAfterRule$1.evaluate(AbstractBeforeAfterRule.java:45)
	at com.carrotsearch.randomizedtesting.rules.StatementAdapter.evaluate(StatementAdapter.java:36)
	at org.apache.lucene.util.TestRuleStoreClassName$1.evaluate(TestRuleStoreClassName.java:41)
	at com.carrotsearch.randomizedtesting.rules.NoShadowingOrOverridesOnMethodsRule$1.evaluate(NoShadowingOrOverridesOnMethodsRule.java:40)
	at com.carrotsearch.randomizedtesting.rules.NoShadowingOrOverridesOnMethodsRule$1.evaluate(NoShadowingOrOverridesOnMethodsRule.java:40)
	at com.carrotsearch.randomizedtesting.rules.StatementAdapter.evaluate(StatementAdapter.java:36)
	at com.carrotsearch.randomizedtesting.rules.StatementAdapter.evaluate(StatementAdapter.java:36)
	at com.carrotsearch.randomizedtesting.rules.StatementAdapter.evaluate(StatementAdapter.java:36)
	at org.apache.lucene.util.TestRuleAssertionsRequired$1.evaluate(TestRuleAssertionsRequired.java:53)
	at org.apache.lucene.util.TestRuleMarkFailure$1.evaluate(TestRuleMarkFailure.java:47)
	at org.apache.lucene.util.TestRuleIgnoreAfterMaxFailures$1.evaluate(TestRuleIgnoreAfterMaxFailures.java:64)
	at org.apache.lucene.util.TestRuleIgnoreTestSuites$1.evaluate(TestRuleIgnoreTestSuites.java:54)
	at com.carrotsearch.randomizedtesting.rules.StatementAdapter.evaluate(StatementAdapter.java:36)
	at com.carrotsearch.randomizedtesting.ThreadLeakControl$StatementRunner.run(ThreadLeakControl.java:368)
	at java.lang.Thread.run(Thread.java:748)




Build Log:
[...truncated 11905 lines...]
   [junit4] Suite: org.apache.solr.cloud.autoscaling.ExecutePlanActionTest
   [junit4]   2> Creating dataDir: /Users/jenkins/workspace/Lucene-Solr-master-MacOSX/solr/build/solr-core/test/J1/temp/solr.cloud.autoscaling.ExecutePlanActionTest_7E5149FDAD2529A4-001/init-core-data-001
   [junit4]   2> 337756 WARN  (SUITE-ExecutePlanActionTest-seed#[7E5149FDAD2529A4]-worker) [    ] o.a.s.SolrTestCaseJ4 startTrackingSearchers: numOpens=1 numCloses=1
   [junit4]   2> 337757 INFO  (SUITE-ExecutePlanActionTest-seed#[7E5149FDAD2529A4]-worker) [    ] o.a.s.SolrTestCaseJ4 Using PointFields (NUMERIC_POINTS_SYSPROP=true) w/NUMERIC_DOCVALUES_SYSPROP=true
   [junit4]   2> 337762 INFO  (SUITE-ExecutePlanActionTest-seed#[7E5149FDAD2529A4]-worker) [    ] o.a.s.SolrTestCaseJ4 Randomized ssl (false) and clientAuth (false) via: @org.apache.solr.util.RandomizeSSL(reason=, value=NaN, ssl=NaN, clientAuth=NaN) w/ MAC_OS_X supressed clientAuth
   [junit4]   2> 337762 INFO  (SUITE-ExecutePlanActionTest-seed#[7E5149FDAD2529A4]-worker) [    ] o.a.s.SolrTestCaseJ4 SecureRandom sanity checks: test.solr.allowed.securerandom=null & java.security.egd=file:/dev/./urandom
   [junit4]   2> 337763 INFO  (SUITE-ExecutePlanActionTest-seed#[7E5149FDAD2529A4]-worker) [    ] o.a.s.c.MiniSolrCloudCluster Starting cluster of 2 servers in /Users/jenkins/workspace/Lucene-Solr-master-MacOSX/solr/build/solr-core/test/J1/temp/solr.cloud.autoscaling.ExecutePlanActionTest_7E5149FDAD2529A4-001/tempDir-001
   [junit4]   2> 337763 INFO  (SUITE-ExecutePlanActionTest-seed#[7E5149FDAD2529A4]-worker) [    ] o.a.s.c.ZkTestServer STARTING ZK TEST SERVER
   [junit4]   2> 337763 INFO  (Thread-553) [    ] o.a.s.c.ZkTestServer client port:0.0.0.0/0.0.0.0:0
   [junit4]   2> 337763 INFO  (Thread-553) [    ] o.a.s.c.ZkTestServer Starting server
   [junit4]   2> 337767 ERROR (Thread-553) [    ] o.a.z.s.ZooKeeperServer ZKShutdownHandler is not registered, so ZooKeeper server won't take any action on ERROR or SHUTDOWN server state changes
   [junit4]   2> 337863 INFO  (SUITE-ExecutePlanActionTest-seed#[7E5149FDAD2529A4]-worker) [    ] o.a.s.c.ZkTestServer start zk server on port:58381
   [junit4]   2> 337886 INFO  (jetty-launcher-346-thread-2) [    ] o.e.j.s.Server jetty-9.3.20.v20170531
   [junit4]   2> 337886 INFO  (jetty-launcher-346-thread-1) [    ] o.e.j.s.Server jetty-9.3.20.v20170531
   [junit4]   2> 337889 INFO  (jetty-launcher-346-thread-2) [    ] o.e.j.s.h.ContextHandler Started o.e.j.s.ServletContextHandler@222ad202{/solr,null,AVAILABLE}
   [junit4]   2> 337890 INFO  (jetty-launcher-346-thread-1) [    ] o.e.j.s.h.ContextHandler Started o.e.j.s.ServletContextHandler@3bd268a0{/solr,null,AVAILABLE}
   [junit4]   2> 337891 INFO  (jetty-launcher-346-thread-1) [    ] o.e.j.s.AbstractConnector Started ServerConnector@6351264c{HTTP/1.1,[http/1.1]}{127.0.0.1:58384}
   [junit4]   2> 337891 INFO  (jetty-launcher-346-thread-1) [    ] o.e.j.s.Server Started @341911ms
   [junit4]   2> 337891 INFO  (jetty-launcher-346-thread-1) [    ] o.a.s.c.s.e.JettySolrRunner Jetty properties: {hostContext=/solr, hostPort=58384}
   [junit4]   2> 337892 INFO  (jetty-launcher-346-thread-2) [    ] o.e.j.s.AbstractConnector Started ServerConnector@265cf032{HTTP/1.1,[http/1.1]}{127.0.0.1:58383}
   [junit4]   2> 337892 INFO  (jetty-launcher-346-thread-2) [    ] o.e.j.s.Server Started @341912ms
   [junit4]   2> 337892 INFO  (jetty-launcher-346-thread-2) [    ] o.a.s.c.s.e.JettySolrRunner Jetty properties: {hostContext=/solr, hostPort=58383}
   [junit4]   2> 337892 ERROR (jetty-launcher-346-thread-1) [    ] o.a.s.u.StartupLoggingUtils Missing Java Option solr.log.dir. Logging may be missing or incomplete.
   [junit4]   2> 337892 ERROR (jetty-launcher-346-thread-2) [    ] o.a.s.u.StartupLoggingUtils Missing Java Option solr.log.dir. Logging may be missing or incomplete.
   [junit4]   2> 337893 INFO  (jetty-launcher-346-thread-1) [    ] o.a.s.s.SolrDispatchFilter  ___      _       Welcome to Apache Solr™ version 8.0.0
   [junit4]   2> 337893 INFO  (jetty-launcher-346-thread-1) [    ] o.a.s.s.SolrDispatchFilter / __| ___| |_ _   Starting in cloud mode on port null
   [junit4]   2> 337893 INFO  (jetty-launcher-346-thread-1) [    ] o.a.s.s.SolrDispatchFilter \__ \/ _ \ | '_|  Install dir: null, Default config dir: null
   [junit4]   2> 337893 INFO  (jetty-launcher-346-thread-1) [    ] o.a.s.s.SolrDispatchFilter |___/\___/_|_|    Start time: 2017-10-20T00:15:54.026Z
   [junit4]   2> 337893 INFO  (jetty-launcher-346-thread-2) [    ] o.a.s.s.SolrDispatchFilter  ___      _       Welcome to Apache Solr™ version 8.0.0
   [junit4]   2> 337893 INFO  (jetty-launcher-346-thread-2) [    ] o.a.s.s.SolrDispatchFilter / __| ___| |_ _   Starting in cloud mode on port null
   [junit4]   2> 337893 INFO  (jetty-launcher-346-thread-2) [    ] o.a.s.s.SolrDispatchFilter \__ \/ _ \ | '_|  Install dir: null, Default config dir: null
   [junit4]   2> 337893 INFO  (jetty-launcher-346-thread-2) [    ] o.a.s.s.SolrDispatchFilter |___/\___/_|_|    Start time: 2017-10-20T00:15:54.026Z
   [junit4]   2> 337897 INFO  (jetty-launcher-346-thread-1) [    ] o.a.s.s.SolrDispatchFilter solr.xml found in ZooKeeper. Loading...
   [junit4]   2> 337898 INFO  (jetty-launcher-346-thread-2) [    ] o.a.s.s.SolrDispatchFilter solr.xml found in ZooKeeper. Loading...
   [junit4]   2> 337908 INFO  (jetty-launcher-346-thread-2) [    ] o.a.s.c.ZkContainer Zookeeper client=127.0.0.1:58381/solr
   [junit4]   2> 337908 INFO  (jetty-launcher-346-thread-1) [    ] o.a.s.c.ZkContainer Zookeeper client=127.0.0.1:58381/solr
   [junit4]   2> 338096 INFO  (jetty-launcher-346-thread-2) [n:127.0.0.1:58383_solr    ] o.a.s.c.Overseer Overseer (id=null) closing
   [junit4]   2> 338098 INFO  (jetty-launcher-346-thread-2) [n:127.0.0.1:58383_solr    ] o.a.s.c.OverseerElectionContext I am going to be the leader 127.0.0.1:58383_solr
   [junit4]   2> 338098 INFO  (jetty-launcher-346-thread-1) [n:127.0.0.1:58384_solr    ] o.a.s.c.Overseer Overseer (id=null) closing
   [junit4]   2> 338099 INFO  (jetty-launcher-346-thread-2) [n:127.0.0.1:58383_solr    ] o.a.s.c.Overseer Overseer (id=98858339788324869-127.0.0.1:58383_solr-n_0000000000) starting
   [junit4]   2> 338100 INFO  (jetty-launcher-346-thread-1) [n:127.0.0.1:58384_solr    ] o.a.s.c.ZkController Register node as live in ZooKeeper:/live_nodes/127.0.0.1:58384_solr
   [junit4]   2> 338101 INFO  (zkCallback-357-thread-1-processing-n:127.0.0.1:58383_solr) [n:127.0.0.1:58383_solr    ] o.a.s.c.c.ZkStateReader Updated live nodes from ZooKeeper... (0) -> (1)
   [junit4]   2> 338102 INFO  (zkCallback-358-thread-1-processing-n:127.0.0.1:58384_solr) [n:127.0.0.1:58384_solr    ] o.a.s.c.c.ZkStateReader Updated live nodes from ZooKeeper... (0) -> (1)
   [junit4]   2> 338113 DEBUG (OverseerAutoScalingTriggerThread-98858339788324869-127.0.0.1:58383_solr-n_0000000000) [n:127.0.0.1:58383_solr    ] o.a.s.c.a.OverseerTriggerThread Adding .autoAddReplicas trigger
   [junit4]   2> 338117 DEBUG (OverseerAutoScalingTriggerThread-98858339788324869-127.0.0.1:58383_solr-n_0000000000) [n:127.0.0.1:58383_solr    ] o.a.s.c.a.OverseerTriggerThread Refreshing /autoscaling.json with znode version 1
   [junit4]   2> 338118 DEBUG (OverseerAutoScalingTriggerThread-98858339788324869-127.0.0.1:58383_solr-n_0000000000) [n:127.0.0.1:58383_solr    ] o.a.s.c.a.NodeLostTrigger Initial livenodes: [127.0.0.1:58384_solr]
   [junit4]   2> 338118 DEBUG (OverseerAutoScalingTriggerThread-98858339788324869-127.0.0.1:58383_solr-n_0000000000) [n:127.0.0.1:58383_solr    ] o.a.s.c.a.OverseerTriggerThread Current znodeVersion 1, lastZnodeVersion -1
   [junit4]   2> 338118 DEBUG (OverseerAutoScalingTriggerThread-98858339788324869-127.0.0.1:58383_solr-n_0000000000) [n:127.0.0.1:58383_solr    ] o.a.s.c.a.OverseerTriggerThread Processed trigger updates upto znodeVersion 1
   [junit4]   2> 338118 INFO  (jetty-launcher-346-thread-2) [n:127.0.0.1:58383_solr    ] o.a.s.c.ZkController Register node as live in ZooKeeper:/live_nodes/127.0.0.1:58383_solr
   [junit4]   2> 338120 INFO  (zkCallback-357-thread-1-processing-n:127.0.0.1:58383_solr) [n:127.0.0.1:58383_solr    ] o.a.s.c.c.ZkStateReader Updated live nodes from ZooKeeper... (1) -> (2)
   [junit4]   2> 338122 DEBUG (OverseerAutoScalingTriggerThread-98858339788324869-127.0.0.1:58383_solr-n_0000000000) [n:127.0.0.1:58383_solr    ] o.a.s.c.a.OverseerTriggerThread -- clean old nodeAdded markers
   [junit4]   2> 338123 DEBUG (OverseerAutoScalingTriggerThread-98858339788324869-127.0.0.1:58383_solr-n_0000000000) [n:127.0.0.1:58383_solr    ] o.a.s.c.a.OverseerTriggerThread Current znodeVersion 1, lastZnodeVersion 1
   [junit4]   2> 338129 DEBUG (ScheduledTrigger-1224-thread-1) [n:127.0.0.1:58383_solr    ] o.a.s.c.a.NodeLostTrigger Running NodeLostTrigger: .auto_add_replicas with currently live nodes: [127.0.0.1:58383_solr, 127.0.0.1:58384_solr]
   [junit4]   2> 338130 INFO  (zkCallback-358-thread-1-processing-n:127.0.0.1:58384_solr) [n:127.0.0.1:58384_solr    ] o.a.s.c.c.ZkStateReader Updated live nodes from ZooKeeper... (1) -> (2)
   [junit4]   2> 338261 INFO  (jetty-launcher-346-thread-1) [n:127.0.0.1:58384_solr    ] o.a.s.m.r.SolrJmxReporter JMX monitoring for 'solr_58384.solr.node' (registry 'solr.node') enabled at server: com.sun.jmx.mbeanserver.JmxMBeanServer@72fd1b1d
   [junit4]   2> 338262 INFO  (jetty-launcher-346-thread-2) [n:127.0.0.1:58383_solr    ] o.a.s.m.r.SolrJmxReporter JMX monitoring for 'solr_58383.solr.node' (registry 'solr.node') enabled at server: com.sun.jmx.mbeanserver.JmxMBeanServer@72fd1b1d
   [junit4]   2> 338274 INFO  (jetty-launcher-346-thread-2) [n:127.0.0.1:58383_solr    ] o.a.s.m.r.SolrJmxReporter JMX monitoring for 'solr_58383.solr.jvm' (registry 'solr.jvm') enabled at server: com.sun.jmx.mbeanserver.JmxMBeanServer@72fd1b1d
   [junit4]   2> 338274 INFO  (jetty-launcher-346-thread-2) [n:127.0.0.1:58383_solr    ] o.a.s.m.r.SolrJmxReporter JMX monitoring for 'solr_58383.solr.jetty' (registry 'solr.jetty') enabled at server: com.sun.jmx.mbeanserver.JmxMBeanServer@72fd1b1d
   [junit4]   2> 338275 INFO  (jetty-launcher-346-thread-2) [n:127.0.0.1:58383_solr    ] o.a.s.c.CorePropertiesLocator Found 0 core definitions underneath /Users/jenkins/workspace/Lucene-Solr-master-MacOSX/solr/build/solr-core/test/J1/temp/solr.cloud.autoscaling.ExecutePlanActionTest_7E5149FDAD2529A4-001/tempDir-001/node2/.
   [junit4]   2> 338281 INFO  (jetty-launcher-346-thread-1) [n:127.0.0.1:58384_solr    ] o.a.s.m.r.SolrJmxReporter JMX monitoring for 'solr_58384.solr.jvm' (registry 'solr.jvm') enabled at server: com.sun.jmx.mbeanserver.JmxMBeanServer@72fd1b1d
   [junit4]   2> 338281 INFO  (jetty-launcher-346-thread-1) [n:127.0.0.1:58384_solr    ] o.a.s.m.r.SolrJmxReporter JMX monitoring for 'solr_58384.solr.jetty' (registry 'solr.jetty') enabled at server: com.sun.jmx.mbeanserver.JmxMBeanServer@72fd1b1d
   [junit4]   2> 338283 INFO  (jetty-launcher-346-thread-1) [n:127.0.0.1:58384_solr    ] o.a.s.c.CorePropertiesLocator Found 0 core definitions underneath /Users/jenkins/workspace/Lucene-Solr-master-MacOSX/solr/build/solr-core/test/J1/temp/solr.cloud.autoscaling.ExecutePlanActionTest_7E5149FDAD2529A4-001/tempDir-001/node1/.
   [junit4]   2> 338333 INFO  (SUITE-ExecutePlanActionTest-seed#[7E5149FDAD2529A4]-worker) [    ] o.a.s.c.c.ZkStateReader Updated live nodes from ZooKeeper... (0) -> (2)
   [junit4]   2> 338335 INFO  (SUITE-ExecutePlanActionTest-seed#[7E5149FDAD2529A4]-worker) [    ] o.a.s.c.s.i.ZkClientClusterStateProvider Cluster at 127.0.0.1:58381/solr ready
   [junit4]   2> 338352 INFO  (TEST-ExecutePlanActionTest.testExecute-seed#[7E5149FDAD2529A4]) [    ] o.a.s.SolrTestCaseJ4 ###Starting testExecute
   [junit4]   2> 338356 DEBUG (zkCallback-357-thread-1-processing-n:127.0.0.1:58383_solr) [n:127.0.0.1:58383_solr    ] o.a.s.c.a.OverseerTriggerThread Refreshing /autoscaling.json with znode version 2
   [junit4]   2> 338356 DEBUG (OverseerAutoScalingTriggerThread-98858339788324869-127.0.0.1:58383_solr-n_0000000000) [n:127.0.0.1:58383_solr    ] o.a.s.c.a.OverseerTriggerThread Processed trigger updates upto znodeVersion 2
   [junit4]   2> 338359 INFO  (qtp2131668350-2272) [n:127.0.0.1:58383_solr    ] o.a.s.h.a.CollectionsHandler Invoked Collection Action :create with params replicationFactor=2&collection.configName=conf&maxShardsPerNode=1&name=testExecute&nrtReplicas=2&action=CREATE&numShards=1&wt=javabin&version=2 and sendToOCPQueue=true
   [junit4]   2> 338362 DEBUG (OverseerAutoScalingTriggerThread-98858339788324869-127.0.0.1:58383_solr-n_0000000000) [n:127.0.0.1:58383_solr    ] o.a.s.c.a.OverseerTriggerThread -- clean old nodeLost markers
   [junit4]   2> 338363 INFO  (OverseerThreadFactory-1226-thread-1-processing-n:127.0.0.1:58383_solr) [n:127.0.0.1:58383_solr    ] o.a.s.c.CreateCollectionCmd Create collection testExecute
   [junit4]   2> 338363 DEBUG (OverseerAutoScalingTriggerThread-98858339788324869-127.0.0.1:58383_solr-n_0000000000) [n:127.0.0.1:58383_solr    ] o.a.s.c.a.OverseerTriggerThread -- clean old nodeAdded markers
   [junit4]   2> 338364 DEBUG (OverseerAutoScalingTriggerThread-98858339788324869-127.0.0.1:58383_solr-n_0000000000) [n:127.0.0.1:58383_solr    ] o.a.s.c.a.OverseerTriggerThread Current znodeVersion 2, lastZnodeVersion 2
   [junit4]   2> 338476 INFO  (OverseerStateUpdate-98858339788324869-127.0.0.1:58383_solr-n_0000000000) [n:127.0.0.1:58383_solr    ] o.a.s.c.o.SliceMutator createReplica() {
   [junit4]   2>   "operation":"ADDREPLICA",
   [junit4]   2>   "collection":"testExecute",
   [junit4]   2>   "shard":"shard1",
   [junit4]   2>   "core":"testExecute_shard1_replica_n1",
   [junit4]   2>   "state":"down",
   [junit4]   2>   "base_url":"http://127.0.0.1:58384/solr",
   [junit4]   2>   "type":"NRT",
   [junit4]   2>   "waitForFinalState":"false"} 
   [junit4]   2> 338480 INFO  (OverseerStateUpdate-98858339788324869-127.0.0.1:58383_solr-n_0000000000) [n:127.0.0.1:58383_solr    ] o.a.s.c.o.SliceMutator createReplica() {
   [junit4]   2>   "operation":"ADDREPLICA",
   [junit4]   2>   "collection":"testExecute",
   [junit4]   2>   "shard":"shard1",
   [junit4]   2>   "core":"testExecute_shard1_replica_n2",
   [junit4]   2>   "state":"down",
   [junit4]   2>   "base_url":"http://127.0.0.1:58383/solr",
   [junit4]   2>   "type":"NRT",
   [junit4]   2>   "waitForFinalState":"false"} 
   [junit4]   2> 338683 INFO  (qtp2131668350-2273) [n:127.0.0.1:58383_solr    ] o.a.s.h.a.CoreAdminOperation core create command qt=/admin/cores&coreNodeName=core_node4&collection.configName=conf&newCollection=true&name=testExecute_shard1_replica_n2&action=CREATE&numShards=1&collection=testExecute&shard=shard1&wt=javabin&version=2&replicaType=NRT
   [junit4]   2> 338683 INFO  (qtp2026556405-2271) [n:127.0.0.1:58384_solr    ] o.a.s.h.a.CoreAdminOperation core create command qt=/admin/cores&coreNodeName=core_node3&collection.configName=conf&newCollection=true&name=testExecute_shard1_replica_n1&action=CREATE&numShards=1&collection=testExecute&shard=shard1&wt=javabin&version=2&replicaType=NRT
   [junit4]   2> 338683 INFO  (qtp2131668350-2273) [n:127.0.0.1:58383_solr    ] o.a.s.c.TransientSolrCoreCacheDefault Allocating transient cache for 2147483647 transient cores
   [junit4]   2> 338684 INFO  (qtp2026556405-2271) [n:127.0.0.1:58384_solr    ] o.a.s.c.TransientSolrCoreCacheDefault Allocating transient cache for 2147483647 transient cores
   [junit4]   2> 338790 INFO  (zkCallback-358-thread-1-processing-n:127.0.0.1:58384_solr) [n:127.0.0.1:58384_solr    ] o.a.s.c.c.ZkStateReader A cluster state change: [WatchedEvent state:SyncConnected type:NodeDataChanged path:/collections/testExecute/state.json] for collection [testExecute] has occurred - updating... (live nodes size: [2])
   [junit4]   2> 338790 INFO  (zkCallback-357-thread-1-processing-n:127.0.0.1:58383_solr) [n:127.0.0.1:58383_solr    ] o.a.s.c.c.ZkStateReader A cluster state change: [WatchedEvent state:SyncConnected type:NodeDataChanged path:/collections/testExecute/state.json] for collection [testExecute] has occurred - updating... (live nodes size: [2])
   [junit4]   2> 338791 INFO  (zkCallback-358-thread-2-processing-n:127.0.0.1:58384_solr) [n:127.0.0.1:58384_solr    ] o.a.s.c.c.ZkStateReader A cluster state change: [WatchedEvent state:SyncConnected type:NodeDataChanged path:/collections/testExecute/state.json] for collection [testExecute] has occurred - updating... (live nodes size: [2])
   [junit4]   2> 338791 INFO  (zkCallback-357-thread-2-processing-n:127.0.0.1:58383_solr) [n:127.0.0.1:58383_solr    ] o.a.s.c.c.ZkStateReader A cluster state change: [WatchedEvent state:SyncConnected type:NodeDataChanged path:/collections/testExecute/state.json] for collection [testExecute] has occurred - updating... (live nodes size: [2])
   [junit4]   2> 339701 INFO  (qtp2131668350-2273) [n:127.0.0.1:58383_solr c:testExecute s:shard1 r:core_node4 x:testExecute_shard1_replica_n2] o.a.s.c.SolrConfig Using Lucene MatchVersion: 8.0.0
   [junit4]   2> 339701 INFO  (qtp2026556405-2271) [n:127.0.0.1:58384_solr c:testExecute s:shard1 r:core_node3 x:testExecute_shard1_replica_n1] o.a.s.c.SolrConfig Using Lucene MatchVersion: 8.0.0
   [junit4]   2> 339706 INFO  (qtp2131668350-2273) [n:127.0.0.1:58383_solr c:testExecute s:shard1 r:core_node4 x:testExecute_shard1_replica_n2] o.a.s.s.IndexSchema [testExecute_shard1_replica_n2] Schema name=minimal
   [junit4]   2> 339706 INFO  (qtp2026556405-2271) [n:127.0.0.1:58384_solr c:testExecute s:shard1 r:core_node3 x:testExecute_shard1_replica_n1] o.a.s.s.IndexSchema [testExecute_shard1_replica_n1] Schema name=minimal
   [junit4]   2> 339709 INFO  (qtp2026556405-2271) [n:127.0.0.1:58384_solr c:testExecute s:shard1 r:core_node3 x:testExecute_shard1_replica_n1] o.a.s.s.IndexSchema Loaded schema minimal/1.1 with uniqueid field id
   [junit4]   2> 339709 INFO  (qtp2131668350-2273) [n:127.0.0.1:58383_solr c:testExecute s:shard1 r:core_node4 x:testExecute_shard1_replica_n2] o.a.s.s.IndexSchema Loaded schema minimal/1.1 with uniqueid field id
   [junit4]   2> 339709 INFO  (qtp2026556405-2271) [n:127.0.0.1:58384_solr c:testExecute s:shard1 r:core_node3 x:testExecute_shard1_replica_n1] o.a.s.c.CoreContainer Creating SolrCore 'testExecute_shard1_replica_n1' using configuration from collection testExecute, trusted=true
   [junit4]   2> 339709 INFO  (qtp2131668350-2273) [n:127.0.0.1:58383_solr c:testExecute s:shard1 r:core_node4 x:testExecute_shard1_replica_n2] o.a.s.c.CoreContainer Creating SolrCore 'testExecute_shard1_replica_n2' using configuration from collection testExecute, trusted=true
   [junit4]   2> 339710 INFO  (qtp2026556405-2271) [n:127.0.0.1:58384_solr c:testExecute s:shard1 r:core_node3 x:testExecute_shard1_replica_n1] o.a.s.m.r.SolrJmxReporter JMX monitoring for 'solr_58384.solr.core.testExecute.shard1.replica_n1' (registry 'solr.core.testExecute.shard1.replica_n1') enabled at server: com.sun.jmx.mbeanserver.JmxMBeanServer@72fd1b1d
   [junit4]   2> 339710 INFO  (qtp2131668350-2273) [n:127.0.0.1:58383_solr c:testExecute s:shard1 r:core_node4 x:testExecute_shard1_replica_n2] o.a.s.m.r.SolrJmxReporter JMX monitoring for 'solr_58383.solr.core.testExecute.shard1.replica_n2' (registry 'solr.core.testExecute.shard1.replica_n2') enabled at server: com.sun.jmx.mbeanserver.JmxMBeanServer@72fd1b1d
   [junit4]   2> 339710 INFO  (qtp2026556405-2271) [n:127.0.0.1:58384_solr c:testExecute s:shard1 r:core_node3 x:testExecute_shard1_replica_n1] o.a.s.c.SolrCore solr.RecoveryStrategy.Builder
   [junit4]   2> 339710 INFO  (qtp2026556405-2271) [n:127.0.0.1:58384_solr c:testExecute s:shard1 r:core_node3 x:testExecute_shard1_replica_n1] o.a.s.c.SolrCore [[testExecute_shard1_replica_n1] ] Opening new SolrCore at [/Users/jenkins/workspace/Lucene-Solr-master-MacOSX/solr/build/solr-core/test/J1/temp/solr.cloud.autoscaling.ExecutePlanActionTest_7E5149FDAD2529A4-001/tempDir-001/node1/testExecute_shard1_replica_n1], dataDir=[/Users/jenkins/workspace/Lucene-Solr-master-MacOSX/solr/build/solr-core/test/J1/temp/solr.cloud.autoscaling.ExecutePlanActionTest_7E5149FDAD2529A4-001/tempDir-001/node1/./testExecute_shard1_replica_n1/data/]
   [junit4]   2> 339710 INFO  (qtp2131668350-2273) [n:127.0.0.1:58383_solr c:testExecute s:shard1 r:core_node4 x:testExecute_shard1_replica_n2] o.a.s.c.SolrCore solr.RecoveryStrategy.Builder
   [junit4]   2> 339710 INFO  (qtp2131668350-2273) [n:127.0.0.1:58383_solr c:testExecute s:shard1 r:core_node4 x:testExecute_shard1_replica_n2] o.a.s.c.SolrCore [[testExecute_shard1_replica_n2] ] Opening new SolrCore at [/Users/jenkins/workspace/Lucene-Solr-master-MacOSX/solr/build/solr-core/test/J1/temp/solr.cloud.autoscaling.ExecutePlanActionTest_7E5149FDAD2529A4-001/tempDir-001/node2/testExecute_shard1_replica_n2], dataDir=[/Users/jenkins/workspace/Lucene-Solr-master-MacOSX/solr/build/solr-core/test/J1/temp/solr.cloud.autoscaling.ExecutePlanActionTest_7E5149FDAD2529A4-001/tempDir-001/node2/./testExecute_shard1_replica_n2/data/]
   [junit4]   2> 339774 INFO  (qtp2131668350-2273) [n:127.0.0.1:58383_solr c:testExecute s:shard1 r:core_node4 x:testExecute_shard1_replica_n2] o.a.s.u.UpdateHandler Using UpdateLog implementation: org.apache.solr.update.UpdateLog
   [junit4]   2> 339774 INFO  (qtp2131668350-2273) [n:127.0.0.1:58383_solr c:testExecute s:shard1 r:core_node4 x:testExecute_shard1_replica_n2] o.a.s.u.UpdateLog Initializing UpdateLog: dataDir=null defaultSyncLevel=FLUSH numRecordsToKeep=100 maxNumLogsToKeep=10 numVersionBuckets=65536
   [junit4]   2> 339776 INFO  (qtp2131668350-2273) [n:127.0.0.1:58383_solr c:testExecute s:shard1 r:core_node4 x:testExecute_shard1_replica_n2] o.a.s.u.CommitTracker Hard AutoCommit: disabled
   [junit4]   2> 339776 INFO  (qtp2131668350-2273) [n:127.0.0.1:58383_solr c:testExecute s:shard1 r:core_node4 x:testExecute_shard1_replica_n2] o.a.s.u.CommitTracker Soft AutoCommit: disabled
   [junit4]   2> 339777 INFO  (qtp2131668350-2273) [n:127.0.0.1:58383_solr c:testExecute s:shard1 r:core_node4 x:testExecute_shard1_replica_n2] o.a.s.s.SolrIndexSearcher Opening [Searcher@196db0af[testExecute_shard1_replica_n2] main]
   [junit4]   2> 339778 INFO  (qtp2131668350-2273) [n:127.0.0.1:58383_solr c:testExecute s:shard1 r:core_node4 x:testExecute_shard1_replica_n2] o.a.s.r.ManagedResourceStorage Configured ZooKeeperStorageIO with znodeBase: /configs/conf
   [junit4]   2> 339779 INFO  (qtp2131668350-2273) [n:127.0.0.1:58383_solr c:testExecute s:shard1 r:core_node4 x:testExecute_shard1_replica_n2] o.a.s.r.ManagedResourceStorage Loaded null at path _rest_managed.json using ZooKeeperStorageIO:path=/configs/conf
   [junit4]   2> 339779 INFO  (qtp2131668350-2273) [n:127.0.0.1:58383_solr c:testExecute s:shard1 r:core_node4 x:testExecute_shard1_replica_n2] o.a.s.h.ReplicationHandler Commits will be reserved for 10000ms.
   [junit4]   2> 339779 INFO  (qtp2131668350-2273) [n:127.0.0.1:58383_solr c:testExecute s:shard1 r:core_node4 x:testExecute_shard1_replica_n2] o.a.s.u.UpdateLog Could not find max version in index or recent updates, using new clock 1581733438723981312
   [junit4]   2> 339780 INFO  (searcherExecutor-1232-thread-1-processing-n:127.0.0.1:58383_solr x:testExecute_shard1_replica_n2 s:shard1 c:testExecute r:core_node4) [n:127.0.0.1:58383_solr c:testExecute s:shard1 r:core_node4 x:testExecute_shard1_replica_n2] o.a.s.c.SolrCore [testExecute_shard1_replica_n2] Registered new searcher Searcher@196db0af[testExecute_shard1_replica_n2] main{ExitableDirectoryReader(UninvertingDirectoryReader())}
   [junit4]   2> 339787 INFO  (qtp2131668350-2273) [n:127.0.0.1:58383_solr c:testExecute s:shard1 r:core_node4 x:testExecute_shard1_replica_n2] o.a.s.c.ShardLeaderElectionContext Waiting until we see more replicas up for shard shard1: total=2 found=1 timeoutin=9999ms
   [junit4]   2> 339788 INFO  (qtp2026556405-2271) [n:127.0.0.1:58384_solr c:testExecute s:shard1 r:core_node3 x:testExecute_shard1_replica_n1] o.a.s.u.UpdateHandler Using UpdateLog implementation: org.apache.solr.update.UpdateLog
   [junit4]   2> 339788 INFO  (qtp2026556405-2271) [n:127.0.0.1:58384_solr c:testExecute s:shard1 r:core_node3 x:testExecute_shard1_replica_n1] o.a.s.u.UpdateLog Initializing UpdateLog: dataDir=null defaultSyncLevel=FLUSH numRecordsToKeep=100 maxNumLogsToKeep=10 numVersionBuckets=65536
   [junit4]   2> 339789 INFO  (qtp2026556405-2271) [n:127.0.0.1:58384_solr c:testExecute s:shard1 r:core_node3 x:testExecute_shard1_replica_n1] o.a.s.u.CommitTracker Hard AutoCommit: disabled
   [junit4]   2> 339789 INFO  (qtp2026556405-2271) [n:127.0.0.1:58384_solr c:testExecute s:shard1 r:core_node3 x:testExecute_shard1_replica_n1] o.a.s.u.CommitTracker Soft AutoCommit: disabled
   [junit4]   2> 339790 INFO  (qtp2026556405-2271) [n:127.0.0.1:58384_solr c:testExecute s:shard1 r:core_node3 x:testExecute_shard1_replica_n1] o.a.s.s.SolrIndexSearcher Opening [Searcher@43fd96de[testExecute_shard1_replica_n1] main]
   [junit4]   2> 339791 INFO  (qtp2026556405-2271) [n:127.0.0.1:58384_solr c:testExecute s:shard1 r:core_node3 x:testExecute_shard1_replica_n1] o.a.s.r.ManagedResourceStorage Configured ZooKeeperStorageIO with znodeBase: /configs/conf
   [junit4]   2> 339792 INFO  (qtp2026556405-2271) [n:127.0.0.1:58384_solr c:testExecute s:shard1 r:core_node3 x:testExecute_shard1_replica_n1] o.a.s.r.ManagedResourceStorage Loaded null at path _rest_managed.json using ZooKeeperStorageIO:path=/configs/conf
   [junit4]   2> 339792 INFO  (qtp2026556405-2271) [n:127.0.0.1:58384_solr c:testExecute s:shard1 r:core_node3 x:testExecute_shard1_replica_n1] o.a.s.h.ReplicationHandler Commits will be reserved for 10000ms.
   [junit4]   2> 339792 INFO  (qtp2026556405-2271) [n:127.0.0.1:58384_solr c:testExecute s:shard1 r:core_node3 x:testExecute_shard1_replica_n1] o.a.s.u.UpdateLog Could not find max version in index or recent updates, using new clock 1581733438737612800
   [junit4]   2> 339793 INFO  (searcherExecutor-1231-thread-1-processing-n:127.0.0.1:58384_solr x:testExecute_shard1_replica_n1 s:shard1 c:testExecute r:core_node3) [n:127.0.0.1:58384_solr c:testExecute s:shard1 r:core_node3 x:testExecute_shard1_replica_n1] o.a.s.c.SolrCore [testExecute_shard1_replica_n1] Registered new searcher Searcher@43fd96de[testExecute_shard1_replica_n1] main{ExitableDirectoryReader(UninvertingDirectoryReader())}
   [junit4]   2> 339888 INFO  (zkCallback-358-thread-2-processing-n:127.0.0.1:58384_solr) [n:127.0.0.1:58384_solr    ] o.a.s.c.c.ZkStateReader A cluster state change: [WatchedEvent state:SyncConnected type:NodeDataChanged path:/collections/testExecute/state.json] for collection [testExecute] has occurred - updating... (live nodes size: [2])
   [junit4]   2> 339889 INFO  (zkCallback-357-thread-2-processing-n:127.0.0.1:58383_solr) [n:127.0.0.1:58383_solr    ] o.a.s.c.c.ZkStateReader A cluster state change: [WatchedEvent state:SyncConnected type:NodeDataChanged path:/collections/testExecute/state.json] for collection [testExecute] has occurred - updating... (live nodes size: [2])
   [junit4]   2> 339889 INFO  (zkCallback-357-thread-3-processing-n:127.0.0.1:58383_solr) [n:127.0.0.1:58383_solr    ] o.a.s.c.c.ZkStateReader A cluster state change: [WatchedEvent state:SyncConnected type:NodeDataChanged path:/collections/testExecute/state.json] for collection [testExecute] has occurred - updating... (live nodes size: [2])
   [junit4]   2> 339888 INFO  (zkCallback-358-thread-1-processing-n:127.0.0.1:58384_solr) [n:127.0.0.1:58384_solr    ] o.a.s.c.c.ZkStateReader A cluster state change: [WatchedEvent state:SyncConnected type:NodeDataChanged path:/collections/testExecute/state.json] for collection [testExecute] has occurred - updating... (live nodes size: [2])
   [junit4]   2> 340288 INFO  (qtp2131668350-2273) [n:127.0.0.1:58383_solr c:testExecute s:shard1 r:core_node4 x:testExecute_shard1_replica_n2] o.a.s.c.ShardLeaderElectionContext Enough replicas found to continue.
   [junit4]   2> 340288 INFO  (qtp2131668350-2273) [n:127.0.0.1:58383_solr c:testExecute s:shard1 r:core_node4 x:testExecute_shard1_replica_n2] o.a.s.c.ShardLeaderElectionContext I may be the new leader - try and sync
   [junit4]   2> 340288 INFO  (qtp2131668350-2273) [n:127.0.0.1:58383_solr c:testExecute s:shard1 r:core_node4 x:testExecute_shard1_replica_n2] o.a.s.c.SyncStrategy Sync replicas to http://127.0.0.1:58383/solr/testExecute_shard1_replica_n2/
   [junit4]   2> 340288 INFO  (qtp2131668350-2273) [n:127.0.0.1:58383_solr c:testExecute s:shard1 r:core_node4 x:testExecute_shard1_replica_n2] o.a.s.u.PeerSync PeerSync: core=testExecute_shard1_replica_n2 url=http://127.0.0.1:58383/solr START replicas=[http://127.0.0.1:58384/solr/testExecute_shard1_replica_n1/] nUpdates=100
   [junit4]   2> 340290 INFO  (qtp2026556405-2278) [n:127.0.0.1:58384_solr c:testExecute s:shard1 r:core_node3 x:testExecute_shard1_replica_n1] o.a.s.c.S.Request [testExecute_shard1_replica_n1]  webapp=/solr path=/get params={distrib=false&qt=/get&fingerprint=false&getVersions=100&wt=javabin&version=2} status=0 QTime=0
   [junit4]   2> 340589 INFO  (qtp2131668350-2273) [n:127.0.0.1:58383_solr c:testExecute s:shard1 r:core_node4 x:testExecute_shard1_replica_n2] o.a.s.u.PeerSync PeerSync: core=testExecute_shard1_replica_n2 url=http://127.0.0.1:58383/solr DONE.  We have no versions.  sync failed.
   [junit4]   2> 340589 INFO  (qtp2131668350-2273) [n:127.0.0.1:58383_solr c:testExecute s:shard1 r:core_node4 x:testExecute_shard1_replica_n2] o.a.s.c.SyncStrategy Leader's attempt to sync with shard failed, moving to the next candidate
   [junit4]   2> 340589 INFO  (qtp2131668350-2273) [n:127.0.0.1:58383_solr c:testExecute s:shard1 r:core_node4 x:testExecute_shard1_replica_n2] o.a.s.c.ShardLeaderElectionContext We failed sync, but we have no versions - we can't sync in that case - we were active before, so become leader anyway
   [junit4]   2> 340589 INFO  (qtp2131668350-2273) [n:127.0.0.1:58383_solr c:testExecute s:shard1 r:core_node4 x:testExecute_shard1_replica_n2] o.a.s.c.ShardLeaderElectionContext Found all replicas participating in election, clear LIR
   [junit4]   2> 340594 INFO  (qtp2131668350-2273) [n:127.0.0.1:58383_solr c:testExecute s:shard1 r:core_node4 x:testExecute_shard1_replica_n2] o.a.s.c.ShardLeaderElectionContext I am the new leader: http://127.0.0.1:58383/solr/testExecute_shard1_replica_n2/ shard1
   [junit4]   2> 340697 INFO  (zkCallback-357-thread-3-processing-n:127.0.0.1:58383_solr) [n:127.0.0.1:58383_solr    ] o.a.s.c.c.ZkStateReader A cluster state change: [WatchedEvent state:SyncConnected type:NodeDataChanged path:/collections/testExecute/state.json] for collection [testExecute] has occurred - updating... (live nodes size: [2])
   [junit4]   2> 340697 INFO  (zkCallback-357-thread-1-processing-n:127.0.0.1:58383_solr) [n:127.0.0.1:58383_solr    ] o.a.s.c.c.ZkStateReader A cluster state change: [WatchedEvent state:SyncConnected type:NodeDataChanged path:/collections/testExecute/state.json] for collection [testExecute] has occurred - updating... (live nodes size: [2])
   [junit4]   2> 340697 INFO  (zkCallback-358-thread-1-processing-n:127.0.0.1:58384_solr) [n:127.0.0.1:58384_solr    ] o.a.s.c.c.ZkStateReader A cluster state change: [WatchedEvent state:SyncConnected type:NodeDataChanged path:/collections/testExecute/state.json] for collection [testExecute] has occurred - updating... (live nodes size: [2])
   [junit4]   2> 340697 INFO  (zkCallback-358-thread-2-processing-n:127.0.0.1:58384_solr) [n:127.0.0.1:58384_solr    ] o.a.s.c.c.ZkStateReader A cluster state change: [WatchedEvent state:SyncConnected type:NodeDataChanged path:/collections/testExecute/state.json] for collection [testExecute] has occurred - updating... (live nodes size: [2])
   [junit4]   2> 340750 INFO  (qtp2131668350-2273) [n:127.0.0.1:58383_solr c:testExecute s:shard1 r:core_node4 x:testExecute_shard1_replica_n2] o.a.s.c.ZkController I am the leader, no recovery necessary
   [junit4]   2> 340751 INFO  (qtp2131668350-2273) [n:127.0.0.1:58383_solr c:testExecute s:shard1 r:core_node4 x:testExecute_shard1_replica_n2] o.a.s.s.HttpSolrCall [admin] webapp=null path=/admin/cores params={qt=/admin/cores&coreNodeName=core_node4&collection.configName=conf&newCollection=true&name=testExecute_shard1_replica_n2&action=CREATE&numShards=1&collection=testExecute&shard=shard1&wt=javabin&version=2&replicaType=NRT} status=0 QTime=2068
   [junit4]   2> 340799 INFO  (qtp2026556405-2271) [n:127.0.0.1:58384_solr c:testExecute s:shard1 r:core_node3 x:testExecute_shard1_replica_n1] o.a.s.s.HttpSolrCall [admin] webapp=null path=/admin/cores params={qt=/admin/cores&coreNodeName=core_node3&collection.configName=conf&newCollection=true&name=testExecute_shard1_replica_n1&action=CREATE&numShards=1&collection=testExecute&shard=shard1&wt=javabin&version=2&replicaType=NRT} status=0 QTime=2116
   [junit4]   2> 340804 INFO  (qtp2131668350-2272) [n:127.0.0.1:58383_solr    ] o.a.s.h.a.CollectionsHandler Wait for new collection to be active for at most 30 seconds. Check all shard replicas
   [junit4]   2> 340901 INFO  (zkCallback-357-thread-2-processing-n:127.0.0.1:58383_solr) [n:127.0.0.1:58383_solr    ] o.a.s.c.c.ZkStateReader A cluster state change: [WatchedEvent state:SyncConnected type:NodeDataChanged path:/collections/testExecute/state.json] for collection [testExecute] has occurred - updating... (live nodes size: [2])
   [junit4]   2> 340901 INFO  (zkCallback-358-thread-2-processing-n:127.0.0.1:58384_solr) [n:127.0.0.1:58384_solr    ] o.a.s.c.c.ZkStateReader A cluster state change: [WatchedEvent state:SyncConnected type:NodeDataChanged path:/collections/testExecute/state.json] for collection [testExecute] has occurred - updating... (live nodes size: [2])
   [junit4]   2> 340901 INFO  (zkCallback-357-thread-1-processing-n:127.0.0.1:58383_solr) [n:127.0.0.1:58383_solr    ] o.a.s.c.c.ZkStateReader A cluster state change: [WatchedEvent state:SyncConnected type:NodeDataChanged path:/collections/testExecute/state.json] for collection [testExecute] has occurred - updating... (live nodes size: [2])
   [junit4]   2> 340901 INFO  (zkCallback-358-thread-1-processing-n:127.0.0.1:58384_solr) [n:127.0.0.1:58384_solr    ] o.a.s.c.c.ZkStateReader A cluster state change: [WatchedEvent state:SyncConnected type:NodeDataChanged path:/collections/testExecute/state.json] for collection [testExecute] has occurred - updating... (live nodes size: [2])
   [junit4]   2> 341804 INFO  (qtp2131668350-2272) [n:127.0.0.1:58383_solr    ] o.a.s.s.HttpSolrCall [admin] webapp=null path=/admin/collections params={replicationFactor=2&collection.configName=conf&maxShardsPerNode=1&name=testExecute&nrtReplicas=2&action=CREATE&numShards=1&wt=javabin&version=2} status=0 QTime=3445
   [junit4]   2> 341813 DEBUG (TEST-ExecutePlanActionTest.testExecute-seed#[7E5149FDAD2529A4]) [    ] o.a.s.c.a.ExecutePlanAction -- processing event: {
   [junit4]   2>   "id":"14ef1f10f8a66e00Tcp12ypvs9v5kgi241riv99v4z",
   [junit4]   2>   "source":"mock_trigger_name",
   [junit4]   2>   "eventTime":1508458557944000000,
   [junit4]   2>   "eventType":"NODELOST",
   [junit4]   2>   "properties":{
   [junit4]   2>     "eventTimes":[1508458557944000000],
   [junit4]   2>     "nodeNames":["127.0.0.1:58384_solr"]}} with context properties: {operations=[org.apache.solr.client.solrj.request.CollectionAdminRequest$MoveReplica@7f319931, org.apache.solr.cloud.autoscaling.ExecutePlanActionTest$1@28d14113]}
   [junit4]   2> 341813 INFO  (TEST-ExecutePlanActionTest.testExecute-seed#[7E5149FDAD2529A4]) [    ] o.a.s.c.a.ExecutePlanAction Executing operation: action=MOVEREPLICA&collection=testExecute&targetNode=127.0.0.1:58383_solr&replica=core_node3
   [junit4]   2> 341816 DEBUG (TEST-ExecutePlanActionTest.testExecute-seed#[7E5149FDAD2529A4]) [    ] o.a.s.c.a.ExecutePlanAction Saved requestId: mock_trigger_name/14ef1f10f8a66e00Tcp12ypvs9v5kgi241riv99v4z/0 in znode: /autoscaling/triggerState/mock_trigger_name/execute_plan/op-0000000000
   [junit4]   2> 341818 INFO  (qtp2131668350-2275) [n:127.0.0.1:58383_solr    ] o.a.s.h.a.CollectionsHandler Invoked Collection Action :movereplica with params async=mock_trigger_name/14ef1f10f8a66e00Tcp12ypvs9v5kgi241riv99v4z/0&replica=core_node3&action=MOVEREPLICA&collection=testExecute&targetNode=127.0.0.1:58383_solr&wt=javabin&version=2 and sendToOCPQueue=true
   [junit4]   2> 341820 INFO  (qtp2131668350-2275) [n:127.0.0.1:58383_solr    ] o.a.s.s.HttpSolrCall [admin] webapp=null path=/admin/collections params={async=mock_trigger_name/14ef1f10f8a66e00Tcp12ypvs9v5kgi241riv99v4z/0&replica=core_node3&action=MOVEREPLICA&collection=testExecute&targetNode=127.0.0.1:58383_solr&wt=javabin&version=2} status=0 QTime=2
   [junit4]   2> 341822 INFO  (qtp2131668350-2277) [n:127.0.0.1:58383_solr    ] o.a.s.h.a.CollectionsHandler Invoked Collection Action :requeststatus with params requestid=mock_trigger_name/14ef1f10f8a66e00Tcp12ypvs9v5kgi241riv99v4z/0&action=REQUESTSTATUS&wt=javabin&version=2 and sendToOCPQueue=true
   [junit4]   2> 341824 INFO  (qtp2131668350-2277) [n:127.0.0.1:58383_solr    ] o.a.s.s.HttpSolrCall [admin] webapp=null path=/admin/collections params={requestid=mock_trigger_name/14ef1f10f8a66e00Tcp12ypvs9v5kgi241riv99v4z/0&action=REQUESTSTATUS&wt=javabin&version=2} status=0 QTime=2
   [junit4]   2> 341825 INFO  (OverseerThreadFactory-1226-thread-2-processing-n:127.0.0.1:58383_solr) [n:127.0.0.1:58383_solr    ] o.a.s.c.MoveReplicaCmd Replica will be moved core_node3:{"core":"testExecute_shard1_replica_n1","base_url":"http://127.0.0.1:58384/solr","node_name":"127.0.0.1:58384_solr","state":"active","type":"NRT"}
   [junit4]   2> 341826 INFO  (OverseerCollectionConfigSetProcessor-98858339788324869-127.0.0.1:58383_solr-n_0000000000) [n:127.0.0.1:58383_solr    ] o.a.s.c.OverseerTaskQueue Response ZK path: /overseer/collection-queue-work/qnr-0000000000 doesn't exist.  Requestor may have disconnected from ZooKeeper
   [junit4]   2> 341828 INFO  (OverseerThreadFactory-1226-thread-2-processing-n:127.0.0.1:58383_solr) [n:127.0.0.1:58383_solr    ] o.a.s.c.AddReplicaCmd Node Identified 127.0.0.1:58383_solr for creating new replica
   [junit4]   2> 341831 INFO  (OverseerStateUpdate-98858339788324869-127.0.0.1:58383_solr-n_0000000000) [n:127.0.0.1:58383_solr    ] o.a.s.c.o.SliceMutator createReplica() {
   [junit4]   2>   "operation":"addreplica",
   [junit4]   2>   "collection":"testExecute",
   [junit4]   2>   "shard":"shard1",
   [junit4]   2>   "core":"testExecute_shard1_replica_n5",
   [junit4]   2>   "state":"down",
   [junit4]   2>   "base_url":"http://127.0.0.1:58383/solr",
   [junit4]   2>   "node_name":"127.0.0.1:58383_solr",
   [junit4]   2>   "type":"NRT"} 
   [junit4]   2> 341934 INFO  (zkCallback-358-thread-1-processing-n:127.0.0.1:58384_solr) [n:127.0.0.1:58384_solr    ] o.a.s.c.c.ZkStateReader A cluster state change: [WatchedEvent state:SyncConnected type:NodeDataChanged path:/collections/testExecute/state.json] for collection [testExecute] has occurred - updating... (live nodes size: [2])
   [junit4]   2> 341934 INFO  (zkCallback-357-thread-3-processing-n:127.0.0.1:58383_solr) [n:127.0.0.1:58383_solr    ] o.a.s.c.c.ZkStateReader A cluster state change: [WatchedEvent state:SyncConnected type:NodeDataChanged path:/collections/testExecute/state.json] for collection [testExecute] has occurred - updating... (live nodes size: [2])
   [junit4]   2> 341934 INFO  (zkCallback-357-thread-1-processing-n:127.0.0.1:58383_solr) [n:127.0.0.1:58383_solr    ] o.a.s.c.c.ZkStateReader A cluster state change: [WatchedEvent state:SyncConnected type:NodeDataChanged path:/collections/testExecute/state.json] for collection [testExecute] has occurred - updating... (live nodes size: [2])
   [junit4]   2> 341934 INFO  (zkCallback-358-thread-2-processing-n:127.0.0.1:58384_solr) [n:127.0.0.1:58384_solr    ] o.a.s.c.c.ZkStateReader A cluster state change: [WatchedEvent state:SyncConnected type:NodeDataChanged path:/collections/testExecute/state.json] for collection [testExecute] has occurred - updating... (live nodes size: [2])
   [junit4]   2> 342033 INFO  (qtp2131668350-2279) [n:127.0.0.1:58383_solr    ] o.a.s.s.HttpSolrCall [admin] webapp=null path=/admin/cores params={async=mock_trigger_name/14ef1f10f8a66e00Tcp12ypvs9v5kgi241riv99v4z/02372071925550893&qt=/admin/cores&coreNodeName=core_node6&collection.configName=conf&name=testExecute_shard1_replica_n5&action=CREATE&collection=testExecute&shard=shard1&wt=javabin&version=2&replicaType=NRT} status=0 QTime=0
   [junit4]   2> 342033 INFO  (parallelCoreAdminExecutor-1227-thread-1-processing-n:127.0.0.1:58383_solr mock_trigger_name//14ef1f10f8a66e00Tcp12ypvs9v5kgi241riv99v4z//02372071925550893 CREATE) [n:127.0.0.1:58383_solr    ] o.a.s.h.a.CoreAdminOperation core create command async=mock_trigger_name/14ef1f10f8a66e00Tcp12ypvs9v5kgi241riv99v4z/02372071925550893&qt=/admin/cores&coreNodeName=core_node6&collection.configName=conf&name=testExecute_shard1_replica_n5&action=CREATE&collection=testExecute&shard=shard1&wt=javabin&version=2&replicaType=NRT
   [junit4]   2> 342034 INFO  (qtp2131668350-2268) [n:127.0.0.1:58383_solr    ] o.a.s.h.a.CoreAdminOperation Checking request status for : mock_trigger_name/14ef1f10f8a66e00Tcp12ypvs9v5kgi241riv99v4z/02372071925550893
   [junit4]   2> 342034 INFO  (qtp2131668350-2268) [n:127.0.0.1:58383_solr    ] o.a.s.s.HttpSolrCall [admin] webapp=null path=/admin/cores params={qt=/admin/cores&requestid=mock_trigger_name/14ef1f10f8a66e00Tcp12ypvs9v5kgi241riv99v4z/02372071925550893&action=REQUESTSTATUS&wt=javabin&version=2} status=0 QTime=0
   [junit4]   2> 342049 INFO  (parallelCoreAdminExecutor-1227-thread-1-processing-n:127.0.0.1:58383_solr mock_trigger_name//14ef1f10f8a66e00Tcp12ypvs9v5kgi241riv99v4z//02372071925550893 CREATE) [n:127.0.0.1:58383_solr c:testExecute s:shard1 r:core_node6 x:testExecute_shard1_replica_n5] o.a.s.c.SolrConfig Using Lucene MatchVersion: 8.0.0
   [junit4]   2> 342055 INFO  (parallelCoreAdminExecutor-1227-thread-1-processing-n:127.0.0.1:58383_solr mock_trigger_name//14ef1f10f8a66e00Tcp12ypvs9v5kgi241riv99v4z//02372071925550893 CREATE) [n:127.0.0.1:58383_solr c:testExecute s:shard1 r:core_node6 x:testExecute_shard1_replica_n5] o.a.s.s.IndexSchema [testExecute_shard1_replica_n5] Schema name=minimal
   [junit4]   2> 342057 INFO  (parallelCoreAdminExecutor-1227-thread-1-processing-n:127.0.0.1:58383_solr mock_trigger_name//14ef1f10f8a66e00Tcp12ypvs9v5kgi241riv99v4z//02372071925550893 CREATE) [n:127.0.0.1:58383_solr c:testExecute s:shard1 r:core_node6 x:testExecute_shard1_replica_n5] o.a.s.s.IndexSchema Loaded schema minimal/1.1 with uniqueid field id
   [junit4]   2> 342058 INFO  (parallelCoreAdminExecutor-1227-thread-1-processing-n:127.0.0.1:58383_solr mock_trigger_name//14ef1f10f8a66e00Tcp12ypvs9v5kgi241riv99v4z//02372071925550893 CREATE) [n:127.0.0.1:58383_solr c:testExecute s:shard1 r:core_node6 x:testExecute_shard1_replica_n5] o.a.s.c.CoreContainer Creating SolrCore 'testExecute_shard1_replica_n5' using configuration from collection testExecute, trusted=true
   [junit4]   2> 342058 INFO  (parallelCoreAdminExecutor-1227-thread-1-processing-n:127.0.0.1:58383_solr mock_trigger_name//14ef1f10f8a66e00Tcp12ypvs9v5kgi241riv99v4z//02372071925550893 CREATE) [n:127.0.0.1:58383_solr c:testExecute s:shard1 r:core_node6 x:testExecute_shard1_replica_n5] o.a.s.m.r.SolrJmxReporter JMX monitoring for 'solr_58383.solr.core.testExecute.shard1.replica_n5' (registry 'solr.core.testExecute.shard1.replica_n5') enabled at server: com.sun.jmx.mbeanserver.JmxMBeanServer@72fd1b1d
   [junit4]   2> 342058 INFO  (parallelCoreAdminExecutor-1227-thread-1-processing-n:127.0.0.1:58383_solr mock_trigger_name//14ef1f10f8a66e00Tcp12ypvs9v5kgi241riv99v4z//02372071925550893 CREATE) [n:127.0.0.1:58383_solr c:testExecute s:shard1 r:core_node6 x:testExecute_shard1_replica_n5] o.a.s.c.SolrCore solr.RecoveryStrategy.Builder
   [junit4]   2> 342058 INFO  (parallelCoreAdminExecutor-1227-thread-1-processing-n:127.0.0.1:58383_solr mock_trigger_name//14ef1f10f8a66e00Tcp12ypvs9v5kgi241riv99v4z//02372071925550893 CREATE) [n:127.0.0.1:58383_solr c:testExecute s:shard1 r:core_node6 x:testExecute_shard1_replica_n5] o.a.s.c.SolrCore [[testExecute_shard1_replica_n5] ] Opening new SolrCore at [/Users/jenkins/workspace/Lucene-Solr-master-MacOSX/solr/build/solr-core/test/J1/temp/solr.cloud.autoscaling.ExecutePlanActionTest_7E5149FDAD2529A4-001/tempDir-001/node2/testExecute_shard1_replica_n5], dataDir=[/Users/jenkins/workspace/Lucene-Solr-master-MacOSX/solr/build/solr-core/test/J1/temp/solr.cloud.autoscaling.ExecutePlanActionTest_7E5149FDAD2529A4-001/tempDir-001/node2/./testExecute_shard1_replica_n5/data/]
   [junit4]   2> 342111 INFO  (parallelCoreAdminExecutor-1227-thread-1-processing-n:127.0.0.1:58383_solr mock_trigger_name//14ef1f10f8a66e00Tcp12ypvs9v5kgi241riv99v4z//02372071925550893 CREATE) [n:127.0.0.1:58383_solr c:testExecute s:shard1 r:core_node6 x:testExecute_shard1_replica_n5] o.a.s.u.UpdateHandler Using UpdateLog implementation: org.apache.solr.update.UpdateLog
   [junit4]   2> 342111 INFO  (parallelCoreAdminExecutor-1227-thread-1-processing-n:127.0.0.1:58383_solr mock_trigger_name//14ef1f10f8a66e00Tcp12ypvs9v5kgi241riv99v4z//02372071925550893 CREATE) [n:127.0.0.1:58383_solr c:testExecute s:shard1 r:core_node6 x:testExecute_shard1_replica_n5] o.a.s.u.UpdateLog Initializing UpdateLog: dataDir=null defaultSyncLevel=FLUSH numRecordsToKeep=100 maxNumLogsToKeep=10 numVersionBuckets=65536
   [junit4]   2> 342112 INFO  (parallelCoreAdminExecutor-1227-thread-1-processing-n:127.0.0.1:58383_solr mock_trigger_name//14ef1f10f8a66e00Tcp12ypvs9v5kgi241riv99v4z//02372071925550893 CREATE) [n:127.0.0.1:58383_solr c:testExecute s:shard1 r:core_node6 x:testExecute_shard1_replica_n5] o.a.s.u.CommitTracker Hard AutoCommit: disabled
   [junit4]   2> 342112 INFO  (parallelCoreAdminExecutor-1227-thread-1-processing-n:127.0.0.1:58383_solr mock_trigger_name//14ef1f10f8a66e00Tcp12ypvs9v5kgi241riv99v4z//02372071925550893 CREATE) [n:127.0.0.1:58383_solr c:testExecute s:shard1 r:core_node6 x:testExecute_shard1_replica_n5] o.a.s.u.CommitTracker Soft AutoCommit: disabled
   [junit4]   2> 342113 INFO  (parallelCoreAdminExecutor-1227-thread-1-processing-n:127.0.0.1:58383_solr mock_trigger_name//14ef1f10f8a66e00Tcp12ypvs9v5kgi241riv99v4z//02372071925550893 CREATE) [n:127.0.0.1:58383_solr c:testExecute s:shard1 r:core_node6 x:testExecute_shard1_replica_n5] o.a.s.s.SolrIndexSearcher Opening [Searcher@421f123d[testExecute_shard1_replica_n5] main]
   [junit4]   2> 342114 INFO  (parallelCoreAdminExecutor-1227-thread-1-processing-n:127.0.0.1:58383_solr mock_trigger_name//14ef1f10f8a66e00Tcp12ypvs9v5kgi241riv99v4z//02372071925550893 CREATE) [n:127.0.0.1:58383_solr c:testExecute s:shard1 r:core_node6 x:testExecute_shard1_replica_n5] o.a.s.r.ManagedResourceStorage Configured ZooKeeperStorageIO with znodeBase: /configs/conf
   [junit4]   2> 342114 INFO  (parallelCoreAdminExecutor-1227-thread-1-processing-n:127.0.0.1:58383_solr mock_trigger_name//14ef1f10f8a66e00Tcp12ypvs9v5kgi241riv99v4z//02372071925550893 CREATE) [n:127.0.0.1:58383_solr c:testExecute s:shard1 r:core_node6 x:testExecute_shard1_replica_n5] o.a.s.r.ManagedResourceStorage Loaded null at path _rest_managed.json using ZooKeeperStorageIO:path=/configs/conf
   [junit4]   2> 342115 INFO  (parallelCoreAdminExecutor-1227-thread-1-processing-n:127.0.0.1:58383_solr mock_trigger_name//14ef1f10f8a66e00Tcp12ypvs9v5kgi241riv99v4z//02372071925550893 CREATE) [n:127.0.0.1:58383_solr c:testExecute s:shard1 r:core_node6 x:testExecute_shard1_replica_n5] o.a.s.h.ReplicationHandler Commits will be reserved for 10000ms.
   [junit4]   2> 342115 INFO  (parallelCoreAdminExecutor-1227-thread-1-processing-n:127.0.0.1:58383_solr mock_trigger_name//14ef1f10f8a66e00Tcp12ypvs9v5kgi241riv99v4z//02372071925550893 CREATE) [n:127.0.0.1:58383_solr c:testExecute s:shard1 r:core_node6 x:testExecute_shard1_replica_n5] o.a.s.u.UpdateLog Could not find max version in index or recent updates, using new clock 1581733441173454848
   [junit4]   2> 342115 INFO  (searcherExecutor-1241-thread-1-processing-x:testExecute_shard1_replica_n5 r:core_node6 mock_trigger_name//14ef1f10f8a66e00Tcp12ypvs9v5kgi241riv99v4z//02372071925550893 CREATE n:127.0.0.1:58383_solr s:shard1 c:testExecute) [n:127.0.0.1:58383_solr c:testExecute s:shard1 r:core_node6 x:testExecute_shard1_replica_n5] o.a.s.c.SolrCore [testExecute_shard1_replica_n5] Registered new searcher Searcher@421f123d[testExecute_shard1_replica_n5] main{ExitableDirectoryReader(UninvertingDirectoryReader())}
   [junit4]   2> 342118 INFO  (parallelCoreAdminExecutor-1227-thread-1-processing-n:127.0.0.1:58383_solr mock_trigger_name//14ef1f10f8a66e00Tcp12ypvs9v5kgi241riv99v4z//02372071925550893 CREATE) [n:127.0.0.1:58383_solr c:testExecute s:shard1 r:core_node6 x:testExecute_shard1_replica_n5] o.a.s.c.ZkController Core needs to recover:testExecute_shard1_replica_n5
   [junit4]   2> 342118 INFO  (updateExecutor-352-thread-1-processing-x:testExecute_shard1_replica_n5 r:core_node6 mock_trigger_name//14ef1f10f8a66e00Tcp12ypvs9v5kgi241riv99v4z//02372071925550893 CREATE n:127.0.0.1:58383_solr s:shard1 c:testExecute) [n:127.0.0.1:58383_solr c:testExecute s:shard1 r:core_node6 x:testExecute_shard1_replica_n5] o.a.s.u.DefaultSolrCoreState Running recovery
   [junit4]   2> 342119 INFO  (recoveryExecutor-353-thread-1-processing-x:testExecute_shard1_replica_n5 r:core_node6 mock_trigger_name//14ef1f10f8a66e00Tcp12ypvs9v5kgi241riv99v4z//02372071925550893 CREATE n:127.0.0.1:58383_solr s:shard1 c:testExecute) [n:127.0.0.1:58383_solr c:testExecute s:shard1 r:core_node6 x:testExecute_shard1_replica_n5] o.a.s.c.RecoveryStrategy Starting recovery process. recoveringAfterStartup=true
   [junit4]   2> 342119 INFO  (recoveryExecutor-353-thread-1-processing-x:testExecute_shard1_replica_n5 r:core_node6 mock_trigger_name//14ef1f10f8a66e00Tcp12ypvs9v5kgi241riv99v4z//02372071925550893 CREATE n:127.0.0.1:58383_solr s:shard1 c:testExecute) [n:127.0.0.1:58383_solr c:testExecute s:shard1 r:core_node6 x:testExecute_shard1_replica_n5] o.a.s.c.RecoveryStrategy ###### startupVersions=[[]]
   [junit4]   2> 342119 INFO  (recoveryExecutor-353-thread-1-processing-x:testExecute_shard1_replica_n5 r:core_node6 mock_trigger_name//14ef1f10f8a66e00Tcp12ypvs9v5kgi241riv99v4z//02372071925550893 CREATE n:127.0.0.1:58383_solr s:shard1 c:testExecute) [n:127.0.0.1:58383_solr c:testExecute s:shard1 r:core_node6 x:testExecute_shard1_replica_n5] o.a.s.c.RecoveryStrategy Begin buffering updates. core=[testExecute_shard1_replica_n5]
   [junit4]   2> 342119 INFO  (recoveryExecutor-353-thread-1-processing-x:testExecute_shard1_replica_n5 r:core_node6 mock_trigger_name//14ef1f10f8a66e00Tcp12ypvs9v5kgi241riv99v4z//02372071925550893 CREATE n:127.0.0.1:58383_solr s:shard1 c:testExecute) [n:127.0.0.1:58383_solr c:testExecute s:shard1 r:core_node6 x:testExecute_shard1_replica_n5] o.a.s.u.UpdateLog Starting to buffer updates. FSUpdateLog{state=ACTIVE, tlog=null}
   [junit4]   2> 342119 INFO  (recoveryExecutor-353-thread-1-processing-x:testExecute_shard1_replica_n5 r:core_node6 mock_trigger_name//14ef1f10f8a66e00Tcp12ypvs9v5kgi241riv99v4z//02372071925550893 CREATE n:127.0.0.1:58383_solr s:shard1 c:testExecute) [n:127.0.0.1:58383_solr c:testExecute s:shard1 r:core_node6 x:testExecute_shard1_replica_n5] o.a.s.c.RecoveryStrategy Publishing state of core [testExecute_shard1_replica_n5] as recovering, leader is [http://127.0.0.1:58383/solr/testExecute_shard1_replica_n2/] and I am [http://127.0.0.1:58383/solr/testExecute_shard1_replica_n5/]
   [junit4]   2> 342123 INFO  (recoveryExecutor-353-thread-1-processing-x:testExecute_shard1_replica_n5 r:core_node6 mock_trigger_name//14ef1f10f8a66e00Tcp12ypvs9v5kgi241riv99v4z//02372071925550893 CREATE n:127.0.0.1:58383_solr s:shard1 c:testExecute) [n:127.0.0.1:58383_solr c:testExecute s:shard1 r:core_node6 x:testExecute_shard1_replica_n5] o.a.s.c.RecoveryStrategy Sending prep recovery command to [http://127.0.0.1:58383/solr]; [WaitForState: action=PREPRECOVERY&core=testExecute_shard1_replica_n2&nodeName=127.0.0.1:58383_solr&coreNodeName=core_node6&state=recovering&checkLive=true&onlyIfLeader=true&onlyIfLeaderActive=true]
   [junit4]   2> 342124 INFO  (qtp2131668350-2272) [n:127.0.0.1:58383_solr    ] o.a.s.h.a.PrepRecoveryOp Going to wait for coreNodeName: core_node6, state: recovering, checkLive: true, onlyIfLeader: true, onlyIfLeaderActive: true, maxTime: 183 s
   [junit4]   2> 342124 INFO  (qtp2131668350-2272) [n:127.0.0.1:58383_solr    ] o.a.s.h.a.PrepRecoveryOp In WaitForState(recovering): collection=testExecute, shard=shard1, thisCore=testExecute_shard1_replica_n2, leaderDoesNotNeedRecovery=false, isLeader? true, live=true, checkLive=true, currentState=down, localState=active, nodeName=127.0.0.1:58383_solr, coreNodeName=core_node6, onlyIfActiveCheckResult=false, nodeProps: core_node6:{"core":"testExecute_shard1_replica_n5","base_url":"http://127.0.0.1:58383/solr","state":"down","node_name":"127.0.0.1:58383_solr","type":"NRT"}
   [junit4]   2> 342222 INFO  (zkCallback-358-thread-2-processing-n:127.0.0.1:58384_solr) [n:127.0.0.1:58384_solr    ] o.a.s.c.c.ZkStateReader A cluster state change: [WatchedEvent state:SyncConnected type:NodeDataChanged path:/collections/testExecute/state.json] for collection [testExecute] has occurred - updating... (live nodes size: [2])
   [junit4]   2> 342222 INFO  (zkCallback-358-thread-1-processing-n:127.0.0.1:58384_solr) [n:127.0.0.1:58384_solr    ] o.a.s.c.c.ZkStateReader A cluster state change: [WatchedEvent state:SyncConnected type:NodeDataChanged path:/collections/testExecute/state.json] for collection [testExecute] has occurred - updating... (live nodes size: [2])
   [junit4]   2> 342222 INFO  (zkCallback-357-thread-2-processing-n:127.0.0.1:58383_solr) [n:127.0.0.1:58383_solr    ] o.a.s.c.c.ZkStateReader A cluster state change: [WatchedEvent state:SyncConnected type:NodeDataChanged path:/collections/testExecute/state.json] for collection [testExecute] has occurred - updating... (live nodes size: [2])
   [junit4]   2> 342222 INFO  (zkCallback-357-thread-1-processing-n:127.0.0.1:58383_solr) [n:127.0.0.1:58383_solr    ] o.a.s.c.c.ZkStateReader A cluster state change: [WatchedEvent state:SyncConnected type:NodeDataChanged path:/collections/testExecute/state.json] for collection [testExecute] has occurred - updating... (live nodes size: [2])
   [junit4]   2> 343035 INFO  (qtp2131668350-2274) [n:127.0.0.1:58383_solr    ] o.a.s.h.a.CoreAdminOperation Checking request status for : mock_trigger_name/14ef1f10f8a66e00Tcp12ypvs9v5kgi241riv99v4z/02372071925550893
   [junit4]   2> 343035 INFO  (qtp2131668350-2274) [n:127.0.0.1:58383_solr    ] o.a.s.s.HttpSolrCall [admin] webapp=null path=/admin/cores params={qt=/admin/cores&requestid=mock_trigger_name/14ef1f10f8a66e00Tcp12ypvs9v5kgi241riv99v4z/02372071925550893&action=REQUESTSTATUS&wt=javabin&version=2} status=0 QTime=0
   [junit4]   2> 343036 INFO  (qtp2026556405-2280) [n:127.0.0.1:58384_solr    ] o.a.s.s.HttpSolrCall [admin] webapp=null path=/admin/cores params={deleteInstanceDir=true&core=testExecute_shard1_replica_n1&async=mock_trigger_name/14ef1f10f8a66e00Tcp12ypvs9v5kgi241riv99v4z/02372072929998031&qt=/admin/cores&deleteDataDir=true&action=UNLOAD&wt=javabin&version=2&deleteIndex=true} status=0 QTime=0
   [junit4]   2> 343037 INFO  (parallelCoreAdminExecutor-1228-thread-1-processing-n:127.0.0.1:58384_solr mock_trigger_name//14ef1f10f8a66e00Tcp12ypvs9v5kgi241riv99v4z//02372072929998031 UNLOAD) [n:127.0.0.1:58384_solr    ] o.a.s.m.SolrMetricManager Closing metric reporters for registry=solr.core.testExecute.shard1.replica_n1, tag=null
   [junit4]   2> 343037 INFO  (parallelCoreAdminExecutor-1228-thread-1-processing-n:127.0.0.1:58384_solr mock_trigger_name//14ef1f10f8a66e00Tcp12ypvs9v5kgi241riv99v4z//02372072929998031 UNLOAD) [n:127.0.0.1:58384_solr    ] o.a.s.m.r.SolrJmxReporter Closing reporter [org.apache.solr.metrics.reporters.SolrJmxReporter@39cff848: rootName = solr_58384, domain = solr.core.testExecute.shard1.replica_n1, service url = null, agent id = null] for registry solr.core.testExecute.shard1.replica_n1 / com.codahale.metrics.MetricRegistry@604038e3
   [junit4]   2> 343037 INFO  (qtp2026556405-2281) [n:127.0.0.1:58384_solr    ] o.a.s.h.a.CoreAdminOperation Checking request status for : mock_trigger_name/14ef1f10f8a66e00Tcp12ypvs9v5kgi241riv99v4z/02372072929998031
   [junit4]   2> 343037 INFO  (qtp2026556405-2281) [n:127.0.0.1:58384_solr    ] o.a.s.s.HttpSolrCall [admin] webapp=null path=/admin/cores params={qt=/admin/cores&requestid=mock_trigger_name/14ef1f10f8a66e00Tcp12ypvs9v5kgi241riv99v4z/02372072929998031&action=REQUESTSTATUS&wt=javabin&version=2} status=0 QTime=0
   [junit4]   2> 343044 INFO  (parallelCoreAdminExecutor-1228-thread-1-processing-n:127.0.0.1:58384_solr mock_trigger_name//14ef1f10f8a66e00Tcp12ypvs9v5kgi241riv99v4z//02372072929998031 UNLOAD) [n:127.0.0.1:58384_solr    ] o.a.s.c.SolrCore [testExecute_shard1_replica_n1]  CLOSING SolrCore org.apache.solr.core.SolrCore@3bebf8f4
   [junit4]   2> 343044 INFO  (parallelCoreAdminExecutor-1228-thread-1-processing-n:127.0.0.1:58384_solr mock_trigger_name//14ef1f10f8a66e00Tcp12ypvs9v5kgi241riv99v4z//02372072929998031 UNLOAD) [n:127.0.0.1:58384_solr    ] o.a.s.m.SolrMetricManager Closing metric reporters for registry=solr.core.testExecute.shard1.replica_n1, tag=1005320436
   [junit4]   2> 343044 INFO  (parallelCoreAdminExecutor-1228-thread-1-processing-n:127.0.0.1:58384_solr mock_trigger_name//14ef1f10f8a66e00Tcp12ypvs9v5kgi241riv99v4z//02372072929998031 UNLOAD) [n:127.0.0.1:58384_solr    ] o.a.s.m.SolrMetricManager Closing metric reporters for registry=solr.collection.testExecute.shard1.leader, tag=1005320436
   [junit4]   2> 343048 INFO  (parallelCoreAdminExecutor-1228-thread-1-processing-n:127.0.0.1:58384_solr mock_trigger_name//14ef1f10f8a66e00Tcp12ypvs9v5kgi241riv99v4z//02372072929998031 UNLOAD) [n:127.0.0.1:58384_solr    ] o.a.s.c.ShardLeaderElectionContextBase No version found for ephemeral leader parent node, won't remove previous leader registration.
   [junit4]   2> 343127 INFO  (qtp2131668350-2272) [n:127.0.0.1:58383_solr    ] o.a.s.h.a.PrepRecoveryOp In WaitForState(recovering): collection=testExecute, shard=shard1, thisCore=testExecute_shard1_replica_n2, leaderDoesNotNeedRecovery=false, isLeader? true, live=true, checkLive=true, currentState=recovering, localState=active, nodeName=127.0.0.1:58383_solr, coreNodeName=core_node6, onlyIfActiveCheckResult=false, nodeProps: core_node6:{"core":"testExecute_shard1_replica_n5","base_url":"http://127.0.0.1:58383/solr","node_name":"127.0.0.1:58383_solr","state":"recovering","type":"NRT"}
   [junit4]   2> 343127 INFO  (qtp2131668350-2272) [n:127.0.0.1:58383_solr    ] o.a.s.h.a.PrepRecoveryOp Waited coreNodeName: core_node6, state: recovering, checkLive: true, onlyIfLeader: true for: 1 seconds.
   [junit4]   2> 343127 INFO  (qtp2131668350-2272) [n:127.0.0.1:58383_solr    ] o.a.s.s.HttpSolrCall [admin] webapp=null path=/admin/cores params={nodeName=127.0.0.1:58383_solr&onlyIfLeaderActive=true&core=testExecute_shard1_replica_n2&coreNodeName=core_node6&action=PREPRECOVERY&checkLive=true&state=recovering&onlyIfLeader=true&wt=javabin&version=2} status=0 QTime=1003
   [junit4]   2> 343150 INFO  (zkCallback-357-thread-1-processing-n:127.0.0.1:58383_solr) [n:127.0.0.1:58383_solr    ] o.a.s.c.c.ZkStateReader A cluster state change: [WatchedEvent state:SyncConnected type:NodeDataChanged path:/collections/testExecute/state.json] for collection [testExecute] has occurred - updating... (live nodes size: [2])
   [junit4]   2> 343151 INFO  (zkCallback-357-thread-2-processing-n:127.0.0.1:58383_solr) [n:127.0.0.1:58383_solr    ] o.a.s.c.c.ZkStateReader A cluster state change: [WatchedEvent state:SyncConnected type:NodeDataChanged path:/collections/testExecute/state.json] for collection [testExecute] has occurred - updating... (live nodes size: [2])
   [junit4]   2> 343628 INFO  (recoveryExecutor-353-thread-1-processing-x:testExecute_shard1_replica_n5 r:core_node6 mock_trigger_name//14ef1f10f8a66e00Tcp12ypvs9v5kgi241riv99v4z//02372071925550893 CREATE n:127.0.0.1:58383_solr s:shard1 c:testExecute) [n:127.0.0.1:58383_solr c:testExecute s:shard1 r:core_node6 x:testExecute_shard1_replica_n5] o.a.s.c.RecoveryStrategy Attempting to PeerSync from [http://127.0.0.1:58383/solr/testExecute_shard1_replica_n2/] - recoveringAfterStartup=[true]
   [junit4]   2> 343629 INFO  (recoveryExecutor-353-thread-1-processing-x:testExecute_shard1_replica_n5 r:core_node6 mock_trigger_name//14ef1f10f8a66e00Tcp12ypvs9v5kgi241riv99v4z//02372071925550893 CREATE n:127.0.0.1:58383_solr s:shard1 c:testExecute) [n:127.0.0.1:58383_solr c:testExecute s:shard1 r:core_node6 x:testExecute_shard1_replica_n5] o.a.s.u.PeerSync PeerSync: core=testExecute_shard1_replica_n5 url=http://127.0.0.1:58383/solr START replicas=[http://127.0.0.1:58383/solr/testExecute_shard1_replica_n2/] nUpdates=100
   [junit4]   2> 343631 INFO  (qtp2131668350-2279) [n:127.0.0.1:58383_solr c:testExecute s:shard1 r:core_node4 x:testExecute_shard1_replica_n2] o.a.s.u.IndexFingerprint IndexFingerprint millis:0.0 result:{maxVersionSpecified=9223372036854775807, maxVersionEncountered=0, maxInHash=0, versionsHash=0, numVersions=0, numDocs=0, maxDoc=0}
   [junit4]   2> 343631 INFO  (qtp2131668350-2279) [n:127.0.0.1:58383_solr c:testExecute s:shard1 r:core_node4 x:testExecute_shard1_replica_n2] o.a.s.c.S.Request [testExecute_shard1_replica_n2]  webapp=/solr path=/get params={distrib=false&qt=/get&getFingerprint=9223372036854775807&wt=javabin&version=2} status=0 QTime=0
   [junit4]   2> 343632 INFO  (recoveryExecutor-353-thread-1-processing-x:testExecute_shard1_replica_n5 r:core_node6 mock_trigger_name//14ef1f10f8a66e00Tcp12ypvs9v5kgi241riv99v4z//02372071925550893 CREATE n:127.0.0.1:58383_solr s:shard1 c:testExecute) [n:127.0.0.1:58383_solr c:testExecute s:shard1 r:core_node6 x:testExecute_shard1_replica_n5] o.a.s.u.IndexFingerprint IndexFingerprint millis:0.0 result:{maxVersionSpecified=9223372036854775807, maxVersionEncountered=0, maxInHash=0, versionsHash=0, numVersions=0, numDocs=0, maxDoc=0}
   [junit4]   2> 343632 INFO  (recoveryExecutor-353-thread-1-processing-x:testExecute_shard1_replica_n5 r:core_node6 mock_trigger_name//14ef1f10f8a66e00Tcp12ypvs9v5kgi241riv99v4z//02372071925550893 CREATE n:127.0.0.1:58383_solr s:shard1 c:testExecute) [n:127.0.0.1:58383_solr c:testExecute s:shard1 r:core_node6 x:testExecute_shard1_replica_n5] o.a.s.u.PeerSync We are already in sync. No need to do a PeerSync 
   [junit4]   2> 343632 INFO  (recoveryExecutor-353-thread-1-processing-x:testExecute_shard1_replica_n5 r:core_node6 mock_trigger_name//14ef1f10f8a66e00Tcp12ypvs9v5kgi241riv99v4z//02372071925550893 CREATE n:127.0.0.1:58383_solr s:shard1 c:testExecute) [n:127.0.0.1:58383_solr c:testExecute s:shard1 r:core_node6 x:testExecute_shard1_replica_n5] o.a.s.u.DirectUpdateHandler2 start commit{,optimize=false,openSearcher=true,waitSearcher=true,expungeDeletes=false,softCommit=false,prepareCommit=false}
   [junit4]   2> 343632 INFO  (recoveryExecutor-353-thread-1-processing-x:testExecute_shard1_replica_n5 r:core_node6 mock_trigger_name//14ef1f10f8a66e00Tcp12ypvs9v5kgi241riv99v4z//02372071925550893 CREATE n:127.0.0.1:58383_solr s:shard1 c:testExecute) [n:127.0.0.1:58383_solr c:testExecute s:shard1 r:core_node6 x:testExecute_shard1_replica_n5] o.a.s.u.DirectUpdateHandler2 No uncommitted changes. Skipping IW.commit.
   [junit4]   2> 343632 INFO  (recoveryExecutor-353-thread-1-processing-x:testExecute_shard1_replica_n5 r:core_node6 mock_trigger_name//14ef1f10f8a66e00Tcp12ypvs9v5kgi241riv99v4z//02372071925550893 CREATE n:127.0.0.1:58383_solr s:shard1 c:testExecute) [n:127.0.0.1:58383_solr c:testExecute s:shard1 r:core_node6 x:testExecute_shard1_replica_n5] o.a.s.u.DirectUpdateHandler2 end_commit_flush
   [junit4]   2> 343632 INFO  (recoveryExecutor-353-thread-1-processing-x:testExecute_shard1_replica_n5 r:core_node6 mock_trigger_name//14ef1f10f8a66e00Tcp12ypvs9v5kgi241riv99v4z//02372071925550893 CREATE n:127.0.0.1:58383_solr s:shard1 c:testExecute) [n:127.0.0.1:58383_solr c:testExecute s:shard1 r:core_node6 x:testExecute_shard1_replica_n5] o.a.s.c.RecoveryStrategy PeerSync stage of recovery was successful.
   [junit4]   2> 343632 INFO  (recoveryExecutor-353-thread-1-processing-x:testExecute_shard1_replica_n5 r:core_node6 mock_trigger_name//14ef1f10f8a66e00Tcp12ypvs9v5kgi241riv99v4z//02372071925550893 CREATE n:127.0.0.1:58383_solr s:shard1 c:testExecute) [n:127.0.0.1:58383_solr c:testExecute s:shard1 r:core_node6 x:testExecute_shard1_replica_n5] o.a.s.c.RecoveryStrategy Replaying updates buffered during PeerSync.
   [junit4]   2> 343632 INFO  (recoveryExecutor-353-thread-1-processing-x:testExecute_shard1_replica_n5 r:core_node6 mock_trigger_name//14ef1f10f8a66e00Tcp12ypvs9v5kgi241riv99v4z//02372071925550893 CREATE n:127.0.0.1:58383_solr s:shard1 c:testExecute) [n:127.0.0.1:58383_solr c:testExecute s:shard1 r:core_node6 x:testExecute_shard1_replica_n5] o.a.s.c.RecoveryStrategy No replay needed.
   [junit4]   2> 343632 INFO  (recoveryExecutor-353-thread-1-processing-x:testExecute_shard1_replica_n5 r:core_node6 mock_trigger_name//14ef1f10f8a66e00Tcp12ypvs9v5kgi241riv99v4z//02372071925550893 CREATE n:127.0.0.1:58383_solr s:shard1 c:testExecute) [n:127.0.0.1:58383_solr c:testExecute s:shard1 r:core_node6 x:testExecute_shard1_replica_n5] o.a.s.c.RecoveryStrategy Registering as Active after recovery.
   [junit4]   2> 343735 INFO  (zkCallback-357-thread-2-processing-n:127.0.0.1:58383_solr) [n:127.0.0.1:58383_solr    ] o.a.s.c.c.ZkStateReader A cluster state change: [WatchedEvent state:SyncConnected type:NodeDataChanged path:/collections/testExecute/state.json] for collection [testExecute] has occurred - updating... (live nodes size: [2])
   [junit4]   2> 343735 INFO  (zkCallback-357-thread-1-processing-n:127.0.0.1:58383_solr) [n:127.0.0.1:58383_solr    ] o.a.s.c.c.ZkStateReader A cluster state change: [WatchedEvent state:SyncConnected type:NodeDataChanged path:/collections/testExecute/state.json] for collection [testExecute] has occurred - updating... (live nodes size: [2])
   [junit4]   2> 344038 INFO  (qtp2026556405-2281) [n:127.0.0.1:58384_solr    ] o.a.s.h.a.CoreAdminOperation Checking request status for : mock_trigger_name/14ef1f10f8a66e00Tcp12ypvs9v5kgi241riv99v4z/02372072929998031
   [junit4]   2> 344038 INFO  (qtp2026556405-2281) [n:127.0.0.1:58384_solr    ] o.a.s.s.HttpSolrCall [admin] webapp=null path=/admin/cores params={qt=/admin/cores&requestid=mock_trigger_name/14ef1f10f8a66e00Tcp12ypvs9v5kgi241riv99v4z/02372072929998031&action=REQUESTSTATUS&wt=javabin&version=2} status=0 QTime=0
   [junit4]   2> 344144 INFO  (OverseerThreadFactory-1226-thread-2-processing-n:127.0.0.1:58383_solr) [n:127.0.0.1:58383_solr    ] o.a.s.c.OverseerTaskQueue Response ZK path: /overseer/collection-queue-work/qnr-0000000002 doesn't exist.  Requestor may have disconnected from ZooKeeper
   [junit4]   2> 345829 INFO  (OverseerCollectionConfigSetProcessor-98858339788324869-127.0.0.1:58383_solr-n_0000000000) [n:127.0.0.1:58383_solr    ] o.a.s.c.OverseerTaskQueue Response ZK path: /overseer/collection-queue-work/qnr-0000000002 doesn't exist.  Requestor may have disconnected from ZooKeeper
   [junit4]   2> 346826 INFO  (qtp2131668350-2273) [n:127.0.0.1:58383_solr    ] o.a.s.h.a.CollectionsHandler Invoked Collection Action :requeststatus with params requestid=mock_trigger_name/14ef1f10f8a66e00Tcp12ypvs9v5kgi241riv99v4z/0&action=REQUESTSTATUS&wt=javabin&version=2 and sendToOCPQueue=true
   [junit4]   2> 346828 INFO  (qtp2131668350-2273) [n:127.0.0.1:58383_solr    ] o.a.s.s.HttpSolrCall [admin] webapp=null path=/admin/collections params={requestid=mock_trigger_name/14ef1f10f8a66e00Tcp12ypvs9v5kgi241riv99v4z/0&action=REQUESTSTATUS&wt=javabin&version=2} status=0 QTime=1
   [junit4]   2> 346828 INFO  (TEST-ExecutePlanActionTest.testExecute-seed#[7E5149FDAD2529A4]) [    ] o.a.s.c.a.ExecutePlanAction Task with requestId=mock_trigger_name/14ef1f10f8a66e00Tcp12ypvs9v5kgi241riv99v4z/0 finished with state=COMPLETED in 5s
   [junit4]   2> 346828 INFO  (qtp2131668350-2268) [n:127.0.0.1:58383_solr    ] o.a.s.h.a.CollectionsHandler Invoked Collection Action :deletestatus with params requestid=mock_trigger_name/14ef1f10f8a66e00Tcp12ypvs9v5kgi241riv99v4z/0&action=DELETESTATUS&wt=javabin&version=2 and sendToOCPQueue=true
   [junit4]   2> 346829 INFO  (qtp2131668350-2268) [n:127.0.0.1:58383_solr    ] o.a.s.s.HttpSolrCall [admin] webapp=null path=/admin/collections params={requestid=mock_trigger_name/14ef1f10f8a66e00Tcp12ypvs9v5kgi241riv99v4z/0&action=DELETESTATUS&wt=javabin&version=2} status=0 QTime=0
   [junit4]   2> 346830 INFO  (TEST-ExecutePlanActionTest.testExecute-seed#[7E5149FDAD2529A4]) [    ] o.a.s.c.a.ExecutePlanAction Executing operation: action=OVERSEERSTATUS
   [junit4]   2> 346833 DEBUG (TEST-ExecutePlanActionTest.testExecute-seed#[7E5149FDAD2529A4]) [    ] o.a.s.c.a.ExecutePlanAction Saved requestId: mock_trigger_name/14ef1f10f8a66e00Tcp12ypvs9v5kgi241riv99v4z/0 in znode: /autoscaling/triggerState/mock_trigger_name/execute_plan/op-0000000001
   [junit4]   2> 346834 INFO  (qtp2131668350-2274) [n:127.0.0.1:58383_solr    ] o.a.s.h.a.CollectionsHandler Invoked Collection Action :overseerstatus with params async=mock_trigger_name/14ef1f10f8a66e00Tcp12ypvs9v5kgi241riv99v4z/0&action=OVERSEERSTATUS&wt=javabin&version=2 and sendToOCPQueue=true
   [junit4]   2> 346836 INFO  (qtp2131668350-2274) [n:127.0.0.1:58383_solr    ] o.a.s.s.HttpSolrCall [admin] webapp=null path=/admin/collections params={async=mock_trigger_name/14ef1f10f8a66e00Tcp12ypvs9v5kgi241riv99v4z/0&action=OVERSEERSTATUS&wt=javabin&version=2} status=0 QTime=2
   [junit4]   2> 346837 INFO  (qtp2131668350-2272) [n:127.0.0.1:58383_solr    ] o.a.s.h.a.CollectionsHandler Invoked Collection Action :requeststatus with params requestid=mock_trigger_name/14ef1f10f8a66e00Tcp12ypvs9v5kgi241riv99v4z/0&action=REQUESTSTATUS&wt=javabin&version=2 and sendToOCPQueue=true
   [junit4]   2> 346839 INFO  (qtp2131668350-2272) [n:127.0.0.1:58383_solr    ] o.a.s.s.HttpSolrCall [admin] webapp=null path=/admin/collections params={requestid=mock_trigger_name/14ef1f10f8a66e00Tcp12ypvs9v5kgi241riv99v4z/0&action=REQUESTSTATUS&wt=javabin&version=2} status=0 QTime=2
   [junit4]   2> 346848 INFO  (OverseerThreadFactory-1226-thread-3-processing-n:127.0.0.1:58383_solr) [n:127.0.0.1:58383_solr    ] o.a.s.c.OverseerTaskQueue Response ZK path: /overseer/collection-queue-work/qnr-0000000003 doesn't exist.  Requestor may have disconnected from ZooKeeper
   [junit4]   2> 348857 INFO  (OverseerCollectionConfigSetProcessor-98858339788324869-127.0.0.1:58383_solr-n_0000000000) [n:127.0.0.1:58383_solr    ] o.a.s.c.OverseerTaskQueue Response ZK path: /overseer/collection-queue-work/qnr-0000000003 doesn't exist.  Requestor may have disconnected from ZooKeeper
   [junit4]   2> 351841 INFO  (qtp2131668350-2277) [n:127.0.0.1:58383_solr    ] o.a.s.h.a.CollectionsHandler Invoked Collection Action :requeststatus with params requestid=mock_trigger_name/14ef1f10f8a66e00Tcp12ypvs9v5kgi241riv99v4z/0&action=REQUESTSTATUS&wt=javabin&version=2 and sendToOCPQueue=true
   [junit4]   2> 351843 INFO  (qtp2131668350-2277) [n:127.0.0.1:58383_solr    ] o.a.s.s.HttpSolrCall [admin] webapp=null path=/admin/collections params={requestid=mock_trigger_name/14ef1f10f8a66e00Tcp12ypvs9v5kgi241riv99v4z/0&action=REQUESTSTATUS&wt=javabin&version=2} status=0 QTime=1
   [junit4]   2> 351843 INFO  (TEST-ExecutePlanActionTest.testExecute-seed#[7E5149FDAD2529A4]) [    ] o.a.s.c.a.ExecutePlanAction Task with requestId=mock_trigger_name/14ef1f10f8a66e00Tcp12ypvs9v5kgi241riv99v4z/0 finished with state=COMPLETED in 5s
   [junit4]   2> 351843 INFO  (qtp2131668350-2275) [n:127.0.0.1:58383_solr    ] o.a.s.h.a.CollectionsHandler Invoked Collection Action :deletestatus with params requestid=mock_trigger_name/14ef1f10f8a66e00Tcp12ypvs9v5kgi241riv99v4z/0&action=DELETESTATUS&wt=javabin&version=2 and sendToOCPQueue=true
   [junit4]   2> 351844 INFO  (qtp2131668350-2275) [n:127.0.0.1:58383_solr    ] o.a.s.s.HttpSolrCall [admin] webapp=null path=/admin/collections params={requestid=mock_trigger_name/14ef1f10f8a66e00Tcp12ypvs9v5kgi241riv99v4z/0&action=DELETESTATUS&wt=javabin&version=2} status=0 QTime=0
   [junit4]   2> 351845 INFO  (TEST-ExecutePlanActionTest.testExecute-seed#[7E5149FDAD2529A4]) [    ] o.a.s.SolrTestCaseJ4 ###Ending testExecute
   [junit4]   2> 351866 INFO  (TEST-ExecutePlanActionTest.testIntegration-seed#[7E5149FDAD2529A4]) [    ] o.a.s.SolrTestCaseJ4 ###Starting testIntegration
   [junit4]   2> 351867 DEBUG (zkCallback-357-thread-1-processing-n:127.0.0.1:58383_solr) [n:127.0.0.1:58383_solr    ] o.a.s.c.a.OverseerTriggerThread Refreshing /autoscaling.json with znode version 3
   [junit4]   2> 351868 DEBUG (OverseerAutoScalingTriggerThread-98858339788324869-127.0.0.1:58383_solr-n_0000000000) [n:127.0.0.1:58383_solr    ] o.a.s.c.a.OverseerTriggerThread Processed trigger updates upto znodeVersion 3
   [junit4]   2> 351868 DEBUG (OverseerAutoScalingTriggerThread-98858339788324869-127.0.0.1:58383_solr-n_0000000000) [n:127.0.0.1:58383_solr    ] o.a.s.c.a.OverseerTriggerThread -- clean old nodeLost markers
   [junit4]   2> 351869 DEBUG (OverseerAutoScalingTriggerThread-98858339788324869-127.0.0.1:58383_solr-n_0000000000) [n:127.0.0.1:58383_solr    ] o.a.s.c.a.OverseerTriggerThread -- clean old nodeAdded markers
   [junit4]   2> 351869 DEBUG (OverseerAutoScalingTriggerThread-98858339788324869-127.0.0.1:58383_solr-n_0000000000) [n:127.0.0.1:58383_solr    ] o.a.s.c.a.OverseerTriggerThread Current znodeVersion 3, lastZnodeVersion 3
   [junit4]   2> 351889 INFO  (qtp2131668350-2279) [n:127.0.0.1:58383_solr    ] o.a.s.c.c.ZkStateReader Updated live nodes from ZooKeeper... (0) -> (2)
   [junit4]   2> 351891 INFO  (qtp2131668350-2279) [n:127.0.0.1:58383_solr    ] o.a.s.c.s.i.ZkClientClusterStateProvider Cluster at 127.0.0.1:58381/solr ready
   [junit4]   2> 351936 INFO  (qtp2131668350-2273) [n:127.0.0.1:58383_solr    ] o.a.s.s.HttpSolrCall [admin] webapp=null path=/admin/metrics params={prefix=CORE.coreName&wt=javabin&version=2&group=solr.core} status=0 QTime=6
   [junit4]   2> 351940 INFO  (qtp2026556405-2267) [n:127.0.0.1:58384_solr    ] o.a.s.s.HttpSolrCall [admin] webapp=null path=/admin/metrics params={prefix=CORE.coreName&wt=javabin&version=2&group=solr.core} status=0 QTime=0
   [junit4]   2> 351941 DEBUG (qtp2131668350-2279) [n:127.0.0.1:58383_solr    ] o.a.s.c.a.AutoScalingHandler Verified autoscaling configuration
   [junit4]   2> 351943 INFO  (qtp2131668350-2279) [n:127.0.0.1:58383_solr    ] o.a.s.s.HttpSolrCall [admin] webapp=null path=/cluster/autoscaling params={wt=javabin&version=2} status=0 QTime=58
   [junit4]   2> 351943 INFO  (qtp2131668350-2268) [n:127.0.0.1:58383_solr    ] o.a.s.h.a.CollectionsHandler Invoked Collection Action :create with params replicationFactor=2&collection.configName=conf&maxShardsPerNode=1&name=testIntegration&nrtReplicas=2&action=CREATE&numShards=1&wt=javabin&version=2 and sendToOCPQueue=true
   [junit4]   2> 351944 DEBUG (zkCallback-357-thread-1-processing-n:127.0.0.1:58383_solr) [n:127.0.0.1:58383_solr    ] o.a.s.c.a.OverseerTriggerThread Refreshing /autoscaling.json with znode version 4
   [junit4]   2> 351945 DEBUG (zkCallback-357-thread-1-processing-n:127.0.0.1:58383_solr) [n:127.0.0.1:58383_solr    ] o.a.s.c.a.NodeLostTrigger Initial livenodes: [127.0.0.1:58383_solr, 127.0.0.1:58384_solr]
   [junit4]   2> 351945 DEBUG (OverseerAutoScalingTriggerThread-98858339788324869-127.0.0.1:58383_solr-n_0000000000) [n:127.0.0.1:58383_solr    ] o.a.s.c.a.OverseerTriggerThread Processed trigger updates upto znodeVersion 4
   [junit4]   2> 351948 INFO  (OverseerThreadFactory-1226-thread-4-processing-n:127.0.0.1:58383_solr) [n:127.0.0.1:58383_solr    ] o.a.s.c.CreateCollectionCmd Create collection testIntegration
   [junit4]   2> 351950 DEBUG (OverseerAutoScalingTriggerThread-98858339788324869-127.0.0.1:58383_solr-n_0000000000) [n:127.0.0.1:58383_solr    ] o.a.s.c.a.OverseerTriggerThread -- clean old nodeAdded markers
   [junit4]   2> 351950 DEBUG (OverseerAutoScalingTriggerThread-98858339788324869-127.0.0.1:58383_solr-n_0000000000) [n:127.0.0.1:58383_solr    ] o.a.s.c.a.OverseerTriggerThread Current znodeVersion 4, lastZnodeVersion 4
   [junit4]   2> 351951 DEBUG (ScheduledTrigger-1224-thread-2) [n:127.0.0.1:58383_solr    ] o.a.s.c.a.NodeLostTrigger Running NodeLostTrigger: node_lost_trigger with currently live nodes: [127.0.0.1:58383_solr, 127.0.0.1:58384_solr]
   [junit4]   2> 352061 INFO  (OverseerStateUpdate-98858339788324869-127.0.0.1:58383_solr-n_0000000000) [n:127.0.0.1:58383_solr    ] o.a.s.c.o.SliceMutator createReplica() {
   [junit4]   2>   "operation":"ADDREPLICA",
   [junit4]   2>   "collection":"testIntegration",
   [junit4]   2>   "shard":"shard1",
   [junit4]   2>   "core":"testIntegration_shard1_replica_n1",
   [junit4]   2>   "state":"down",
   [junit4]   2>   "base_url":"http://127.0.0.1:58384/solr",
   [junit4]   2>   "type":"NRT",
   [junit4]   2>   "waitForFinalState":"false"} 
   [junit4]   2> 352064 INFO  (OverseerStateUpdate-98858339788324869-127.0.0.1:58383_solr-n_0000000000) [n:127.0.0.1:58383_solr    ] o.a.s.c.o.SliceMutator createReplica() {
   [junit4]   2>   "operation":"ADDREPLICA",
   [junit4]   2>   "collection":"testIntegration",
   [junit4]   2>   "shard":"shard1",
   [junit4]   2>   "core":"testIntegration_shard1_replica_n2",
   [junit4]   2>   "state":"down",
   [junit4]   2>   "base_url":"http://127.0.0.1:58383/solr",
   [junit4]   2>   "type":"NRT",
   [junit4]   2>   "waitForFinalState":"false"} 
   [junit4]   2> 352267 INFO  (qtp2026556405-2276) [n:127.0.0.1:58384_solr    ] o.a.s.h.a.CoreAdminOperation core create command qt=/admin/cores&coreNodeName=core_node3&collection.configName=conf&newCollection=true&name=testIntegration_shard1_replica_n1&action=CREATE&numShards=1&collection=testIntegration&shard=shard1&wt=javabin&version=2&replicaType=NRT
   [junit4]   2> 352267 INFO  (qtp2131668350-2274) [n:127.0.0.1:58383_solr    ] o.a.s.h.a.CoreAdminOperation core create command qt=/admin/cores&coreNodeName=core_node4&collection.configName=conf&newCollection=true&name=testIntegration_shard1_replica_n2&action=CREATE&numShards=1&collection=testIntegration&shard=shard1&wt=javabin&version=2&replicaType=NRT
   [junit4]   2> 352376 INFO  (zkCallback-358-thread-1-processing-n:127.0.0.1:5

[...truncated too long message...]

334 INFO  (TEST-FullSolrCloudDistribCmdsTest.test-seed#[7E5149FDAD2529A4]) [    ] o.e.j.s.AbstractConnector Stopped ServerConnector@3aac2334{HTTP/1.1,[http/1.1]}{127.0.0.1:0}
   [junit4]   2> 1550334 INFO  (TEST-FullSolrCloudDistribCmdsTest.test-seed#[7E5149FDAD2529A4]) [    ] o.e.j.s.h.ContextHandler Stopped o.e.j.s.ServletContextHandler@12db93fa{/v,null,UNAVAILABLE}
   [junit4]   2> 1550341 INFO  (TEST-FullSolrCloudDistribCmdsTest.test-seed#[7E5149FDAD2529A4]) [    ] o.a.s.c.ChaosMonkey monkey: stop jetty! 61940
   [junit4]   2> 1550344 ERROR (TEST-FullSolrCloudDistribCmdsTest.test-seed#[7E5149FDAD2529A4]) [    ] o.a.z.s.ZooKeeperServer ZKShutdownHandler is not registered, so ZooKeeper server won't take any action on ERROR or SHUTDOWN server state changes
   [junit4]   2> 1550345 INFO  (TEST-FullSolrCloudDistribCmdsTest.test-seed#[7E5149FDAD2529A4]) [    ] o.a.s.c.ZkTestServer connecting to 127.0.0.1:61862 61862
   [junit4]   2> 1550368 INFO  (Thread-1122) [    ] o.a.s.c.ZkTestServer connecting to 127.0.0.1:61862 61862
   [junit4]   2> 1550537 WARN  (Thread-1122) [    ] o.a.s.c.ZkTestServer Watch limit violations: 
   [junit4]   2> Maximum concurrent create/delete watches above limit:
   [junit4]   2> 
   [junit4]   2> 	15	/solr/aliases.json
   [junit4]   2> 	11	/solr/configs/conf1
   [junit4]   2> 	7	/solr/security.json
   [junit4]   2> 
   [junit4]   2> Maximum concurrent data watches above limit:
   [junit4]   2> 
   [junit4]   2> 	15	/solr/clusterprops.json
   [junit4]   2> 	15	/solr/clusterstate.json
   [junit4]   2> 	6	/solr/collections/collection1/state.json
   [junit4]   2> 	5	/solr/collections/collection2/state.json
   [junit4]   2> 	2	/solr/autoscaling.json
   [junit4]   2> 	2	/solr/overseer_elect/election/98858414969716748-127.0.0.1:61902_v-n_0000000002
   [junit4]   2> 
   [junit4]   2> Maximum concurrent children watches above limit:
   [junit4]   2> 
   [junit4]   2> 	15	/solr/live_nodes
   [junit4]   2> 	15	/solr/collections
   [junit4]   2> 	2	/solr/overseer/queue
   [junit4]   2> 	2	/solr/overseer/collection-queue-work
   [junit4]   2> 	2	/solr/overseer/queue-work
   [junit4]   2> 
   [junit4]   2> NOTE: reproduce with: ant test  -Dtestcase=FullSolrCloudDistribCmdsTest -Dtests.method=test -Dtests.seed=7E5149FDAD2529A4 -Dtests.slow=true -Dtests.locale=en-SG -Dtests.timezone=Africa/Banjul -Dtests.asserts=true -Dtests.file.encoding=UTF-8
   [junit4] FAILURE 65.6s J1 | FullSolrCloudDistribCmdsTest.test <<<
   [junit4]    > Throwable #1: java.lang.AssertionError: Could not find collection:collection2
   [junit4]    > 	at __randomizedtesting.SeedInfo.seed([7E5149FDAD2529A4:F605762703D9445C]:0)
   [junit4]    > 	at org.apache.solr.cloud.AbstractDistribZkTestBase.waitForRecoveriesToFinish(AbstractDistribZkTestBase.java:155)
   [junit4]    > 	at org.apache.solr.cloud.AbstractDistribZkTestBase.waitForRecoveriesToFinish(AbstractDistribZkTestBase.java:140)
   [junit4]    > 	at org.apache.solr.cloud.AbstractDistribZkTestBase.waitForRecoveriesToFinish(AbstractDistribZkTestBase.java:135)
   [junit4]    > 	at org.apache.solr.cloud.AbstractFullDistribZkTestBase.waitForRecoveriesToFinish(AbstractFullDistribZkTestBase.java:908)
   [junit4]    > 	at org.apache.solr.cloud.FullSolrCloudDistribCmdsTest.testIndexingBatchPerRequestWithHttpSolrClient(FullSolrCloudDistribCmdsTest.java:612)
   [junit4]    > 	at org.apache.solr.cloud.FullSolrCloudDistribCmdsTest.test(FullSolrCloudDistribCmdsTest.java:152)
   [junit4]    > 	at org.apache.solr.BaseDistributedSearchTestCase$ShardsRepeatRule$ShardsFixedStatement.callStatement(BaseDistributedSearchTestCase.java:993)
   [junit4]    > 	at org.apache.solr.BaseDistributedSearchTestCase$ShardsRepeatRule$ShardsStatement.evaluate(BaseDistributedSearchTestCase.java:968)
   [junit4]    > 	at java.lang.Thread.run(Thread.java:748)
   [junit4]   2> NOTE: leaving temporary files on disk at: /Users/jenkins/workspace/Lucene-Solr-master-MacOSX/solr/build/solr-core/test/J1/temp/solr.cloud.FullSolrCloudDistribCmdsTest_7E5149FDAD2529A4-001
   [junit4]   2> Oct 20, 2017 12:36:06 AM com.carrotsearch.randomizedtesting.ThreadLeakControl checkThreadLeaks
   [junit4]   2> WARNING: Will linger awaiting termination of 1 leaked thread(s).
   [junit4]   2> NOTE: test params are: codec=Asserting(Lucene70): {6grand2_s=PostingsFormat(name=LuceneVarGapDocFreqInterval), 7grand5_s=PostingsFormat(name=LuceneVarGapDocFreqInterval), 5grand1_s=PostingsFormat(name=Memory), 6grand4_s=PostingsFormat(name=Memory), 4grand0_s=PostingsFormat(name=LuceneVarGapDocFreqInterval), 7grand1_s=PostingsFormat(name=LuceneVarGapDocFreqInterval), 4grand2_s=PostingsFormat(name=Memory), 9grand7_s=PostingsFormat(name=LuceneVarGapDocFreqInterval), 7grand3_s=PostingsFormat(name=Memory), 8grand2_s=PostingsFormat(name=Memory), 9grand5_s=PostingsFormat(name=Memory), 8grand0_s=PostingsFormat(name=LuceneVarGapDocFreqInterval), 9grand3_s=PostingsFormat(name=LuceneVarGapDocFreqInterval), 6parent_f2_s=FST50, 8grand6_s=PostingsFormat(name=Memory), 9grand1_s=PostingsFormat(name=Memory), 8grand4_s=PostingsFormat(name=LuceneVarGapDocFreqInterval), 0parent_f2_s=PostingsFormat(name=LuceneFixedGap), 3grand1_s=PostingsFormat(name=LuceneVarGapDocFreqInterval), 4parent_f1_s=PostingsFormat(name=LuceneVarGapDocFreqInterval), 5child3_s=PostingsFormat(name=LuceneVarGapDocFreqInterval), 9parent_f2_s=PostingsFormat(name=LuceneVarGapDocFreqInterval), a_t=PostingsFormat(name=Memory), id=PostingsFormat(name=LuceneFixedGap), 5grand3_s=PostingsFormat(name=LuceneVarGapDocFreqInterval), 5parent_f1_s=FST50, 1parent_f1_s=FST50, 6grand0_s=PostingsFormat(name=Memory), 10parent_f2_s=PostingsFormat(name=Memory), _root_=PostingsFormat(name=Memory), 5child0_s=FST50, 5child2_s=PostingsFormat(name=LuceneFixedGap), 8parent_f1_s=PostingsFormat(name=LuceneVarGapDocFreqInterval), 2parent_f2_s=FST50, 3child0_s=FST50, 4child3_s=FST50, 1grand0_s=FST50, 4child1_s=PostingsFormat(name=LuceneFixedGap), 2grand1_s=FST50, 3child2_s=PostingsFormat(name=LuceneFixedGap), 1child0_s=PostingsFormat(name=LuceneFixedGap), 7parent_f1_s=PostingsFormat(name=LuceneFixedGap), 2child1_s=PostingsFormat(name=LuceneFixedGap), 3parent_f2_s=PostingsFormat(name=Memory), 6grand3_s=FST50, 7grand6_s=PostingsFormat(name=LuceneFixedGap), 5grand0_s=PostingsFormat(name=LuceneFixedGap), 6grand5_s=PostingsFormat(name=LuceneFixedGap), 5grand2_s=FST50, 7grand2_s=PostingsFormat(name=LuceneFixedGap), 4grand1_s=FST50, 7grand4_s=FST50, 4grand3_s=PostingsFormat(name=LuceneFixedGap), 9grand8_s=FST50, 3grand0_s=FST50, 8grand3_s=PostingsFormat(name=LuceneFixedGap), 9grand6_s=PostingsFormat(name=LuceneFixedGap), 6parent_f1_s=PostingsFormat(name=Memory), 8grand1_s=FST50, 9grand4_s=FST50, 8grand7_s=PostingsFormat(name=LuceneFixedGap), 9grand2_s=PostingsFormat(name=LuceneFixedGap), 0parent_f1_s=PostingsFormat(name=LuceneVarGapDocFreqInterval), 3grand2_s=PostingsFormat(name=LuceneFixedGap), 8grand5_s=FST50, 9grand0_s=FST50, 4parent_f2_s=PostingsFormat(name=LuceneFixedGap), 9parent_f1_s=FST50, 5child4_s=FST50, 1parent_f2_s=PostingsFormat(name=LuceneVarGapDocFreqInterval), 7grand0_s=FST50, text_t=PostingsFormat(name=Memory), 5grand4_s=PostingsFormat(name=LuceneFixedGap), 6grand1_s=PostingsFormat(name=LuceneFixedGap), type_s=PostingsFormat(name=Memory), 5parent_f2_s=PostingsFormat(name=LuceneVarGapDocFreqInterval), 5child1_s=PostingsFormat(name=Memory), 8parent_f2_s=PostingsFormat(name=LuceneFixedGap), 10parent_f1_s=FST50, 2parent_f1_s=PostingsFormat(name=Memory), 4child2_s=PostingsFormat(name=Memory), rnd_b=PostingsFormat(name=LuceneFixedGap), 4child0_s=PostingsFormat(name=LuceneVarGapDocFreqInterval), 2grand0_s=PostingsFormat(name=Memory), 3child1_s=PostingsFormat(name=LuceneVarGapDocFreqInterval), 7parent_f2_s=PostingsFormat(name=Memory), 2child0_s=PostingsFormat(name=Memory), 3parent_f1_s=PostingsFormat(name=LuceneFixedGap)}, docValues:{_version_=DocValuesFormat(name=Memory)}, maxPointsInLeafNode=1520, maxMBSortInHeap=7.7990818527498815, sim=RandomSimilarity(queryNorm=false): {}, locale=en-SG, timezone=Africa/Banjul
   [junit4]   2> NOTE: Mac OS X 10.11.6 x86_64/Oracle Corporation 1.8.0_144 (64-bit)/cpus=3,threads=1,free=158271752,total=533725184
   [junit4]   2> NOTE: All tests run in this JVM: [TestDocSet, TestGraphTermsQParserPlugin, TestDynamicFieldResource, CursorMarkTest, TestCloudPivotFacet, TestIndexSearcher, DistributedFacetPivotSmallAdvancedTest, NodeLostTriggerTest, SolrGangliaReporterTest, TestCloudRecovery, TestFunctionQuery, TestSimpleTrackingShardHandler, SolrCoreCheckLockOnStartupTest, SolrIndexSplitterTest, ActionThrottleTest, TestRequestForwarding, RequestLoggingTest, FileBasedSpellCheckerTest, TermVectorComponentDistributedTest, TestSchemaManager, SoftAutoCommitTest, PingRequestHandlerTest, MetricUtilsTest, BaseCdcrDistributedZkTest, TestPullReplica, TestFieldSortValues, TestRemoteStreaming, TestLuceneMatchVersion, TestUniqueKeyFieldResource, HdfsWriteToMultipleCollectionsTest, ExecutePlanActionTest, TestComplexPhraseQParserPlugin, BlobRepositoryCloudTest, SolrShardReporterTest, SimpleCollectionCreateDeleteTest, JsonLoaderTest, TestInPlaceUpdatesDistrib, SortSpecParsingTest, TestCollationField, BasicAuthStandaloneTest, IgnoreCommitOptimizeUpdateProcessorFactoryTest, DistributedMLTComponentTest, SearchHandlerTest, TestObjectReleaseTracker, TestNRTOpen, TestSolrCloudWithHadoopAuthPlugin, TestRandomCollapseQParserPlugin, TestSolrCloudSnapshots, OverseerRolesTest, LoggingHandlerTest, TestGeoJSONResponseWriter, TestLegacyTerms, TestLuceneIndexBackCompat, SSLMigrationTest, TestInitQParser, TestSearchPerf, FacetPivotSmallTest, CacheHeaderTest, QueryElevationComponentTest, TolerantUpdateProcessorTest, TestDocumentBuilder, ZkStateWriterTest, BasicZkTest, TestBlobHandler, DistributedFacetPivotWhiteBoxTest, BadCopyFieldTest, AutoAddReplicasIntegrationTest, TestCloudManagedSchema, FullSolrCloudDistribCmdsTest]
   [junit4] Completed [257/745 (2!)] on J1 in 66.17s, 1 test, 1 failure <<< FAILURES!

[...truncated 48842 lines...]

Mime
View raw message