lucene-dev mailing list archives

Site index · List index
Message view « Date » · « Thread »
Top « Date » · « Thread »
From Policeman Jenkins Server <jenk...@thetaphi.de>
Subject [JENKINS] Lucene-Solr-7.x-Linux (64bit/jdk1.8.0_144) - Build # 708 - Still Unstable!
Date Tue, 31 Oct 2017 05:22:23 GMT
Build: https://jenkins.thetaphi.de/job/Lucene-Solr-7.x-Linux/708/
Java: 64bit/jdk1.8.0_144 -XX:+UseCompressedOops -XX:+UseG1GC

3 tests failed.
FAILED:  junit.framework.TestSuite.org.apache.solr.cloud.TestSolrCloudWithSecureImpersonation

Error Message:
2 threads leaked from SUITE scope at org.apache.solr.cloud.TestSolrCloudWithSecureImpersonation:     1) Thread[id=4559, name=jetty-launcher-721-thread-2-EventThread, state=TIMED_WAITING, group=TGRP-TestSolrCloudWithSecureImpersonation]         at sun.misc.Unsafe.park(Native Method)         at java.util.concurrent.locks.LockSupport.parkNanos(LockSupport.java:215)         at java.util.concurrent.locks.AbstractQueuedSynchronizer.doAcquireSharedNanos(AbstractQueuedSynchronizer.java:1037)         at java.util.concurrent.locks.AbstractQueuedSynchronizer.tryAcquireSharedNanos(AbstractQueuedSynchronizer.java:1328)         at java.util.concurrent.CountDownLatch.await(CountDownLatch.java:277)         at org.apache.curator.CuratorZookeeperClient.internalBlockUntilConnectedOrTimedOut(CuratorZookeeperClient.java:323)         at org.apache.curator.RetryLoop.callWithRetry(RetryLoop.java:105)         at org.apache.curator.framework.imps.GetDataBuilderImpl.pathInForeground(GetDataBuilderImpl.java:288)         at org.apache.curator.framework.imps.GetDataBuilderImpl.forPath(GetDataBuilderImpl.java:279)         at org.apache.curator.framework.imps.GetDataBuilderImpl.forPath(GetDataBuilderImpl.java:41)         at org.apache.curator.framework.recipes.shared.SharedValue.readValue(SharedValue.java:244)         at org.apache.curator.framework.recipes.shared.SharedValue.access$100(SharedValue.java:44)         at org.apache.curator.framework.recipes.shared.SharedValue$1.process(SharedValue.java:61)         at org.apache.curator.framework.imps.NamespaceWatcher.process(NamespaceWatcher.java:67)         at org.apache.zookeeper.ClientCnxn$EventThread.processEvent(ClientCnxn.java:530)         at org.apache.zookeeper.ClientCnxn$EventThread.run(ClientCnxn.java:505)    2) Thread[id=4557, name=jetty-launcher-721-thread-1-EventThread, state=TIMED_WAITING, group=TGRP-TestSolrCloudWithSecureImpersonation]         at sun.misc.Unsafe.park(Native Method)         at java.util.concurrent.locks.LockSupport.parkNanos(LockSupport.java:215)         at java.util.concurrent.locks.AbstractQueuedSynchronizer.doAcquireSharedNanos(AbstractQueuedSynchronizer.java:1037)         at java.util.concurrent.locks.AbstractQueuedSynchronizer.tryAcquireSharedNanos(AbstractQueuedSynchronizer.java:1328)         at java.util.concurrent.CountDownLatch.await(CountDownLatch.java:277)         at org.apache.curator.CuratorZookeeperClient.internalBlockUntilConnectedOrTimedOut(CuratorZookeeperClient.java:323)         at org.apache.curator.RetryLoop.callWithRetry(RetryLoop.java:105)         at org.apache.curator.framework.imps.GetDataBuilderImpl.pathInForeground(GetDataBuilderImpl.java:288)         at org.apache.curator.framework.imps.GetDataBuilderImpl.forPath(GetDataBuilderImpl.java:279)         at org.apache.curator.framework.imps.GetDataBuilderImpl.forPath(GetDataBuilderImpl.java:41)         at org.apache.curator.framework.recipes.shared.SharedValue.readValue(SharedValue.java:244)         at org.apache.curator.framework.recipes.shared.SharedValue.access$100(SharedValue.java:44)         at org.apache.curator.framework.recipes.shared.SharedValue$1.process(SharedValue.java:61)         at org.apache.curator.framework.imps.NamespaceWatcher.process(NamespaceWatcher.java:67)         at org.apache.zookeeper.ClientCnxn$EventThread.processEvent(ClientCnxn.java:530)         at org.apache.zookeeper.ClientCnxn$EventThread.run(ClientCnxn.java:505)

Stack Trace:
com.carrotsearch.randomizedtesting.ThreadLeakError: 2 threads leaked from SUITE scope at org.apache.solr.cloud.TestSolrCloudWithSecureImpersonation: 
   1) Thread[id=4559, name=jetty-launcher-721-thread-2-EventThread, state=TIMED_WAITING, group=TGRP-TestSolrCloudWithSecureImpersonation]
        at sun.misc.Unsafe.park(Native Method)
        at java.util.concurrent.locks.LockSupport.parkNanos(LockSupport.java:215)
        at java.util.concurrent.locks.AbstractQueuedSynchronizer.doAcquireSharedNanos(AbstractQueuedSynchronizer.java:1037)
        at java.util.concurrent.locks.AbstractQueuedSynchronizer.tryAcquireSharedNanos(AbstractQueuedSynchronizer.java:1328)
        at java.util.concurrent.CountDownLatch.await(CountDownLatch.java:277)
        at org.apache.curator.CuratorZookeeperClient.internalBlockUntilConnectedOrTimedOut(CuratorZookeeperClient.java:323)
        at org.apache.curator.RetryLoop.callWithRetry(RetryLoop.java:105)
        at org.apache.curator.framework.imps.GetDataBuilderImpl.pathInForeground(GetDataBuilderImpl.java:288)
        at org.apache.curator.framework.imps.GetDataBuilderImpl.forPath(GetDataBuilderImpl.java:279)
        at org.apache.curator.framework.imps.GetDataBuilderImpl.forPath(GetDataBuilderImpl.java:41)
        at org.apache.curator.framework.recipes.shared.SharedValue.readValue(SharedValue.java:244)
        at org.apache.curator.framework.recipes.shared.SharedValue.access$100(SharedValue.java:44)
        at org.apache.curator.framework.recipes.shared.SharedValue$1.process(SharedValue.java:61)
        at org.apache.curator.framework.imps.NamespaceWatcher.process(NamespaceWatcher.java:67)
        at org.apache.zookeeper.ClientCnxn$EventThread.processEvent(ClientCnxn.java:530)
        at org.apache.zookeeper.ClientCnxn$EventThread.run(ClientCnxn.java:505)
   2) Thread[id=4557, name=jetty-launcher-721-thread-1-EventThread, state=TIMED_WAITING, group=TGRP-TestSolrCloudWithSecureImpersonation]
        at sun.misc.Unsafe.park(Native Method)
        at java.util.concurrent.locks.LockSupport.parkNanos(LockSupport.java:215)
        at java.util.concurrent.locks.AbstractQueuedSynchronizer.doAcquireSharedNanos(AbstractQueuedSynchronizer.java:1037)
        at java.util.concurrent.locks.AbstractQueuedSynchronizer.tryAcquireSharedNanos(AbstractQueuedSynchronizer.java:1328)
        at java.util.concurrent.CountDownLatch.await(CountDownLatch.java:277)
        at org.apache.curator.CuratorZookeeperClient.internalBlockUntilConnectedOrTimedOut(CuratorZookeeperClient.java:323)
        at org.apache.curator.RetryLoop.callWithRetry(RetryLoop.java:105)
        at org.apache.curator.framework.imps.GetDataBuilderImpl.pathInForeground(GetDataBuilderImpl.java:288)
        at org.apache.curator.framework.imps.GetDataBuilderImpl.forPath(GetDataBuilderImpl.java:279)
        at org.apache.curator.framework.imps.GetDataBuilderImpl.forPath(GetDataBuilderImpl.java:41)
        at org.apache.curator.framework.recipes.shared.SharedValue.readValue(SharedValue.java:244)
        at org.apache.curator.framework.recipes.shared.SharedValue.access$100(SharedValue.java:44)
        at org.apache.curator.framework.recipes.shared.SharedValue$1.process(SharedValue.java:61)
        at org.apache.curator.framework.imps.NamespaceWatcher.process(NamespaceWatcher.java:67)
        at org.apache.zookeeper.ClientCnxn$EventThread.processEvent(ClientCnxn.java:530)
        at org.apache.zookeeper.ClientCnxn$EventThread.run(ClientCnxn.java:505)
	at __randomizedtesting.SeedInfo.seed([9A20AFD0F52E2FEE]:0)


FAILED:  org.apache.solr.cloud.OverseerStatusTest.test

Error Message:
Error from server at http://127.0.0.1:45359/solr: create the collection time out:180s

Stack Trace:
org.apache.solr.client.solrj.impl.HttpSolrClient$RemoteSolrException: Error from server at http://127.0.0.1:45359/solr: create the collection time out:180s
	at __randomizedtesting.SeedInfo.seed([9A20AFD0F52E2FEE:1274900A5BD24216]:0)
	at org.apache.solr.client.solrj.impl.HttpSolrClient.executeMethod(HttpSolrClient.java:626)
	at org.apache.solr.client.solrj.impl.HttpSolrClient.request(HttpSolrClient.java:253)
	at org.apache.solr.client.solrj.impl.HttpSolrClient.request(HttpSolrClient.java:242)
	at org.apache.solr.client.solrj.impl.LBHttpSolrClient.doRequest(LBHttpSolrClient.java:483)
	at org.apache.solr.client.solrj.impl.LBHttpSolrClient.request(LBHttpSolrClient.java:413)
	at org.apache.solr.client.solrj.impl.CloudSolrClient.sendRequest(CloudSolrClient.java:1096)
	at org.apache.solr.client.solrj.impl.CloudSolrClient.requestWithRetryOnStaleState(CloudSolrClient.java:875)
	at org.apache.solr.client.solrj.impl.CloudSolrClient.request(CloudSolrClient.java:808)
	at org.apache.solr.client.solrj.SolrRequest.process(SolrRequest.java:178)
	at org.apache.solr.client.solrj.SolrRequest.process(SolrRequest.java:195)
	at org.apache.solr.cloud.OverseerStatusTest.test(OverseerStatusTest.java:42)
	at sun.reflect.NativeMethodAccessorImpl.invoke0(Native Method)
	at sun.reflect.NativeMethodAccessorImpl.invoke(NativeMethodAccessorImpl.java:62)
	at sun.reflect.DelegatingMethodAccessorImpl.invoke(DelegatingMethodAccessorImpl.java:43)
	at java.lang.reflect.Method.invoke(Method.java:498)
	at com.carrotsearch.randomizedtesting.RandomizedRunner.invoke(RandomizedRunner.java:1737)
	at com.carrotsearch.randomizedtesting.RandomizedRunner$8.evaluate(RandomizedRunner.java:934)
	at com.carrotsearch.randomizedtesting.RandomizedRunner$9.evaluate(RandomizedRunner.java:970)
	at com.carrotsearch.randomizedtesting.RandomizedRunner$10.evaluate(RandomizedRunner.java:984)
	at com.carrotsearch.randomizedtesting.rules.SystemPropertiesRestoreRule$1.evaluate(SystemPropertiesRestoreRule.java:57)
	at org.apache.lucene.util.TestRuleSetupTeardownChained$1.evaluate(TestRuleSetupTeardownChained.java:49)
	at org.apache.lucene.util.AbstractBeforeAfterRule$1.evaluate(AbstractBeforeAfterRule.java:45)
	at org.apache.lucene.util.TestRuleThreadAndTestName$1.evaluate(TestRuleThreadAndTestName.java:48)
	at org.apache.lucene.util.TestRuleIgnoreAfterMaxFailures$1.evaluate(TestRuleIgnoreAfterMaxFailures.java:64)
	at org.apache.lucene.util.TestRuleMarkFailure$1.evaluate(TestRuleMarkFailure.java:47)
	at com.carrotsearch.randomizedtesting.rules.StatementAdapter.evaluate(StatementAdapter.java:36)
	at com.carrotsearch.randomizedtesting.ThreadLeakControl$StatementRunner.run(ThreadLeakControl.java:368)
	at com.carrotsearch.randomizedtesting.ThreadLeakControl.forkTimeoutingTask(ThreadLeakControl.java:817)
	at com.carrotsearch.randomizedtesting.ThreadLeakControl$3.evaluate(ThreadLeakControl.java:468)
	at com.carrotsearch.randomizedtesting.RandomizedRunner.runSingleTest(RandomizedRunner.java:943)
	at com.carrotsearch.randomizedtesting.RandomizedRunner$5.evaluate(RandomizedRunner.java:829)
	at com.carrotsearch.randomizedtesting.RandomizedRunner$6.evaluate(RandomizedRunner.java:879)
	at com.carrotsearch.randomizedtesting.RandomizedRunner$7.evaluate(RandomizedRunner.java:890)
	at com.carrotsearch.randomizedtesting.rules.StatementAdapter.evaluate(StatementAdapter.java:36)
	at com.carrotsearch.randomizedtesting.rules.SystemPropertiesRestoreRule$1.evaluate(SystemPropertiesRestoreRule.java:57)
	at org.apache.lucene.util.AbstractBeforeAfterRule$1.evaluate(AbstractBeforeAfterRule.java:45)
	at com.carrotsearch.randomizedtesting.rules.StatementAdapter.evaluate(StatementAdapter.java:36)
	at org.apache.lucene.util.TestRuleStoreClassName$1.evaluate(TestRuleStoreClassName.java:41)
	at com.carrotsearch.randomizedtesting.rules.NoShadowingOrOverridesOnMethodsRule$1.evaluate(NoShadowingOrOverridesOnMethodsRule.java:40)
	at com.carrotsearch.randomizedtesting.rules.NoShadowingOrOverridesOnMethodsRule$1.evaluate(NoShadowingOrOverridesOnMethodsRule.java:40)
	at com.carrotsearch.randomizedtesting.rules.StatementAdapter.evaluate(StatementAdapter.java:36)
	at com.carrotsearch.randomizedtesting.rules.StatementAdapter.evaluate(StatementAdapter.java:36)
	at com.carrotsearch.randomizedtesting.rules.StatementAdapter.evaluate(StatementAdapter.java:36)
	at org.apache.lucene.util.TestRuleAssertionsRequired$1.evaluate(TestRuleAssertionsRequired.java:53)
	at org.apache.lucene.util.TestRuleMarkFailure$1.evaluate(TestRuleMarkFailure.java:47)
	at org.apache.lucene.util.TestRuleIgnoreAfterMaxFailures$1.evaluate(TestRuleIgnoreAfterMaxFailures.java:64)
	at org.apache.lucene.util.TestRuleIgnoreTestSuites$1.evaluate(TestRuleIgnoreTestSuites.java:54)
	at com.carrotsearch.randomizedtesting.rules.StatementAdapter.evaluate(StatementAdapter.java:36)
	at com.carrotsearch.randomizedtesting.ThreadLeakControl$StatementRunner.run(ThreadLeakControl.java:368)
	at java.lang.Thread.run(Thread.java:748)


FAILED:  org.apache.solr.cloud.autoscaling.ExecutePlanActionTest.testIntegration

Error Message:
Timed out waiting for replicas of collection to be 2 again null Live Nodes: [127.0.0.1:38129_solr] Last available state: DocCollection(testIntegration//collections/testIntegration/state.json/6)={   "pullReplicas":"0",   "replicationFactor":"2",   "shards":{"shard1":{       "range":"80000000-7fffffff",       "state":"active",       "replicas":{         "core_node3":{           "core":"testIntegration_shard1_replica_n1",           "base_url":"https://127.0.0.1:38129/solr",           "node_name":"127.0.0.1:38129_solr",           "state":"active",           "type":"NRT",           "leader":"true"},         "core_node4":{           "core":"testIntegration_shard1_replica_n2",           "base_url":"https://127.0.0.1:36967/solr",           "node_name":"127.0.0.1:36967_solr",           "state":"down",           "type":"NRT"}}}},   "router":{"name":"compositeId"},   "maxShardsPerNode":"1",   "autoAddReplicas":"false",   "nrtReplicas":"2",   "tlogReplicas":"0"}

Stack Trace:
java.lang.AssertionError: Timed out waiting for replicas of collection to be 2 again
null
Live Nodes: [127.0.0.1:38129_solr]
Last available state: DocCollection(testIntegration//collections/testIntegration/state.json/6)={
  "pullReplicas":"0",
  "replicationFactor":"2",
  "shards":{"shard1":{
      "range":"80000000-7fffffff",
      "state":"active",
      "replicas":{
        "core_node3":{
          "core":"testIntegration_shard1_replica_n1",
          "base_url":"https://127.0.0.1:38129/solr",
          "node_name":"127.0.0.1:38129_solr",
          "state":"active",
          "type":"NRT",
          "leader":"true"},
        "core_node4":{
          "core":"testIntegration_shard1_replica_n2",
          "base_url":"https://127.0.0.1:36967/solr",
          "node_name":"127.0.0.1:36967_solr",
          "state":"down",
          "type":"NRT"}}}},
  "router":{"name":"compositeId"},
  "maxShardsPerNode":"1",
  "autoAddReplicas":"false",
  "nrtReplicas":"2",
  "tlogReplicas":"0"}
	at __randomizedtesting.SeedInfo.seed([9A20AFD0F52E2FEE:2A41A1FCD0118ECB]:0)
	at org.junit.Assert.fail(Assert.java:93)
	at org.apache.solr.cloud.SolrCloudTestCase.waitForState(SolrCloudTestCase.java:269)
	at org.apache.solr.cloud.autoscaling.ExecutePlanActionTest.testIntegration(ExecutePlanActionTest.java:209)
	at sun.reflect.NativeMethodAccessorImpl.invoke0(Native Method)
	at sun.reflect.NativeMethodAccessorImpl.invoke(NativeMethodAccessorImpl.java:62)
	at sun.reflect.DelegatingMethodAccessorImpl.invoke(DelegatingMethodAccessorImpl.java:43)
	at java.lang.reflect.Method.invoke(Method.java:498)
	at com.carrotsearch.randomizedtesting.RandomizedRunner.invoke(RandomizedRunner.java:1737)
	at com.carrotsearch.randomizedtesting.RandomizedRunner$8.evaluate(RandomizedRunner.java:934)
	at com.carrotsearch.randomizedtesting.RandomizedRunner$9.evaluate(RandomizedRunner.java:970)
	at com.carrotsearch.randomizedtesting.RandomizedRunner$10.evaluate(RandomizedRunner.java:984)
	at com.carrotsearch.randomizedtesting.rules.SystemPropertiesRestoreRule$1.evaluate(SystemPropertiesRestoreRule.java:57)
	at org.apache.lucene.util.TestRuleSetupTeardownChained$1.evaluate(TestRuleSetupTeardownChained.java:49)
	at org.apache.lucene.util.AbstractBeforeAfterRule$1.evaluate(AbstractBeforeAfterRule.java:45)
	at org.apache.lucene.util.TestRuleThreadAndTestName$1.evaluate(TestRuleThreadAndTestName.java:48)
	at org.apache.lucene.util.TestRuleIgnoreAfterMaxFailures$1.evaluate(TestRuleIgnoreAfterMaxFailures.java:64)
	at org.apache.lucene.util.TestRuleMarkFailure$1.evaluate(TestRuleMarkFailure.java:47)
	at com.carrotsearch.randomizedtesting.rules.StatementAdapter.evaluate(StatementAdapter.java:36)
	at com.carrotsearch.randomizedtesting.ThreadLeakControl$StatementRunner.run(ThreadLeakControl.java:368)
	at com.carrotsearch.randomizedtesting.ThreadLeakControl.forkTimeoutingTask(ThreadLeakControl.java:817)
	at com.carrotsearch.randomizedtesting.ThreadLeakControl$3.evaluate(ThreadLeakControl.java:468)
	at com.carrotsearch.randomizedtesting.RandomizedRunner.runSingleTest(RandomizedRunner.java:943)
	at com.carrotsearch.randomizedtesting.RandomizedRunner$5.evaluate(RandomizedRunner.java:829)
	at com.carrotsearch.randomizedtesting.RandomizedRunner$6.evaluate(RandomizedRunner.java:879)
	at com.carrotsearch.randomizedtesting.RandomizedRunner$7.evaluate(RandomizedRunner.java:890)
	at com.carrotsearch.randomizedtesting.rules.StatementAdapter.evaluate(StatementAdapter.java:36)
	at com.carrotsearch.randomizedtesting.rules.SystemPropertiesRestoreRule$1.evaluate(SystemPropertiesRestoreRule.java:57)
	at org.apache.lucene.util.AbstractBeforeAfterRule$1.evaluate(AbstractBeforeAfterRule.java:45)
	at com.carrotsearch.randomizedtesting.rules.StatementAdapter.evaluate(StatementAdapter.java:36)
	at org.apache.lucene.util.TestRuleStoreClassName$1.evaluate(TestRuleStoreClassName.java:41)
	at com.carrotsearch.randomizedtesting.rules.NoShadowingOrOverridesOnMethodsRule$1.evaluate(NoShadowingOrOverridesOnMethodsRule.java:40)
	at com.carrotsearch.randomizedtesting.rules.NoShadowingOrOverridesOnMethodsRule$1.evaluate(NoShadowingOrOverridesOnMethodsRule.java:40)
	at com.carrotsearch.randomizedtesting.rules.StatementAdapter.evaluate(StatementAdapter.java:36)
	at com.carrotsearch.randomizedtesting.rules.StatementAdapter.evaluate(StatementAdapter.java:36)
	at com.carrotsearch.randomizedtesting.rules.StatementAdapter.evaluate(StatementAdapter.java:36)
	at org.apache.lucene.util.TestRuleAssertionsRequired$1.evaluate(TestRuleAssertionsRequired.java:53)
	at org.apache.lucene.util.TestRuleMarkFailure$1.evaluate(TestRuleMarkFailure.java:47)
	at org.apache.lucene.util.TestRuleIgnoreAfterMaxFailures$1.evaluate(TestRuleIgnoreAfterMaxFailures.java:64)
	at org.apache.lucene.util.TestRuleIgnoreTestSuites$1.evaluate(TestRuleIgnoreTestSuites.java:54)
	at com.carrotsearch.randomizedtesting.rules.StatementAdapter.evaluate(StatementAdapter.java:36)
	at com.carrotsearch.randomizedtesting.ThreadLeakControl$StatementRunner.run(ThreadLeakControl.java:368)
	at java.lang.Thread.run(Thread.java:748)




Build Log:
[...truncated 12218 lines...]
   [junit4] Suite: org.apache.solr.cloud.OverseerStatusTest
   [junit4]   2> Creating dataDir: /home/jenkins/workspace/Lucene-Solr-7.x-Linux/solr/build/solr-core/test/J1/temp/solr.cloud.OverseerStatusTest_9A20AFD0F52E2FEE-001/init-core-data-001
   [junit4]   2> 423176 WARN  (SUITE-OverseerStatusTest-seed#[9A20AFD0F52E2FEE]-worker) [    ] o.a.s.SolrTestCaseJ4 startTrackingSearchers: numOpens=4 numCloses=4
   [junit4]   2> 423177 INFO  (SUITE-OverseerStatusTest-seed#[9A20AFD0F52E2FEE]-worker) [    ] o.a.s.SolrTestCaseJ4 Using TrieFields (NUMERIC_POINTS_SYSPROP=false) w/NUMERIC_DOCVALUES_SYSPROP=true
   [junit4]   2> 423178 INFO  (SUITE-OverseerStatusTest-seed#[9A20AFD0F52E2FEE]-worker) [    ] o.a.s.SolrTestCaseJ4 Randomized ssl (false) and clientAuth (true) via: @org.apache.solr.util.RandomizeSSL(reason=, value=NaN, ssl=NaN, clientAuth=NaN)
   [junit4]   2> 423178 INFO  (SUITE-OverseerStatusTest-seed#[9A20AFD0F52E2FEE]-worker) [    ] o.a.s.SolrTestCaseJ4 SecureRandom sanity checks: test.solr.allowed.securerandom=null & java.security.egd=file:/dev/./urandom
   [junit4]   2> 423178 INFO  (SUITE-OverseerStatusTest-seed#[9A20AFD0F52E2FEE]-worker) [    ] o.a.s.c.MiniSolrCloudCluster Starting cluster of 2 servers in /home/jenkins/workspace/Lucene-Solr-7.x-Linux/solr/build/solr-core/test/J1/temp/solr.cloud.OverseerStatusTest_9A20AFD0F52E2FEE-001/tempDir-001
   [junit4]   2> 423178 INFO  (SUITE-OverseerStatusTest-seed#[9A20AFD0F52E2FEE]-worker) [    ] o.a.s.c.ZkTestServer STARTING ZK TEST SERVER
   [junit4]   2> 423179 INFO  (Thread-1017) [    ] o.a.s.c.ZkTestServer client port:0.0.0.0/0.0.0.0:0
   [junit4]   2> 423179 INFO  (Thread-1017) [    ] o.a.s.c.ZkTestServer Starting server
   [junit4]   2> 423182 ERROR (Thread-1017) [    ] o.a.z.s.ZooKeeperServer ZKShutdownHandler is not registered, so ZooKeeper server won't take any action on ERROR or SHUTDOWN server state changes
   [junit4]   2> 423279 INFO  (SUITE-OverseerStatusTest-seed#[9A20AFD0F52E2FEE]-worker) [    ] o.a.s.c.ZkTestServer start zk server on port:46519
   [junit4]   2> 423290 INFO  (jetty-launcher-699-thread-2) [    ] o.e.j.s.Server jetty-9.3.20.v20170531
   [junit4]   2> 423290 INFO  (jetty-launcher-699-thread-1) [    ] o.e.j.s.Server jetty-9.3.20.v20170531
   [junit4]   2> 423292 INFO  (jetty-launcher-699-thread-2) [    ] o.e.j.s.h.ContextHandler Started o.e.j.s.ServletContextHandler@6c66dd67{/solr,null,AVAILABLE}
   [junit4]   2> 423293 INFO  (jetty-launcher-699-thread-1) [    ] o.e.j.s.h.ContextHandler Started o.e.j.s.ServletContextHandler@55c63c9d{/solr,null,AVAILABLE}
   [junit4]   2> 423295 INFO  (jetty-launcher-699-thread-1) [    ] o.e.j.s.AbstractConnector Started ServerConnector@4179b2c3{HTTP/1.1,[http/1.1]}{127.0.0.1:46705}
   [junit4]   2> 423295 INFO  (jetty-launcher-699-thread-2) [    ] o.e.j.s.AbstractConnector Started ServerConnector@688480f4{HTTP/1.1,[http/1.1]}{127.0.0.1:45359}
   [junit4]   2> 423295 INFO  (jetty-launcher-699-thread-1) [    ] o.e.j.s.Server Started @425393ms
   [junit4]   2> 423296 INFO  (jetty-launcher-699-thread-2) [    ] o.e.j.s.Server Started @425393ms
   [junit4]   2> 423296 INFO  (jetty-launcher-699-thread-2) [    ] o.a.s.c.s.e.JettySolrRunner Jetty properties: {hostContext=/solr, hostPort=45359}
   [junit4]   2> 423296 INFO  (jetty-launcher-699-thread-1) [    ] o.a.s.c.s.e.JettySolrRunner Jetty properties: {hostContext=/solr, hostPort=46705}
   [junit4]   2> 423296 ERROR (jetty-launcher-699-thread-2) [    ] o.a.s.u.StartupLoggingUtils Missing Java Option solr.log.dir. Logging may be missing or incomplete.
   [junit4]   2> 423296 ERROR (jetty-launcher-699-thread-1) [    ] o.a.s.u.StartupLoggingUtils Missing Java Option solr.log.dir. Logging may be missing or incomplete.
   [junit4]   2> 423296 INFO  (jetty-launcher-699-thread-1) [    ] o.a.s.s.SolrDispatchFilter  ___      _       Welcome to Apache Solr™ version 7.2.0
   [junit4]   2> 423296 INFO  (jetty-launcher-699-thread-2) [    ] o.a.s.s.SolrDispatchFilter  ___      _       Welcome to Apache Solr™ version 7.2.0
   [junit4]   2> 423296 INFO  (jetty-launcher-699-thread-1) [    ] o.a.s.s.SolrDispatchFilter / __| ___| |_ _   Starting in cloud mode on port null
   [junit4]   2> 423296 INFO  (jetty-launcher-699-thread-2) [    ] o.a.s.s.SolrDispatchFilter / __| ___| |_ _   Starting in cloud mode on port null
   [junit4]   2> 423296 INFO  (jetty-launcher-699-thread-1) [    ] o.a.s.s.SolrDispatchFilter \__ \/ _ \ | '_|  Install dir: null
   [junit4]   2> 423296 INFO  (jetty-launcher-699-thread-2) [    ] o.a.s.s.SolrDispatchFilter \__ \/ _ \ | '_|  Install dir: null
   [junit4]   2> 423296 INFO  (jetty-launcher-699-thread-1) [    ] o.a.s.s.SolrDispatchFilter |___/\___/_|_|    Start time: 2017-10-31T04:25:38.327Z
   [junit4]   2> 423296 INFO  (jetty-launcher-699-thread-2) [    ] o.a.s.s.SolrDispatchFilter |___/\___/_|_|    Start time: 2017-10-31T04:25:38.327Z
   [junit4]   2> 423302 INFO  (jetty-launcher-699-thread-2) [    ] o.a.s.s.SolrDispatchFilter solr.xml found in ZooKeeper. Loading...
   [junit4]   2> 423303 INFO  (jetty-launcher-699-thread-1) [    ] o.a.s.s.SolrDispatchFilter solr.xml found in ZooKeeper. Loading...
   [junit4]   2> 423308 INFO  (jetty-launcher-699-thread-2) [    ] o.a.s.c.ZkContainer Zookeeper client=127.0.0.1:46519/solr
   [junit4]   2> 423316 INFO  (jetty-launcher-699-thread-1) [    ] o.a.s.c.ZkContainer Zookeeper client=127.0.0.1:46519/solr
   [junit4]   2> 423379 INFO  (jetty-launcher-699-thread-2) [n:127.0.0.1:45359_solr    ] o.a.s.c.Overseer Overseer (id=null) closing
   [junit4]   2> 423379 INFO  (jetty-launcher-699-thread-1) [n:127.0.0.1:46705_solr    ] o.a.s.c.Overseer Overseer (id=null) closing
   [junit4]   2> 423379 INFO  (jetty-launcher-699-thread-2) [n:127.0.0.1:45359_solr    ] o.a.s.c.OverseerElectionContext I am going to be the leader 127.0.0.1:45359_solr
   [junit4]   2> 423380 INFO  (jetty-launcher-699-thread-1) [n:127.0.0.1:46705_solr    ] o.a.s.c.ZkController Register node as live in ZooKeeper:/live_nodes/127.0.0.1:46705_solr
   [junit4]   2> 423380 INFO  (jetty-launcher-699-thread-2) [n:127.0.0.1:45359_solr    ] o.a.s.c.Overseer Overseer (id=98921607214661637-127.0.0.1:45359_solr-n_0000000000) starting
   [junit4]   2> 423381 INFO  (zkCallback-710-thread-1-processing-n:127.0.0.1:45359_solr) [n:127.0.0.1:45359_solr    ] o.a.s.c.c.ZkStateReader Updated live nodes from ZooKeeper... (0) -> (1)
   [junit4]   2> 423383 INFO  (zkCallback-711-thread-1-processing-n:127.0.0.1:46705_solr) [n:127.0.0.1:46705_solr    ] o.a.s.c.c.ZkStateReader Updated live nodes from ZooKeeper... (0) -> (1)
   [junit4]   2> 423395 INFO  (jetty-launcher-699-thread-2) [n:127.0.0.1:45359_solr    ] o.a.s.c.ZkController Register node as live in ZooKeeper:/live_nodes/127.0.0.1:45359_solr
   [junit4]   2> 423398 INFO  (zkCallback-710-thread-1-processing-n:127.0.0.1:45359_solr) [n:127.0.0.1:45359_solr    ] o.a.s.c.c.ZkStateReader Updated live nodes from ZooKeeper... (1) -> (2)
   [junit4]   2> 423402 INFO  (zkCallback-711-thread-1-processing-n:127.0.0.1:46705_solr) [n:127.0.0.1:46705_solr    ] o.a.s.c.c.ZkStateReader Updated live nodes from ZooKeeper... (1) -> (2)
   [junit4]   2> 423456 INFO  (jetty-launcher-699-thread-1) [n:127.0.0.1:46705_solr    ] o.a.s.m.r.SolrJmxReporter JMX monitoring for 'solr_46705.solr.node' (registry 'solr.node') enabled at server: com.sun.jmx.mbeanserver.JmxMBeanServer@20d276f4
   [junit4]   2> 423457 INFO  (jetty-launcher-699-thread-2) [n:127.0.0.1:45359_solr    ] o.a.s.m.r.SolrJmxReporter JMX monitoring for 'solr_45359.solr.node' (registry 'solr.node') enabled at server: com.sun.jmx.mbeanserver.JmxMBeanServer@20d276f4
   [junit4]   2> 423467 INFO  (jetty-launcher-699-thread-1) [n:127.0.0.1:46705_solr    ] o.a.s.m.r.SolrJmxReporter JMX monitoring for 'solr_46705.solr.jvm' (registry 'solr.jvm') enabled at server: com.sun.jmx.mbeanserver.JmxMBeanServer@20d276f4
   [junit4]   2> 423468 INFO  (jetty-launcher-699-thread-1) [n:127.0.0.1:46705_solr    ] o.a.s.m.r.SolrJmxReporter JMX monitoring for 'solr_46705.solr.jetty' (registry 'solr.jetty') enabled at server: com.sun.jmx.mbeanserver.JmxMBeanServer@20d276f4
   [junit4]   2> 423469 INFO  (jetty-launcher-699-thread-1) [n:127.0.0.1:46705_solr    ] o.a.s.c.CorePropertiesLocator Found 0 core definitions underneath /home/jenkins/workspace/Lucene-Solr-7.x-Linux/solr/build/solr-core/test/J1/temp/solr.cloud.OverseerStatusTest_9A20AFD0F52E2FEE-001/tempDir-001/node1/.
   [junit4]   2> 423473 INFO  (jetty-launcher-699-thread-2) [n:127.0.0.1:45359_solr    ] o.a.s.m.r.SolrJmxReporter JMX monitoring for 'solr_45359.solr.jvm' (registry 'solr.jvm') enabled at server: com.sun.jmx.mbeanserver.JmxMBeanServer@20d276f4
   [junit4]   2> 423473 INFO  (jetty-launcher-699-thread-2) [n:127.0.0.1:45359_solr    ] o.a.s.m.r.SolrJmxReporter JMX monitoring for 'solr_45359.solr.jetty' (registry 'solr.jetty') enabled at server: com.sun.jmx.mbeanserver.JmxMBeanServer@20d276f4
   [junit4]   2> 423474 INFO  (jetty-launcher-699-thread-2) [n:127.0.0.1:45359_solr    ] o.a.s.c.CorePropertiesLocator Found 0 core definitions underneath /home/jenkins/workspace/Lucene-Solr-7.x-Linux/solr/build/solr-core/test/J1/temp/solr.cloud.OverseerStatusTest_9A20AFD0F52E2FEE-001/tempDir-001/node2/.
   [junit4]   2> 423502 INFO  (SUITE-OverseerStatusTest-seed#[9A20AFD0F52E2FEE]-worker) [    ] o.a.s.c.c.ZkStateReader Updated live nodes from ZooKeeper... (0) -> (2)
   [junit4]   2> 423502 INFO  (SUITE-OverseerStatusTest-seed#[9A20AFD0F52E2FEE]-worker) [    ] o.a.s.c.s.i.ZkClientClusterStateProvider Cluster at 127.0.0.1:46519/solr ready
   [junit4]   2> 423518 INFO  (TEST-OverseerStatusTest.test-seed#[9A20AFD0F52E2FEE]) [    ] o.a.s.SolrTestCaseJ4 ###Starting test
   [junit4]   2> 423519 INFO  (qtp1440646733-4415) [n:127.0.0.1:45359_solr    ] o.a.s.h.a.CollectionsHandler Invoked Collection Action :create with params replicationFactor=1&collection.configName=conf&name=overseer_status_test&nrtReplicas=1&action=CREATE&numShards=1&wt=javabin&version=2 and sendToOCPQueue=true
   [junit4]   2> 423521 INFO  (OverseerThreadFactory-2070-thread-1-processing-n:127.0.0.1:45359_solr) [n:127.0.0.1:45359_solr    ] o.a.s.c.CreateCollectionCmd Create collection overseer_status_test
   [junit4]   2> 423624 INFO  (OverseerStateUpdate-98921607214661637-127.0.0.1:45359_solr-n_0000000000) [n:127.0.0.1:45359_solr    ] o.a.s.c.o.SliceMutator createReplica() {
   [junit4]   2>   "operation":"ADDREPLICA",
   [junit4]   2>   "collection":"overseer_status_test",
   [junit4]   2>   "shard":"shard1",
   [junit4]   2>   "core":"overseer_status_test_shard1_replica_n1",
   [junit4]   2>   "state":"down",
   [junit4]   2>   "base_url":"http://127.0.0.1:45359/solr",
   [junit4]   2>   "type":"NRT",
   [junit4]   2>   "waitForFinalState":"false"} 
   [junit4]   2> 423825 INFO  (qtp1440646733-4417) [n:127.0.0.1:45359_solr    ] o.a.s.h.a.CoreAdminOperation core create command qt=/admin/cores&coreNodeName=core_node2&collection.configName=conf&newCollection=true&name=overseer_status_test_shard1_replica_n1&action=CREATE&numShards=1&collection=overseer_status_test&shard=shard1&wt=javabin&version=2&replicaType=NRT
   [junit4]   2> 423826 INFO  (qtp1440646733-4417) [n:127.0.0.1:45359_solr    ] o.a.s.c.TransientSolrCoreCacheDefault Allocating transient cache for 2147483647 transient cores
   [junit4]   2> 423929 INFO  (zkCallback-710-thread-1-processing-n:127.0.0.1:45359_solr) [n:127.0.0.1:45359_solr    ] o.a.s.c.c.ZkStateReader A cluster state change: [WatchedEvent state:SyncConnected type:NodeDataChanged path:/collections/overseer_status_test/state.json] for collection [overseer_status_test] has occurred - updating... (live nodes size: [2])
   [junit4]   2> 423929 INFO  (zkCallback-710-thread-2-processing-n:127.0.0.1:45359_solr) [n:127.0.0.1:45359_solr    ] o.a.s.c.c.ZkStateReader A cluster state change: [WatchedEvent state:SyncConnected type:NodeDataChanged path:/collections/overseer_status_test/state.json] for collection [overseer_status_test] has occurred - updating... (live nodes size: [2])
   [junit4]   2> 424835 INFO  (qtp1440646733-4417) [n:127.0.0.1:45359_solr c:overseer_status_test s:shard1 r:core_node2 x:overseer_status_test_shard1_replica_n1] o.a.s.c.SolrConfig Using Lucene MatchVersion: 7.2.0
   [junit4]   2> 424896 INFO  (qtp1440646733-4417) [n:127.0.0.1:45359_solr c:overseer_status_test s:shard1 r:core_node2 x:overseer_status_test_shard1_replica_n1] o.a.s.s.IndexSchema [overseer_status_test_shard1_replica_n1] Schema name=minimal
   [junit4]   2> 424898 INFO  (qtp1440646733-4417) [n:127.0.0.1:45359_solr c:overseer_status_test s:shard1 r:core_node2 x:overseer_status_test_shard1_replica_n1] o.a.s.s.IndexSchema Loaded schema minimal/1.1 with uniqueid field id
   [junit4]   2> 424898 INFO  (qtp1440646733-4417) [n:127.0.0.1:45359_solr c:overseer_status_test s:shard1 r:core_node2 x:overseer_status_test_shard1_replica_n1] o.a.s.c.CoreContainer Creating SolrCore 'overseer_status_test_shard1_replica_n1' using configuration from collection overseer_status_test, trusted=true
   [junit4]   2> 424899 INFO  (qtp1440646733-4417) [n:127.0.0.1:45359_solr c:overseer_status_test s:shard1 r:core_node2 x:overseer_status_test_shard1_replica_n1] o.a.s.m.r.SolrJmxReporter JMX monitoring for 'solr_45359.solr.core.overseer_status_test.shard1.replica_n1' (registry 'solr.core.overseer_status_test.shard1.replica_n1') enabled at server: com.sun.jmx.mbeanserver.JmxMBeanServer@20d276f4
   [junit4]   2> 424899 INFO  (qtp1440646733-4417) [n:127.0.0.1:45359_solr c:overseer_status_test s:shard1 r:core_node2 x:overseer_status_test_shard1_replica_n1] o.a.s.c.SolrCore solr.RecoveryStrategy.Builder
   [junit4]   2> 424899 INFO  (qtp1440646733-4417) [n:127.0.0.1:45359_solr c:overseer_status_test s:shard1 r:core_node2 x:overseer_status_test_shard1_replica_n1] o.a.s.c.SolrCore [[overseer_status_test_shard1_replica_n1] ] Opening new SolrCore at [/home/jenkins/workspace/Lucene-Solr-7.x-Linux/solr/build/solr-core/test/J1/temp/solr.cloud.OverseerStatusTest_9A20AFD0F52E2FEE-001/tempDir-001/node2/overseer_status_test_shard1_replica_n1], dataDir=[/home/jenkins/workspace/Lucene-Solr-7.x-Linux/solr/build/solr-core/test/J1/temp/solr.cloud.OverseerStatusTest_9A20AFD0F52E2FEE-001/tempDir-001/node2/./overseer_status_test_shard1_replica_n1/data/]
   [junit4]   2> 424943 INFO  (qtp1440646733-4417) [n:127.0.0.1:45359_solr c:overseer_status_test s:shard1 r:core_node2 x:overseer_status_test_shard1_replica_n1] o.a.s.u.UpdateHandler Using UpdateLog implementation: org.apache.solr.update.UpdateLog
   [junit4]   2> 424943 INFO  (qtp1440646733-4417) [n:127.0.0.1:45359_solr c:overseer_status_test s:shard1 r:core_node2 x:overseer_status_test_shard1_replica_n1] o.a.s.u.UpdateLog Initializing UpdateLog: dataDir=null defaultSyncLevel=FLUSH numRecordsToKeep=100 maxNumLogsToKeep=10 numVersionBuckets=65536
   [junit4]   2> 424944 INFO  (qtp1440646733-4417) [n:127.0.0.1:45359_solr c:overseer_status_test s:shard1 r:core_node2 x:overseer_status_test_shard1_replica_n1] o.a.s.u.CommitTracker Hard AutoCommit: disabled
   [junit4]   2> 424944 INFO  (qtp1440646733-4417) [n:127.0.0.1:45359_solr c:overseer_status_test s:shard1 r:core_node2 x:overseer_status_test_shard1_replica_n1] o.a.s.u.CommitTracker Soft AutoCommit: disabled
   [junit4]   2> 424945 INFO  (qtp1440646733-4417) [n:127.0.0.1:45359_solr c:overseer_status_test s:shard1 r:core_node2 x:overseer_status_test_shard1_replica_n1] o.a.s.s.SolrIndexSearcher Opening [Searcher@3b292fca[overseer_status_test_shard1_replica_n1] main]
   [junit4]   2> 424946 INFO  (qtp1440646733-4417) [n:127.0.0.1:45359_solr c:overseer_status_test s:shard1 r:core_node2 x:overseer_status_test_shard1_replica_n1] o.a.s.r.ManagedResourceStorage Configured ZooKeeperStorageIO with znodeBase: /configs/conf
   [junit4]   2> 424946 INFO  (qtp1440646733-4417) [n:127.0.0.1:45359_solr c:overseer_status_test s:shard1 r:core_node2 x:overseer_status_test_shard1_replica_n1] o.a.s.r.ManagedResourceStorage Loaded null at path _rest_managed.json using ZooKeeperStorageIO:path=/configs/conf
   [junit4]   2> 424947 INFO  (qtp1440646733-4417) [n:127.0.0.1:45359_solr c:overseer_status_test s:shard1 r:core_node2 x:overseer_status_test_shard1_replica_n1] o.a.s.h.ReplicationHandler Commits will be reserved for 10000ms.
   [junit4]   2> 424948 INFO  (searcherExecutor-2075-thread-1-processing-n:127.0.0.1:45359_solr x:overseer_status_test_shard1_replica_n1 s:shard1 c:overseer_status_test r:core_node2) [n:127.0.0.1:45359_solr c:overseer_status_test s:shard1 r:core_node2 x:overseer_status_test_shard1_replica_n1] o.a.s.c.SolrCore [overseer_status_test_shard1_replica_n1] Registered new searcher Searcher@3b292fca[overseer_status_test_shard1_replica_n1] main{ExitableDirectoryReader(UninvertingDirectoryReader())}
   [junit4]   2> 424948 INFO  (qtp1440646733-4417) [n:127.0.0.1:45359_solr c:overseer_status_test s:shard1 r:core_node2 x:overseer_status_test_shard1_replica_n1] o.a.s.u.UpdateLog Could not find max version in index or recent updates, using new clock 1582745717287419904
   [junit4]   2> 424951 INFO  (qtp1440646733-4417) [n:127.0.0.1:45359_solr c:overseer_status_test s:shard1 r:core_node2 x:overseer_status_test_shard1_replica_n1] o.a.s.c.ShardLeaderElectionContext Enough replicas found to continue.
   [junit4]   2> 424951 INFO  (qtp1440646733-4417) [n:127.0.0.1:45359_solr c:overseer_status_test s:shard1 r:core_node2 x:overseer_status_test_shard1_replica_n1] o.a.s.c.ShardLeaderElectionContext I may be the new leader - try and sync
   [junit4]   2> 424951 INFO  (qtp1440646733-4417) [n:127.0.0.1:45359_solr c:overseer_status_test s:shard1 r:core_node2 x:overseer_status_test_shard1_replica_n1] o.a.s.c.SyncStrategy Sync replicas to http://127.0.0.1:45359/solr/overseer_status_test_shard1_replica_n1/
   [junit4]   2> 424951 INFO  (qtp1440646733-4417) [n:127.0.0.1:45359_solr c:overseer_status_test s:shard1 r:core_node2 x:overseer_status_test_shard1_replica_n1] o.a.s.c.SyncStrategy Sync Success - now sync replicas to me
   [junit4]   2> 424951 INFO  (qtp1440646733-4417) [n:127.0.0.1:45359_solr c:overseer_status_test s:shard1 r:core_node2 x:overseer_status_test_shard1_replica_n1] o.a.s.c.SyncStrategy http://127.0.0.1:45359/solr/overseer_status_test_shard1_replica_n1/ has no replicas
   [junit4]   2> 424951 INFO  (qtp1440646733-4417) [n:127.0.0.1:45359_solr c:overseer_status_test s:shard1 r:core_node2 x:overseer_status_test_shard1_replica_n1] o.a.s.c.ShardLeaderElectionContext Found all replicas participating in election, clear LIR
   [junit4]   2> 424954 INFO  (qtp1440646733-4417) [n:127.0.0.1:45359_solr c:overseer_status_test s:shard1 r:core_node2 x:overseer_status_test_shard1_replica_n1] o.a.s.c.ShardLeaderElectionContext I am the new leader: http://127.0.0.1:45359/solr/overseer_status_test_shard1_replica_n1/ shard1
   [junit4]   2> 603521 ERROR (qtp1440646733-4415) [n:127.0.0.1:45359_solr    ] o.a.s.h.RequestHandlerBase org.apache.solr.common.SolrException: create the collection time out:180s
   [junit4]   2> 	at org.apache.solr.handler.admin.CollectionsHandler.handleResponse(CollectionsHandler.java:312)
   [junit4]   2> 	at org.apache.solr.handler.admin.CollectionsHandler.invokeAction(CollectionsHandler.java:244)
   [junit4]   2> 	at org.apache.solr.handler.admin.CollectionsHandler.handleRequestBody(CollectionsHandler.java:222)
   [junit4]   2> 	at org.apache.solr.handler.RequestHandlerBase.handleRequest(RequestHandlerBase.java:177)
   [junit4]   2> 	at org.apache.solr.servlet.HttpSolrCall.handleAdmin(HttpSolrCall.java:735)
   [junit4]   2> 	at org.apache.solr.servlet.HttpSolrCall.handleAdminRequest(HttpSolrCall.java:716)
   [junit4]   2> 	at org.apache.solr.servlet.HttpSolrCall.call(HttpSolrCall.java:497)
   [junit4]   2> 	at org.apache.solr.servlet.SolrDispatchFilter.doFilter(SolrDispatchFilter.java:382)
   [junit4]   2> 	at org.apache.solr.servlet.SolrDispatchFilter.doFilter(SolrDispatchFilter.java:326)
   [junit4]   2> 	at org.eclipse.jetty.servlet.ServletHandler$CachedChain.doFilter(ServletHandler.java:1759)
   [junit4]   2> 	at org.apache.solr.client.solrj.embedded.JettySolrRunner$DebugFilter.doFilter(JettySolrRunner.java:139)
   [junit4]   2> 	at org.eclipse.jetty.servlet.ServletHandler$CachedChain.doFilter(ServletHandler.java:1759)
   [junit4]   2> 	at org.eclipse.jetty.servlet.ServletHandler.doHandle(ServletHandler.java:582)
   [junit4]   2> 	at org.eclipse.jetty.server.session.SessionHandler.doHandle(SessionHandler.java:224)
   [junit4]   2> 	at org.eclipse.jetty.server.handler.ContextHandler.doHandle(ContextHandler.java:1180)
   [junit4]   2> 	at org.eclipse.jetty.servlet.ServletHandler.doScope(ServletHandler.java:512)
   [junit4]   2> 	at org.eclipse.jetty.server.session.SessionHandler.doScope(SessionHandler.java:185)
   [junit4]   2> 	at org.eclipse.jetty.server.handler.ContextHandler.doScope(ContextHandler.java:1112)
   [junit4]   2> 	at org.eclipse.jetty.server.handler.ScopedHandler.handle(ScopedHandler.java:141)
   [junit4]   2> 	at org.eclipse.jetty.server.handler.gzip.GzipHandler.handle(GzipHandler.java:493)
   [junit4]   2> 	at org.eclipse.jetty.server.handler.HandlerWrapper.handle(HandlerWrapper.java:134)
   [junit4]   2> 	at org.eclipse.jetty.server.Server.handle(Server.java:534)
   [junit4]   2> 	at org.eclipse.jetty.server.HttpChannel.handle(HttpChannel.java:320)
   [junit4]   2> 	at org.eclipse.jetty.server.HttpConnection.onFillable(HttpConnection.java:251)
   [junit4]   2> 	at org.eclipse.jetty.io.AbstractConnection$ReadCallback.succeeded(AbstractConnection.java:283)
   [junit4]   2> 	at org.eclipse.jetty.io.FillInterest.fillable(FillInterest.java:108)
   [junit4]   2> 	at org.eclipse.jetty.io.SelectChannelEndPoint$2.run(SelectChannelEndPoint.java:93)
   [junit4]   2> 	at org.eclipse.jetty.util.thread.strategy.ExecuteProduceConsume.executeProduceConsume(ExecuteProduceConsume.java:303)
   [junit4]   2> 	at org.eclipse.jetty.util.thread.strategy.ExecuteProduceConsume.produceConsume(ExecuteProduceConsume.java:148)
   [junit4]   2> 	at org.eclipse.jetty.util.thread.strategy.ExecuteProduceConsume.run(ExecuteProduceConsume.java:136)
   [junit4]   2> 	at org.eclipse.jetty.util.thread.QueuedThreadPool.runJob(QueuedThreadPool.java:671)
   [junit4]   2> 	at org.eclipse.jetty.util.thread.QueuedThreadPool$2.run(QueuedThreadPool.java:589)
   [junit4]   2> 	at java.lang.Thread.run(Thread.java:748)
   [junit4]   2> 
   [junit4]   2> 603521 INFO  (qtp1440646733-4415) [n:127.0.0.1:45359_solr    ] o.a.s.s.HttpSolrCall [admin] webapp=null path=/admin/collections params={replicationFactor=1&collection.configName=conf&name=overseer_status_test&nrtReplicas=1&action=CREATE&numShards=1&wt=javabin&version=2} status=500 QTime=180001
   [junit4]   2> 603521 ERROR (qtp1440646733-4415) [n:127.0.0.1:45359_solr    ] o.a.s.s.HttpSolrCall null:org.apache.solr.common.SolrException: create the collection time out:180s
   [junit4]   2> 	at org.apache.solr.handler.admin.CollectionsHandler.handleResponse(CollectionsHandler.java:312)
   [junit4]   2> 	at org.apache.solr.handler.admin.CollectionsHandler.invokeAction(CollectionsHandler.java:244)
   [junit4]   2> 	at org.apache.solr.handler.admin.CollectionsHandler.handleRequestBody(CollectionsHandler.java:222)
   [junit4]   2> 	at org.apache.solr.handler.RequestHandlerBase.handleRequest(RequestHandlerBase.java:177)
   [junit4]   2> 	at org.apache.solr.servlet.HttpSolrCall.handleAdmin(HttpSolrCall.java:735)
   [junit4]   2> 	at org.apache.solr.servlet.HttpSolrCall.handleAdminRequest(HttpSolrCall.java:716)
   [junit4]   2> 	at org.apache.solr.servlet.HttpSolrCall.call(HttpSolrCall.java:497)
   [junit4]   2> 	at org.apache.solr.servlet.SolrDispatchFilter.doFilter(SolrDispatchFilter.java:382)
   [junit4]   2> 	at org.apache.solr.servlet.SolrDispatchFilter.doFilter(SolrDispatchFilter.java:326)
   [junit4]   2> 	at org.eclipse.jetty.servlet.ServletHandler$CachedChain.doFilter(ServletHandler.java:1759)
   [junit4]   2> 	at org.apache.solr.client.solrj.embedded.JettySolrRunner$DebugFilter.doFilter(JettySolrRunner.java:139)
   [junit4]   2> 	at org.eclipse.jetty.servlet.ServletHandler$CachedChain.doFilter(ServletHandler.java:1759)
   [junit4]   2> 	at org.eclipse.jetty.servlet.ServletHandler.doHandle(ServletHandler.java:582)
   [junit4]   2> 	at org.eclipse.jetty.server.session.SessionHandler.doHandle(SessionHandler.java:224)
   [junit4]   2> 	at org.eclipse.jetty.server.handler.ContextHandler.doHandle(ContextHandler.java:1180)
   [junit4]   2> 	at org.eclipse.jetty.servlet.ServletHandler.doScope(ServletHandler.java:512)
   [junit4]   2> 	at org.eclipse.jetty.server.session.SessionHandler.doScope(SessionHandler.java:185)
   [junit4]   2> 	at org.eclipse.jetty.server.handler.ContextHandler.doScope(ContextHandler.java:1112)
   [junit4]   2> 	at org.eclipse.jetty.server.handler.ScopedHandler.handle(ScopedHandler.java:141)
   [junit4]   2> 	at org.eclipse.jetty.server.handler.gzip.GzipHandler.handle(GzipHandler.java:493)
   [junit4]   2> 	at org.eclipse.jetty.server.handler.HandlerWrapper.handle(HandlerWrapper.java:134)
   [junit4]   2> 	at org.eclipse.jetty.server.Server.handle(Server.java:534)
   [junit4]   2> 	at org.eclipse.jetty.server.HttpChannel.handle(HttpChannel.java:320)
   [junit4]   2> 	at org.eclipse.jetty.server.HttpConnection.onFillable(HttpConnection.java:251)
   [junit4]   2> 	at org.eclipse.jetty.io.AbstractConnection$ReadCallback.succeeded(AbstractConnection.java:283)
   [junit4]   2> 	at org.eclipse.jetty.io.FillInterest.fillable(FillInterest.java:108)
   [junit4]   2> 	at org.eclipse.jetty.io.SelectChannelEndPoint$2.run(SelectChannelEndPoint.java:93)
   [junit4]   2> 	at org.eclipse.jetty.util.thread.strategy.ExecuteProduceConsume.executeProduceConsume(ExecuteProduceConsume.java:303)
   [junit4]   2> 	at org.eclipse.jetty.util.thread.strategy.ExecuteProduceConsume.produceConsume(ExecuteProduceConsume.java:148)
   [junit4]   2> 	at org.eclipse.jetty.util.thread.strategy.ExecuteProduceConsume.run(ExecuteProduceConsume.java:136)
   [junit4]   2> 	at org.eclipse.jetty.util.thread.QueuedThreadPool.runJob(QueuedThreadPool.java:671)
   [junit4]   2> 	at org.eclipse.jetty.util.thread.QueuedThreadPool$2.run(QueuedThreadPool.java:589)
   [junit4]   2> 	at java.lang.Thread.run(Thread.java:748)
   [junit4]   2> 
   [junit4]   2> 603522 INFO  (TEST-OverseerStatusTest.test-seed#[9A20AFD0F52E2FEE]) [    ] o.a.s.SolrTestCaseJ4 ###Ending test
   [junit4]   2> NOTE: reproduce with: ant test  -Dtestcase=OverseerStatusTest -Dtests.method=test -Dtests.seed=9A20AFD0F52E2FEE -Dtests.multiplier=3 -Dtests.slow=true -Dtests.locale=es -Dtests.timezone=America/Winnipeg -Dtests.asserts=true -Dtests.file.encoding=UTF-8
   [junit4] ERROR    180s J1 | OverseerStatusTest.test <<<
   [junit4]    > Throwable #1: org.apache.solr.client.solrj.impl.HttpSolrClient$RemoteSolrException: Error from server at http://127.0.0.1:45359/solr: create the collection time out:180s
   [junit4]    > 	at __randomizedtesting.SeedInfo.seed([9A20AFD0F52E2FEE:1274900A5BD24216]:0)
   [junit4]    > 	at org.apache.solr.client.solrj.impl.HttpSolrClient.executeMethod(HttpSolrClient.java:626)
   [junit4]    > 	at org.apache.solr.client.solrj.impl.HttpSolrClient.request(HttpSolrClient.java:253)
   [junit4]    > 	at org.apache.solr.client.solrj.impl.HttpSolrClient.request(HttpSolrClient.java:242)
   [junit4]    > 	at org.apache.solr.client.solrj.impl.LBHttpSolrClient.doRequest(LBHttpSolrClient.java:483)
   [junit4]    > 	at org.apache.solr.client.solrj.impl.LBHttpSolrClient.request(LBHttpSolrClient.java:413)
   [junit4]    > 	at org.apache.solr.client.solrj.impl.CloudSolrClient.sendRequest(CloudSolrClient.java:1096)
   [junit4]    > 	at org.apache.solr.client.solrj.impl.CloudSolrClient.requestWithRetryOnStaleState(CloudSolrClient.java:875)
   [junit4]    > 	at org.apache.solr.client.solrj.impl.CloudSolrClient.request(CloudSolrClient.java:808)
   [junit4]    > 	at org.apache.solr.client.solrj.SolrRequest.process(SolrRequest.java:178)
   [junit4]    > 	at org.apache.solr.client.solrj.SolrRequest.process(SolrRequest.java:195)
   [junit4]    > 	at org.apache.solr.cloud.OverseerStatusTest.test(OverseerStatusTest.java:42)
   [junit4]    > 	at java.lang.Thread.run(Thread.java:748)
   [junit4]   2> 603524 INFO  (jetty-closer-700-thread-2) [    ] o.e.j.s.AbstractConnector Stopped ServerConnector@688480f4{HTTP/1.1,[http/1.1]}{127.0.0.1:0}
   [junit4]   2> 603524 INFO  (jetty-closer-700-thread-2) [    ] o.a.s.c.CoreContainer Shutting down CoreContainer instance=1683744673
   [junit4]   2> 603525 ERROR (OverseerThreadFactory-2070-thread-1-processing-n:127.0.0.1:45359_solr) [n:127.0.0.1:45359_solr    ] o.a.s.c.OverseerCollectionMessageHandler Error from shard: http://127.0.0.1:45359/solr
   [junit4]   2> org.apache.solr.client.solrj.SolrServerException: IOException occured when talking to server at: http://127.0.0.1:45359/solr
   [junit4]   2> 	at org.apache.solr.client.solrj.impl.HttpSolrClient.executeMethod(HttpSolrClient.java:640)
   [junit4]   2> 	at org.apache.solr.client.solrj.impl.HttpSolrClient.request(HttpSolrClient.java:253)
   [junit4]   2> 	at org.apache.solr.client.solrj.impl.HttpSolrClient.request(HttpSolrClient.java:242)
   [junit4]   2> 	at org.apache.solr.client.solrj.SolrClient.request(SolrClient.java:1219)
   [junit4]   2> 	at org.apache.solr.handler.component.HttpShardHandler.lambda$submit$0(HttpShardHandler.java:172)
   [junit4]   2> 	at java.util.concurrent.FutureTask.run(FutureTask.java:266)
   [junit4]   2> 	at java.util.concurrent.Executors$RunnableAdapter.call(Executors.java:511)
   [junit4]   2> 	at java.util.concurrent.FutureTask.run(FutureTask.java:266)
   [junit4]   2> 	at com.codahale.metrics.InstrumentedExecutorService$InstrumentedRunnable.run(InstrumentedExecutorService.java:176)
   [junit4]   2> 	at org.apache.solr.common.util.ExecutorUtil$MDCAwareThreadPoolExecutor.lambda$execute$0(ExecutorUtil.java:188)
   [junit4]   2> 	at java.util.concurrent.ThreadPoolExecutor.runWorker(ThreadPoolExecutor.java:1149)
   [junit4]   2> 	at java.util.concurrent.ThreadPoolExecutor$Worker.run(ThreadPoolExecutor.java:624)
   [junit4]   2> 	at java.lang.Thread.run(Thread.java:748)
   [junit4]   2> Caused by: org.apache.http.NoHttpResponseException: 127.0.0.1:45359 failed to respond
   [junit4]   2> 	at org.apache.http.impl.conn.DefaultHttpResponseParser.parseHead(DefaultHttpResponseParser.java:141)
   [junit4]   2> 	at org.apache.http.impl.conn.DefaultHttpResponseParser.parseHead(DefaultHttpResponseParser.java:56)
   [junit4]   2> 	at org.apache.http.impl.io.AbstractMessageParser.parse(AbstractMessageParser.java:259)
   [junit4]   2> 	at org.apache.http.impl.DefaultBHttpClientConnection.receiveResponseHeader(DefaultBHttpClientConnection.java:163)
   [junit4]   2> 	at org.apache.http.impl.conn.CPoolProxy.receiveResponseHeader(CPoolProxy.java:165)
   [junit4]   2> 	at org.apache.http.protocol.HttpRequestExecutor.doReceiveResponse(HttpRequestExecutor.java:273)
   [junit4]   2> 	at org.apache.http.protocol.HttpRequestExecutor.execute(HttpRequestExecutor.java:125)
   [junit4]   2> 	at org.apache.solr.util.stats.InstrumentedHttpRequestExecutor.execute(InstrumentedHttpRequestExecutor.java:118)
   [junit4]   2> 	at org.apache.http.impl.execchain.MainClientExec.execute(MainClientExec.java:272)
   [junit4]   2> 	at org.apache.http.impl.execchain.ProtocolExec.execute(ProtocolExec.java:185)
   [junit4]   2> 	at org.apache.http.impl.execchain.RetryExec.execute(RetryExec.java:89)
   [junit4]   2> 	at org.apache.http.impl.execchain.RedirectExec.execute(RedirectExec.java:111)
   [junit4]   2> 	at org.apache.http.impl.client.InternalHttpClient.doExecute(InternalHttpClient.java:185)
   [junit4]   2> 	at org.apache.http.impl.client.CloseableHttpClient.execute(CloseableHttpClient.java:83)
   [junit4]   2> 	at org.apache.http.impl.client.CloseableHttpClient.execute(CloseableHttpClient.java:56)
   [junit4]   2> 	at org.apache.solr.client.solrj.impl.HttpSolrClient.executeMethod(HttpSolrClient.java:525)
   [junit4]   2> 	... 12 more
   [junit4]   2> 603524 INFO  (jetty-closer-700-thread-1) [    ] o.e.j.s.AbstractConnector Stopped ServerConnector@4179b2c3{HTTP/1.1,[http/1.1]}{127.0.0.1:0}
   [junit4]   2> 603526 INFO  (jetty-closer-700-thread-2) [    ] o.a.s.m.SolrMetricManager Closing metric reporters for registry=solr.node, tag=null
   [junit4]   2> 603527 INFO  (jetty-closer-700-thread-1) [    ] o.a.s.c.CoreContainer Shutting down CoreContainer instance=1999573714
   [junit4]   2> 603527 INFO  (jetty-closer-700-thread-2) [    ] o.a.s.m.r.SolrJmxReporter Closing reporter [org.apache.solr.metrics.reporters.SolrJmxReporter@12f475b5: rootName = solr_45359, domain = solr.node, service url = null, agent id = null] for registry solr.node / com.codahale.metrics.MetricRegistry@7b8ec8a6
   [junit4]   2> 603527 ERROR (OverseerThreadFactory-2070-thread-1-processing-n:127.0.0.1:45359_solr) [n:127.0.0.1:45359_solr    ] o.a.s.c.OverseerCollectionMessageHandler Cleaning up collection [overseer_status_test].
   [junit4]   2> 603527 INFO  (jetty-closer-700-thread-1) [    ] o.a.s.m.SolrMetricManager Closing metric reporters for registry=solr.node, tag=null
   [junit4]   2> 603527 INFO  (jetty-closer-700-thread-1) [    ] o.a.s.m.r.SolrJmxReporter Closing reporter [org.apache.solr.metrics.reporters.SolrJmxReporter@21b2ccdf: rootName = solr_46705, domain = solr.node, service url = null, agent id = null] for registry solr.node / com.codahale.metrics.MetricRegistry@1cf70d7e
   [junit4]   2> 603527 INFO  (OverseerThreadFactory-2070-thread-1-processing-n:127.0.0.1:45359_solr) [n:127.0.0.1:45359_solr    ] o.a.s.c.OverseerCollectionMessageHandler Executing Collection Cmd : action=UNLOAD&deleteInstanceDir=true&deleteDataDir=true
   [junit4]   2> 603528 ERROR (OverseerThreadFactory-2070-thread-1-processing-n:127.0.0.1:45359_solr) [n:127.0.0.1:45359_solr    ] o.a.s.c.OverseerCollectionMessageHandler Error from shard: http://127.0.0.1:45359/solr
   [junit4]   2> org.apache.solr.client.solrj.SolrServerException: Server refused connection at: http://127.0.0.1:45359/solr
   [junit4]   2> 	at org.apache.solr.client.solrj.impl.HttpSolrClient.executeMethod(HttpSolrClient.java:633)
   [junit4]   2> 	at org.apache.solr.client.solrj.impl.HttpSolrClient.request(HttpSolrClient.java:253)
   [junit4]   2> 	at org.apache.solr.client.solrj.impl.HttpSolrClient.request(HttpSolrClient.java:242)
   [junit4]   2> 	at org.apache.solr.client.solrj.SolrClient.request(SolrClient.java:1219)
   [junit4]   2> 	at org.apache.solr.handler.component.HttpShardHandler.lambda$submit$0(HttpShardHandler.java:172)
   [junit4]   2> 	at java.util.concurrent.FutureTask.run(FutureTask.java:266)
   [junit4]   2> 	at java.util.concurrent.Executors$RunnableAdapter.call(Executors.java:511)
   [junit4]   2> 	at java.util.concurrent.FutureTask.run(FutureTask.java:266)
   [junit4]   2> 	at com.codahale.metrics.InstrumentedExecutorService$InstrumentedRunnable.run(InstrumentedExecutorService.java:176)
   [junit4]   2> 	at org.apache.solr.common.util.ExecutorUtil$MDCAwareThreadPoolExecutor.lambda$execute$0(ExecutorUtil.java:188)
   [junit4]   2> 	at java.util.concurrent.ThreadPoolExecutor.runWorker(ThreadPoolExecutor.java:1149)
   [junit4]   2> 	at java.util.concurrent.ThreadPoolExecutor$Worker.run(ThreadPoolExecutor.java:624)
   [junit4]   2> 	at java.lang.Thread.run(Thread.java:748)
   [junit4]   2> Caused by: org.apache.http.conn.HttpHostConnectException: Connect to 127.0.0.1:45359 [/127.0.0.1] failed: Connection refused (Connection refused)
   [junit4]   2> 	at org.apache.http.impl.conn.DefaultHttpClientConnectionOperator.connect(DefaultHttpClientConnectionOperator.java:159)
   [junit4]   2> 	at org.apache.http.impl.conn.PoolingHttpClientConnectionManager.connect(PoolingHttpClientConnectionManager.java:359)
   [junit4]   2> 	at org.apache.http.impl.execchain.MainClientExec.establishRoute(MainClientExec.java:381)
   [junit4]   2> 	at org.apache.http.impl.execchain.MainClientExec.execute(MainClientExec.java:237)
   [junit4]   2> 	at org.apache.http.impl.execchain.ProtocolExec.execute(ProtocolExec.java:185)
   [junit4]   2> 	at org.apache.http.impl.execchain.RetryExec.execute(RetryExec.java:89)
   [junit4]   2> 	at org.apache.http.impl.execchain.RedirectExec.execute(RedirectExec.java:111)
   [junit4]   2> 	at org.apache.http.impl.client.InternalHttpClient.doExecute(InternalHttpClient.java:185)
   [junit4]   2> 	at org.apache.http.impl.client.CloseableHttpClient.execute(CloseableHttpClient.java:83)
   [junit4]   2> 	at org.apache.http.impl.client.CloseableHttpClient.execute(CloseableHttpClient.java:56)
   [junit4]   2> 	at org.apache.solr.client.solrj.impl.HttpSolrClient.executeMethod(HttpSolrClient.java:525)
   [junit4]   2> 	... 12 more
   [junit4]   2> Caused by: java.net.ConnectException: Connection refused (Connection refused)
   [junit4]   2> 	at java.net.PlainSocketImpl.socketConnect(Native Method)
   [junit4]   2> 	at java.net.AbstractPlainSocketImpl.doConnect(AbstractPlainSocketImpl.java:350)
   [junit4]   2> 	at java.net.AbstractPlainSocketImpl.connectToAddress(AbstractPlainSocketImpl.java:206)
   [junit4]   2> 	at java.net.AbstractPlainSocketImpl.connect(AbstractPlainSocketImpl.java:188)
   [junit4]   2> 	at java.net.SocksSocketImpl.connect(SocksSocketImpl.java:392)
   [junit4]   2> 	at java.net.Socket.connect(Socket.java:589)
   [junit4]   2> 	at org.apache.http.conn.socket.PlainConnectionSocketFactory.connectSocket(PlainConnectionSocketFactory.java:75)
   [junit4]   2> 	at org.apache.http.impl.conn.DefaultHttpClientConnectionOperator.connect(DefaultHttpClientConnectionOperator.java:142)
   [junit4]   2> 	... 22 more
   [junit4]   2> 603533 INFO  (jetty-closer-700-thread-2) [    ] o.a.s.m.SolrMetricManager Closing metric reporters for registry=solr.jvm, tag=null
   [junit4]   2> 603533 INFO  (jetty-closer-700-thread-2) [    ] o.a.s.m.r.SolrJmxReporter Closing reporter [org.apache.solr.metrics.reporters.SolrJmxReporter@7a9465b9: rootName = solr_45359, domain = solr.jvm, service url = null, agent id = null] for registry solr.jvm / com.codahale.metrics.MetricRegistry@2861a85a
   [junit4]   2> 603533 INFO  (jetty-closer-700-thread-1) [    ] o.a.s.m.SolrMetricManager Closing metric reporters for registry=solr.jvm, tag=null
   [junit4]   2> 603533 INFO  (jetty-closer-700-thread-1) [    ] o.a.s.m.r.SolrJmxReporter Closing reporter [org.apache.solr.metrics.reporters.SolrJmxReporter@6b49b7e: rootName = solr_46705, domain = solr.jvm, service url = null, agent id = null] for registry solr.jvm / com.codahale.metrics.MetricRegistry@2861a85a
   [junit4]   2> 603536 INFO  (jetty-closer-700-thread-2) [    ] o.a.s.m.SolrMetricManager Closing metric reporters for registry=solr.jetty, tag=null
   [junit4]   2> 603536 INFO  (jetty-closer-700-thread-2) [    ] o.a.s.m.r.SolrJmxReporter Closing reporter [org.apache.solr.metrics.reporters.SolrJmxReporter@1d5eeaf7: rootName = solr_45359, domain = solr.jetty, service url = null, agent id = null] for registry solr.jetty / com.codahale.metrics.MetricRegistry@72d72495
   [junit4]   2> 603536 INFO  (jetty-closer-700-thread-1) [    ] o.a.s.m.SolrMetricManager Closing metric reporters for registry=solr.jetty, tag=null
   [junit4]   2> 603536 INFO  (jetty-closer-700-thread-1) [    ] o.a.s.m.r.SolrJmxReporter Closing reporter [org.apache.solr.metrics.reporters.SolrJmxReporter@69f313ea: rootName = solr_46705, domain = solr.jetty, service url = null, agent id = null] for registry solr.jetty / com.codahale.metrics.MetricRegistry@72d72495
   [junit4]   2> 603537 INFO  (jetty-closer-700-thread-1) [    ] o.a.s.c.ZkController Remove node as live in ZooKeeper:/live_nodes/127.0.0.1:46705_solr
   [junit4]   2> 603537 INFO  (jetty-closer-700-thread-2) [    ] o.a.s.c.ZkController Remove node as live in ZooKeeper:/live_nodes/127.0.0.1:45359_solr
   [junit4]   2> 603537 INFO  (jetty-closer-700-thread-1) [    ] o.a.s.m.SolrMetricManager Closing metric reporters for registry=solr.cluster, tag=null
   [junit4]   2> 603537 INFO  (jetty-closer-700-thread-2) [    ] o.a.s.m.SolrMetricManager Closing metric reporters for registry=solr.cluster, tag=null
   [junit4]   2> 603538 INFO  (jetty-closer-700-thread-1) [    ] o.a.s.c.TransientSolrCoreCacheDefault Allocating transient cache for 2147483647 transient cores
   [junit4]   2> 603538 INFO  (zkCallback-710-thread-5-processing-n:127.0.0.1:45359_solr) [n:127.0.0.1:45359_solr    ] o.a.s.c.c.ZkStateReader Updated live nodes from ZooKeeper... (2) -> (0)
   [junit4]   2> 603538 INFO  (zkCallback-711-thread-2-processing-n:127.0.0.1:46705_solr) [n:127.0.0.1:46705_solr    ] o.a.s.c.c.ZkStateReader Updated live nodes from ZooKeeper... (2) -> (0)
   [junit4]   2> 603538 INFO  (coreCloseExecutor-2080-thread-1) [n:127.0.0.1:45359_solr c:overseer_status_test s:shard1 r:core_node2 x:overseer_status_test_shard1_replica_n1] o.a.s.c.SolrCore [overseer_status_test_shard1_replica_n1]  CLOSING SolrCore org.apache.solr.core.SolrCore@463dfdf5
   [junit4]   2> 603538 INFO  (coreCloseExecutor-2080-thread-1) [n:127.0.0.1:45359_solr c:overseer_status_test s:shard1 r:core_node2 x:overseer_status_test_shard1_replica_n1] o.a.s.m.SolrMetricManager Closing metric reporters for registry=solr.core.overseer_status_test.shard1.replica_n1, tag=1178467829
   [junit4]   2> 603538 INFO  (coreCloseExecutor-2080-thread-1) [n:127.0.0.1:45359_solr c:overseer_status_test s:shard1 r:core_node2 x:overseer_status_test_shard1_replica_n1] o.a.s.m.r.SolrJmxReporter Closing reporter [org.apache.solr.metrics.reporters.SolrJmxReporter@673733fc: rootName = solr_45359, domain = solr.core.overseer_status_test.shard1.replica_n1, service url = null, agent id = null] for registry solr.core.overseer_status_test.shard1.replica_n1 / com.codahale.metrics.MetricRegistry@2169c520
   [junit4]   2> 603542 INFO  (coreCloseExecutor-2080-thread-1) [n:127.0.0.1:45359_solr c:overseer_status_test s:shard1 r:core_node2 x:overseer_status_test_shard1_replica_n1] o.a.s.m.SolrMetricManager Closing metric reporters for registry=solr.collection.overseer_status_test.shard1.leader, tag=1178467829
   [junit4]   2> 603544 INFO  (jetty-closer-700-thread-2) [    ] o.a.s.c.Overseer Overseer (id=98921607214661637-127.0.0.1:45359_solr-n_0000000000) closing
   [junit4]   2> 603544 INFO  (OverseerStateUpdate-98921607214661637-127.0.0.1:45359_solr-n_0000000000) [n:127.0.0.1:45359_solr    ] o.a.s.c.Overseer Overseer Loop exiting : 127.0.0.1:45359_solr
   [junit4]   2> 605038 WARN  (zkCallback-711-thread-2-processing-n:127.0.0.1:46705_solr) [n:127.0.0.1:46705_solr    ] o.a.s.c.ZkController Unable to register nodeLost path for 127.0.0.1:46705_solr
   [junit4]   2> org.apache.zookeeper.KeeperException$SessionExpiredException: KeeperErrorCode = Session expired for /autoscaling/nodeLost/127.0.0.1:46705_solr
   [junit4]   2> 	at org.apache.zookeeper.KeeperException.create(KeeperException.java:127)
   [junit4]   2> 	at org.apache.zookeeper.KeeperException.create(KeeperException.java:51)
   [junit4]   2> 	at org.apache.zookeeper.ZooKeeper.create(ZooKeeper.java:783)
   [junit4]   2> 	at org.apache.solr.common.cloud.SolrZkClient.lambda$create$7(SolrZkClient.java:357)
   [junit4]   2> 	at org.apache.solr.common.cloud.ZkCmdExecutor.retryOperation(ZkCmdExecutor.java:60)
   [junit4]   2> 	at org.apache.solr.common.cloud.SolrZkClient.create(SolrZkClient.java:357)
   [junit4]   2> 	at org.apache.solr.cloud.ZkController.lambda$registerLiveNodesListener$2(ZkController.java:879)
   [junit4]   2> 	at org.apache.solr.common.cloud.ZkStateReader.lambda$refreshLiveNodes$1(ZkStateReader.java:749)
   [junit4]   2> 	at java.util.concurrent.ConcurrentHashMap$KeySetView.forEach(ConcurrentHashMap.java:4649)
   [junit4]   2> 	at org.apache.solr.common.cloud.ZkStateReader.refreshLiveNodes(ZkStateReader.java:748)
   [junit4]   2> 	at org.apache.solr.common.cloud.ZkStateReader.access$1000(ZkStateReader.java:72)
   [junit4]   2> 	at org.apache.solr.common.cloud.ZkStateReader$LiveNodeWatcher.refreshAndWatch(ZkStateReader.java:1154)
   [junit4]   2> 	at org.apache.solr.common.cloud.ZkStateReader$LiveNodeWatcher.process(ZkStateReader.java:1149)
   [junit4]   2> 	at org.apache.solr.common.cloud.SolrZkClient$1.lambda$process$0(SolrZkClient.java:262)
   [junit4]   2> 	at java.util.concurrent.Executors$RunnableAdapter.call(Executors.java:511)
   [junit4]   2> 	at java.util.concurrent.FutureTask.run(FutureTask.java:266)
   [junit4]   2> 	at org.apache.solr.common.util.ExecutorUtil$MDCAwareThreadPoolExecutor.lambda$execute$0(ExecutorUtil.java:188)
   [junit4]   2> 	at java.util.concurrent.ThreadPoolExecutor.runWorker(ThreadPoolExecutor.java:1149)
   [junit4]   2> 	at java.util.concurrent.ThreadPoolExecutor$Worker.run(ThreadPoolExecutor.java:624)
   [junit4]   2> 	at java.lang.Thread.run(Thread.java:748)
   [junit4]   2> 605039 INFO  (jetty-closer-700-thread-1) [    ] o.e.j.s.h.ContextHandler Stopped o.e.j.s.ServletContextHandler@55c63c9d{/solr,null,UNAVAILABLE}
   [junit4]   2> 633560 INFO  (zkCallback-710-thread-5-processing-n:127.0.0.1:45359_solr) [n:127.0.0.1:45359_solr    ] o.a.s.c.c.ZkStateReader A cluster state change: [WatchedEvent state:SyncConnected type:NodeDeleted path:/collections/overseer_status_test/state.json] for collection [overseer_status_test] has occurred - updating... (live nodes size: [0])
   [junit4]   2> 633560 INFO  (zkCallback-710-thread-4-processing-n:127.0.0.1:45359_solr) [n:127.0.0.1:45359_solr    ] o.a.s.c.c.ZkStateReader A cluster state change: [WatchedEvent state:SyncConnected type:NodeDeleted path:/collections/overseer_status_test/state.json] for collection [overseer_status_test] has occurred - updating... (live nodes size: [0])
   [junit4]   2> 633561 ERROR (OverseerThreadFactory-2070-thread-1-processing-n:127.0.0.1:45359_solr) [n:127.0.0.1:45359_solr    ] o.a.s.c.OverseerCollectionMessageHandler Collection: overseer_status_test operation: create failed:org.apache.solr.common.SolrException: Could not fully remove collection: overseer_status_test
   [junit4]   2> 	at org.apache.solr.cloud.DeleteCollectionCmd.call(DeleteCollectionCmd.java:109)
   [junit4]   2> 	at org.apache.solr.cloud.OverseerCollectionMessageHandler.cleanupCollection(OverseerCollectionMessageHandler.java:681)
   [junit4]   2> 	at org.apache.solr.cloud.CreateCollectionCmd.call(CreateCollectionCmd.java:302)
   [junit4]   2> 	at org.apache.solr.cloud.OverseerCollectionMessageHandler.processMessage(OverseerCollectionMessageHandler.java:229)
   [junit4]   2> 	at org.apache.solr.cloud.OverseerTaskProcessor$Runner.run(OverseerTaskProcessor.java:464)
   [junit4]   2> 	at org.apache.solr.common.util.ExecutorUtil$MDCAwareThreadPoolExecutor.lambda$execute$0(ExecutorUtil.java:188)
   [junit4]   2> 	at java.util.concurrent.ThreadPoolExecutor.runWorker(ThreadPoolExecutor.java:1149)
   [junit4]   2> 	at java.util.concurrent.ThreadPoolExecutor$Worker.run(ThreadPoolExecutor.java:624)
   [junit4]   2> 	at java.lang.Thread.run(Thread.java:748)
   [junit4]   2> 
   [junit4]   2> 633567 INFO  (OverseerThreadFactory-2070-thread-1-processing-n:127.0.0.1:45359_solr) [n:127.0.0.1:45359_solr    ] o.a.s.c.OverseerTaskQueue Response ZK path: /overseer/collection-queue-work/qnr-0000000000 doesn't exist.  Requestor may have disconnected from ZooKeeper
   [junit4]   2> 633567 WARN  (OverseerAutoScalingTriggerThread-98921607214661637-127.0.0.1:45359_solr-n_0000000000) [n:127.0.0.1:45359_solr    ] o.a.s.c.a.OverseerTriggerThread OverseerTriggerThread woken up but we are closed, exiting.
   [junit4]   2> 633569 INFO  (jetty-closer-700-thread-2) [    ] o.e.j.s.h.ContextHandler Stopped o.e.j.s.ServletContextHandler@6c66dd67{/solr,null,UNAVAILABLE}
   [junit4]   2> 633569 ERROR (qtp1440646733-4417) [n:127.0.0.1:45359_solr c:overseer_status_test s:shard1 r:core_node2 x:overseer_status_test_shard1_replica_n1] o.a.s.c.ZkController Error getting leader from zk
   [junit4]   2> org.apache.solr.common.SolrException: No registered leader was found after waiting for 1220000ms , collection: overseer_status_test slice: shard1 saw state=null with live_nodes=[]
   [junit4]   2> 	at org.apache.solr.common.cloud.ZkStateReader.getLeaderRetry(ZkStateReader.java:816)
   [junit4]   2> 	at org.apache.solr.common.cloud.ZkStateReader.getLeaderUrl(ZkStateReader.java:781)
   [junit4]   2> 	at org.apache.solr.cloud.ZkController.getLeader(ZkController.java:1178)
   [junit4]   2> 	at org.apache.solr.cloud.ZkController.register(ZkController.java:1079)
   [junit4]   2> 	at org.apache.solr.cloud.ZkController.register(ZkController.java:1014)
   [junit4]   2> 	at org.apache.solr.core.ZkContainer.lambda$registerInZk$0(ZkContainer.java:181)
   [junit4]   2> 	at org.apache.solr.core.ZkContainer.registerInZk(ZkContainer.java:208)
   [junit4]   2> 	at org.apache.solr.core.CoreContainer.registerCore(CoreContainer.java:886)
   [junit4]   2> 	at org.apache.solr.core.CoreContainer.createFromDescriptor(CoreContainer.java:1046)
   [junit4]   2> 	at org.apache.solr.core.CoreContainer.create(CoreContainer.java:948)
   [junit4]   2> 	at org.apache.solr.handler.admin.CoreAdminOperation.lambda$static$0(CoreAdminOperation.java:91)
   [junit4]   2> 	at org.apache.solr.handler.admin.CoreAdminOperation.execute(CoreAdminOperation.java:384)
   [junit4]   2> 	at org.apache.solr.handler.admin.CoreAdminHandler$CallInfo.call(CoreAdminHandler.java:389)
   [junit4]   2> 	at org.apache.solr.handler.admin.CoreAdminHandler.handleRequestBody(CoreAdminHandler.java:174)
   [junit4]   2> 	at org.apache.solr.handler.RequestHandlerBase.handleRequest(RequestHandlerBase.java:177)
   [junit4]   2> 	at org.apache.solr.servlet.HttpSolrCall.handleAdmin(HttpSolrCall.java:735)
   [junit4]   2> 	at org.apache.solr.servlet.HttpSolrCall.handleAdminRequest(HttpSolrCall.java:716)
   [junit4]   2> 	at org.apache.solr.servlet.HttpSolrCall.call(HttpSolrCall.java:497)
   [junit4]   2> 	at org.apache.solr.servlet.SolrDispatchFilter.doFilter(SolrDispatchFilter.java:382)
   [junit4]   2> 	at org.apache.solr.servlet.SolrDispatchFilter.doFilter(SolrDispatchFilter.java:326)
   [junit4]   2> 	at org.eclipse.jetty.servlet.ServletHandler$CachedChain.doFilter(ServletHandler.java:1759)
   [junit4]   2> 	at org.apache.solr.client.solrj.embedded.JettySolrRunner$DebugFilter.doFilter(JettySolrRunner.java:139)
   [junit4]   2> 	at org.eclipse.jetty.servlet.ServletHandler$CachedChain.doFilter(ServletHandler.java:1759)
   [junit4]   2> 	at org.eclipse.jetty.servlet.ServletHandler.doHandle(ServletHandler.java:582)
   [junit4]   2> 	at org.eclipse.jetty.server.session.SessionHandler.doHandle(SessionHandler.java:224)
   [junit4]   2> 	at org.eclipse.jetty.server.handler.ContextHandler.doHandle(ContextHandler.java:1180)
   [junit4]   2> 	at org.eclipse.jetty.servlet.ServletHandler.doScope(ServletHandler.java:512)
   [junit4]   2> 	at org.eclipse.jetty.server.session.SessionHandler.doScope(SessionHandler.java:185)
   [junit4]   2> 	at org.eclipse.jetty.server.handler.ContextHandler.doScope(ContextHandler.java:1112)
   [junit4]   2> 	at org.eclipse.jetty.server.handler.ScopedHandler.handle(ScopedHandler.java:141)
   [junit4]   2> 	at org.eclipse.jetty.server.handler.gzip.GzipHandler.handle(GzipHandler.java:426)
   [junit4]   2> 	at org.eclipse.jetty.server.handler.HandlerWrapper.handle(HandlerWrapper.java:134)
   [junit4]   2> 	at org.eclipse.jetty.server.Server.handle(Server.java:534)
   [junit4]   2> 	at org.eclipse.jetty.server.HttpChannel.handle(HttpChannel.java:320)
   [junit4]   2> 	at org.eclipse.jetty.server.HttpConnection.onFillable(HttpConnection.java:251)
   [junit4]   2> 	at org.eclipse.jetty.io.AbstractConnection$ReadCallback.succeeded(AbstractConnection.java:283)
   [junit4]   2> 	at org.eclipse.jetty.io.FillInterest.fillable(FillInterest.java:108)
   [junit4]   2> 	at org.eclipse.jetty.io.SelectChannelEndPoint$2.run(SelectChannelEndPoint.java:93)
   [junit4]   2> 	at org.eclipse.jetty.util.thread.strategy.ExecuteProduceConsume.executeProduceConsume(ExecuteProduceConsume.java:303)
   [junit4]   2> 	at org.eclipse.jetty.util.thread.strategy.ExecuteProduceConsume.produceConsume(ExecuteProduceConsume.java:148)
   [junit4]   2> 	at org.eclipse.jetty.util.thread.strategy.ExecuteProduceConsume.run(ExecuteProduceConsume.java:136)
   [junit4]   2> 	at org.eclipse.jetty.util.thread.QueuedThreadPool.runJob(QueuedThreadPool.java:671)
   [junit4]   2> 	at org.eclipse.jetty.util.thread.QueuedThreadPool$2.run(QueuedThreadPool.java:589)
   [junit4]   2> 	at java.lang.Thread.run(Thread.java:748)
   [junit4]   2> 633569 ERROR (qtp1440646733-4417) [n:127.0.0.1:45359_solr c:overseer_status_test s:shard1 r:core_node2 x:overseer_status_test_shard1_replica_n1] o.a.s.c.ZkContainer :org.apache.solr.common.SolrException: Error getting leader from zk for shard shard1
   [junit4]   2> 	at org.apache.solr.cloud.ZkController.getLeader(ZkController.java:1207)
   [junit4]   2> 	at org.apache.solr.cloud.ZkController.register(ZkController.java:1079)
   [junit4]   2> 	at org.apache.solr.cloud.ZkController.register(ZkController.java:1014)
   [junit4]   2> 	at org.apache.solr.core.ZkContainer.lambda$registerInZk$0(ZkContainer.java:181)
   [junit4]   2> 	at org.apache.solr.core.ZkContainer.registerInZk(ZkContainer.java:208)
   [junit4]   2> 	at org.apache.solr.core.CoreContainer.registerCore(CoreContainer.java:886)
   [junit4]   2> 	at org.apache.solr.core.CoreContainer.createFromDescriptor(CoreContainer.java:1046)
   [junit4]   2> 	at org.apache.solr.core.CoreContainer.create(CoreContainer.java:948)
   [junit4]   2> 	at org.apache.solr.handler.admin.CoreAdminOperation.lambda$static$0(CoreAdminOperation.java:91)
   [junit4]   2> 	at org.apache.solr.handler.admin.CoreAdminOperation.execute(CoreAdminOperation.java:384)
   [junit4]   2> 	at org.apache.solr.handler.admin.CoreAdminHandler$CallInfo.call(CoreAdminHandler.java:389)
   [junit4]   2> 	at org.apache.solr.handler.admin.CoreAdminHandler.handleRequestBody(CoreAdminHandler.java:174)
   [junit4]   2> 	at org.apache.solr.handler.RequestHandlerBase.handleRequest(RequestHandlerBase.java:177)
   [junit4]   2> 	at org.apache.solr.servlet.HttpSolrCall.handleAdmin(HttpSolrCall.java:735)
   [junit4]   2> 	at org.apache.solr.servlet.HttpSolrCall.handleAdminRequest(HttpSolrCall.java:716)
   [junit4]   2> 	at org.apache.solr.servlet.HttpSolrCall.call(HttpSolrCall.java:497)
   [junit4]   2> 	at org.apache.solr.servlet.SolrDispatchFilter.doFilter(SolrDispatchFilter.java:382)
   [junit4]   2> 	at org.apache.solr.servlet.SolrDispatchFilter.doFilter(SolrDispatchFilter.java:326)
   [junit4]   2> 	at org.eclipse.jetty.servlet.ServletHandler$CachedChain.doFilter(ServletHandler.java:1759)
   [junit4]   2> 	at org.apache.solr.client.solrj.embedded.JettySolrRunner$DebugFilter.doFilter(JettySolrRunner.java:139)
   [junit4]   2> 	at org.eclipse.jetty.servlet.ServletHandler$CachedChain.doFilter(ServletHandler.java:1759)
   [junit4]   2> 	at org.eclipse.jetty.servlet.ServletHandler.doHandle(ServletHandler.java:582)
   [junit4]   2> 	at org.eclipse.jetty.server.session.SessionHandler.doHandle(SessionHandler.java:224)
   [junit4]   2> 	at org.eclipse.jetty.server.handler.ContextHandler.doHandle(ContextHandler.java:1180)
   [junit4]   2> 	at org.eclipse.jetty.servlet.ServletHandler.doScope(ServletHandler.java:512)
   [junit4]   2> 	at org.eclipse.jetty.server.session.SessionHandler.doScope(SessionHandler.java:185)
   [junit4]   2> 	at org.eclipse.jetty.server.handler.ContextHandler.doScope(ContextHandler.java:1112)
   [junit4]   2> 	at org.eclipse.jetty.server.handler.ScopedHandler.handle(ScopedHandler.java:141)
   [junit4]   2> 	at org.eclipse.jetty.server.handler.gzip.GzipHandler.handle(GzipHandler.java:426)
   [junit4]   2> 	at org.eclipse.jetty.server.handler.HandlerWrapper.handle(HandlerWrapper.java:134)
   [junit4]   2> 	at org.eclipse.jetty.server.Server.handle(Server.java:534)
   [junit4]   2> 	at org.eclipse.jetty.server.HttpChannel.handle(HttpChannel.java:320)
   [junit4]   2> 	at org.eclipse.jetty.server.HttpConnection.onFillable(HttpConnection.java:251)
   [junit4]   2> 	at org.eclipse.jetty.io.AbstractConnection$ReadCallback.succeeded(AbstractConnection.java:283)
   [junit4]   2> 	at org.eclipse.jetty.io.FillInterest.fillable(FillInterest.java:108)
   [junit4]   2> 	at org.eclipse.jetty.io.SelectChannelEndPoint$2.run(SelectChannelEndPoint.java:93)
   [junit4]   2> 	at org.eclipse.jetty.util.thread.strategy.ExecuteProduceConsume.executeProduceConsume(ExecuteProduceConsume.java:303)
   [junit4]   2> 	at org.eclipse.jetty.util.thread.strategy.ExecuteProduceConsume.produceConsume(ExecuteProduceConsume.java:148)
   [junit4]   2> 	at org.eclipse.jetty.util.thread.strategy.ExecuteProduceConsume.run(ExecuteProduceConsume.java:136)
   [junit4]   2> 	at org.eclipse.jetty.util.thread.QueuedThreadPool.runJob(QueuedThreadPool.java:671)
   [junit4]   2> 	at org.eclipse.jetty.util.thread.QueuedThreadPool$2.run(QueuedThreadPool.java:589)
   [junit4]   2> 	at java.lang.Thread.run(Thread.java:748)
   [junit4]   2> Caused by: org.apache.solr.common.SolrException: No registered leader was found after waiting for 1220000ms , collection: overseer_status_test slice: shard1 saw state=null with live_nodes=[]
   [junit4]   2> 	at org.apache.solr.common.cloud.ZkStateReader.getLeaderRetry(ZkStateReader.java:816)
   [junit4]   2> 	at org.apache.solr.common.cloud.ZkStateReader.getLeaderUrl(ZkStateReader.java:781)
   [junit4]   2> 	at org.apache.solr.cloud.ZkController.getLeader(ZkController.java:1178)
   [junit4]   2> 	... 41 more
   [junit4]   2> 
   [junit4]   2> 633570 INFO  (qtp1440646733-4417) [n:127.0.0.1:45359_solr c:overseer_status_test s:shard1 r:core_node2 x:overseer_status_test_shard1_replica_n1] o.a.s.s.HttpSolrCall [admin] webapp=null path=/admin/cores params={qt=/admin/cores&coreNodeName=core_node2&collection.configName=conf&newCollection=true&name=overseer_status_test_shard1_replica_n1&action=CREATE&numShards=1&collection=overseer_status_test&shard=shard1&wt=javabin&version=2&replicaType=NRT} status=0 QTime=209744
   [junit4]   2> 633570 ERROR (SUITE-OverseerStatusTest-seed#[9A20AFD0F52E2FEE]-worker) [    ] o.a.z.s.ZooKeeperServer ZKShutdownHandler is not registered, so ZooKeeper server won't take any action on ERROR or SHUTDOWN server state changes
   [junit4]   2> 633570 INFO  (SUITE-OverseerStatusTest-seed#[9A20AFD0F52E2FEE]-worker) [    ] o.a.s.c.ZkTestServer connecting to 127.0.0.1:46519 46519
   [junit4]   2> 633747 INFO  (Thread-1017) [    ] o.a.s.c.ZkTestServer connecting to 127.0.0.1:46519 46519
   [junit4]   2> 633748 WARN  (Thread-1017) [    ] o.a.s.c.ZkTestServer Watch limit violations: 
   [junit4]   2> Maximum concurrent create/delete watches above limit:
   [junit4]   2> 
   [junit4]   2> 	3	/solr/aliases.json
   [junit4]   2> 	3	/solr/clusterprops.json
   [junit4]   2> 	2	/solr/security.json
   [junit4]   2> 
   [junit4]   2> Maximum concurrent data watches above limit:
   [junit4]   2> 
   [junit4]   2> 	3	/solr/collections/overseer_status_test/state.json
   [junit4]   2> 	3	/solr/clusterstate.json
   [junit4]   2> 
   [junit4]   2> Maximum concurrent children watches above limit:
   [junit4]   2> 
   [junit4]   2> 	3	/solr/live_nodes
   [junit4]   2> 	3	/solr/collections
   [junit4]   2> 
   [junit4]   2> NOTE: leaving temporary files on disk at: /home/jenkins/workspace/Lucene-Solr-7.x-Linux/solr/build/solr-core/test/J1/temp/solr.cloud.OverseerStatusTest_9A20AFD0F52E2FEE-001
   [junit4]   2> Oct 31, 2017 4:29:08 AM com.carrotsearch.randomizedtesting.ThreadLeakControl checkThreadLeaks
   [junit4]   2> WARNING: Will linger awaiting termination of 1 leaked thread(s).
   [junit4]   2> NOTE: test params are: codec=Asserting(Lucene70): {}, docValues:{}, maxPointsInLeafNode=1414, maxMBSortInHeap=5.169535040596158, sim=RandomSimilarity(queryNorm=false): {}, locale=es, timezone=America/Winnipeg
   [junit4]   2> NOTE: Linux 4.10.0-37-generic amd64/Oracle Corporation 1.8.0_144 (64-bit)/cpus=8,threads=1,free=335796520,total=536870912
   [junit4]   2> NOTE: All tests run in this JVM: [AddSchemaFieldsUpdateProcessorFactoryTest, NodeMutatorTest, BadIndexSchemaTest, HighlighterConfigTest, ImplicitSnitchTest, JvmMetricsTest, SolrCloudExampleTest, ShardRoutingTest, TestRandomRequestDistribution, UninvertDocValuesMergePolicyTest, DistributedFacetPivotSmallTest, TestStressLucene, TestSolr4Spatial, ConjunctionSolrSpellCheckerTest, TestStandardQParsers, QueryEqualityTest, TestBlobHandler, TestWriterPerf, TestFilteredDocIdSet, TestJettySolrRunner, PreAnalyzedFieldTest, TestSolrQueryParser, TestCloudPivotFacet, AutoAddReplicasPlanActionTest, HLLSerializationTest, ShowFileRequestHandlerTest, TestSolrCoreSnapshots, TestZkAclsWithHadoopAuth, HdfsRecoverLeaseTest, ClassificationUpdateProcessorFactoryTest, TestManagedSynonymFilterFactory, TestNumericRangeQuery64, ChaosMonkeySafeLeaderTest, PrimUtilsTest, TestMissingGroups, TestInPlaceUpdatesStandalone, SynonymTokenizerTest, OutputWriterTest, TestManagedSchema, TestSegmentSorting, TestDefaultStatsCache, TestFaceting, TestInfoStreamLogging, TestDistributedStatsComponentCardinality, TestSubQueryTransformer, PeerSyncWithIndexFingerprintCachingTest, AnalyticsQueryTest, DeleteLastCustomShardedReplicaTest, TestAnalyzedSuggestions, VMParamsZkACLAndCredentialsProvidersTest, SolrMetricManagerTest, DebugComponentTest, AssignTest, SOLR749Test, TestBinaryResponseWriter, AddReplicaTest, OverseerStatusTest]
   [junit4] Completed [205/745 (1!)] on J1 in 210.84s, 1 test, 1 error <<< FAILURES!

[...truncated 43 lines...]
   [junit4] Suite: org.apache.solr.cloud.TestSolrCloudWithSecureImpersonation
   [junit4]   2> Creating dataDir: /home/jenkins/workspace/Lucene-Solr-7.x-Linux/solr/build/solr-core/test/J1/temp/solr.cloud.TestSolrCloudWithSecureImpersonation_9A20AFD0F52E2FEE-001/init-core-data-001
   [junit4]   2> 676237 WARN  (SUITE-TestSolrCloudWithSecureImpersonation-seed#[9A20AFD0F52E2FEE]-worker) [    ] o.a.s.SolrTestCaseJ4 startTrackingSearchers: numOpens=88 numCloses=88
   [junit4]   2> 676237 INFO  (SUITE-TestSolrCloudWithSecureImpersonation-seed#[9A20AFD0F52E2FEE]-worker) [    ] o.a.s.SolrTestCaseJ4 Using PointFields (NUMERIC_POINTS_SYSPROP=true) w/NUMERIC_DOCVALUES_SYSPROP=false
   [junit4]   2> 676238 INFO  (SUITE-TestSolrCloudWithSecureImpersonation-seed#[9A20AFD0F52E2FEE]-worker) [    ] o.a.s.SolrTestCaseJ4 Randomized ssl (true) and clientAuth (false) via: @org.apache.solr.util.RandomizeSSL(reason=, value=NaN, ssl=NaN, clientAuth=NaN)
   [junit4]   2> 676238 INFO  (SUITE-TestSolrCloudWithSecureImpersonation-seed#[9A20AFD0F52E2FEE]-worker) [    ] o.a.s.SolrTestCaseJ4 SecureRandom sanity checks: test.solr.allowed.securerandom=null & java.security.egd=file:/dev/./urandom
   [junit4]   2> 676252 INFO  (SUITE-TestSolrCloudWithSecureImpersonation-seed#[9A20AFD0F52E2FEE]-worker) [    ] o.a.s.c.MiniSolrCloudCluster Starting cluster of 2 servers in /home/jenkins/workspace/Lucene-Solr-7.x-Linux/solr/build/solr-core/test/J1/temp/solr.cloud.TestSolrCloudWithSecureImpersonation_9A20AFD0F52E2FEE-001/tempDir-001
   [junit4]   2> 676253 INFO  (SUITE-TestSolrCloudWithSecureImpersonation-seed#[9A20AFD0F52E2FEE]-worker) [    ] o.a.s.c.ZkTestServer STARTING ZK TEST SERVER
   [junit4]   2> 676253 INFO  (Thread-1040) [    ] o.a.s.c.ZkTestServer client port:0.0.0.0/0.0.0.0:0
   [junit4]   2> 676253 INFO  (Thread-1040) [    ] o.a.s.c.ZkTestServer Starting server
   [junit4]   2> 676255 ERROR (Thread-1040) [    ] o.a.z.s.ZooKeeperServer ZKShutdownHandler is not registered, so ZooKeeper server won't take any action on ERROR or SHUTDOWN server state changes
   [junit4]   2> 676353 INFO  (SUITE-TestSolrCloudWithSecureImpersonation-seed#[9A20AFD0F52E2FEE]-worker) [    ] o.a.s.c.ZkTestServer start zk server on port:35975
   [junit4]   2> 676372 INFO  (jetty-launcher-721-thread-2) [    ] o.e.j.s.Server jetty-9.3.20.v20170531
   [junit4]   2> 676372 INFO  (jetty-launcher-721-thread-1) [    ] o.e.j.s.Server jetty-9.3.20.v20170531
   [junit4]   2> 676407 INFO  (jetty-launcher-721-thread-1) [    ] o.e.j.s.h.ContextHandler Started o.e.j.s.ServletContextHandler@2d1a0df3{/solr,null,AVAILABLE}
   [junit4]   2> 676409 INFO  (jetty-launcher-721-thread-1) [    ] o.e.j.s.AbstractConnector Started ServerConnector@22023d2a{SSL,[ssl, http/1.1]}{127.0.0.1:45089}
   [junit4]   2> 676409 INFO  (jetty-launcher-721-thread-1) [    ] o.e.j.s.Server Started @678506ms
   [junit4]   2> 676409 INFO  (jetty-launcher-721-thread-1) [    ] o.a.s.c.s.e.JettySolrRunner Jetty properties: {hostContext=/solr, hostPort=45089}
   [junit4]   2> 676409 ERROR (jetty-launcher-721-thread-1) [    ] o.a.s.u.StartupLoggingUtils Missing Java Option solr.log.dir. Logging may be missing or incomplete.
   [junit4]   2> 676409 INFO  (jetty-launcher-721-thread-1) [    ] o.a.s.s.SolrDispatchFilter  ___      _       Welcome to Apache Solr™ version 7.2.0
   [junit4]   2> 676409 INFO  (jetty-launcher-721-thread-1) [    ] o.a.s.s.SolrDispatchFilter / __| ___| |_ _   Starting in cloud mode on port null
   [junit4]   2> 676409 INFO  (jetty-launcher-721-thread-1) [    ] o.a.s.s.SolrDispatchFilter \__ \/ _ \ | '_|  Install dir: null
   [junit4]   2> 676409 INFO  (jetty-launcher-721-thread-1) [    ] o.a.s.s.SolrDispatchFilter |___/\___/_|_|    Start time: 2017-10-31T04:29:51.440Z
   [junit4]   2> 676420 INFO  (jetty-launcher-721-thread-2) [    ] o.e.j.s.h.ContextHandler Started o.e.j.s.ServletContextHandler@2706f743{/solr,null,AVAILABLE}
   [junit4]   2> 676421 INFO  (jetty-launcher-721-thread-2) [    ] o.e.j.s.AbstractConnector Started ServerConnector@2737dfe3{SSL,[ssl, http/1.1]}{127.0.0.1:39613}
   [junit4]   2> 676444 INFO  (jetty-launcher-721-thread-2) [    ] o.e.j.s.Server Started @678541ms
   [junit4]   2> 676444 INFO  (jetty-launcher-721-thread-2) [    ] o.a.s.c.s.e.JettySolrRunner Jetty properties: {hostContext=/solr, hostPort=39613}
   [junit4]   2> 676444 ERROR (jetty-launcher-721-thread-2) [    ] o.a.s.u.StartupLoggingUtils Missing Java Option solr.log.dir. Logging may be missing or incomplete.
   [junit4]   2> 676445 INFO  (jetty-launcher-721-thread-2) [    ] o.a.s.s.SolrDispatchFilter  ___      _       Welcome to Apache Solr™ version 7.2.0
   [junit4]   2> 676445 INFO  (jetty-launcher-721-thread-2) [    ] o.a.s.s.SolrDispatchFilter / __| ___| |_ _   Starting in cloud mode on port null
   [junit4]   2> 676445 INFO  (jetty-launcher-721-thread-2) [    ] o.a.s.s.SolrDispatchFilter \__ \/ _ \ | '_|  Install dir: null
   [junit4]   2> 676445 INFO  (jetty-launcher-721-thread-2) [    ] o.a.s.s.SolrDispatchFilter |___/\___/_|_|    Start time: 2017-10-31T04:29:51.476Z
   [junit4]   2> 676446 INFO  (jetty-launcher-721-thread-1) [    ] o.a.s.s.SolrDispatchFilter solr.xml found in ZooKeeper. Loading...
   [junit4]   2> 676543 INFO  (jetty-launcher-721-thread-1) [    ] o.a.s.c.ZkContainer Zookeeper client=127.0.0.1:35975/solr
   [junit4]   2> 676574 INFO  (jetty-launcher-721-thread-2) [    ] o.a.s.s.SolrDispatchFilter solr.xml found in ZooKeeper. Loading...
   [junit4]   2> 676586 INFO  (jetty-launcher-721-thread-2) [    ] o.a.s.c.ZkContainer Zookeeper client=127.0.0.1:35975/solr
   [junit4]   2> 676684 INFO  (jetty-launcher-721-thread-2) [n:127.0.0.1:39613_solr    ] o.a.s.c.Overseer Overseer (id=null) closing
   [junit4]   2> 676685 INFO  (jetty-launcher-721-thread-2) [n:127.0.0.1:39613_solr    ] o.a.s.c.OverseerElectionContext I am going to be the leader 127.0.0.1:39613_solr
   [junit4]   2> 676687 INFO  (jetty-launcher-721-thread-2) [n:127.0.0.1:39613_solr    ] o.a.s.c.Overseer Overseer (id=98921623800053766-127.0.0.1:39613_solr-n_0000000000) starting
   [junit4]   2> 676694 INFO  (jetty-launcher-721-thread-1) [n:127.0.0.1:45089_solr    ] o.a.s.c.Overseer Overseer (id=null) closing
   [junit4]   2> 676695 INFO  (jetty-launcher-721-thread-1) [n:127.0.0.1:45089_solr    ] o.a.s.c.ZkController Register node as live in ZooKeeper:/live_nodes/127.0.0.1:45089_solr
   [junit4]   2> 676702 INFO  (zkCallback-729-thread-1-processing-n:127.0.0.1:45089_solr) [n:127.0.0.1:45089_solr    ] o.a.s.c.c.ZkStateReader Updated live nodes from ZooKeeper... (0) -> (1)
   [junit4]   2> 676704 INFO  (OverseerStateUpdate-98921623800053766-127.0.0.1:39613_solr-n_0000000000) [n:127.0.0.1:39613_solr    ] o.a.s.c.c.ZkStateReader Updated live nodes from ZooKeeper... (0) -> (1)
   [junit4]   2> 676704 INFO  (jetty-launcher-721-thread-2) [n:127.0.0.1:39613_solr    ] o.a.s.c.ZkController Register node as live in ZooKeeper:/live_nodes/127.0.0.1:39613_solr
   [junit4]   2> 676704 INFO  (zkCallback-729-thread-1-processing-n:127.0.0.1:45089_solr) [n:127.0.0.1:45089_solr    ] o.a.s.c.c.ZkStateReader Updated live nodes from ZooKeeper... (1) -> (2)
   [junit4]   2> 676711 INFO  (zkCallback-733-thread-1-processing-n:127.0.0.1:39613_solr) [n:127.0.0.1:39613_solr    ] o.a.s.c.c.ZkStateReader Updated live nodes from ZooKeeper... (1) -> (2)
   [junit4]   2> 676734 INFO  (jetty-launcher-721-thread-2) [n:127.0.0.1:39613_solr    ] o.a.s.c.CoreContainer Initializing authentication plugin: org.apache.solr.security.HttpParamDelegationTokenPlugin
   [junit4]   2> 676736 INFO  (jetty-launcher-721-thread-1) [n:127.0.0.1:45089_solr    ] o.a.s.c.CoreContainer Initializing authentication plugin: org.apache.solr.security.HttpParamDelegationTokenPlugin
   [junit4]   2> 676738 WARN  (jetty-launcher-721-thread-1) [n:127.0.0.1:45089_solr    ] o.a.s.c.s.i.Krb5HttpClientBuilder org.apache.solr.client.solrj.impl.Krb5HttpClientBuilder is configured without specifying system property 'java.security.auth.login.config'
   [junit4]   2> 676738 WARN  (jetty-launcher-721-thread-2) [n:127.0.0.1:39613_solr    ] o.a.s.c.s.i.Krb5HttpClientBuilder org.apache.solr.client.solrj.impl.Krb5HttpClientBuilder is configured without specifying system property 'java.security.auth.login.config'
   [junit4]   2> 676740 INFO  (jetty-launcher-721-thread-1) [n:127.0.0.1:45089_solr    ] o.a.s.s.KerberosPlugin Params: {solr.kerberos.impersonator.user.noGroups.hosts=*, solr.kerberos.impersonator.user.bogusGroup.groups=__some_bogus_group, token.valid=30, cookie.domain=127.0.0.1, solr.kerberos.impersonator.user.anyHostAnyUser.groups=*, solr.kerberos.impersonator.user.bogusGroup.hosts=*, solr.kerberos.impersonator.user.anyHostAnyUser.hosts=*, token.validity=36000, solr.kerberos.impersonator.user.noHosts.groups=*, type=kerberos, solr.kerberos.impersonator.user.localHostAnyGroup.groups=*, delegation-token.token-kind=solr-dt, solr.kerberos.impersonator.user.wrongHost.hosts=1.1.1.1.1.1, cookie.path=/, zk-dt-secret-manager.znodeWorkingPath=solr/security/zkdtsm, solr.kerberos.impersonator.user.localHostAnyGroup.hosts=localhost.localdomain,localhost,127.0.0.1, signer.secret.provider.zookeeper.path=/token, solr.kerberos.impersonator.user.anyHostUsersGroup.groups=jenkins, zk-dt-secret-manager.enable=true, solr.kerberos.impersonator.user.wrongHost.groups=*, kerberos.name.rules=DEFAULT, signer.secret.provider=zookeeper, solr.kerberos.impersonator.user.anyHostUsersGroup.hosts=*}
   [junit4]   2> 676740 INFO  (jetty-launcher-721-thread-2) [n:127.0.0.1:39613_solr    ] o.a.s.s.KerberosPlugin Params: {solr.kerberos.impersonator.user.noGroups.hosts=*, solr.kerberos.impersonator.user.bogusGroup.groups=__some_bogus_group, token.valid=30, cookie.domain=127.0.0.1, solr.kerberos.impersonator.user.anyHostAnyUser.groups=*, solr.kerberos.impersonator.user.bogusGroup.hosts=*, solr.kerberos.impersonator.user.anyHostAnyUse

[...truncated too long message...]

8090-thread-1-processing-n:127.0.0.1:38129_solr) [n:127.0.0.1:38129_solr    ] o.a.s.c.a.ExecutePlanAction Unexpected Exception while querying status of requestId=node_lost_trigger/14f28ed2390d8080T7dqeweg8nw5ialb4f2ibdeens/0
   [junit4]   2> java.io.IOException: org.apache.solr.client.solrj.SolrServerException: No live SolrServers available to handle this request
   [junit4]   2> 	at org.apache.solr.client.solrj.impl.SolrClientCloudManager.request(SolrClientCloudManager.java:101)
   [junit4]   2> 	at org.apache.solr.cloud.autoscaling.ExecutePlanAction.waitForTaskToFinish(ExecutePlanAction.java:130)
   [junit4]   2> 	at org.apache.solr.cloud.autoscaling.ScheduledTriggers.waitForPendingTasks(ScheduledTriggers.java:289)
   [junit4]   2> 	at org.apache.solr.cloud.autoscaling.ScheduledTriggers.lambda$null$2(ScheduledTriggers.java:221)
   [junit4]   2> 	at java.util.concurrent.Executors$RunnableAdapter.call(Executors.java:511)
   [junit4]   2> 	at java.util.concurrent.FutureTask.run(FutureTask.java:266)
   [junit4]   2> 	at org.apache.solr.common.util.ExecutorUtil$MDCAwareThreadPoolExecutor.lambda$execute$0(ExecutorUtil.java:188)
   [junit4]   2> 	at java.util.concurrent.ThreadPoolExecutor.runWorker(ThreadPoolExecutor.java:1149)
   [junit4]   2> 	at java.util.concurrent.ThreadPoolExecutor$Worker.run(ThreadPoolExecutor.java:624)
   [junit4]   2> 	at java.lang.Thread.run(Thread.java:748)
   [junit4]   2> Caused by: org.apache.solr.client.solrj.SolrServerException: No live SolrServers available to handle this request
   [junit4]   2> 	at org.apache.solr.client.solrj.impl.LBHttpSolrClient.request(LBHttpSolrClient.java:460)
   [junit4]   2> 	at org.apache.solr.client.solrj.impl.CloudSolrClient.sendRequest(CloudSolrClient.java:1096)
   [junit4]   2> 	at org.apache.solr.client.solrj.impl.CloudSolrClient.requestWithRetryOnStaleState(CloudSolrClient.java:875)
   [junit4]   2> 	at org.apache.solr.client.solrj.impl.CloudSolrClient.request(CloudSolrClient.java:808)
   [junit4]   2> 	at org.apache.solr.client.solrj.SolrRequest.process(SolrRequest.java:178)
   [junit4]   2> 	at org.apache.solr.client.solrj.SolrRequest.process(SolrRequest.java:195)
   [junit4]   2> 	at org.apache.solr.client.solrj.impl.SolrClientCloudManager.request(SolrClientCloudManager.java:99)
   [junit4]   2> 	... 9 more
   [junit4]   2> 2955861 WARN  (OverseerThreadFactory-8091-thread-5-processing-n:127.0.0.1:38129_solr) [n:127.0.0.1:38129_solr    ] o.a.s.c.MoveReplicaCmd Timed out waiting for leader's replica to recover, collection=testExecute shard=shard1 on node=127.0.0.1:38129_solr
   [junit4]   2> 2955866 INFO  (OverseerThreadFactory-8091-thread-5-processing-n:127.0.0.1:38129_solr) [n:127.0.0.1:38129_solr    ] o.a.s.c.OverseerTaskQueue Response ZK path: /overseer/collection-queue-work/qnr-0000000006 doesn't exist.  Requestor may have disconnected from ZooKeeper
   [junit4]   2> 2955867 WARN  (OverseerAutoScalingTriggerThread-98921729889992709-127.0.0.1:38129_solr-n_0000000000) [n:127.0.0.1:38129_solr    ] o.a.s.c.a.OverseerTriggerThread OverseerTriggerThread woken up but we are closed, exiting.
   [junit4]   2> 2955867 DEBUG (jetty-closer-5757-thread-1) [    ] o.a.s.c.a.OverseerTriggerThread OverseerTriggerThread has been closed explicitly
   [junit4]   2> 2955868 INFO  (jetty-closer-5757-thread-1) [    ] o.e.j.s.h.ContextHandler Stopped o.e.j.s.ServletContextHandler@265b5d26{/solr,null,UNAVAILABLE}
   [junit4]   2> 2955869 ERROR (SUITE-ExecutePlanActionTest-seed#[9A20AFD0F52E2FEE]-worker) [    ] o.a.z.s.ZooKeeperServer ZKShutdownHandler is not registered, so ZooKeeper server won't take any action on ERROR or SHUTDOWN server state changes
   [junit4]   2> 2955869 INFO  (SUITE-ExecutePlanActionTest-seed#[9A20AFD0F52E2FEE]-worker) [    ] o.a.s.c.ZkTestServer connecting to 127.0.0.1:34771 34771
   [junit4]   2> 2955898 INFO  (Thread-4116) [    ] o.a.s.c.ZkTestServer connecting to 127.0.0.1:34771 34771
   [junit4]   2> 2955899 WARN  (Thread-4116) [    ] o.a.s.c.ZkTestServer Watch limit violations: 
   [junit4]   2> Maximum concurrent create/delete watches above limit:
   [junit4]   2> 
   [junit4]   2> 	4	/solr/aliases.json
   [junit4]   2> 	3	/solr/configs/conf
   [junit4]   2> 	2	/solr/security.json
   [junit4]   2> 
   [junit4]   2> Maximum concurrent data watches above limit:
   [junit4]   2> 
   [junit4]   2> 	22	/solr/collections/testExecute/state.json
   [junit4]   2> 	15	/solr/collections/testIntegration/state.json
   [junit4]   2> 	4	/solr/clusterstate.json
   [junit4]   2> 	4	/solr/clusterprops.json
   [junit4]   2> 
   [junit4]   2> Maximum concurrent children watches above limit:
   [junit4]   2> 
   [junit4]   2> 	4	/solr/live_nodes
   [junit4]   2> 	4	/solr/collections
   [junit4]   2> 
   [junit4]   2> NOTE: leaving temporary files on disk at: /home/jenkins/workspace/Lucene-Solr-7.x-Linux/solr/build/solr-core/test/J1/temp/solr.cloud.autoscaling.ExecutePlanActionTest_9A20AFD0F52E2FEE-001
   [junit4]   2> Oct 31, 2017 5:07:50 AM com.carrotsearch.randomizedtesting.ThreadLeakControl checkThreadLeaks
   [junit4]   2> WARNING: Will linger awaiting termination of 2 leaked thread(s).
   [junit4]   2> NOTE: test params are: codec=CheapBastard, sim=RandomSimilarity(queryNorm=false): {}, locale=es-PY, timezone=Antarctica/Troll
   [junit4]   2> NOTE: Linux 4.10.0-37-generic amd64/Oracle Corporation 1.8.0_144 (64-bit)/cpus=8,threads=1,free=238660424,total=536870912
   [junit4]   2> NOTE: All tests run in this JVM: [AddSchemaFieldsUpdateProcessorFactoryTest, NodeMutatorTest, BadIndexSchemaTest, HighlighterConfigTest, ImplicitSnitchTest, JvmMetricsTest, SolrCloudExampleTest, ShardRoutingTest, TestRandomRequestDistribution, UninvertDocValuesMergePolicyTest, DistributedFacetPivotSmallTest, TestStressLucene, TestSolr4Spatial, ConjunctionSolrSpellCheckerTest, TestStandardQParsers, QueryEqualityTest, TestBlobHandler, TestWriterPerf, TestFilteredDocIdSet, TestJettySolrRunner, PreAnalyzedFieldTest, TestSolrQueryParser, TestCloudPivotFacet, AutoAddReplicasPlanActionTest, HLLSerializationTest, ShowFileRequestHandlerTest, TestSolrCoreSnapshots, TestZkAclsWithHadoopAuth, HdfsRecoverLeaseTest, ClassificationUpdateProcessorFactoryTest, TestManagedSynonymFilterFactory, TestNumericRangeQuery64, ChaosMonkeySafeLeaderTest, PrimUtilsTest, TestMissingGroups, TestInPlaceUpdatesStandalone, SynonymTokenizerTest, OutputWriterTest, TestManagedSchema, TestSegmentSorting, TestDefaultStatsCache, TestFaceting, TestInfoStreamLogging, TestDistributedStatsComponentCardinality, TestSubQueryTransformer, PeerSyncWithIndexFingerprintCachingTest, AnalyticsQueryTest, DeleteLastCustomShardedReplicaTest, TestAnalyzedSuggestions, VMParamsZkACLAndCredentialsProvidersTest, SolrMetricManagerTest, DebugComponentTest, AssignTest, SOLR749Test, TestBinaryResponseWriter, AddReplicaTest, OverseerStatusTest, TestIntervalFaceting, TestSolrCloudWithSecureImpersonation, TestComplexPhraseQParserPlugin, TestSkipOverseerOperations, TestCloudSchemaless, MergeStrategyTest, TestClusterStateMutator, SolrIndexSplitterTest, TestSerializedLuceneMatchVersion, TestLegacyField, DistributedDebugComponentTest, TestRangeQuery, AnalysisErrorHandlingTest, TestDocTermOrds, TestExactStatsCache, BlockJoinFacetRandomTest, OverseerCollectionConfigSetProcessorTest, TestBulkSchemaAPI, TestNumericTerms64, TestRTGBase, TestSimpleTrackingShardHandler, BufferStoreTest, ShardRoutingCustomTest, InfixSuggestersTest, LukeRequestHandlerTest, ConfigureRecoveryStrategyTest, TermVectorComponentDistributedTest, TestLeaderInitiatedRecoveryThread, HdfsBasicDistributedZk2Test, SolrJmxReporterTest, TestQuerySenderNoQuery, SolrIndexConfigTest, DistributedFacetPivotLargeTest, TestPseudoReturnFields, RegexBoostProcessorTest, TestCustomStream, ManagedSchemaRoundRobinCloudTest, SpatialHeatmapFacetsTest, DistribDocExpirationUpdateProcessorTest, DOMUtilTest, ZkCLITest, TemplateUpdateProcessorTest, SolrGangliaReporterTest, SpellingQueryConverterTest, TestRequestForwarding, TestCollationField, TestPointFields, NumericFieldsTest, BitVectorTest, DirectUpdateHandlerTest, CreateCollectionCleanupTest, TestPushWriter, TestGeoJSONResponseWriter, TestInitQParser, TestRetrieveFieldsOptimizer, TestAddFieldRealTimeGet, PathHierarchyTokenizerFactoryTest, OpenCloseCoreStressTest, TestSurroundQueryParser, TestBackupRepositoryFactory, TestCollectionAPIs, MigrateRouteKeyTest, TestStressLiveNodes, OpenExchangeRatesOrgProviderTest, SyncSliceTest, OverseerTest, ClusterStateUpdateTest, ZkSolrClientTest, TestRealTimeGet, TestStressReorder, TestReload, TestGroupingSearch, TestSort, TestBadConfig, TestCoreDiscovery, AnalysisAfterCoreReloadTest, SuggesterFSTTest, TestFoldingMultitermQuery, SuggesterTSTTest, SuggesterWFSTTest, TestCSVLoader, PolyFieldTest, NoCacheHeaderTest, WordBreakSolrSpellCheckerTest, SolrCoreCheckLockOnStartupTest, DirectUpdateHandlerOptimizeTest, SortByFunctionTest, DocValuesMultiTest, TestSolrDeletionPolicy1, CacheHeaderTest, DocumentAnalysisRequestHandlerTest, TestOmitPositions, MoreLikeThisHandlerTest, IndexSchemaRuntimeFieldTest, TestJmxIntegration, MBeansHandlerTest, ZkNodePropsTest, FileUtilsTest, DistributedMLTComponentTest, TestEmbeddedSolrServerAdminHandler, TestEmbeddedSolrServerConstructors, TestEmbeddedSolrServerSchemaAPI, ConnectionReuseTest, CdcrReplicationHandlerTest, CdcrRequestHandlerTest, CdcrVersionReplicationTest, ChaosMonkeyNothingIsSafeWithPullReplicasTest, CollectionsAPISolrJTest, DistributedVersionInfoTest, LeaderFailureAfterFreshStartTest, MoveReplicaHDFSFailoverTest, MoveReplicaTest, OverseerTaskQueueTest, TestCloudDeleteByQuery, TestCloudPseudoReturnFields, TestCloudRecovery, TestClusterProperties, TestConfigSetsAPIExclusivity, TestConfigSetsAPIZkFailure, TestCryptoKeys, TestDistribDocBasedVersion, TestLocalFSCloudBackupRestore, TestPullReplica, TestStressInPlaceUpdates, AutoScalingHandlerTest, ExecutePlanActionTest]
   [junit4] Completed [745/745 (3!)] on J1 in 661.11s, 2 tests, 1 failure <<< FAILURES!

[...truncated 47246 lines...]

Mime
View raw message