lucene-dev mailing list archives

Site index · List index
Message view « Date » · « Thread »
Top « Date » · « Thread »
From Policeman Jenkins Server <jenk...@thetaphi.de>
Subject [JENKINS] Lucene-Solr-7.x-MacOSX (64bit/jdk-9) - Build # 258 - Still Unstable!
Date Sat, 21 Oct 2017 02:29:27 GMT
Build: https://jenkins.thetaphi.de/job/Lucene-Solr-7.x-MacOSX/258/
Java: 64bit/jdk-9 -XX:-UseCompressedOops -XX:+UseParallelGC --illegal-access=deny

1 tests failed.
FAILED:  org.apache.solr.cloud.autoscaling.ExecutePlanActionTest.testIntegration

Error Message:
Timed out waiting for replicas of collection to be 2 again null Live Nodes: [127.0.0.1:49460_solr] Last available state: DocCollection(testIntegration//collections/testIntegration/state.json/8)={   "pullReplicas":"0",   "replicationFactor":"2",   "shards":{"shard1":{       "range":"80000000-7fffffff",       "state":"active",       "replicas":{         "core_node3":{           "core":"testIntegration_shard1_replica_n1",           "base_url":"http://127.0.0.1:49460/solr",           "node_name":"127.0.0.1:49460_solr",           "state":"active",           "type":"NRT",           "leader":"true"},         "core_node4":{           "core":"testIntegration_shard1_replica_n2",           "base_url":"http://127.0.0.1:49459/solr",           "node_name":"127.0.0.1:49459_solr",           "state":"down",           "type":"NRT"}}}},   "router":{"name":"compositeId"},   "maxShardsPerNode":"1",   "autoAddReplicas":"false",   "nrtReplicas":"2",   "tlogReplicas":"0"}

Stack Trace:
java.lang.AssertionError: Timed out waiting for replicas of collection to be 2 again
null
Live Nodes: [127.0.0.1:49460_solr]
Last available state: DocCollection(testIntegration//collections/testIntegration/state.json/8)={
  "pullReplicas":"0",
  "replicationFactor":"2",
  "shards":{"shard1":{
      "range":"80000000-7fffffff",
      "state":"active",
      "replicas":{
        "core_node3":{
          "core":"testIntegration_shard1_replica_n1",
          "base_url":"http://127.0.0.1:49460/solr",
          "node_name":"127.0.0.1:49460_solr",
          "state":"active",
          "type":"NRT",
          "leader":"true"},
        "core_node4":{
          "core":"testIntegration_shard1_replica_n2",
          "base_url":"http://127.0.0.1:49459/solr",
          "node_name":"127.0.0.1:49459_solr",
          "state":"down",
          "type":"NRT"}}}},
  "router":{"name":"compositeId"},
  "maxShardsPerNode":"1",
  "autoAddReplicas":"false",
  "nrtReplicas":"2",
  "tlogReplicas":"0"}
	at __randomizedtesting.SeedInfo.seed([C0C350E0FC2E6941:70A25ECCD911C864]:0)
	at org.junit.Assert.fail(Assert.java:93)
	at org.apache.solr.cloud.SolrCloudTestCase.waitForState(SolrCloudTestCase.java:269)
	at org.apache.solr.cloud.autoscaling.ExecutePlanActionTest.testIntegration(ExecutePlanActionTest.java:209)
	at java.base/jdk.internal.reflect.NativeMethodAccessorImpl.invoke0(Native Method)
	at java.base/jdk.internal.reflect.NativeMethodAccessorImpl.invoke(NativeMethodAccessorImpl.java:62)
	at java.base/jdk.internal.reflect.DelegatingMethodAccessorImpl.invoke(DelegatingMethodAccessorImpl.java:43)
	at java.base/java.lang.reflect.Method.invoke(Method.java:564)
	at com.carrotsearch.randomizedtesting.RandomizedRunner.invoke(RandomizedRunner.java:1737)
	at com.carrotsearch.randomizedtesting.RandomizedRunner$8.evaluate(RandomizedRunner.java:934)
	at com.carrotsearch.randomizedtesting.RandomizedRunner$9.evaluate(RandomizedRunner.java:970)
	at com.carrotsearch.randomizedtesting.RandomizedRunner$10.evaluate(RandomizedRunner.java:984)
	at com.carrotsearch.randomizedtesting.rules.SystemPropertiesRestoreRule$1.evaluate(SystemPropertiesRestoreRule.java:57)
	at org.apache.lucene.util.TestRuleSetupTeardownChained$1.evaluate(TestRuleSetupTeardownChained.java:49)
	at org.apache.lucene.util.AbstractBeforeAfterRule$1.evaluate(AbstractBeforeAfterRule.java:45)
	at org.apache.lucene.util.TestRuleThreadAndTestName$1.evaluate(TestRuleThreadAndTestName.java:48)
	at org.apache.lucene.util.TestRuleIgnoreAfterMaxFailures$1.evaluate(TestRuleIgnoreAfterMaxFailures.java:64)
	at org.apache.lucene.util.TestRuleMarkFailure$1.evaluate(TestRuleMarkFailure.java:47)
	at com.carrotsearch.randomizedtesting.rules.StatementAdapter.evaluate(StatementAdapter.java:36)
	at com.carrotsearch.randomizedtesting.ThreadLeakControl$StatementRunner.run(ThreadLeakControl.java:368)
	at com.carrotsearch.randomizedtesting.ThreadLeakControl.forkTimeoutingTask(ThreadLeakControl.java:817)
	at com.carrotsearch.randomizedtesting.ThreadLeakControl$3.evaluate(ThreadLeakControl.java:468)
	at com.carrotsearch.randomizedtesting.RandomizedRunner.runSingleTest(RandomizedRunner.java:943)
	at com.carrotsearch.randomizedtesting.RandomizedRunner$5.evaluate(RandomizedRunner.java:829)
	at com.carrotsearch.randomizedtesting.RandomizedRunner$6.evaluate(RandomizedRunner.java:879)
	at com.carrotsearch.randomizedtesting.RandomizedRunner$7.evaluate(RandomizedRunner.java:890)
	at com.carrotsearch.randomizedtesting.rules.StatementAdapter.evaluate(StatementAdapter.java:36)
	at com.carrotsearch.randomizedtesting.rules.SystemPropertiesRestoreRule$1.evaluate(SystemPropertiesRestoreRule.java:57)
	at org.apache.lucene.util.AbstractBeforeAfterRule$1.evaluate(AbstractBeforeAfterRule.java:45)
	at com.carrotsearch.randomizedtesting.rules.StatementAdapter.evaluate(StatementAdapter.java:36)
	at org.apache.lucene.util.TestRuleStoreClassName$1.evaluate(TestRuleStoreClassName.java:41)
	at com.carrotsearch.randomizedtesting.rules.NoShadowingOrOverridesOnMethodsRule$1.evaluate(NoShadowingOrOverridesOnMethodsRule.java:40)
	at com.carrotsearch.randomizedtesting.rules.NoShadowingOrOverridesOnMethodsRule$1.evaluate(NoShadowingOrOverridesOnMethodsRule.java:40)
	at com.carrotsearch.randomizedtesting.rules.StatementAdapter.evaluate(StatementAdapter.java:36)
	at com.carrotsearch.randomizedtesting.rules.StatementAdapter.evaluate(StatementAdapter.java:36)
	at org.apache.lucene.util.TestRuleAssertionsRequired$1.evaluate(TestRuleAssertionsRequired.java:53)
	at org.apache.lucene.util.TestRuleMarkFailure$1.evaluate(TestRuleMarkFailure.java:47)
	at org.apache.lucene.util.TestRuleIgnoreAfterMaxFailures$1.evaluate(TestRuleIgnoreAfterMaxFailures.java:64)
	at org.apache.lucene.util.TestRuleIgnoreTestSuites$1.evaluate(TestRuleIgnoreTestSuites.java:54)
	at com.carrotsearch.randomizedtesting.rules.StatementAdapter.evaluate(StatementAdapter.java:36)
	at com.carrotsearch.randomizedtesting.ThreadLeakControl$StatementRunner.run(ThreadLeakControl.java:368)
	at java.base/java.lang.Thread.run(Thread.java:844)




Build Log:
[...truncated 12486 lines...]
   [junit4] Suite: org.apache.solr.cloud.autoscaling.ExecutePlanActionTest
   [junit4]   2> Creating dataDir: /Users/jenkins/workspace/Lucene-Solr-7.x-MacOSX/solr/build/solr-core/test/J0/temp/solr.cloud.autoscaling.ExecutePlanActionTest_C0C350E0FC2E6941-001/init-core-data-001
   [junit4]   2> 1200669 WARN  (SUITE-ExecutePlanActionTest-seed#[C0C350E0FC2E6941]-worker) [    ] o.a.s.SolrTestCaseJ4 startTrackingSearchers: numOpens=1 numCloses=1
   [junit4]   2> 1200669 INFO  (SUITE-ExecutePlanActionTest-seed#[C0C350E0FC2E6941]-worker) [    ] o.a.s.SolrTestCaseJ4 Using TrieFields (NUMERIC_POINTS_SYSPROP=false) w/NUMERIC_DOCVALUES_SYSPROP=false
   [junit4]   2> 1200670 INFO  (SUITE-ExecutePlanActionTest-seed#[C0C350E0FC2E6941]-worker) [    ] o.a.s.SolrTestCaseJ4 Randomized ssl (false) and clientAuth (false) via: @org.apache.solr.util.RandomizeSSL(reason="", value=0.0/0.0, ssl=0.0/0.0, clientAuth=0.0/0.0) w/ MAC_OS_X supressed clientAuth
   [junit4]   2> 1200670 INFO  (SUITE-ExecutePlanActionTest-seed#[C0C350E0FC2E6941]-worker) [    ] o.a.s.SolrTestCaseJ4 SecureRandom sanity checks: test.solr.allowed.securerandom=null & java.security.egd=file:/dev/./urandom
   [junit4]   2> 1200670 INFO  (SUITE-ExecutePlanActionTest-seed#[C0C350E0FC2E6941]-worker) [    ] o.a.s.c.MiniSolrCloudCluster Starting cluster of 2 servers in /Users/jenkins/workspace/Lucene-Solr-7.x-MacOSX/solr/build/solr-core/test/J0/temp/solr.cloud.autoscaling.ExecutePlanActionTest_C0C350E0FC2E6941-001/tempDir-001
   [junit4]   2> 1200670 INFO  (SUITE-ExecutePlanActionTest-seed#[C0C350E0FC2E6941]-worker) [    ] o.a.s.c.ZkTestServer STARTING ZK TEST SERVER
   [junit4]   2> 1200671 INFO  (Thread-2241) [    ] o.a.s.c.ZkTestServer client port:0.0.0.0/0.0.0.0:0
   [junit4]   2> 1200671 INFO  (Thread-2241) [    ] o.a.s.c.ZkTestServer Starting server
   [junit4]   2> 1200673 ERROR (Thread-2241) [    ] o.a.z.s.ZooKeeperServer ZKShutdownHandler is not registered, so ZooKeeper server won't take any action on ERROR or SHUTDOWN server state changes
   [junit4]   2> 1200771 INFO  (SUITE-ExecutePlanActionTest-seed#[C0C350E0FC2E6941]-worker) [    ] o.a.s.c.ZkTestServer start zk server on port:49457
   [junit4]   2> 1200789 INFO  (jetty-launcher-2923-thread-1) [    ] o.e.j.s.Server jetty-9.3.20.v20170531
   [junit4]   2> 1200789 INFO  (jetty-launcher-2923-thread-2) [    ] o.e.j.s.Server jetty-9.3.20.v20170531
   [junit4]   2> 1200791 INFO  (jetty-launcher-2923-thread-1) [    ] o.e.j.s.h.ContextHandler Started o.e.j.s.ServletContextHandler@1f1da86f{/solr,null,AVAILABLE}
   [junit4]   2> 1200791 INFO  (jetty-launcher-2923-thread-2) [    ] o.e.j.s.h.ContextHandler Started o.e.j.s.ServletContextHandler@42c803e8{/solr,null,AVAILABLE}
   [junit4]   2> 1200792 INFO  (jetty-launcher-2923-thread-2) [    ] o.e.j.s.AbstractConnector Started ServerConnector@42bf8c5e{HTTP/1.1,[http/1.1]}{127.0.0.1:49460}
   [junit4]   2> 1200792 INFO  (jetty-launcher-2923-thread-2) [    ] o.e.j.s.Server Started @1204964ms
   [junit4]   2> 1200792 INFO  (jetty-launcher-2923-thread-1) [    ] o.e.j.s.AbstractConnector Started ServerConnector@bb1f164{HTTP/1.1,[http/1.1]}{127.0.0.1:49459}
   [junit4]   2> 1200792 INFO  (jetty-launcher-2923-thread-2) [    ] o.a.s.c.s.e.JettySolrRunner Jetty properties: {hostContext=/solr, hostPort=49460}
   [junit4]   2> 1200792 INFO  (jetty-launcher-2923-thread-1) [    ] o.e.j.s.Server Started @1204964ms
   [junit4]   2> 1200793 INFO  (jetty-launcher-2923-thread-1) [    ] o.a.s.c.s.e.JettySolrRunner Jetty properties: {hostContext=/solr, hostPort=49459}
   [junit4]   2> 1200793 ERROR (jetty-launcher-2923-thread-2) [    ] o.a.s.u.StartupLoggingUtils Missing Java Option solr.log.dir. Logging may be missing or incomplete.
   [junit4]   2> 1200793 ERROR (jetty-launcher-2923-thread-1) [    ] o.a.s.u.StartupLoggingUtils Missing Java Option solr.log.dir. Logging may be missing or incomplete.
   [junit4]   2> 1200793 INFO  (jetty-launcher-2923-thread-2) [    ] o.a.s.s.SolrDispatchFilter  ___      _       Welcome to Apache Solr™ version 7.2.0
   [junit4]   2> 1200793 INFO  (jetty-launcher-2923-thread-1) [    ] o.a.s.s.SolrDispatchFilter  ___      _       Welcome to Apache Solr™ version 7.2.0
   [junit4]   2> 1200793 INFO  (jetty-launcher-2923-thread-2) [    ] o.a.s.s.SolrDispatchFilter / __| ___| |_ _   Starting in cloud mode on port null
   [junit4]   2> 1200793 INFO  (jetty-launcher-2923-thread-1) [    ] o.a.s.s.SolrDispatchFilter / __| ___| |_ _   Starting in cloud mode on port null
   [junit4]   2> 1200793 INFO  (jetty-launcher-2923-thread-2) [    ] o.a.s.s.SolrDispatchFilter \__ \/ _ \ | '_|  Install dir: null, Default config dir: null
   [junit4]   2> 1200793 INFO  (jetty-launcher-2923-thread-1) [    ] o.a.s.s.SolrDispatchFilter \__ \/ _ \ | '_|  Install dir: null, Default config dir: null
   [junit4]   2> 1200793 INFO  (jetty-launcher-2923-thread-2) [    ] o.a.s.s.SolrDispatchFilter |___/\___/_|_|    Start time: 2017-10-21T01:34:24.482375Z
   [junit4]   2> 1200793 INFO  (jetty-launcher-2923-thread-1) [    ] o.a.s.s.SolrDispatchFilter |___/\___/_|_|    Start time: 2017-10-21T01:34:24.482398Z
   [junit4]   2> 1200795 INFO  (jetty-launcher-2923-thread-2) [    ] o.a.s.s.SolrDispatchFilter solr.xml found in ZooKeeper. Loading...
   [junit4]   2> 1200795 INFO  (jetty-launcher-2923-thread-1) [    ] o.a.s.s.SolrDispatchFilter solr.xml found in ZooKeeper. Loading...
   [junit4]   2> 1200810 INFO  (jetty-launcher-2923-thread-1) [    ] o.a.s.c.ZkContainer Zookeeper client=127.0.0.1:49457/solr
   [junit4]   2> 1200813 INFO  (jetty-launcher-2923-thread-2) [    ] o.a.s.c.ZkContainer Zookeeper client=127.0.0.1:49457/solr
   [junit4]   2> 1200946 INFO  (jetty-launcher-2923-thread-2) [    ] o.a.s.c.Overseer Overseer (id=null) closing
   [junit4]   2> 1200946 INFO  (jetty-launcher-2923-thread-1) [    ] o.a.s.c.Overseer Overseer (id=null) closing
   [junit4]   2> 1200947 INFO  (jetty-launcher-2923-thread-2) [    ] o.a.s.c.OverseerElectionContext I am going to be the leader 127.0.0.1:49460_solr
   [junit4]   2> 1200948 INFO  (jetty-launcher-2923-thread-1) [    ] o.a.s.c.ZkController Register node as live in ZooKeeper:/live_nodes/127.0.0.1:49459_solr
   [junit4]   2> 1200948 INFO  (jetty-launcher-2923-thread-2) [    ] o.a.s.c.Overseer Overseer (id=98864310803562502-127.0.0.1:49460_solr-n_0000000000) starting
   [junit4]   2> 1200950 INFO  (zkCallback-2935-thread-1) [    ] o.a.s.c.c.ZkStateReader Updated live nodes from ZooKeeper... (0) -> (1)
   [junit4]   2> 1200950 INFO  (zkCallback-2934-thread-1) [    ] o.a.s.c.c.ZkStateReader Updated live nodes from ZooKeeper... (0) -> (1)
   [junit4]   2> 1200959 DEBUG (OverseerAutoScalingTriggerThread-98864310803562502-127.0.0.1:49460_solr-n_0000000000) [    ] o.a.s.c.a.OverseerTriggerThread Adding .autoAddReplicas trigger
   [junit4]   2> 1200961 DEBUG (OverseerAutoScalingTriggerThread-98864310803562502-127.0.0.1:49460_solr-n_0000000000) [    ] o.a.s.c.a.OverseerTriggerThread Refreshing /autoscaling.json with znode version 1
   [junit4]   2> 1200962 INFO  (jetty-launcher-2923-thread-2) [    ] o.a.s.c.ZkController Register node as live in ZooKeeper:/live_nodes/127.0.0.1:49460_solr
   [junit4]   2> 1200962 DEBUG (OverseerAutoScalingTriggerThread-98864310803562502-127.0.0.1:49460_solr-n_0000000000) [    ] o.a.s.c.a.NodeLostTrigger Initial livenodes: [127.0.0.1:49459_solr]
   [junit4]   2> 1200962 DEBUG (OverseerAutoScalingTriggerThread-98864310803562502-127.0.0.1:49460_solr-n_0000000000) [    ] o.a.s.c.a.OverseerTriggerThread Current znodeVersion 1, lastZnodeVersion -1
   [junit4]   2> 1200962 DEBUG (OverseerAutoScalingTriggerThread-98864310803562502-127.0.0.1:49460_solr-n_0000000000) [    ] o.a.s.c.a.OverseerTriggerThread Processed trigger updates upto znodeVersion 1
   [junit4]   2> 1200975 INFO  (zkCallback-2935-thread-1) [    ] o.a.s.c.c.ZkStateReader Updated live nodes from ZooKeeper... (1) -> (2)
   [junit4]   2> 1200975 INFO  (zkCallback-2934-thread-1) [    ] o.a.s.c.c.ZkStateReader Updated live nodes from ZooKeeper... (1) -> (2)
   [junit4]   2> 1200991 INFO  (jetty-launcher-2923-thread-1) [    ] o.a.s.m.r.SolrJmxReporter JMX monitoring for 'solr_49459.solr.node' (registry 'solr.node') enabled at server: com.sun.jmx.mbeanserver.JmxMBeanServer@256f3b19
   [junit4]   2> 1200998 INFO  (jetty-launcher-2923-thread-1) [    ] o.a.s.m.r.SolrJmxReporter JMX monitoring for 'solr_49459.solr.jvm' (registry 'solr.jvm') enabled at server: com.sun.jmx.mbeanserver.JmxMBeanServer@256f3b19
   [junit4]   2> 1200998 INFO  (jetty-launcher-2923-thread-1) [    ] o.a.s.m.r.SolrJmxReporter JMX monitoring for 'solr_49459.solr.jetty' (registry 'solr.jetty') enabled at server: com.sun.jmx.mbeanserver.JmxMBeanServer@256f3b19
   [junit4]   2> 1200999 INFO  (jetty-launcher-2923-thread-1) [    ] o.a.s.c.CorePropertiesLocator Found 0 core definitions underneath /Users/jenkins/workspace/Lucene-Solr-7.x-MacOSX/solr/build/solr-core/test/J0/temp/solr.cloud.autoscaling.ExecutePlanActionTest_C0C350E0FC2E6941-001/tempDir-001/node1/.
   [junit4]   2> 1201004 DEBUG (OverseerAutoScalingTriggerThread-98864310803562502-127.0.0.1:49460_solr-n_0000000000) [    ] o.a.s.c.a.OverseerTriggerThread -- clean old nodeAdded markers
   [junit4]   2> 1201005 DEBUG (OverseerAutoScalingTriggerThread-98864310803562502-127.0.0.1:49460_solr-n_0000000000) [    ] o.a.s.c.a.OverseerTriggerThread Current znodeVersion 1, lastZnodeVersion 1
   [junit4]   2> 1201005 DEBUG (ScheduledTrigger-5209-thread-1) [    ] o.a.s.c.a.NodeLostTrigger Running NodeLostTrigger: .auto_add_replicas with currently live nodes: [127.0.0.1:49459_solr, 127.0.0.1:49460_solr]
   [junit4]   2> 1201008 INFO  (jetty-launcher-2923-thread-2) [    ] o.a.s.m.r.SolrJmxReporter JMX monitoring for 'solr_49460.solr.node' (registry 'solr.node') enabled at server: com.sun.jmx.mbeanserver.JmxMBeanServer@256f3b19
   [junit4]   2> 1201014 INFO  (jetty-launcher-2923-thread-2) [    ] o.a.s.m.r.SolrJmxReporter JMX monitoring for 'solr_49460.solr.jvm' (registry 'solr.jvm') enabled at server: com.sun.jmx.mbeanserver.JmxMBeanServer@256f3b19
   [junit4]   2> 1201015 INFO  (jetty-launcher-2923-thread-2) [    ] o.a.s.m.r.SolrJmxReporter JMX monitoring for 'solr_49460.solr.jetty' (registry 'solr.jetty') enabled at server: com.sun.jmx.mbeanserver.JmxMBeanServer@256f3b19
   [junit4]   2> 1201015 INFO  (jetty-launcher-2923-thread-2) [    ] o.a.s.c.CorePropertiesLocator Found 0 core definitions underneath /Users/jenkins/workspace/Lucene-Solr-7.x-MacOSX/solr/build/solr-core/test/J0/temp/solr.cloud.autoscaling.ExecutePlanActionTest_C0C350E0FC2E6941-001/tempDir-001/node2/.
   [junit4]   2> 1201035 INFO  (SUITE-ExecutePlanActionTest-seed#[C0C350E0FC2E6941]-worker) [    ] o.a.s.c.c.ZkStateReader Updated live nodes from ZooKeeper... (0) -> (2)
   [junit4]   2> 1201036 INFO  (SUITE-ExecutePlanActionTest-seed#[C0C350E0FC2E6941]-worker) [    ] o.a.s.c.s.i.ZkClientClusterStateProvider Cluster at 127.0.0.1:49457/solr ready
   [junit4]   2> 1201051 INFO  (TEST-ExecutePlanActionTest.testExecute-seed#[C0C350E0FC2E6941]) [    ] o.a.s.SolrTestCaseJ4 ###Starting testExecute
   [junit4]   2> 1201052 DEBUG (zkCallback-2935-thread-1) [    ] o.a.s.c.a.OverseerTriggerThread Refreshing /autoscaling.json with znode version 2
   [junit4]   2> 1201052 DEBUG (OverseerAutoScalingTriggerThread-98864310803562502-127.0.0.1:49460_solr-n_0000000000) [    ] o.a.s.c.a.OverseerTriggerThread Processed trigger updates upto znodeVersion 2
   [junit4]   2> 1201054 DEBUG (OverseerAutoScalingTriggerThread-98864310803562502-127.0.0.1:49460_solr-n_0000000000) [    ] o.a.s.c.a.OverseerTriggerThread -- clean old nodeLost markers
   [junit4]   2> 1201055 DEBUG (OverseerAutoScalingTriggerThread-98864310803562502-127.0.0.1:49460_solr-n_0000000000) [    ] o.a.s.c.a.OverseerTriggerThread -- clean old nodeAdded markers
   [junit4]   2> 1201055 DEBUG (OverseerAutoScalingTriggerThread-98864310803562502-127.0.0.1:49460_solr-n_0000000000) [    ] o.a.s.c.a.OverseerTriggerThread Current znodeVersion 2, lastZnodeVersion 2
   [junit4]   2> 1201056 INFO  (qtp964427671-14274) [    ] o.a.s.h.a.CollectionsHandler Invoked Collection Action :create with params replicationFactor=2&collection.configName=conf&maxShardsPerNode=1&name=testExecute&nrtReplicas=2&action=CREATE&numShards=1&wt=javabin&version=2 and sendToOCPQueue=true
   [junit4]   2> 1201058 INFO  (OverseerThreadFactory-5211-thread-1) [    ] o.a.s.c.CreateCollectionCmd Create collection testExecute
   [junit4]   2> 1201170 INFO  (OverseerStateUpdate-98864310803562502-127.0.0.1:49460_solr-n_0000000000) [    ] o.a.s.c.o.SliceMutator createReplica() {
   [junit4]   2>   "operation":"ADDREPLICA",
   [junit4]   2>   "collection":"testExecute",
   [junit4]   2>   "shard":"shard1",
   [junit4]   2>   "core":"testExecute_shard1_replica_n1",
   [junit4]   2>   "state":"down",
   [junit4]   2>   "base_url":"http://127.0.0.1:49459/solr",
   [junit4]   2>   "type":"NRT",
   [junit4]   2>   "waitForFinalState":"false"} 
   [junit4]   2> 1201173 INFO  (OverseerStateUpdate-98864310803562502-127.0.0.1:49460_solr-n_0000000000) [    ] o.a.s.c.o.SliceMutator createReplica() {
   [junit4]   2>   "operation":"ADDREPLICA",
   [junit4]   2>   "collection":"testExecute",
   [junit4]   2>   "shard":"shard1",
   [junit4]   2>   "core":"testExecute_shard1_replica_n2",
   [junit4]   2>   "state":"down",
   [junit4]   2>   "base_url":"http://127.0.0.1:49460/solr",
   [junit4]   2>   "type":"NRT",
   [junit4]   2>   "waitForFinalState":"false"} 
   [junit4]   2> 1201379 INFO  (qtp964427671-14277) [    ] o.a.s.h.a.CoreAdminOperation core create command qt=/admin/cores&coreNodeName=core_node3&collection.configName=conf&newCollection=true&name=testExecute_shard1_replica_n1&action=CREATE&numShards=1&collection=testExecute&shard=shard1&wt=javabin&version=2&replicaType=NRT
   [junit4]   2> 1201380 INFO  (qtp345545531-14282) [    ] o.a.s.h.a.CoreAdminOperation core create command qt=/admin/cores&coreNodeName=core_node4&collection.configName=conf&newCollection=true&name=testExecute_shard1_replica_n2&action=CREATE&numShards=1&collection=testExecute&shard=shard1&wt=javabin&version=2&replicaType=NRT
   [junit4]   2> 1201380 INFO  (qtp964427671-14277) [    ] o.a.s.c.TransientSolrCoreCacheDefault Allocating transient cache for 2147483647 transient cores
   [junit4]   2> 1201380 INFO  (qtp345545531-14282) [    ] o.a.s.c.TransientSolrCoreCacheDefault Allocating transient cache for 2147483647 transient cores
   [junit4]   2> 1201486 INFO  (zkCallback-2934-thread-1) [    ] o.a.s.c.c.ZkStateReader A cluster state change: [WatchedEvent state:SyncConnected type:NodeDataChanged path:/collections/testExecute/state.json] for collection [testExecute] has occurred - updating... (live nodes size: [2])
   [junit4]   2> 1201486 INFO  (zkCallback-2935-thread-1) [    ] o.a.s.c.c.ZkStateReader A cluster state change: [WatchedEvent state:SyncConnected type:NodeDataChanged path:/collections/testExecute/state.json] for collection [testExecute] has occurred - updating... (live nodes size: [2])
   [junit4]   2> 1201486 INFO  (zkCallback-2934-thread-2) [    ] o.a.s.c.c.ZkStateReader A cluster state change: [WatchedEvent state:SyncConnected type:NodeDataChanged path:/collections/testExecute/state.json] for collection [testExecute] has occurred - updating... (live nodes size: [2])
   [junit4]   2> 1201486 INFO  (zkCallback-2935-thread-2) [    ] o.a.s.c.c.ZkStateReader A cluster state change: [WatchedEvent state:SyncConnected type:NodeDataChanged path:/collections/testExecute/state.json] for collection [testExecute] has occurred - updating... (live nodes size: [2])
   [junit4]   2> 1202399 INFO  (qtp964427671-14277) [    ] o.a.s.c.SolrConfig Using Lucene MatchVersion: 7.2.0
   [junit4]   2> 1202400 INFO  (qtp345545531-14282) [    ] o.a.s.c.SolrConfig Using Lucene MatchVersion: 7.2.0
   [junit4]   2> 1202412 INFO  (qtp345545531-14282) [    ] o.a.s.s.IndexSchema [testExecute_shard1_replica_n2] Schema name=minimal
   [junit4]   2> 1202412 INFO  (qtp964427671-14277) [    ] o.a.s.s.IndexSchema [testExecute_shard1_replica_n1] Schema name=minimal
   [junit4]   2> 1202414 INFO  (qtp345545531-14282) [    ] o.a.s.s.IndexSchema Loaded schema minimal/1.1 with uniqueid field id
   [junit4]   2> 1202414 INFO  (qtp345545531-14282) [    ] o.a.s.c.CoreContainer Creating SolrCore 'testExecute_shard1_replica_n2' using configuration from collection testExecute, trusted=true
   [junit4]   2> 1202414 INFO  (qtp964427671-14277) [    ] o.a.s.s.IndexSchema Loaded schema minimal/1.1 with uniqueid field id
   [junit4]   2> 1202414 INFO  (qtp964427671-14277) [    ] o.a.s.c.CoreContainer Creating SolrCore 'testExecute_shard1_replica_n1' using configuration from collection testExecute, trusted=true
   [junit4]   2> 1202415 INFO  (qtp345545531-14282) [    ] o.a.s.m.r.SolrJmxReporter JMX monitoring for 'solr_49460.solr.core.testExecute.shard1.replica_n2' (registry 'solr.core.testExecute.shard1.replica_n2') enabled at server: com.sun.jmx.mbeanserver.JmxMBeanServer@256f3b19
   [junit4]   2> 1202415 INFO  (qtp345545531-14282) [    ] o.a.s.c.SolrCore solr.RecoveryStrategy.Builder
   [junit4]   2> 1202415 INFO  (qtp964427671-14277) [    ] o.a.s.m.r.SolrJmxReporter JMX monitoring for 'solr_49459.solr.core.testExecute.shard1.replica_n1' (registry 'solr.core.testExecute.shard1.replica_n1') enabled at server: com.sun.jmx.mbeanserver.JmxMBeanServer@256f3b19
   [junit4]   2> 1202415 INFO  (qtp345545531-14282) [    ] o.a.s.c.SolrCore [[testExecute_shard1_replica_n2] ] Opening new SolrCore at [/Users/jenkins/workspace/Lucene-Solr-7.x-MacOSX/solr/build/solr-core/test/J0/temp/solr.cloud.autoscaling.ExecutePlanActionTest_C0C350E0FC2E6941-001/tempDir-001/node2/testExecute_shard1_replica_n2], dataDir=[/Users/jenkins/workspace/Lucene-Solr-7.x-MacOSX/solr/build/solr-core/test/J0/temp/solr.cloud.autoscaling.ExecutePlanActionTest_C0C350E0FC2E6941-001/tempDir-001/node2/./testExecute_shard1_replica_n2/data/]
   [junit4]   2> 1202415 INFO  (qtp964427671-14277) [    ] o.a.s.c.SolrCore solr.RecoveryStrategy.Builder
   [junit4]   2> 1202415 INFO  (qtp964427671-14277) [    ] o.a.s.c.SolrCore [[testExecute_shard1_replica_n1] ] Opening new SolrCore at [/Users/jenkins/workspace/Lucene-Solr-7.x-MacOSX/solr/build/solr-core/test/J0/temp/solr.cloud.autoscaling.ExecutePlanActionTest_C0C350E0FC2E6941-001/tempDir-001/node1/testExecute_shard1_replica_n1], dataDir=[/Users/jenkins/workspace/Lucene-Solr-7.x-MacOSX/solr/build/solr-core/test/J0/temp/solr.cloud.autoscaling.ExecutePlanActionTest_C0C350E0FC2E6941-001/tempDir-001/node1/./testExecute_shard1_replica_n1/data/]
   [junit4]   2> 1202458 INFO  (qtp345545531-14282) [    ] o.a.s.u.UpdateHandler Using UpdateLog implementation: org.apache.solr.update.UpdateLog
   [junit4]   2> 1202458 INFO  (qtp345545531-14282) [    ] o.a.s.u.UpdateLog Initializing UpdateLog: dataDir=null defaultSyncLevel=FLUSH numRecordsToKeep=100 maxNumLogsToKeep=10 numVersionBuckets=65536
   [junit4]   2> 1202459 INFO  (qtp964427671-14277) [    ] o.a.s.u.UpdateHandler Using UpdateLog implementation: org.apache.solr.update.UpdateLog
   [junit4]   2> 1202459 INFO  (qtp964427671-14277) [    ] o.a.s.u.UpdateLog Initializing UpdateLog: dataDir=null defaultSyncLevel=FLUSH numRecordsToKeep=100 maxNumLogsToKeep=10 numVersionBuckets=65536
   [junit4]   2> 1202460 INFO  (qtp345545531-14282) [    ] o.a.s.u.CommitTracker Hard AutoCommit: disabled
   [junit4]   2> 1202460 INFO  (qtp345545531-14282) [    ] o.a.s.u.CommitTracker Soft AutoCommit: disabled
   [junit4]   2> 1202460 INFO  (qtp964427671-14277) [    ] o.a.s.u.CommitTracker Hard AutoCommit: disabled
   [junit4]   2> 1202460 INFO  (qtp964427671-14277) [    ] o.a.s.u.CommitTracker Soft AutoCommit: disabled
   [junit4]   2> 1202461 INFO  (qtp345545531-14282) [    ] o.a.s.s.SolrIndexSearcher Opening [Searcher@4f35aa6b[testExecute_shard1_replica_n2] main]
   [junit4]   2> 1202461 INFO  (qtp964427671-14277) [    ] o.a.s.s.SolrIndexSearcher Opening [Searcher@619dca11[testExecute_shard1_replica_n1] main]
   [junit4]   2> 1202462 INFO  (qtp345545531-14282) [    ] o.a.s.r.ManagedResourceStorage Configured ZooKeeperStorageIO with znodeBase: /configs/conf
   [junit4]   2> 1202462 INFO  (qtp964427671-14277) [    ] o.a.s.r.ManagedResourceStorage Configured ZooKeeperStorageIO with znodeBase: /configs/conf
   [junit4]   2> 1202463 INFO  (qtp345545531-14282) [    ] o.a.s.r.ManagedResourceStorage Loaded null at path _rest_managed.json using ZooKeeperStorageIO:path=/configs/conf
   [junit4]   2> 1202463 INFO  (qtp964427671-14277) [    ] o.a.s.r.ManagedResourceStorage Loaded null at path _rest_managed.json using ZooKeeperStorageIO:path=/configs/conf
   [junit4]   2> 1202463 INFO  (qtp964427671-14277) [    ] o.a.s.h.ReplicationHandler Commits will be reserved for 10000ms.
   [junit4]   2> 1202463 INFO  (qtp345545531-14282) [    ] o.a.s.h.ReplicationHandler Commits will be reserved for 10000ms.
   [junit4]   2> 1202464 INFO  (qtp964427671-14277) [    ] o.a.s.u.UpdateLog Could not find max version in index or recent updates, using new clock 1581828974736048128
   [junit4]   2> 1202464 INFO  (qtp345545531-14282) [    ] o.a.s.u.UpdateLog Could not find max version in index or recent updates, using new clock 1581828974736048128
   [junit4]   2> 1202464 INFO  (searcherExecutor-5217-thread-1) [    ] o.a.s.c.SolrCore [testExecute_shard1_replica_n1] Registered new searcher Searcher@619dca11[testExecute_shard1_replica_n1] main{ExitableDirectoryReader(UninvertingDirectoryReader())}
   [junit4]   2> 1202465 INFO  (searcherExecutor-5216-thread-1) [    ] o.a.s.c.SolrCore [testExecute_shard1_replica_n2] Registered new searcher Searcher@4f35aa6b[testExecute_shard1_replica_n2] main{ExitableDirectoryReader(UninvertingDirectoryReader())}
   [junit4]   2> 1202471 INFO  (qtp345545531-14282) [    ] o.a.s.c.ShardLeaderElectionContext Enough replicas found to continue.
   [junit4]   2> 1202471 INFO  (qtp345545531-14282) [    ] o.a.s.c.ShardLeaderElectionContext I may be the new leader - try and sync
   [junit4]   2> 1202471 INFO  (qtp345545531-14282) [    ] o.a.s.c.SyncStrategy Sync replicas to http://127.0.0.1:49460/solr/testExecute_shard1_replica_n2/
   [junit4]   2> 1202471 INFO  (qtp345545531-14282) [    ] o.a.s.u.PeerSync PeerSync: core=testExecute_shard1_replica_n2 url=http://127.0.0.1:49460/solr START replicas=[http://127.0.0.1:49459/solr/testExecute_shard1_replica_n1/] nUpdates=100
   [junit4]   2> 1202473 INFO  (qtp964427671-14279) [    ] o.a.s.c.S.Request [testExecute_shard1_replica_n1]  webapp=/solr path=/get params={distrib=false&qt=/get&fingerprint=false&getVersions=100&wt=javabin&version=2} status=0 QTime=0
   [junit4]   2> 1202576 INFO  (zkCallback-2935-thread-2) [    ] o.a.s.c.c.ZkStateReader A cluster state change: [WatchedEvent state:SyncConnected type:NodeDataChanged path:/collections/testExecute/state.json] for collection [testExecute] has occurred - updating... (live nodes size: [2])
   [junit4]   2> 1202576 INFO  (zkCallback-2934-thread-1) [    ] o.a.s.c.c.ZkStateReader A cluster state change: [WatchedEvent state:SyncConnected type:NodeDataChanged path:/collections/testExecute/state.json] for collection [testExecute] has occurred - updating... (live nodes size: [2])
   [junit4]   2> 1202576 INFO  (zkCallback-2934-thread-2) [    ] o.a.s.c.c.ZkStateReader A cluster state change: [WatchedEvent state:SyncConnected type:NodeDataChanged path:/collections/testExecute/state.json] for collection [testExecute] has occurred - updating... (live nodes size: [2])
   [junit4]   2> 1202576 INFO  (zkCallback-2935-thread-3) [    ] o.a.s.c.c.ZkStateReader A cluster state change: [WatchedEvent state:SyncConnected type:NodeDataChanged path:/collections/testExecute/state.json] for collection [testExecute] has occurred - updating... (live nodes size: [2])
   [junit4]   2> 1202775 INFO  (qtp345545531-14282) [    ] o.a.s.u.PeerSync PeerSync: core=testExecute_shard1_replica_n2 url=http://127.0.0.1:49460/solr DONE.  We have no versions.  sync failed.
   [junit4]   2> 1202775 INFO  (qtp345545531-14282) [    ] o.a.s.c.SyncStrategy Leader's attempt to sync with shard failed, moving to the next candidate
   [junit4]   2> 1202775 INFO  (qtp345545531-14282) [    ] o.a.s.c.ShardLeaderElectionContext We failed sync, but we have no versions - we can't sync in that case - we were active before, so become leader anyway
   [junit4]   2> 1202775 INFO  (qtp345545531-14282) [    ] o.a.s.c.ShardLeaderElectionContext Found all replicas participating in election, clear LIR
   [junit4]   2> 1202781 INFO  (qtp345545531-14282) [    ] o.a.s.c.ShardLeaderElectionContext I am the new leader: http://127.0.0.1:49460/solr/testExecute_shard1_replica_n2/ shard1
   [junit4]   2> 1202884 INFO  (zkCallback-2935-thread-3) [    ] o.a.s.c.c.ZkStateReader A cluster state change: [WatchedEvent state:SyncConnected type:NodeDataChanged path:/collections/testExecute/state.json] for collection [testExecute] has occurred - updating... (live nodes size: [2])
   [junit4]   2> 1202884 INFO  (zkCallback-2934-thread-2) [    ] o.a.s.c.c.ZkStateReader A cluster state change: [WatchedEvent state:SyncConnected type:NodeDataChanged path:/collections/testExecute/state.json] for collection [testExecute] has occurred - updating... (live nodes size: [2])
   [junit4]   2> 1202884 INFO  (zkCallback-2935-thread-2) [    ] o.a.s.c.c.ZkStateReader A cluster state change: [WatchedEvent state:SyncConnected type:NodeDataChanged path:/collections/testExecute/state.json] for collection [testExecute] has occurred - updating... (live nodes size: [2])
   [junit4]   2> 1202884 INFO  (zkCallback-2934-thread-1) [    ] o.a.s.c.c.ZkStateReader A cluster state change: [WatchedEvent state:SyncConnected type:NodeDataChanged path:/collections/testExecute/state.json] for collection [testExecute] has occurred - updating... (live nodes size: [2])
   [junit4]   2> 1202886 INFO  (qtp345545531-14282) [    ] o.a.s.c.ZkController I am the leader, no recovery necessary
   [junit4]   2> 1202887 INFO  (qtp345545531-14282) [    ] o.a.s.s.HttpSolrCall [admin] webapp=null path=/admin/cores params={qt=/admin/cores&coreNodeName=core_node4&collection.configName=conf&newCollection=true&name=testExecute_shard1_replica_n2&action=CREATE&numShards=1&collection=testExecute&shard=shard1&wt=javabin&version=2&replicaType=NRT} status=0 QTime=1507
   [junit4]   2> 1202992 INFO  (zkCallback-2934-thread-1) [    ] o.a.s.c.c.ZkStateReader A cluster state change: [WatchedEvent state:SyncConnected type:NodeDataChanged path:/collections/testExecute/state.json] for collection [testExecute] has occurred - updating... (live nodes size: [2])
   [junit4]   2> 1202992 INFO  (zkCallback-2935-thread-1) [    ] o.a.s.c.c.ZkStateReader A cluster state change: [WatchedEvent state:SyncConnected type:NodeDataChanged path:/collections/testExecute/state.json] for collection [testExecute] has occurred - updating... (live nodes size: [2])
   [junit4]   2> 1202992 INFO  (zkCallback-2934-thread-2) [    ] o.a.s.c.c.ZkStateReader A cluster state change: [WatchedEvent state:SyncConnected type:NodeDataChanged path:/collections/testExecute/state.json] for collection [testExecute] has occurred - updating... (live nodes size: [2])
   [junit4]   2> 1202992 INFO  (zkCallback-2935-thread-2) [    ] o.a.s.c.c.ZkStateReader A cluster state change: [WatchedEvent state:SyncConnected type:NodeDataChanged path:/collections/testExecute/state.json] for collection [testExecute] has occurred - updating... (live nodes size: [2])
   [junit4]   2> 1203472 INFO  (qtp964427671-14277) [    ] o.a.s.s.HttpSolrCall [admin] webapp=null path=/admin/cores params={qt=/admin/cores&coreNodeName=core_node3&collection.configName=conf&newCollection=true&name=testExecute_shard1_replica_n1&action=CREATE&numShards=1&collection=testExecute&shard=shard1&wt=javabin&version=2&replicaType=NRT} status=0 QTime=2093
   [junit4]   2> 1203475 INFO  (qtp964427671-14274) [    ] o.a.s.h.a.CollectionsHandler Wait for new collection to be active for at most 30 seconds. Check all shard replicas
   [junit4]   2> 1203574 INFO  (zkCallback-2935-thread-2) [    ] o.a.s.c.c.ZkStateReader A cluster state change: [WatchedEvent state:SyncConnected type:NodeDataChanged path:/collections/testExecute/state.json] for collection [testExecute] has occurred - updating... (live nodes size: [2])
   [junit4]   2> 1203574 INFO  (zkCallback-2934-thread-1) [    ] o.a.s.c.c.ZkStateReader A cluster state change: [WatchedEvent state:SyncConnected type:NodeDataChanged path:/collections/testExecute/state.json] for collection [testExecute] has occurred - updating... (live nodes size: [2])
   [junit4]   2> 1203574 INFO  (zkCallback-2935-thread-3) [    ] o.a.s.c.c.ZkStateReader A cluster state change: [WatchedEvent state:SyncConnected type:NodeDataChanged path:/collections/testExecute/state.json] for collection [testExecute] has occurred - updating... (live nodes size: [2])
   [junit4]   2> 1203574 INFO  (zkCallback-2934-thread-2) [    ] o.a.s.c.c.ZkStateReader A cluster state change: [WatchedEvent state:SyncConnected type:NodeDataChanged path:/collections/testExecute/state.json] for collection [testExecute] has occurred - updating... (live nodes size: [2])
   [junit4]   2> 1204485 INFO  (qtp964427671-14274) [    ] o.a.s.s.HttpSolrCall [admin] webapp=null path=/admin/collections params={replicationFactor=2&collection.configName=conf&maxShardsPerNode=1&name=testExecute&nrtReplicas=2&action=CREATE&numShards=1&wt=javabin&version=2} status=0 QTime=3429
   [junit4]   2> 1204491 DEBUG (TEST-ExecutePlanActionTest.testExecute-seed#[C0C350E0FC2E6941]) [    ] o.a.s.c.a.ExecutePlanAction -- processing event: {
   [junit4]   2>   "id":"14ef71ee39d7bac0Tanbod8awv5sm50ty5diifajwf",
   [junit4]   2>   "source":"mock_trigger_name",
   [junit4]   2>   "eventTime":1508549668179000000,
   [junit4]   2>   "eventType":"NODELOST",
   [junit4]   2>   "properties":{
   [junit4]   2>     "eventTimes":[1508549668179000000],
   [junit4]   2>     "nodeNames":["127.0.0.1:49460_solr"]}} with context properties: {operations=[org.apache.solr.client.solrj.request.CollectionAdminRequest$MoveReplica@4a026ac7, org.apache.solr.cloud.autoscaling.ExecutePlanActionTest$1@26c5099e]}
   [junit4]   2> 1204491 INFO  (TEST-ExecutePlanActionTest.testExecute-seed#[C0C350E0FC2E6941]) [    ] o.a.s.c.a.ExecutePlanAction Executing operation: action=MOVEREPLICA&collection=testExecute&targetNode=127.0.0.1:49459_solr&replica=core_node4
   [junit4]   2> 1204494 DEBUG (TEST-ExecutePlanActionTest.testExecute-seed#[C0C350E0FC2E6941]) [    ] o.a.s.c.a.ExecutePlanAction Saved requestId: mock_trigger_name/14ef71ee39d7bac0Tanbod8awv5sm50ty5diifajwf/0 in znode: /autoscaling/triggerState/mock_trigger_name/execute_plan/op-0000000000
   [junit4]   2> 1204495 INFO  (qtp964427671-14272) [    ] o.a.s.h.a.CollectionsHandler Invoked Collection Action :movereplica with params async=mock_trigger_name/14ef71ee39d7bac0Tanbod8awv5sm50ty5diifajwf/0&replica=core_node4&action=MOVEREPLICA&collection=testExecute&targetNode=127.0.0.1:49459_solr&wt=javabin&version=2 and sendToOCPQueue=true
   [junit4]   2> 1204497 INFO  (qtp964427671-14272) [    ] o.a.s.s.HttpSolrCall [admin] webapp=null path=/admin/collections params={async=mock_trigger_name/14ef71ee39d7bac0Tanbod8awv5sm50ty5diifajwf/0&replica=core_node4&action=MOVEREPLICA&collection=testExecute&targetNode=127.0.0.1:49459_solr&wt=javabin&version=2} status=0 QTime=2
   [junit4]   2> 1204498 INFO  (qtp964427671-14275) [    ] o.a.s.h.a.CollectionsHandler Invoked Collection Action :requeststatus with params requestid=mock_trigger_name/14ef71ee39d7bac0Tanbod8awv5sm50ty5diifajwf/0&action=REQUESTSTATUS&wt=javabin&version=2 and sendToOCPQueue=true
   [junit4]   2> 1204500 INFO  (qtp964427671-14275) [    ] o.a.s.s.HttpSolrCall [admin] webapp=null path=/admin/collections params={requestid=mock_trigger_name/14ef71ee39d7bac0Tanbod8awv5sm50ty5diifajwf/0&action=REQUESTSTATUS&wt=javabin&version=2} status=0 QTime=1
   [junit4]   2> 1204502 INFO  (OverseerThreadFactory-5211-thread-2) [    ] o.a.s.c.MoveReplicaCmd Replica will be moved core_node4:{"core":"testExecute_shard1_replica_n2","base_url":"http://127.0.0.1:49460/solr","node_name":"127.0.0.1:49460_solr","state":"active","type":"NRT","leader":"true"}
   [junit4]   2> 1204503 INFO  (OverseerCollectionConfigSetProcessor-98864310803562502-127.0.0.1:49460_solr-n_0000000000) [    ] o.a.s.c.OverseerTaskQueue Response ZK path: /overseer/collection-queue-work/qnr-0000000000 doesn't exist.  Requestor may have disconnected from ZooKeeper
   [junit4]   2> 1204511 INFO  (OverseerThreadFactory-5211-thread-2) [    ] o.a.s.c.AddReplicaCmd Node Identified 127.0.0.1:49459_solr for creating new replica
   [junit4]   2> 1204513 INFO  (OverseerStateUpdate-98864310803562502-127.0.0.1:49460_solr-n_0000000000) [    ] o.a.s.c.o.SliceMutator createReplica() {
   [junit4]   2>   "operation":"addreplica",
   [junit4]   2>   "collection":"testExecute",
   [junit4]   2>   "shard":"shard1",
   [junit4]   2>   "core":"testExecute_shard1_replica_n5",
   [junit4]   2>   "state":"down",
   [junit4]   2>   "base_url":"http://127.0.0.1:49459/solr",
   [junit4]   2>   "node_name":"127.0.0.1:49459_solr",
   [junit4]   2>   "type":"NRT"} 
   [junit4]   2> 1204616 INFO  (zkCallback-2935-thread-3) [    ] o.a.s.c.c.ZkStateReader A cluster state change: [WatchedEvent state:SyncConnected type:NodeDataChanged path:/collections/testExecute/state.json] for collection [testExecute] has occurred - updating... (live nodes size: [2])
   [junit4]   2> 1204616 INFO  (zkCallback-2935-thread-2) [    ] o.a.s.c.c.ZkStateReader A cluster state change: [WatchedEvent state:SyncConnected type:NodeDataChanged path:/collections/testExecute/state.json] for collection [testExecute] has occurred - updating... (live nodes size: [2])
   [junit4]   2> 1204616 INFO  (zkCallback-2934-thread-1) [    ] o.a.s.c.c.ZkStateReader A cluster state change: [WatchedEvent state:SyncConnected type:NodeDataChanged path:/collections/testExecute/state.json] for collection [testExecute] has occurred - updating... (live nodes size: [2])
   [junit4]   2> 1204616 INFO  (zkCallback-2934-thread-2) [    ] o.a.s.c.c.ZkStateReader A cluster state change: [WatchedEvent state:SyncConnected type:NodeDataChanged path:/collections/testExecute/state.json] for collection [testExecute] has occurred - updating... (live nodes size: [2])
   [junit4]   2> 1204716 INFO  (qtp964427671-14278) [    ] o.a.s.s.HttpSolrCall [admin] webapp=null path=/admin/cores params={async=mock_trigger_name/14ef71ee39d7bac0Tanbod8awv5sm50ty5diifajwf/02463182184755211&qt=/admin/cores&coreNodeName=core_node6&collection.configName=conf&name=testExecute_shard1_replica_n5&action=CREATE&collection=testExecute&shard=shard1&wt=javabin&version=2&replicaType=NRT} status=0 QTime=0
   [junit4]   2> 1204716 INFO  (parallelCoreAdminExecutor-5212-thread-1) [    ] o.a.s.h.a.CoreAdminOperation core create command async=mock_trigger_name/14ef71ee39d7bac0Tanbod8awv5sm50ty5diifajwf/02463182184755211&qt=/admin/cores&coreNodeName=core_node6&collection.configName=conf&name=testExecute_shard1_replica_n5&action=CREATE&collection=testExecute&shard=shard1&wt=javabin&version=2&replicaType=NRT
   [junit4]   2> 1204716 INFO  (qtp964427671-14279) [    ] o.a.s.h.a.CoreAdminOperation Checking request status for : mock_trigger_name/14ef71ee39d7bac0Tanbod8awv5sm50ty5diifajwf/02463182184755211
   [junit4]   2> 1204716 INFO  (qtp964427671-14279) [    ] o.a.s.s.HttpSolrCall [admin] webapp=null path=/admin/cores params={qt=/admin/cores&requestid=mock_trigger_name/14ef71ee39d7bac0Tanbod8awv5sm50ty5diifajwf/02463182184755211&action=REQUESTSTATUS&wt=javabin&version=2} status=0 QTime=0
   [junit4]   2> 1204724 INFO  (parallelCoreAdminExecutor-5212-thread-1) [    ] o.a.s.c.SolrConfig Using Lucene MatchVersion: 7.2.0
   [junit4]   2> 1204738 INFO  (parallelCoreAdminExecutor-5212-thread-1) [    ] o.a.s.s.IndexSchema [testExecute_shard1_replica_n5] Schema name=minimal
   [junit4]   2> 1204739 INFO  (parallelCoreAdminExecutor-5212-thread-1) [    ] o.a.s.s.IndexSchema Loaded schema minimal/1.1 with uniqueid field id
   [junit4]   2> 1204739 INFO  (parallelCoreAdminExecutor-5212-thread-1) [    ] o.a.s.c.CoreContainer Creating SolrCore 'testExecute_shard1_replica_n5' using configuration from collection testExecute, trusted=true
   [junit4]   2> 1204740 INFO  (parallelCoreAdminExecutor-5212-thread-1) [    ] o.a.s.m.r.SolrJmxReporter JMX monitoring for 'solr_49459.solr.core.testExecute.shard1.replica_n5' (registry 'solr.core.testExecute.shard1.replica_n5') enabled at server: com.sun.jmx.mbeanserver.JmxMBeanServer@256f3b19
   [junit4]   2> 1204740 INFO  (parallelCoreAdminExecutor-5212-thread-1) [    ] o.a.s.c.SolrCore solr.RecoveryStrategy.Builder
   [junit4]   2> 1204740 INFO  (parallelCoreAdminExecutor-5212-thread-1) [    ] o.a.s.c.SolrCore [[testExecute_shard1_replica_n5] ] Opening new SolrCore at [/Users/jenkins/workspace/Lucene-Solr-7.x-MacOSX/solr/build/solr-core/test/J0/temp/solr.cloud.autoscaling.ExecutePlanActionTest_C0C350E0FC2E6941-001/tempDir-001/node1/testExecute_shard1_replica_n5], dataDir=[/Users/jenkins/workspace/Lucene-Solr-7.x-MacOSX/solr/build/solr-core/test/J0/temp/solr.cloud.autoscaling.ExecutePlanActionTest_C0C350E0FC2E6941-001/tempDir-001/node1/./testExecute_shard1_replica_n5/data/]
   [junit4]   2> 1204780 INFO  (parallelCoreAdminExecutor-5212-thread-1) [    ] o.a.s.u.UpdateHandler Using UpdateLog implementation: org.apache.solr.update.UpdateLog
   [junit4]   2> 1204781 INFO  (parallelCoreAdminExecutor-5212-thread-1) [    ] o.a.s.u.UpdateLog Initializing UpdateLog: dataDir=null defaultSyncLevel=FLUSH numRecordsToKeep=100 maxNumLogsToKeep=10 numVersionBuckets=65536
   [junit4]   2> 1204782 INFO  (parallelCoreAdminExecutor-5212-thread-1) [    ] o.a.s.u.CommitTracker Hard AutoCommit: disabled
   [junit4]   2> 1204782 INFO  (parallelCoreAdminExecutor-5212-thread-1) [    ] o.a.s.u.CommitTracker Soft AutoCommit: disabled
   [junit4]   2> 1204783 INFO  (parallelCoreAdminExecutor-5212-thread-1) [    ] o.a.s.s.SolrIndexSearcher Opening [Searcher@23f70e28[testExecute_shard1_replica_n5] main]
   [junit4]   2> 1204784 INFO  (parallelCoreAdminExecutor-5212-thread-1) [    ] o.a.s.r.ManagedResourceStorage Configured ZooKeeperStorageIO with znodeBase: /configs/conf
   [junit4]   2> 1204785 INFO  (parallelCoreAdminExecutor-5212-thread-1) [    ] o.a.s.r.ManagedResourceStorage Loaded null at path _rest_managed.json using ZooKeeperStorageIO:path=/configs/conf
   [junit4]   2> 1204785 INFO  (parallelCoreAdminExecutor-5212-thread-1) [    ] o.a.s.h.ReplicationHandler Commits will be reserved for 10000ms.
   [junit4]   2> 1204786 INFO  (parallelCoreAdminExecutor-5212-thread-1) [    ] o.a.s.u.UpdateLog Could not find max version in index or recent updates, using new clock 1581828977170841600
   [junit4]   2> 1204787 INFO  (searcherExecutor-5226-thread-1) [    ] o.a.s.c.SolrCore [testExecute_shard1_replica_n5] Registered new searcher Searcher@23f70e28[testExecute_shard1_replica_n5] main{ExitableDirectoryReader(UninvertingDirectoryReader())}
   [junit4]   2> 1204790 INFO  (parallelCoreAdminExecutor-5212-thread-1) [    ] o.a.s.c.ZkController Core needs to recover:testExecute_shard1_replica_n5
   [junit4]   2> 1204790 INFO  (updateExecutor-2928-thread-1) [    ] o.a.s.u.DefaultSolrCoreState Running recovery
   [junit4]   2> 1204790 INFO  (recoveryExecutor-2929-thread-1) [    ] o.a.s.c.RecoveryStrategy Starting recovery process. recoveringAfterStartup=true
   [junit4]   2> 1204791 INFO  (recoveryExecutor-2929-thread-1) [    ] o.a.s.c.RecoveryStrategy ###### startupVersions=[[]]
   [junit4]   2> 1204791 INFO  (recoveryExecutor-2929-thread-1) [    ] o.a.s.c.RecoveryStrategy Begin buffering updates. core=[testExecute_shard1_replica_n5]
   [junit4]   2> 1204791 INFO  (recoveryExecutor-2929-thread-1) [    ] o.a.s.u.UpdateLog Starting to buffer updates. FSUpdateLog{state=ACTIVE, tlog=null}
   [junit4]   2> 1204791 INFO  (recoveryExecutor-2929-thread-1) [    ] o.a.s.c.RecoveryStrategy Publishing state of core [testExecute_shard1_replica_n5] as recovering, leader is [http://127.0.0.1:49460/solr/testExecute_shard1_replica_n2/] and I am [http://127.0.0.1:49459/solr/testExecute_shard1_replica_n5/]
   [junit4]   2> 1204793 INFO  (recoveryExecutor-2929-thread-1) [    ] o.a.s.c.RecoveryStrategy Sending prep recovery command to [http://127.0.0.1:49460/solr]; [WaitForState: action=PREPRECOVERY&core=testExecute_shard1_replica_n2&nodeName=127.0.0.1:49459_solr&coreNodeName=core_node6&state=recovering&checkLive=true&onlyIfLeader=true&onlyIfLeaderActive=true]
   [junit4]   2> 1204794 INFO  (qtp345545531-14285) [    ] o.a.s.h.a.PrepRecoveryOp Going to wait for coreNodeName: core_node6, state: recovering, checkLive: true, onlyIfLeader: true, onlyIfLeaderActive: true, maxTime: 183 s
   [junit4]   2> 1204794 INFO  (qtp345545531-14285) [    ] o.a.s.h.a.PrepRecoveryOp In WaitForState(recovering): collection=testExecute, shard=shard1, thisCore=testExecute_shard1_replica_n2, leaderDoesNotNeedRecovery=false, isLeader? true, live=true, checkLive=true, currentState=down, localState=active, nodeName=127.0.0.1:49459_solr, coreNodeName=core_node6, onlyIfActiveCheckResult=false, nodeProps: core_node6:{"core":"testExecute_shard1_replica_n5","base_url":"http://127.0.0.1:49459/solr","state":"down","node_name":"127.0.0.1:49459_solr","type":"NRT"}
   [junit4]   2> 1204900 INFO  (zkCallback-2934-thread-2) [    ] o.a.s.c.c.ZkStateReader A cluster state change: [WatchedEvent state:SyncConnected type:NodeDataChanged path:/collections/testExecute/state.json] for collection [testExecute] has occurred - updating... (live nodes size: [2])
   [junit4]   2> 1204900 INFO  (zkCallback-2935-thread-2) [    ] o.a.s.c.c.ZkStateReader A cluster state change: [WatchedEvent state:SyncConnected type:NodeDataChanged path:/collections/testExecute/state.json] for collection [testExecute] has occurred - updating... (live nodes size: [2])
   [junit4]   2> 1204900 INFO  (zkCallback-2935-thread-3) [    ] o.a.s.c.c.ZkStateReader A cluster state change: [WatchedEvent state:SyncConnected type:NodeDataChanged path:/collections/testExecute/state.json] for collection [testExecute] has occurred - updating... (live nodes size: [2])
   [junit4]   2> 1204900 INFO  (zkCallback-2934-thread-1) [    ] o.a.s.c.c.ZkStateReader A cluster state change: [WatchedEvent state:SyncConnected type:NodeDataChanged path:/collections/testExecute/state.json] for collection [testExecute] has occurred - updating... (live nodes size: [2])
   [junit4]   2> 1205718 INFO  (qtp964427671-14279) [    ] o.a.s.h.a.CoreAdminOperation Checking request status for : mock_trigger_name/14ef71ee39d7bac0Tanbod8awv5sm50ty5diifajwf/02463182184755211
   [junit4]   2> 1205718 INFO  (qtp964427671-14279) [    ] o.a.s.s.HttpSolrCall [admin] webapp=null path=/admin/cores params={qt=/admin/cores&requestid=mock_trigger_name/14ef71ee39d7bac0Tanbod8awv5sm50ty5diifajwf/02463182184755211&action=REQUESTSTATUS&wt=javabin&version=2} status=0 QTime=0
   [junit4]   2> 1205719 INFO  (qtp345545531-14286) [    ] o.a.s.s.HttpSolrCall [admin] webapp=null path=/admin/cores params={deleteInstanceDir=true&core=testExecute_shard1_replica_n2&async=mock_trigger_name/14ef71ee39d7bac0Tanbod8awv5sm50ty5diifajwf/02463183187673082&qt=/admin/cores&deleteDataDir=true&action=UNLOAD&wt=javabin&version=2&deleteIndex=true} status=0 QTime=0
   [junit4]   2> 1205719 INFO  (qtp345545531-14287) [    ] o.a.s.h.a.CoreAdminOperation Checking request status for : mock_trigger_name/14ef71ee39d7bac0Tanbod8awv5sm50ty5diifajwf/02463183187673082
   [junit4]   2> 1205719 INFO  (qtp345545531-14287) [    ] o.a.s.s.HttpSolrCall [admin] webapp=null path=/admin/cores params={qt=/admin/cores&requestid=mock_trigger_name/14ef71ee39d7bac0Tanbod8awv5sm50ty5diifajwf/02463183187673082&action=REQUESTSTATUS&wt=javabin&version=2} status=0 QTime=0
   [junit4]   2> 1205719 INFO  (parallelCoreAdminExecutor-5213-thread-1) [    ] o.a.s.m.SolrMetricManager Closing metric reporters for registry=solr.core.testExecute.shard1.replica_n2, tag=null
   [junit4]   2> 1205719 INFO  (parallelCoreAdminExecutor-5213-thread-1) [    ] o.a.s.m.r.SolrJmxReporter Closing reporter [org.apache.solr.metrics.reporters.SolrJmxReporter@ae7619c: rootName = solr_49460, domain = solr.core.testExecute.shard1.replica_n2, service url = null, agent id = null] for registry solr.core.testExecute.shard1.replica_n2 / com.codahale.metrics.MetricRegistry@de022c5
   [junit4]   2> 1205726 INFO  (parallelCoreAdminExecutor-5213-thread-1) [    ] o.a.s.c.SolrCore [testExecute_shard1_replica_n2]  CLOSING SolrCore org.apache.solr.core.SolrCore@29bfcdeb
   [junit4]   2> 1205726 INFO  (parallelCoreAdminExecutor-5213-thread-1) [    ] o.a.s.m.SolrMetricManager Closing metric reporters for registry=solr.core.testExecute.shard1.replica_n2, tag=700435947
   [junit4]   2> 1205726 INFO  (parallelCoreAdminExecutor-5213-thread-1) [    ] o.a.s.m.SolrMetricManager Closing metric reporters for registry=solr.collection.testExecute.shard1.leader, tag=700435947
   [junit4]   2> 1205731 INFO  (zkCallback-2934-thread-1) [    ] o.a.s.c.ShardLeaderElectionContext I may be the new leader - try and sync
   [junit4]   2> 1205833 INFO  (zkCallback-2934-thread-2) [    ] o.a.s.c.c.ZkStateReader A cluster state change: [WatchedEvent state:SyncConnected type:NodeDataChanged path:/collections/testExecute/state.json] for collection [testExecute] has occurred - updating... (live nodes size: [2])
   [junit4]   2> 1205833 INFO  (zkCallback-2934-thread-3) [    ] o.a.s.c.c.ZkStateReader A cluster state change: [WatchedEvent state:SyncConnected type:NodeDataChanged path:/collections/testExecute/state.json] for collection [testExecute] has occurred - updating... (live nodes size: [2])
   [junit4]   2> 1206720 INFO  (qtp345545531-14288) [    ] o.a.s.h.a.CoreAdminOperation Checking request status for : mock_trigger_name/14ef71ee39d7bac0Tanbod8awv5sm50ty5diifajwf/02463183187673082
   [junit4]   2> 1206720 INFO  (qtp345545531-14288) [    ] o.a.s.s.HttpSolrCall [admin] webapp=null path=/admin/cores params={qt=/admin/cores&requestid=mock_trigger_name/14ef71ee39d7bac0Tanbod8awv5sm50ty5diifajwf/02463183187673082&action=REQUESTSTATUS&wt=javabin&version=2} status=0 QTime=0
   [junit4]   2> 1206826 INFO  (OverseerThreadFactory-5211-thread-2) [    ] o.a.s.c.OverseerTaskQueue Response ZK path: /overseer/collection-queue-work/qnr-0000000002 doesn't exist.  Requestor may have disconnected from ZooKeeper
   [junit4]   2> 1208241 INFO  (zkCallback-2934-thread-1) [    ] o.a.s.c.SyncStrategy Sync replicas to http://127.0.0.1:49459/solr/testExecute_shard1_replica_n1/
   [junit4]   2> 1208241 INFO  (zkCallback-2934-thread-1) [    ] o.a.s.u.PeerSync PeerSync: core=testExecute_shard1_replica_n1 url=http://127.0.0.1:49459/solr START replicas=[http://127.0.0.1:49459/solr/testExecute_shard1_replica_n5/] nUpdates=100
   [junit4]   2> 1208242 INFO  (qtp964427671-14274) [    ] o.a.s.c.S.Request [testExecute_shard1_replica_n5]  webapp=/solr path=/get params={distrib=false&qt=/get&fingerprint=false&getVersions=100&wt=javabin&version=2} status=0 QTime=0
   [junit4]   2> 1208510 INFO  (OverseerCollectionConfigSetProcessor-98864310803562502-127.0.0.1:49460_solr-n_0000000000) [    ] o.a.s.c.OverseerTaskQueue Response ZK path: /overseer/collection-queue-work/qnr-0000000002 doesn't exist.  Requestor may have disconnected from ZooKeeper
   [junit4]   2> 1208552 INFO  (zkCallback-2934-thread-1) [    ] o.a.s.u.PeerSync PeerSync: core=testExecute_shard1_replica_n1 url=http://127.0.0.1:49459/solr DONE.  We have no versions.  sync failed.
   [junit4]   2> 1208552 INFO  (zkCallback-2934-thread-1) [    ] o.a.s.c.SyncStrategy Leader's attempt to sync with shard failed, moving to the next candidate
   [junit4]   2> 1208552 INFO  (zkCallback-2934-thread-1) [    ] o.a.s.c.ShardLeaderElectionContext We failed sync, but we have no versions - we can't sync in that case - we were active before, so become leader anyway
   [junit4]   2> 1208555 INFO  (zkCallback-2934-thread-1) [    ] o.a.s.c.ShardLeaderElectionContext I am the new leader: http://127.0.0.1:49459/solr/testExecute_shard1_replica_n1/ shard1
   [junit4]   2> 1208556 INFO  (zkCallback-2934-thread-1) [    ] o.a.s.c.c.ZkStateReader A cluster state change: [WatchedEvent state:SyncConnected type:NodeDataChanged path:/collections/testExecute/state.json] for collection [testExecute] has occurred - updating... (live nodes size: [2])
   [junit4]   2> 1208556 INFO  (zkCallback-2934-thread-3) [    ] o.a.s.c.c.ZkStateReader A cluster state change: [WatchedEvent state:SyncConnected type:NodeDataChanged path:/collections/testExecute/state.json] for collection [testExecute] has occurred - updating... (live nodes size: [2])
   [junit4]   2> 1209514 INFO  (qtp964427671-14272) [    ] o.a.s.h.a.CollectionsHandler Invoked Collection Action :requeststatus with params requestid=mock_trigger_name/14ef71ee39d7bac0Tanbod8awv5sm50ty5diifajwf/0&action=REQUESTSTATUS&wt=javabin&version=2 and sendToOCPQueue=true
   [junit4]   2> 1209515 INFO  (qtp964427671-14272) [    ] o.a.s.s.HttpSolrCall [admin] webapp=null path=/admin/collections params={requestid=mock_trigger_name/14ef71ee39d7bac0Tanbod8awv5sm50ty5diifajwf/0&action=REQUESTSTATUS&wt=javabin&version=2} status=0 QTime=1
   [junit4]   2> 1209515 INFO  (TEST-ExecutePlanActionTest.testExecute-seed#[C0C350E0FC2E6941]) [    ] o.a.s.c.a.ExecutePlanAction Task with requestId=mock_trigger_name/14ef71ee39d7bac0Tanbod8awv5sm50ty5diifajwf/0 finished with state=COMPLETED in 5s
   [junit4]   2> 1209516 INFO  (qtp964427671-14275) [    ] o.a.s.h.a.CollectionsHandler Invoked Collection Action :deletestatus with params requestid=mock_trigger_name/14ef71ee39d7bac0Tanbod8awv5sm50ty5diifajwf/0&action=DELETESTATUS&wt=javabin&version=2 and sendToOCPQueue=true
   [junit4]   2> 1209516 INFO  (qtp964427671-14275) [    ] o.a.s.s.HttpSolrCall [admin] webapp=null path=/admin/collections params={requestid=mock_trigger_name/14ef71ee39d7bac0Tanbod8awv5sm50ty5diifajwf/0&action=DELETESTATUS&wt=javabin&version=2} status=0 QTime=0
   [junit4]   2> 1209517 INFO  (TEST-ExecutePlanActionTest.testExecute-seed#[C0C350E0FC2E6941]) [    ] o.a.s.c.a.ExecutePlanAction Executing operation: action=OVERSEERSTATUS
   [junit4]   2> 1209519 DEBUG (TEST-ExecutePlanActionTest.testExecute-seed#[C0C350E0FC2E6941]) [    ] o.a.s.c.a.ExecutePlanAction Saved requestId: mock_trigger_name/14ef71ee39d7bac0Tanbod8awv5sm50ty5diifajwf/0 in znode: /autoscaling/triggerState/mock_trigger_name/execute_plan/op-0000000001
   [junit4]   2> 1209520 INFO  (qtp964427671-14278) [    ] o.a.s.h.a.CollectionsHandler Invoked Collection Action :overseerstatus with params async=mock_trigger_name/14ef71ee39d7bac0Tanbod8awv5sm50ty5diifajwf/0&action=OVERSEERSTATUS&wt=javabin&version=2 and sendToOCPQueue=true
   [junit4]   2> 1209522 INFO  (qtp964427671-14278) [    ] o.a.s.s.HttpSolrCall [admin] webapp=null path=/admin/collections params={async=mock_trigger_name/14ef71ee39d7bac0Tanbod8awv5sm50ty5diifajwf/0&action=OVERSEERSTATUS&wt=javabin&version=2} status=0 QTime=1
   [junit4]   2> 1209522 INFO  (qtp964427671-14277) [    ] o.a.s.h.a.CollectionsHandler Invoked Collection Action :requeststatus with params requestid=mock_trigger_name/14ef71ee39d7bac0Tanbod8awv5sm50ty5diifajwf/0&action=REQUESTSTATUS&wt=javabin&version=2 and sendToOCPQueue=true
   [junit4]   2> 1209524 INFO  (qtp964427671-14277) [    ] o.a.s.s.HttpSolrCall [admin] webapp=null path=/admin/collections params={requestid=mock_trigger_name/14ef71ee39d7bac0Tanbod8awv5sm50ty5diifajwf/0&action=REQUESTSTATUS&wt=javabin&version=2} status=0 QTime=1
   [junit4]   2> 1209531 INFO  (OverseerThreadFactory-5211-thread-3) [    ] o.a.s.c.OverseerTaskQueue Response ZK path: /overseer/collection-queue-work/qnr-0000000003 doesn't exist.  Requestor may have disconnected from ZooKeeper
   [junit4]   2> 1211531 INFO  (OverseerCollectionConfigSetProcessor-98864310803562502-127.0.0.1:49460_solr-n_0000000000) [    ] o.a.s.c.OverseerTaskQueue Response ZK path: /overseer/collection-queue-work/qnr-0000000003 doesn't exist.  Requestor may have disconnected from ZooKeeper
   [junit4]   2> 1214529 INFO  (qtp964427671-14279) [    ] o.a.s.h.a.CollectionsHandler Invoked Collection Action :requeststatus with params requestid=mock_trigger_name/14ef71ee39d7bac0Tanbod8awv5sm50ty5diifajwf/0&action=REQUESTSTATUS&wt=javabin&version=2 and sendToOCPQueue=true
   [junit4]   2> 1214531 INFO  (qtp964427671-14279) [    ] o.a.s.s.HttpSolrCall [admin] webapp=null path=/admin/collections params={requestid=mock_trigger_name/14ef71ee39d7bac0Tanbod8awv5sm50ty5diifajwf/0&action=REQUESTSTATUS&wt=javabin&version=2} status=0 QTime=1
   [junit4]   2> 1214531 INFO  (TEST-ExecutePlanActionTest.testExecute-seed#[C0C350E0FC2E6941]) [    ] o.a.s.c.a.ExecutePlanAction Task with requestId=mock_trigger_name/14ef71ee39d7bac0Tanbod8awv5sm50ty5diifajwf/0 finished with state=COMPLETED in 5s
   [junit4]   2> 1214531 INFO  (qtp964427671-14280) [    ] o.a.s.h.a.CollectionsHandler Invoked Collection Action :deletestatus with params requestid=mock_trigger_name/14ef71ee39d7bac0Tanbod8awv5sm50ty5diifajwf/0&action=DELETESTATUS&wt=javabin&version=2 and sendToOCPQueue=true
   [junit4]   2> 1214532 INFO  (qtp964427671-14280) [    ] o.a.s.s.HttpSolrCall [admin] webapp=null path=/admin/collections params={requestid=mock_trigger_name/14ef71ee39d7bac0Tanbod8awv5sm50ty5diifajwf/0&action=DELETESTATUS&wt=javabin&version=2} status=0 QTime=0
   [junit4]   2> 1234985 ERROR (qtp345545531-14285) [    ] o.a.s.h.RequestHandlerBase org.apache.solr.common.SolrException: core not found:testExecute_shard1_replica_n2
   [junit4]   2> 	at org.apache.solr.handler.admin.PrepRecoveryOp.execute(PrepRecoveryOp.java:75)
   [junit4]   2> 	at org.apache.solr.handler.admin.CoreAdminOperation.execute(CoreAdminOperation.java:384)
   [junit4]   2> 	at org.apache.solr.handler.admin.CoreAdminHandler$CallInfo.call(CoreAdminHandler.java:389)
   [junit4]   2> 	at org.apache.solr.handler.admin.CoreAdminHandler.handleRequestBody(CoreAdminHandler.java:174)
   [junit4]   2> 	at org.apache.solr.handler.RequestHandlerBase.handleRequest(RequestHandlerBase.java:177)
   [junit4]   2> 	at org.apache.solr.servlet.HttpSolrCall.handleAdmin(HttpSolrCall.java:735)
   [junit4]   2> 	at org.apache.solr.servlet.HttpSolrCall.handleAdminRequest(HttpSolrCall.java:716)
   [junit4]   2> 	at org.apache.solr.servlet.HttpSolrCall.call(HttpSolrCall.java:497)
   [junit4]   2> 	at org.apache.solr.servlet.SolrDispatchFilter.doFilter(SolrDispatchFilter.java:382)
   [junit4]   2> 	at org.apache.solr.servlet.SolrDispatchFilter.doFilter(SolrDispatchFilter.java:326)
   [junit4]   2> 	at org.eclipse.jetty.servlet.ServletHandler$CachedChain.doFilter(ServletHandler.java:1759)
   [junit4]   2> 	at org.apache.solr.client.solrj.embedded.JettySolrRunner$DebugFilter.doFilter(JettySolrRunner.java:139)
   [junit4]   2> 	at org.eclipse.jetty.servlet.ServletHandler$CachedChain.doFilter(ServletHandler.java:1759)
   [junit4]   2> 	at org.eclipse.jetty.servlet.ServletHandler.doHandle(ServletHandler.java:582)
   [junit4]   2> 	at org.eclipse.jetty.server.session.SessionHandler.doHandle(SessionHandler.java:224)
   [junit4]   2> 	at org.eclipse.jetty.server.handler.ContextHandler.doHandle(ContextHandler.java:1180)
   [junit4]   2> 	at org.eclipse.jetty.servlet.ServletHandler.doScope(ServletHandler.java:512)
   [junit4]   2> 	at org.eclipse.jetty.server.session.SessionHandler.doScope(SessionHandler.java:185)
   [junit4]   2> 	at org.eclipse.jetty.server.handler.ContextHandler.doScope(ContextHandler.java:1112)
   [junit4]   2> 	at org.eclipse.jetty.server.handler.ScopedHandler.handle(ScopedHandler.java:141)
   [junit4]   2> 	at org.eclipse.jetty.server.handler.gzip.GzipHandler.handle(GzipHandler.java:493)
   [junit4]   2> 	at org.eclipse.jetty.server.handler.HandlerWrapper.handle(HandlerWrapper.java:134)
   [junit4]   2> 	at org.eclipse.jetty.server.Server.handle(Server.java:534)
   [junit4]   2> 	at org.eclipse.jetty.server.HttpChannel.handle(HttpChannel.java:320)
   [junit4]   2> 	at org.eclipse.jetty.server.HttpConnection.onFillable(HttpConnection.java:251)
   [junit4]   2> 	at org.eclipse.jetty.io.AbstractConnection$ReadCallback.succeeded(AbstractConnection.java:283)
   [junit4]   2> 	at org.eclipse.jetty.io.FillInterest.fillable(FillInterest.java:108)
   [junit4]   2> 	at org.eclipse.jetty.io.SelectChannelEndPoint$2.run(SelectChannelEndPoint.java:93)
   [junit4]   2> 	at org.eclipse.jetty.util.thread.strategy.ExecuteProduceConsume.executeProduceConsume(ExecuteProduceConsume.java:303)
   [junit4]   2> 	at org.eclipse.jetty.util.thread.strategy.ExecuteProduceConsume.produceConsume(ExecuteProduceConsume.java:148)
   [junit4]   2> 	at org.eclipse.jetty.util.thread.strategy.ExecuteProduceConsume.run(ExecuteProduceConsume.java:136)
   [junit4]   2> 	at org.eclipse.jetty.util.thread.QueuedThreadPool.runJob(QueuedThreadPool.java:671)
   [junit4]   2> 	at org.eclipse.jetty.util.thread.QueuedThreadPool$2.run(QueuedThreadPool.java:589)
   [junit4]   2> 	at java.base/java.lang.Thread.run(Thread.java:844)
   [junit4]   2> 
   [junit4]   2> 1234986 INFO  (qtp345545531-14285) [    ] o.a.s.s.HttpSolrCall [admin] webapp=null path=/admin/cores params={nodeName=127.0.0.1:49459_solr&onlyIfLeaderActive=true&core=testExecute_shard1_replica_n2&coreNodeName=core_node6&action=PREPRECOVERY&checkLive=true&state=recovering&onlyIfLeader=true&wt=javabin&version=2} status=400 QTime=30192
   [junit4]   2> 1234988 ERROR (recoveryExecutor-2929-thread-1) [    ] o.a.s.c.RecoveryStrategy Error while trying to recover. core=testExecute_shard1_replica_n5:java.util.concurrent.ExecutionException: org.apache.solr.client.solrj.impl.HttpSolrClient$RemoteSolrException: Error from server at http://127.0.0.1:49460/solr: core not found:testExecute_shard1_replica_n2
   [junit4]   2> 	at java.base/java.util.concurrent.FutureTask.report(FutureTask.java:122)
   [junit4]   2> 	at java.base/java.util.concurrent.FutureTask.get(FutureTask.java:191)
   [junit4]   2> 	at org.apache.solr.cloud.RecoveryStrategy.sendPrepRecoveryCmd(RecoveryStrategy.java:825)
   [junit4]   2> 	at org.apache.solr.cloud.RecoveryStrategy.doSyncOrReplicateRecovery(RecoveryStrategy.java:562)
   [junit4]   2> 	at org.apache.solr.cloud.RecoveryStrategy.doRecovery(RecoveryStrategy.java:302)
   [junit4]   2> 	at org.apache.solr.cloud.RecoveryStrategy.run(RecoveryStrategy.java:286)
   [junit4]   2> 	at com.codahale.metrics.InstrumentedExecutorService$InstrumentedRunnable.run(InstrumentedExecutorService.java:176)
   [junit4]   2> 	at java.base/java.util.concurrent.Executors$RunnableAdapter.call(Executors.java:514)
   [junit4]   2> 	at java.base/java.util.concurrent.FutureTask.run(FutureTask.java:264)
   [junit4]   2> 	at org.apache.solr.common.util.ExecutorUtil$MDCAwareThreadPoolExecutor.lambda$execute$0(ExecutorUtil.java:188)
   [junit4]   2> 	at java.base/java.util.concurrent.ThreadPoolExecutor.runWorker(ThreadPoolExecutor.java:1167)
   [junit4]   2> 	at java.base/java.util.concurrent.ThreadPoolExecutor$Worker.run(ThreadPoolExecutor.java:641)
   [junit4]   2> 	at java.base/java.lang.Thread.run(Thread.java:844)
   [junit4]   2> Caused by: org.apache.solr.client.solrj.impl.HttpSolrClient$RemoteSolrException: Error from server at http://127.0.0.1:49460/solr: core not found:testExecute_shard1_replica_n2
   [junit4]   2> 	at org.apache.solr.client.solrj.impl.HttpSolrClient.executeMethod(HttpSolrClient.java:626)
   [junit4]   2> 	at org.apache.solr.client.solrj.impl.HttpSolrClient.lambda$httpUriRequest$0(HttpSolrClient.java:297)
   [junit4]   2> 	... 5 more
   [junit4]   2> 
   [junit4]   2> 1234988 INFO  (recoveryExecutor-2929-thread-1) [    ] o.a.s.c.RecoveryStrategy Replay not started, or was not successful... still buffering updates.
   [junit4]   2> 1234988 ERROR (recoveryExecutor-2929-thread-1) [    ] o.a.s.c.RecoveryStrategy Recovery failed - trying again... (0)
   [junit4]   2> 1234988 INFO  (recoveryExecutor-2929-thread-1) [    ] o.a.s.c.RecoveryStrategy Wait [2.0] seconds before trying to recover again (attempt=1)
   [junit4]   2> 1244999 INFO  (recoveryExecutor-2929-thread-1) [    ] o.a.s.c.RecoveryStrategy Begin buffering updates. core=[testExecute_shard1_replica_n5]
   [junit4]   2> 1244999 INFO  (recoveryExecutor-2929-thread-1) [    ] o.a.s.u.UpdateLog Restarting buffering. previous=RecoveryInfo{adds=0 deletes=0 deleteByQuery=0 errors=0 positionOfStart=0}
   [junit4]   2> 1244999 INFO  (recoveryExecutor-2929-thread-1) [    ] o.a.s.u.UpdateLog Starting to buffer updates. FSUpdateLog{state=BUFFERING, tlog=null}
   [junit4]   2> 1244999 INFO  (recoveryExecutor-2929-thread-1) [    ] o.a.s.c.RecoveryStrategy Publishing state of core [testExecute_shard1_replica_n5] as recovering, leader is [http://127.0.0.1:49459/solr/testExecute_shard1_replica_n1/] and I am [http://127.0.0.1:49459/solr/testExecute_shard1_replica_n5/]
   [junit4]   2> 1245002 INFO  (recoveryExecutor-2929-thread-1) [    ] o.a.s.c.RecoveryStrategy Sending prep recovery command to [http://127.0.0.1:49459/solr]; [WaitForState: action=PREPRECOVERY&core=testExecute_shard1_replica_n1&nodeName=127.0.0.1:49459_solr&coreNodeName=core_node6&state=recovering&checkLive=true&onlyIfLeader=true&onlyIfLeaderActive=true]
   [junit4]   2> 1245004 INFO  (qtp964427671-14274) [    ] o.a.s.h.a.PrepRecoveryOp Going to wait for coreNodeName: core_node6, state: recovering, checkLive: true, onlyIfLeader: true, onlyIfLeaderActive: true, maxTime: 183 s
   [junit4]   2> 1245005 INFO  (qtp964427671-14274) [    ] o.a.s.h.a.PrepRecoveryOp In WaitForState(recovering): collection=testExecute, shard=shard1, thisCore=testExecute_shard1_replica_n1, leaderDoesNotNeedRecovery=false, isLeader? true, live=true, checkLive=true, currentState=recovering, localState=active, nodeName=127.0.0.1:49459_solr, coreNodeName=core_node6, onlyIfActiveCheckResult=false, nodeProps: core_node6:{"core":"testExecute_shard1_replica_n5","base_url":"http://127.0.0.1:49459/solr","node_name":"127.0.0.1:49459_solr","state":"recovering","type":"NRT"}
   [junit4]   2> 1245005 INFO  (qtp964427671-14274) [    ] o.a.s.h.a.PrepRecoveryOp Waited coreNodeName: core_node6, state: recovering, checkLive: true, onlyIfLeader: true for: 0 seconds.
   [junit4]   2> 1245005 INFO  (qtp964427671-14274) [    ] o.a.s.s.HttpSolrCall [admin] webapp=null path=/admin/cores params={nodeName=127.0.0.1:49459_solr&onlyIfLeaderActive=true&core=testExecute_shard1_replica_n1&coreNodeName=core_node6&action=PREPRECOVERY&checkLive=true&state=recovering&onlyIfLeader=true&wt=javabin&version=2} status=0 QTime=1
   [junit4]   2> 1245015 INFO  (zkCallback-2942-thread-1) [    ] o.a.s.c.c.ZkStateReader A cluster state change: [WatchedEvent state:SyncConnected type:NodeDataChanged path:/collections/testExecute/state.json] for collection [testExecute] has occurred - updating... (live nodes size: [2])
   [junit4]   2> 1245016 INFO  (zkCallback-2934-thread-3) [    ] o.a.s.c.c.ZkStateReader A cluster state change: [WatchedEvent state:SyncConnected type:NodeDataChanged path:/collections/testExecute/state.json] for collection [testExecute] has occurred - updating... (live nodes size: [2])
   [junit4]   2> 1245016 INFO  (zkCallback-2934-thread-1) [    ] o.a.s.c.c.ZkStateReader A cluster state change: [WatchedEvent state:SyncConnected type:NodeDataChanged path:/collections/testExecute/state.json] for collection [testExecute] has occurred - updating... (live nodes size: [2])
   [junit4]   2> 1245515 INFO  (recoveryExecutor-2929-thread-1) [    ] o.a.s.c.RecoveryStrategy Attempting to PeerSync from [http://127.0.0.1:49459/solr/testExecute_shard1_replica_n1/] - recoveringAfterStartup=[true]
   [junit4]   2> 1245515 INFO  (recoveryExecutor-2929-thread-1) [    ] o.a.s.u.PeerSync PeerSync: core=testExecute_shard1_replica_n5 url=http://127.0.0.1:49459/solr START replicas=[http://127.0.0.1:49459/solr/testExecute_shard1_replica_n1/] nUpdates=100
   [junit4]   2> 1245519 INFO  (qtp964427671-14272) [    ] o.a.s.u.IndexFingerprint IndexFingerprint millis:0.0 result:{maxVersionSpecified=9223372036854775807, maxVersionEncountered=0, maxInHash=0, versionsHash=0, numVersions=0, numDocs=0, maxDoc=0}
   [junit4]   2> 1245519 INFO  (qtp964427671-14272) [    ] o.a.s.c.S.Request [testExecute_shard1_replica_n1]  webapp=/solr path=/get params={distrib=false&qt=/get&getFingerprint=9223372036854775807&wt=javabin&version=2} status=0 QTime=0
   [junit4]   2> 1245520 INFO  (recoveryExecutor-2929-thread-1) [    ] o.a.s.u.IndexFingerprint IndexFingerprint millis:0.0 result:{maxVersionSpecified=9223372036854775807, maxVersionEncountered=0, maxInHash=0, versionsHash=0, numVersions=0, numDocs=0, maxDoc=0}
   [junit4]   2> 1245520 INFO  (recoveryExecutor-2929-thread-1) [    ] o.a.s.u.PeerSync We are already in sync. No need to do a PeerSync 
   [junit4]   2> 1245520 INFO  (recoveryExecutor-2929-thread-1) [    ] o.a.s.u.DirectUpdateHandler2 start commit{,optimize=false,openSearcher=true,waitSearcher=true,expungeDeletes=false,softCommit=false,prepareCommit=false}
   [junit4]   2> 1245520 INFO  (recoveryExecutor-2929-thread-1) [    ] o.a.s.u.DirectUpdateHandler2 No uncommitted changes. Skipping IW.commit.
   [junit4]   2> 1245520 INFO  (recoveryExecutor-2929-thread-1) [    ] o.a.s.u.DirectUpdateHandler2 end_commit_flush
   [junit4]   2> 1245520 INFO  (recoveryExecutor-2929-thread-1) [    ] o.a.s.c.RecoveryStrategy PeerSync stage of recovery was successful.
   [junit4]   2> 1245520 INFO  (recoveryExecutor-2929-thread-1) [    ] o.a.s.c.RecoveryStrategy Replaying updates buffered during PeerSync.
   [junit4]   2> 1245520 INFO  (recoveryExecutor-2929-thread-1) [    ] o.a.s.c.RecoveryStrategy No replay needed.
   [junit4]   2> 1245520 INFO  (recoveryExecutor-2929-thread-1) [    ] o.a.s.c.RecoveryStrategy Registering as Active after recovery.
   [junit4]   2> 1245624 INFO  (zkCallback-2934-thread-1) [    ] o.a.s.c.c.ZkStateReader A cluster state change: [WatchedEvent state:SyncConnected type:NodeDataChanged path:/collections/testExecute/state.json] for collection [testExecute] has occurred - updating... (live nodes size: [2])
   [junit4]   2> 1245624 INFO  (zkCallback-2934-thread-3) [    ] o.a.s.c.c.ZkStateReader A cluster state change: [WatchedEvent state:SyncConnected type:NodeDataChanged path:/collections/testExecute/state.json] for collection [testExecute] has occurred - updating... (live nodes size: [2])
   [junit4]   2> 1245624 INFO  (zkCallback-2942-thread-1) [    ] o.a.s.c.c.ZkStateReader A cluster state change: [WatchedEvent state:SyncConnected type:NodeDataChanged path:/collections/testExecute/state.json] for collection [testExecute] has occurred - updating... (live nodes size: [2])
   [junit4]   2> 1245625 INFO  (TEST-ExecutePlanActionTest.testExecute-seed#[C0C350E0FC2E6941]) [    ] o.a.s.SolrTestCaseJ4 ###Ending testExecute
   [junit4]   2> 1245655 INFO  (TEST-ExecutePlanActionTest.testIntegration-seed#[C0C350E0FC2E6941]) [    ] o.a.s.SolrTestCaseJ4 ###Starting testIntegration
   [junit4]   2> 1245658 DEBUG (zkCallback-2935-thread-1) [    ] o.a.s.c.a.OverseerTriggerThread Refreshing /autoscaling.json with znode version 3
   [junit4]   2> 1245658 DEBUG (OverseerAutoScalingTriggerThread-98864310803562502-127.0.0.1:49460_solr-n_0000000000) [    ] o.a.s.c.a.OverseerTriggerThread Processed trigger updates upto znodeVersion 3
   [junit4]   2> 1245659 DEBUG (OverseerAutoScalingTriggerThread-98864310803562502-127.0.0.1:49460_solr-n_0000000000) [    ] o.a.s.c.a.OverseerTriggerThread -- clean old nodeLost markers
   [junit4]   2> 1245659 DEBUG (OverseerAutoScalingTriggerThread-98864310803562502-127.0.0.1:49460_solr-n_0000000000) [    ] o.a.s.c.a.OverseerTriggerThread -- clean old nodeAdded markers
   [junit4]   2> 1245660 DEBUG (OverseerAutoScalingTriggerThread-98864310803562502-127.0.0.1:49460_solr-n_0000000000) [    ] o.a.s.c.a.OverseerTriggerThread Current znodeVersion 3, lastZnodeVersion 3
   [junit4]   2> 1245673 INFO  (qtp345545531-14286) [    ] o.a.s.c.c.ZkStateReader Updated live nodes from ZooKeeper... (0) -> (2)
   [junit4]   2> 1245680 INFO  (qtp345545531-14286) [    ] o.a.s.c.s.i.ZkClientClusterStateProvider Cluster at 127.0.0.1:49457/solr ready
   [junit4]   2> 1245700 INFO  (qtp964427671-14278) [    ] o.a.s.s.HttpSolrCall [admin] webapp=null path=/admin/metrics params={prefix=CORE.coreName&wt=javabin&version=2&group=solr.core} status=0 QTime=1
   [junit4]   2> 1245707 INFO  (qtp345545531-14288) [    ] o.a.s.s.HttpSolrCall [admin] webapp=null path=/admin/metrics params={prefix=CORE.coreName&wt=javabin&version=2&group=solr.core} status=0 QTime=0
   [junit4]   2> 1245707 DEBUG (qtp345545531-14286) [    ] o.a.s.c.a.AutoScalingHandler Verified autoscaling configuration
   [junit4]   2> 1245708 INFO  (qtp345545531-14286) [    ] o.a.s.s.HttpSolrCall [admin] webapp=null path=/cluster/autoscaling params={wt=javabin&version=2} status=0 QTime=46
   [junit4]   2> 1245709 DEBUG (zkCallback-2935-thread-1) [    ] o.a.s.c.a.OverseerTriggerThread Refreshing /autoscaling.json with znode version 4
   [junit4]   2> 1245710 DEBUG (zkCallback-2935-thread-1) [    ] o.a.s.c.a.NodeLostTrigger Initial livenodes: [127.0.0.1:49459_solr, 127.0.0.1:49460_solr]
   [junit4]   2> 1245710 DEBUG (OverseerAutoScalingTriggerThread-98864310803562502-127.0.0.1:49460_solr-n_0000000000) [    ] o.a.s.c.a.OverseerTriggerThread Processed trigger updates upto znodeVersion 4
   [junit4]   2> 1245712 INFO  (qtp964427671-14277) [    ] o.a.s.h.a.CollectionsHandler Invoked Collection Action :create with params replicationFactor=2&collection.configName=conf&maxShardsPerNode=1&name=testIntegration&nrtReplicas=2&action=CREATE&numShards=1&wt=javabin&version=2 and sendToOCPQueue=true
   [junit4]   2> 1245719 DEBUG (OverseerAutoScalingTriggerThread-98864310803562502-127.0.0.1:49460_solr-n_0000000000) [    ] o.a.s.c.a.OverseerTriggerThread -- clean old nodeAdded markers
   [junit4]   2> 1245720 INFO  (OverseerThreadFactory-5211-thread-4) [    ] o.a.s.c.CreateCollectionCmd Create collection testIntegration
   [junit4]   2> 1245720 DEBUG (OverseerAutoScalingTriggerThread-98864310803562502-127.0.0.1:49460_solr-n_0000000000) [    ] o.a.s.c.a.OverseerTriggerThread Current znodeVersion 4, lastZnodeVersion 4
   [junit4]   2> 1245720 DEBUG (ScheduledTrigger-5209-thread-2) [    ] o.a.s.c.a.NodeLostTrigger Running NodeLostTrigger: node_lost_trigger with currently live nodes: [127.0.0.1:49459_solr, 127.0.0.1:49460_solr]
   [junit4]   2> 1245854 INFO  (OverseerStateUpdate-98864310803562502-127.0.0.1:49460_solr-n_0000000000) [    ] o.a.s.c.o.SliceMutator createReplica() {
   [junit4]   2>   "operation":"ADDREPLICA",
   [junit4]   2>   "collection":"testIntegration",
   [junit4]   2>   "shard":"shard1",
   [junit4]   2>   "core":"testIntegration_shard1_replica_n1",
   [junit4]   2>   "state":"down",
   [junit4]   2>   "base_url":"http://127.0.0.1:49460/solr",
   [junit4]   2>   "type":"NRT",
   [junit4]   2>   "waitForFinalState":"false"} 
   [junit4]   2> 1245857 INFO  (OverseerStateUpdate-98864310803562502-127.0.0.1:49460_solr-n_0000000000) [    ] o.a.s.c.o.SliceMutator createReplica() {
   [junit4]   2>   "operation":"ADDREPLICA",
   [junit4]   2>   "collection":"testIntegration",
   [junit4]   2>   "shard":"shard1",
   [junit4]   2>   "core":"testIntegration_shard1_replica_n2",
   [junit4]   2>   "state":"down",
   [junit4]   2>   "base_url":"http://127.0.0.1:49459/solr",
   [junit4]   2>   "type":"NRT",
   [junit4]   2>   "waitForFinalState":"false"} 
   [junit4]   2> 1246083 INFO  (qtp345545531-14285) [    ] o.a.s.h.a.CoreAdminOperation core create command qt=/admin/cores&coreNodeName=core_node3&collection.configName=conf&newCollection=true&name=testIntegration_shard1_replica_n1&action=CREATE&numShards=1&collection=testIntegration&shard=shard1&wt=javabin&version=2&replicaType=NRT
   [junit4]   2> 1246083 INFO  (qtp964427671-14279) [    ] o.a.s.h.a.CoreAdminOperation core create command qt=/admin/cores&coreNodeName=core_node4&collection.configName=conf&newCollection=true&name=testIntegration_shard1_replica_n2&action=CREATE&numShards=1&collection=testIntegration&shard=shard1&wt=javabin&version=2&replicaType=NRT
   [junit4]   2> 1246192 INFO  (zkCallback-2934-thread-3) [    ] o.a.s.c.c.ZkStateReader A cluster state change: [WatchedEvent state:SyncConnected type:NodeDataChanged path:/collections/testIntegration/state.json] for collection [testIntegration] has occurred - updating... (live nodes size: [2])
   [junit4]   2> 1246192 INFO  (zkCallback-2935-thread-1) [    ] o.a.s.c.c.ZkStateReader A cluster state change: [WatchedEvent state:SyncConnected type:NodeDataChanged path:/collections/testIntegration/state.json] for collection [testIntegration] has occurred - updating... (live nodes size: [2])
   [junit4]   2> 1246192 INFO  (zkCallback-2935-thread-3) [    ] o.a.s.c.c.ZkStateReader A cluster state change: [WatchedEvent state:SyncConnected type:NodeDataChanged path:/collections/testIntegration/state.json] for collection [testIntegration] has occurred - updating... (live nodes size: [2])
   [junit4]   2> 1246192 INFO  (zkCallback-2934-thread-1) [    ] o.a.s.c.c.ZkStateReader A cluster state change: [WatchedEvent state:SyncConnected type:NodeDataChanged path:/collections/testIntegration/state.json] for collection [testIntegration] has occurred - updating... (live nodes size: [2])
   [junit4]   2> 1246731 DEBUG (ScheduledTrigger-5209-thread-1) [    ] o.a.s.c.a.NodeLostTrigger Running NodeLostTrigger: node_lost_trigger with currently live nodes: [127.0.0.1:49459_solr, 127.0.0.1:49460_solr]
   [junit4]   2> 1247106 INFO  (qtp964427671-14279) [    ] o.a.s.c.SolrConfig Using Lucene MatchVersion: 7.2.0
   [junit4]   2> 1247116 INFO  (qtp345545531-14285) [    ] o.a.s.c.SolrConfig Using Lucene MatchVersion: 7.2.0
   [junit4]   2> 1247144 INFO  (qtp964427671-14279) [    ] o.a.s.s.IndexSchema [testIntegration_shard1_replica_n2] Schema name=minimal
   [junit4]   2> 1247145 INFO  (qtp964427671-14279) [    ] o.a.s.s.IndexSchema Loaded schema minimal/1.1 with uniqueid field id
   [junit4]   2> 1247145 INFO  (qtp964427671-14279) [    ] o.a.s.c.CoreContainer Creating SolrCore 'testIntegration_shard1_replica_n2' using configuration from collection testIntegration, trusted=true
   [junit4]   2> 1247146 INFO  (qtp964427671-14279) [    ] o.a.s.m.r.SolrJmxReporter JMX monitoring for 'solr_49459.solr.core.testIntegration.shard1.replica_n2' (registry 'solr.core.testIntegration.shard1.replica_n2') enabled at server: com.sun.jmx.mbeanserver.JmxMBeanServer@256f3b19
   [junit4]   2> 1247146 INFO  (qtp964427671-14279) [    ] o.a.s.c.SolrCore solr.RecoveryStrategy.Builder
   [junit4]   2> 1247146 INFO  (qtp964427671-14279) [    ] o.a.s.c.SolrCore [[testIntegration_shard1_replica_n2] ] Opening new SolrCore at [/Users/jenkins/workspace/Lucene-Solr-7.x-MacOSX/solr/build/solr-core/test/J0/temp/solr.cloud.autoscaling.ExecutePlanActionTest_C0C350E0FC2E6941-001/tempDir-001/node1/testIntegration_shard1_replica_n2], dataDir=[/Users/jenkins/workspace/Lucene-Solr-7.x-MacOSX/solr/build/solr-core/test/J0/temp/solr.cloud.autoscaling.ExecutePlanActionTest_C0C350E0FC2E6941-001/tempDir-001/node1/./testIntegration_shard1_replica_n2/data/]
   [junit4]   2> 1247151 INFO  (qtp345545531-14285) [    ] o.a.s.s.IndexSchema [testIntegration_shard1_replica_n1] Schema name=minimal
   [junit4]   2> 1247152 INFO  (qtp345545531-14285) [    ] o.a.s.s.IndexSchema Loaded schema minimal/1.1 with uniqueid field id
   [junit4]   2> 1247153 INFO  (qtp345545531-14285) [    ] o.a.s.c.CoreContainer Creating SolrCore 'testIntegration_shard1_replica_n1' using configuration from collection testIntegration, trusted=true
   [junit4]   2> 1247153 INFO  (qtp345545531-14285) [    ] o.a.s.m.r.SolrJmxReporter JMX monitoring for 'solr_49460.solr.core.testIntegration.shard1.replica_n1' (registry 'solr.core.testIntegration.shard1.replica_n1') enabled at server: com.sun.jmx.mbeanserver.JmxMBeanServer@256f3b19
   [junit4]   2> 1247153 INFO  (qtp345545531-14285) [    ] o.a.s.c.SolrCore solr.RecoveryStrategy.Builder
   [junit4]   2> 1247153 INFO  (qtp345545531-14285) [    ] o.a.s.c.SolrCore [[testIntegration_shard1_replica_n1] ] Opening new SolrCore at [/Users/jenkins/workspace/Lucene-Solr-7.x-MacOSX/solr/build/solr-core/test/J0/temp/solr.cloud.autoscaling.ExecutePlanActionTest_C0C350E0FC2E6941-001/tempDir-001/node2/testIntegration_shard1_replica_n1], dataDir=[/Users/jenkins/workspace/Lucene-Solr-7.x-MacOSX/solr/build/solr-core/test/J0/temp/solr.cloud.autoscaling.ExecutePlanActionTest_C0C350E0FC2E6941-001/tempDir-001/node2/./testIntegration_shard1_replica_n1/data/]
   [junit4]   2> 1247225 INFO  (qtp964427671-14279) [    ] o.a.s.u.UpdateHandler Using UpdateLog implementation: org.apache.solr.update.UpdateLog
   [junit4]   2> 1247225 INFO  (qtp964427671-14279) [    ] o.a.s.u.UpdateLog Initializing UpdateLog: dataDir=null defaultSyncLevel=FLUSH numRecordsToKeep=100 maxNumLogsToKeep=10 numVersionBuckets=65536
   [junit4]   2> 1247225 INFO  (qtp345545531-14285) [    ] o.a.s.u.UpdateHandler Using UpdateLog implementation: org.apache.solr.update.UpdateLog
   [junit4]   2> 1247225 INFO  (qtp345545531-14285) [    ] o.a.s.u.UpdateLog Initializing UpdateLog: dataDir=null defaultSyncLevel=FLUSH numRecordsToKeep=100 maxNumLogsToKeep=10 numVersionBuckets=65536
   [junit4]   2> 1247227 INFO  (qtp964427671-14279) [    ] o.a.s.u.CommitTracker Hard AutoCommit: disabled
   [junit4]   2> 1247227 INFO  (qtp964427671-14279) [    ] o.a.s.u.CommitTracker Soft AutoCommit: disabled
   [junit4]   2> 1247227 INFO  (qtp345545531-14285) [    ] o.a.s.u.CommitTracker Hard AutoCommit: disabled
   [junit4]   2> 1247227 INFO  (qtp345545531-14285) [    ] o.a.s.u.CommitTracker Soft AutoCommit: disabled
   [junit4]   2> 1247228 INFO  (qtp964427671-14279) [    ] o.a.s.s.SolrIndexSearcher Opening [Searcher@60437dfb[testIntegration_shard1_replica_n2] main]
   [junit4]   2> 1247228 INFO  (qtp345545531-14285) [    ] o.a.s.s.SolrIndexSearcher Opening [Searcher@5cbfece8[testIntegration_shard1_replica_n1] main]
   [junit4]   2> 1247230 INFO  (qtp345545531-14285) [    ] o.a.s.r.ManagedResourceStorage Configured ZooKeeperStorageIO with znodeBase: /configs/conf
   [junit4]   2> 1247230 INFO  (qtp964427671-14279) [    ] o.a.s.r.ManagedResourceStorage Configured ZooKeeperStorageIO with znodeBase: /configs/conf
   [junit4]   2> 1247230 INFO  (qtp345545531-14285) [    ] o.a.s.r.ManagedResourceStorage Loaded null at path _rest_managed.json using ZooKeeperStorageIO:path=/configs/conf
   [junit4]   2> 1247230 INFO  (qtp964427671-14279) [    ] o.a.s.r.ManagedResourceStorage Loaded null at path _rest_managed.json using ZooKeeperStorageIO:path=/configs/conf
   [junit4]   2> 1247230 INFO  (qtp345545531-14285) [    ] o.a.s.h.ReplicationHandler Commits will be reserved for 10000ms.
   [junit4]   2> 1247230 INFO  (qtp964427671-14279) [    ] o.a.s.h.ReplicationHandler Commits will be reserved for 10000ms.
   [junit4]   2> 1247230 INFO  (qtp964427671-14279) [    ] o.a.s.u.UpdateLog Could not find max version in index or recent updates, using new clock 1581829021676601344
   [junit4]   2> 1247230 INFO  (qtp345545531-14285) [    ] o.a.s.u.UpdateLog Could not find max version in index or recent updates, using new clock 1581829021676601344
   [junit4]   2> 1247230 INFO  (searcherExecutor-5232-thread-1) [    ] o.a.s.c.SolrCore [testIntegration_shard1_replica_n1] Registered new searcher Searcher@5cbfece8[testIntegration_shard1_replica_n1] main{ExitableDirectoryReader(UninvertingDirectoryReader())}
   [junit4]   2> 1247235 INFO  (searcherExecutor-5231-thread-1) [    ] o.a.s.c.SolrCore [testIntegration_shard1_replica_n2] Registered new searcher Searcher@60437dfb[testIntegration_shard1_replica_n2] main{ExitableDirectoryReader(UninvertingDirectoryReader())}
   [junit4]   2> 1247243 INFO  (qtp964427671-14279) [    ] o.a.s.c.ShardLeaderElectionContext Enough replicas found to continue.
   [junit4]   2> 1247243 INFO  (qtp964427671-14279) [    ] o.a.s.c.ShardLeaderElectionContext I may be the new leader - try and sync
   [junit4]   2> 1247243 INFO  (qtp964427671-14279) [    ] o.a.s.c.SyncStrategy Sync replicas to http://127.0.0.1:49459/solr/testIntegration_shard1_replica_n2/
   [junit4]   2> 1247244 INFO  (qtp964427671-14279) [    ] o.a.s.u.PeerSync PeerSync: core=testIntegration_shard1_replica_n2 url=http://127.0.0.1:49459/solr START replicas=[http://127.0.0.1:49460/solr/testIntegration_shard1_replica_n1/] nUpdates=100
   [junit4]   2> 1247246 INFO  (qtp345545531-14276) [    ] o.a.s.c.S.Request [testIntegration_shard1_replica_n1]  webapp=/solr path=/get params={distrib=false&qt=/get&fingerprint=false&getVersions=100&wt=javabin&version=2} status=0 QTime=0
   [junit4]   2> 1247352 INFO  (zkCallback-2935-thread-2) [    ] o.a.s.c.c.ZkStateReader A cluster state change: [WatchedEvent state:SyncConnected type:NodeDataChanged path:/collections/testIntegration/state.json] for collection [testIntegration] has occurred - updating... (live nodes size: [2])
   [junit4]   2> 1247352 INFO  (zkCallback-2934-thread-3) [    ] o.a.s.c.c.ZkStateReader A cluster state change: [WatchedEvent state:SyncConnected type:NodeDataChanged path:/collections/testIntegration/state.json] for collection [testIntegration] has occurred - updating... (live nodes size: [2])
   [junit4]   2> 1247352 INFO  (zkCallback-2935-thread-3) [    ] o.a.s.c.c.ZkStateReader A cluster state change: [WatchedEvent state:SyncConnected type:NodeDataChanged path:/collections/testIntegration/state.json] for collection [testIntegration] has occurred - updating... (live nodes size: [2])
   [junit4]   2> 1247352 INFO  (zkCallback-2934-thread-1) [    ] o.a.s.c.c.ZkStateReader A cluster state change: [WatchedEvent state:SyncConnected type:NodeDataChanged path:/collections/testIntegration/state.json] for collection [testIntegration] has occurred - updating... (live nodes size: [2])
   [junit4]   2> 1247554 INFO  (qtp964427671-14279) [    ] o.a.s.u.PeerSync PeerSync: core=testIntegration_shard1_replica_n2 url=http://127.0.0.1:49459/solr DONE.  We have no versions.  sync failed.
   [junit4]   2> 1247554 INFO  (qtp964427671-14279) [    ] o.a.s.c.SyncStrategy Leader's attempt to sync with shard failed, moving to the next candidate
   [junit4]   2> 1247554 INFO  (qtp964427671-14279) [    ] o.a.s.c.ShardLeaderElectionContext We failed sync, but we have no versions - we can't sync in that case - we were active before, so become leader anyway
   [junit4]   2> 1247554 INFO  (qtp964427671-14279) [    ] o.a.s.c.ShardLeaderElectionContext Found all replicas participating in election, clear LIR
   [junit4]   2> 1247560 INFO  (qtp964427671-14279) [    ] o.a.s.c.ShardLeaderElectionContext I am the new leader: http://127.0.0.1:49459/solr/testIntegration_shard1_replica_n2/ shard1
   [junit4]   2> 1247668 INFO  (zkCallback-2935-thread-3) [    ] o.a.s.c.c.ZkStateReader A cluster state change: [WatchedEvent state:SyncConnected type:NodeDataChanged path:/collections/testIntegration/state.json] for collection [testIntegration] has occurred - updating... (live nodes size: [2])
   [junit4]   2> 1247668 INFO  (zkCallback-2934-thread-1) [    ] o.a.s.c.c.ZkStateReader A cluster state change: [WatchedEvent state:SyncConnected type:NodeDataChanged path:/collections/testIntegration/state.json] for collection [testIntegration] has occurred - updating... (live nodes size: [2])
   [junit4]   2> 1247668 INFO  (zkCallback-2935-thread-2) [    ] o.a.s.c.c.ZkStateReader A cluster state change: [WatchedEvent state:SyncConnected type:NodeDa

[...truncated too long message...]

Client.java:460)
   [junit4]   2> 	at org.apache.solr.client.solrj.impl.CloudSolrClient.sendRequest(CloudSolrClient.java:1086)
   [junit4]   2> 	at org.apache.solr.client.solrj.impl.CloudSolrClient.requestWithRetryOnStaleState(CloudSolrClient.java:867)
   [junit4]   2> 	at org.apache.solr.client.solrj.impl.CloudSolrClient.request(CloudSolrClient.java:800)
   [junit4]   2> 	at org.apache.solr.client.solrj.SolrRequest.process(SolrRequest.java:178)
   [junit4]   2> 	at org.apache.solr.client.solrj.SolrRequest.process(SolrRequest.java:195)
   [junit4]   2> 	at org.apache.solr.client.solrj.impl.SolrClientCloudManager.request(SolrClientCloudManager.java:99)
   [junit4]   2> 	... 9 more
   [junit4]   2> 1857989 ERROR (AutoscalingActionExecutor-5210-thread-1) [    ] o.a.s.c.a.ExecutePlanAction Unexpected Exception while querying status of requestId=node_lost_trigger/14ef71f8c443a0c0Tanbod8awv5sm50ty5diifajwj/0
   [junit4]   2> java.io.IOException: org.apache.solr.client.solrj.SolrServerException: No live SolrServers available to handle this request
   [junit4]   2> 	at org.apache.solr.client.solrj.impl.SolrClientCloudManager.request(SolrClientCloudManager.java:101)
   [junit4]   2> 	at org.apache.solr.cloud.autoscaling.ExecutePlanAction.waitForTaskToFinish(ExecutePlanAction.java:130)
   [junit4]   2> 	at org.apache.solr.cloud.autoscaling.ScheduledTriggers.waitForPendingTasks(ScheduledTriggers.java:289)
   [junit4]   2> 	at org.apache.solr.cloud.autoscaling.ScheduledTriggers.lambda$add$2(ScheduledTriggers.java:221)
   [junit4]   2> 	at java.base/java.util.concurrent.Executors$RunnableAdapter.call(Executors.java:514)
   [junit4]   2> 	at java.base/java.util.concurrent.FutureTask.run(FutureTask.java:264)
   [junit4]   2> 	at org.apache.solr.common.util.ExecutorUtil$MDCAwareThreadPoolExecutor.lambda$execute$0(ExecutorUtil.java:188)
   [junit4]   2> 	at java.base/java.util.concurrent.ThreadPoolExecutor.runWorker(ThreadPoolExecutor.java:1167)
   [junit4]   2> 	at java.base/java.util.concurrent.ThreadPoolExecutor$Worker.run(ThreadPoolExecutor.java:641)
   [junit4]   2> 	at java.base/java.lang.Thread.run(Thread.java:844)
   [junit4]   2> Caused by: org.apache.solr.client.solrj.SolrServerException: No live SolrServers available to handle this request
   [junit4]   2> 	at org.apache.solr.client.solrj.impl.LBHttpSolrClient.request(LBHttpSolrClient.java:460)
   [junit4]   2> 	at org.apache.solr.client.solrj.impl.CloudSolrClient.sendRequest(CloudSolrClient.java:1086)
   [junit4]   2> 	at org.apache.solr.client.solrj.impl.CloudSolrClient.requestWithRetryOnStaleState(CloudSolrClient.java:867)
   [junit4]   2> 	at org.apache.solr.client.solrj.impl.CloudSolrClient.request(CloudSolrClient.java:800)
   [junit4]   2> 	at org.apache.solr.client.solrj.SolrRequest.process(SolrRequest.java:178)
   [junit4]   2> 	at org.apache.solr.client.solrj.SolrRequest.process(SolrRequest.java:195)
   [junit4]   2> 	at org.apache.solr.client.solrj.impl.SolrClientCloudManager.request(SolrClientCloudManager.java:99)
   [junit4]   2> 	... 9 more
   [junit4]   2> 1862106 WARN  (OverseerThreadFactory-5211-thread-5) [    ] o.a.s.c.MoveReplicaCmd Timed out waiting for leader's replica to recover, collection=testExecute shard=shard1 on node=127.0.0.1:49460_solr
   [junit4]   2> 1862112 INFO  (OverseerThreadFactory-5211-thread-5) [    ] o.a.s.c.OverseerTaskQueue Response ZK path: /overseer/collection-queue-work/qnr-0000000006 doesn't exist.  Requestor may have disconnected from ZooKeeper
   [junit4]   2> 1862113 WARN  (OverseerAutoScalingTriggerThread-98864310803562502-127.0.0.1:49460_solr-n_0000000000) [    ] o.a.s.c.a.OverseerTriggerThread OverseerTriggerThread woken up but we are closed, exiting.
   [junit4]   2> 1862114 DEBUG (jetty-closer-2924-thread-1) [    ] o.a.s.c.a.OverseerTriggerThread OverseerTriggerThread has been closed explicitly
   [junit4]   2> 1862114 ERROR (AutoscalingActionExecutor-5210-thread-1) [    ] o.a.s.c.a.ScheduledTriggers Unexpected exception while waiting for pending task with requestid: node_lost_trigger/14ef71f8c443a0c0Tanbod8awv5sm50ty5diifajwj/0 to finish
   [junit4]   2> java.lang.InterruptedException: sleep interrupted
   [junit4]   2> 	at java.base/java.lang.Thread.sleep(Native Method)
   [junit4]   2> 	at java.base/java.lang.Thread.sleep(Thread.java:340)
   [junit4]   2> 	at java.base/java.util.concurrent.TimeUnit.sleep(TimeUnit.java:401)
   [junit4]   2> 	at org.apache.solr.cloud.autoscaling.ExecutePlanAction.waitForTaskToFinish(ExecutePlanAction.java:155)
   [junit4]   2> 	at org.apache.solr.cloud.autoscaling.ScheduledTriggers.waitForPendingTasks(ScheduledTriggers.java:289)
   [junit4]   2> 	at org.apache.solr.cloud.autoscaling.ScheduledTriggers.lambda$add$2(ScheduledTriggers.java:221)
   [junit4]   2> 	at java.base/java.util.concurrent.Executors$RunnableAdapter.call(Executors.java:514)
   [junit4]   2> 	at java.base/java.util.concurrent.FutureTask.run(FutureTask.java:264)
   [junit4]   2> 	at org.apache.solr.common.util.ExecutorUtil$MDCAwareThreadPoolExecutor.lambda$execute$0(ExecutorUtil.java:188)
   [junit4]   2> 	at java.base/java.util.concurrent.ThreadPoolExecutor.runWorker(ThreadPoolExecutor.java:1167)
   [junit4]   2> 	at java.base/java.util.concurrent.ThreadPoolExecutor$Worker.run(ThreadPoolExecutor.java:641)
   [junit4]   2> 	at java.base/java.lang.Thread.run(Thread.java:844)
   [junit4]   2> 1862115 INFO  (jetty-closer-2924-thread-1) [    ] o.e.j.s.h.ContextHandler Stopped o.e.j.s.ServletContextHandler@42c803e8{/solr,null,UNAVAILABLE}
   [junit4]   2> 1862116 ERROR (SUITE-ExecutePlanActionTest-seed#[C0C350E0FC2E6941]-worker) [    ] o.a.z.s.ZooKeeperServer ZKShutdownHandler is not registered, so ZooKeeper server won't take any action on ERROR or SHUTDOWN server state changes
   [junit4]   2> 1862117 INFO  (SUITE-ExecutePlanActionTest-seed#[C0C350E0FC2E6941]-worker) [    ] o.a.s.c.ZkTestServer connecting to 127.0.0.1:49457 49457
   [junit4]   2> 1863270 INFO  (Thread-2241) [    ] o.a.s.c.ZkTestServer connecting to 127.0.0.1:49457 49457
   [junit4]   2> 1864144 WARN  (Thread-2241) [    ] o.a.s.c.ZkTestServer Watch limit violations: 
   [junit4]   2> Maximum concurrent create/delete watches above limit:
   [junit4]   2> 
   [junit4]   2> 	4	/solr/aliases.json
   [junit4]   2> 	4	/solr/clusterprops.json
   [junit4]   2> 	3	/solr/configs/conf
   [junit4]   2> 	2	/solr/security.json
   [junit4]   2> 
   [junit4]   2> Maximum concurrent data watches above limit:
   [junit4]   2> 
   [junit4]   2> 	22	/solr/collections/testExecute/state.json
   [junit4]   2> 	21	/solr/collections/testIntegration/state.json
   [junit4]   2> 	4	/solr/clusterstate.json
   [junit4]   2> 
   [junit4]   2> Maximum concurrent children watches above limit:
   [junit4]   2> 
   [junit4]   2> 	4	/solr/live_nodes
   [junit4]   2> 	4	/solr/collections
   [junit4]   2> 
   [junit4]   2> NOTE: leaving temporary files on disk at: /Users/jenkins/workspace/Lucene-Solr-7.x-MacOSX/solr/build/solr-core/test/J0/temp/solr.cloud.autoscaling.ExecutePlanActionTest_C0C350E0FC2E6941-001
   [junit4]   2> NOTE: test params are: codec=Lucene70, sim=RandomSimilarity(queryNorm=false): {}, locale=pa, timezone=Antarctica/Rothera
   [junit4]   2> NOTE: Mac OS X 10.11.6 x86_64/Oracle Corporation 9 (64-bit)/cpus=3,threads=1,free=146869032,total=486539264
   [junit4]   2> NOTE: All tests run in this JVM: [ShowFileRequestHandlerTest, TestLegacyTerms, IndexBasedSpellCheckerTest, AsyncCallRequestStatusResponseTest, TestFieldCacheReopen, HdfsDirectoryTest, ResponseLogComponentTest, TestStressLiveNodes, TestInfoStreamLogging, DefaultValueUpdateProcessorTest, TestInPlaceUpdatesDistrib, TestManagedSynonymFilterFactory, TolerantUpdateProcessorTest, StatsReloadRaceTest, TestRebalanceLeaders, TestExpandComponent, DistributedTermsComponentTest, CdcrVersionReplicationTest, PreAnalyzedUpdateProcessorTest, TestManagedSchema, TestManagedSchemaThreadSafety, TestSkipOverseerOperations, TestObjectReleaseTracker, TestDistribDocBasedVersion, TestQuerySenderListener, TestSchemaManager, TestJsonFacetRefinement, ChangedSchemaMergeTest, StatsComponentTest, RequiredFieldsTest, TestReqParamsAPI, TestSolrDeletionPolicy2, TestOverriddenPrefixQueryForCustomFieldType, TestDistributedSearch, XmlUpdateRequestHandlerTest, TestRawResponseWriter, RequestLoggingTest, NoCacheHeaderTest, PrimitiveFieldTypeTest, DistribJoinFromCollectionTest, TestHighFrequencyDictionaryFactory, EnumFieldTest, TestMinMaxOnMultiValuedField, OverseerRolesTest, TestCloudNestedDocsSort, TestPHPSerializedResponseWriter, OverseerTest, SolrGangliaReporterTest, HdfsBasicDistributedZkTest, DateMathParserTest, TestCopyFieldCollectionResource, MultiThreadedOCPTest, AnalysisErrorHandlingTest, TestReloadDeadlock, DistributedSpellCheckComponentTest, DeleteNodeTest, DistribCursorPagingTest, CleanupOldIndexTest, SortSpecParsingTest, TestHdfsBackupRestoreCore, DistanceUnitsTest, TestExceedMaxTermLength, TestDelegationWithHadoopAuth, MissingSegmentRecoveryTest, TestPivotHelperCode, PrimUtilsTest, TestComplexPhraseQParserPlugin, TestEmbeddedSolrServerSchemaAPI, CoreAdminCreateDiscoverTest, PreAnalyzedFieldManagedSchemaCloudTest, MinimalSchemaTest, ChaosMonkeyNothingIsSafeTest, RAMDirectoryFactoryTest, OverseerTaskQueueTest, TriggerIntegrationTest, LeaderElectionTest, V2StandaloneTest, TestFiltering, HdfsSyncSliceTest, TestCoreDiscovery, LeaderFailureAfterFreshStartTest, WordBreakSolrSpellCheckerTest, TestQuerySenderNoQuery, TestEmbeddedSolrServerAdminHandler, HdfsWriteToMultipleCollectionsTest, TestReplicationHandler, SolrInfoBeanTest, TestMacros, TestCollapseQParserPlugin, CollectionsAPISolrJTest, TestAtomicUpdateErrorCases, TestOnReconnectListenerSupport, SuggesterFSTTest, BlockJoinFacetDistribTest, ScriptEngineTest, TestSolr4Spatial2, HighlighterConfigTest, TestSolrConfigHandlerCloud, TestIBSimilarityFactory, ExecutePlanActionTest]
   [junit4] Completed [288/744 (1!)] on J0 in 663.49s, 2 tests, 1 failure <<< FAILURES!

[...truncated 41590 lines...]

Mime
View raw message