lucene-dev mailing list archives

Site index · List index
Message view « Date » · « Thread »
Top « Date » · « Thread »
From Policeman Jenkins Server <jenk...@thetaphi.de>
Subject [JENKINS] Lucene-Solr-master-Solaris (64bit/jdk1.8.0) - Build # 1483 - Still Unstable!
Date Fri, 20 Oct 2017 05:01:23 GMT
Build: https://jenkins.thetaphi.de/job/Lucene-Solr-master-Solaris/1483/
Java: 64bit/jdk1.8.0 -XX:+UseCompressedOops -XX:+UseParallelGC

1 tests failed.
FAILED:  org.apache.solr.cloud.autoscaling.ExecutePlanActionTest.testIntegration

Error Message:
Timed out waiting for replicas of collection to be 2 again null Live Nodes: [127.0.0.1:57209_solr] Last available state: DocCollection(testIntegration//collections/testIntegration/state.json/6)={   "pullReplicas":"0",   "replicationFactor":"2",   "shards":{"shard1":{       "range":"80000000-7fffffff",       "state":"active",       "replicas":{         "core_node3":{           "core":"testIntegration_shard1_replica_n1",           "base_url":"http://127.0.0.1:57209/solr",           "node_name":"127.0.0.1:57209_solr",           "state":"active",           "type":"NRT",           "leader":"true"},         "core_node4":{           "core":"testIntegration_shard1_replica_n2",           "base_url":"http://127.0.0.1:34966/solr",           "node_name":"127.0.0.1:34966_solr",           "state":"down",           "type":"NRT"}}}},   "router":{"name":"compositeId"},   "maxShardsPerNode":"1",   "autoAddReplicas":"false",   "nrtReplicas":"2",   "tlogReplicas":"0"}

Stack Trace:
java.lang.AssertionError: Timed out waiting for replicas of collection to be 2 again
null
Live Nodes: [127.0.0.1:57209_solr]
Last available state: DocCollection(testIntegration//collections/testIntegration/state.json/6)={
  "pullReplicas":"0",
  "replicationFactor":"2",
  "shards":{"shard1":{
      "range":"80000000-7fffffff",
      "state":"active",
      "replicas":{
        "core_node3":{
          "core":"testIntegration_shard1_replica_n1",
          "base_url":"http://127.0.0.1:57209/solr",
          "node_name":"127.0.0.1:57209_solr",
          "state":"active",
          "type":"NRT",
          "leader":"true"},
        "core_node4":{
          "core":"testIntegration_shard1_replica_n2",
          "base_url":"http://127.0.0.1:34966/solr",
          "node_name":"127.0.0.1:34966_solr",
          "state":"down",
          "type":"NRT"}}}},
  "router":{"name":"compositeId"},
  "maxShardsPerNode":"1",
  "autoAddReplicas":"false",
  "nrtReplicas":"2",
  "tlogReplicas":"0"}
	at __randomizedtesting.SeedInfo.seed([E749D7ECA26842A7:5728D9C08757E382]:0)
	at org.junit.Assert.fail(Assert.java:93)
	at org.apache.solr.cloud.SolrCloudTestCase.waitForState(SolrCloudTestCase.java:269)
	at org.apache.solr.cloud.autoscaling.ExecutePlanActionTest.testIntegration(ExecutePlanActionTest.java:209)
	at sun.reflect.NativeMethodAccessorImpl.invoke0(Native Method)
	at sun.reflect.NativeMethodAccessorImpl.invoke(NativeMethodAccessorImpl.java:62)
	at sun.reflect.DelegatingMethodAccessorImpl.invoke(DelegatingMethodAccessorImpl.java:43)
	at java.lang.reflect.Method.invoke(Method.java:498)
	at com.carrotsearch.randomizedtesting.RandomizedRunner.invoke(RandomizedRunner.java:1737)
	at com.carrotsearch.randomizedtesting.RandomizedRunner$8.evaluate(RandomizedRunner.java:934)
	at com.carrotsearch.randomizedtesting.RandomizedRunner$9.evaluate(RandomizedRunner.java:970)
	at com.carrotsearch.randomizedtesting.RandomizedRunner$10.evaluate(RandomizedRunner.java:984)
	at com.carrotsearch.randomizedtesting.rules.SystemPropertiesRestoreRule$1.evaluate(SystemPropertiesRestoreRule.java:57)
	at org.apache.lucene.util.TestRuleSetupTeardownChained$1.evaluate(TestRuleSetupTeardownChained.java:49)
	at org.apache.lucene.util.AbstractBeforeAfterRule$1.evaluate(AbstractBeforeAfterRule.java:45)
	at org.apache.lucene.util.TestRuleThreadAndTestName$1.evaluate(TestRuleThreadAndTestName.java:48)
	at org.apache.lucene.util.TestRuleIgnoreAfterMaxFailures$1.evaluate(TestRuleIgnoreAfterMaxFailures.java:64)
	at org.apache.lucene.util.TestRuleMarkFailure$1.evaluate(TestRuleMarkFailure.java:47)
	at com.carrotsearch.randomizedtesting.rules.StatementAdapter.evaluate(StatementAdapter.java:36)
	at com.carrotsearch.randomizedtesting.ThreadLeakControl$StatementRunner.run(ThreadLeakControl.java:368)
	at com.carrotsearch.randomizedtesting.ThreadLeakControl.forkTimeoutingTask(ThreadLeakControl.java:817)
	at com.carrotsearch.randomizedtesting.ThreadLeakControl$3.evaluate(ThreadLeakControl.java:468)
	at com.carrotsearch.randomizedtesting.RandomizedRunner.runSingleTest(RandomizedRunner.java:943)
	at com.carrotsearch.randomizedtesting.RandomizedRunner$5.evaluate(RandomizedRunner.java:829)
	at com.carrotsearch.randomizedtesting.RandomizedRunner$6.evaluate(RandomizedRunner.java:879)
	at com.carrotsearch.randomizedtesting.RandomizedRunner$7.evaluate(RandomizedRunner.java:890)
	at com.carrotsearch.randomizedtesting.rules.StatementAdapter.evaluate(StatementAdapter.java:36)
	at com.carrotsearch.randomizedtesting.rules.SystemPropertiesRestoreRule$1.evaluate(SystemPropertiesRestoreRule.java:57)
	at org.apache.lucene.util.AbstractBeforeAfterRule$1.evaluate(AbstractBeforeAfterRule.java:45)
	at com.carrotsearch.randomizedtesting.rules.StatementAdapter.evaluate(StatementAdapter.java:36)
	at org.apache.lucene.util.TestRuleStoreClassName$1.evaluate(TestRuleStoreClassName.java:41)
	at com.carrotsearch.randomizedtesting.rules.NoShadowingOrOverridesOnMethodsRule$1.evaluate(NoShadowingOrOverridesOnMethodsRule.java:40)
	at com.carrotsearch.randomizedtesting.rules.NoShadowingOrOverridesOnMethodsRule$1.evaluate(NoShadowingOrOverridesOnMethodsRule.java:40)
	at com.carrotsearch.randomizedtesting.rules.StatementAdapter.evaluate(StatementAdapter.java:36)
	at com.carrotsearch.randomizedtesting.rules.StatementAdapter.evaluate(StatementAdapter.java:36)
	at com.carrotsearch.randomizedtesting.rules.StatementAdapter.evaluate(StatementAdapter.java:36)
	at org.apache.lucene.util.TestRuleAssertionsRequired$1.evaluate(TestRuleAssertionsRequired.java:53)
	at org.apache.lucene.util.TestRuleMarkFailure$1.evaluate(TestRuleMarkFailure.java:47)
	at org.apache.lucene.util.TestRuleIgnoreAfterMaxFailures$1.evaluate(TestRuleIgnoreAfterMaxFailures.java:64)
	at org.apache.lucene.util.TestRuleIgnoreTestSuites$1.evaluate(TestRuleIgnoreTestSuites.java:54)
	at com.carrotsearch.randomizedtesting.rules.StatementAdapter.evaluate(StatementAdapter.java:36)
	at com.carrotsearch.randomizedtesting.ThreadLeakControl$StatementRunner.run(ThreadLeakControl.java:368)
	at java.lang.Thread.run(Thread.java:748)




Build Log:
[...truncated 13499 lines...]
   [junit4] Suite: org.apache.solr.cloud.autoscaling.ExecutePlanActionTest
   [junit4]   2> Creating dataDir: /export/home/jenkins/workspace/Lucene-Solr-master-Solaris/solr/build/solr-core/test/J0/temp/solr.cloud.autoscaling.ExecutePlanActionTest_E749D7ECA26842A7-001/init-core-data-001
   [junit4]   2> 3690053 WARN  (SUITE-ExecutePlanActionTest-seed#[E749D7ECA26842A7]-worker) [    ] o.a.s.SolrTestCaseJ4 startTrackingSearchers: numOpens=7 numCloses=7
   [junit4]   2> 3690053 INFO  (SUITE-ExecutePlanActionTest-seed#[E749D7ECA26842A7]-worker) [    ] o.a.s.SolrTestCaseJ4 Using PointFields (NUMERIC_POINTS_SYSPROP=true) w/NUMERIC_DOCVALUES_SYSPROP=true
   [junit4]   2> 3690053 INFO  (SUITE-ExecutePlanActionTest-seed#[E749D7ECA26842A7]-worker) [    ] o.a.s.SolrTestCaseJ4 Randomized ssl (false) and clientAuth (false) via: @org.apache.solr.util.RandomizeSSL(reason=, value=NaN, ssl=NaN, clientAuth=NaN)
   [junit4]   2> 3690053 INFO  (SUITE-ExecutePlanActionTest-seed#[E749D7ECA26842A7]-worker) [    ] o.a.s.SolrTestCaseJ4 SecureRandom sanity checks: test.solr.allowed.securerandom=null & java.security.egd=file:/dev/./urandom
   [junit4]   2> 3690053 INFO  (SUITE-ExecutePlanActionTest-seed#[E749D7ECA26842A7]-worker) [    ] o.a.s.c.MiniSolrCloudCluster Starting cluster of 2 servers in /export/home/jenkins/workspace/Lucene-Solr-master-Solaris/solr/build/solr-core/test/J0/temp/solr.cloud.autoscaling.ExecutePlanActionTest_E749D7ECA26842A7-001/tempDir-001
   [junit4]   2> 3690053 INFO  (SUITE-ExecutePlanActionTest-seed#[E749D7ECA26842A7]-worker) [    ] o.a.s.c.ZkTestServer STARTING ZK TEST SERVER
   [junit4]   2> 3690053 INFO  (Thread-6410) [    ] o.a.s.c.ZkTestServer client port:0.0.0.0/0.0.0.0:0
   [junit4]   2> 3690053 INFO  (Thread-6410) [    ] o.a.s.c.ZkTestServer Starting server
   [junit4]   2> 3690060 ERROR (Thread-6410) [    ] o.a.z.s.ZooKeeperServer ZKShutdownHandler is not registered, so ZooKeeper server won't take any action on ERROR or SHUTDOWN server state changes
   [junit4]   2> 3690153 INFO  (SUITE-ExecutePlanActionTest-seed#[E749D7ECA26842A7]-worker) [    ] o.a.s.c.ZkTestServer start zk server on port:49146
   [junit4]   2> 3690161 INFO  (jetty-launcher-4817-thread-2) [    ] o.e.j.s.Server jetty-9.3.20.v20170531
   [junit4]   2> 3690162 INFO  (jetty-launcher-4817-thread-2) [    ] o.e.j.s.h.ContextHandler Started o.e.j.s.ServletContextHandler@213ccef4{/solr,null,AVAILABLE}
   [junit4]   2> 3690162 INFO  (jetty-launcher-4817-thread-1) [    ] o.e.j.s.Server jetty-9.3.20.v20170531
   [junit4]   2> 3690163 INFO  (jetty-launcher-4817-thread-2) [    ] o.e.j.s.AbstractConnector Started ServerConnector@5ac28201{HTTP/1.1,[http/1.1]}{127.0.0.1:57209}
   [junit4]   2> 3690163 INFO  (jetty-launcher-4817-thread-2) [    ] o.e.j.s.Server Started @3692771ms
   [junit4]   2> 3690163 INFO  (jetty-launcher-4817-thread-2) [    ] o.a.s.c.s.e.JettySolrRunner Jetty properties: {hostContext=/solr, hostPort=57209}
   [junit4]   2> 3690163 INFO  (jetty-launcher-4817-thread-1) [    ] o.e.j.s.h.ContextHandler Started o.e.j.s.ServletContextHandler@1735d9c6{/solr,null,AVAILABLE}
   [junit4]   2> 3690163 ERROR (jetty-launcher-4817-thread-2) [    ] o.a.s.u.StartupLoggingUtils Missing Java Option solr.log.dir. Logging may be missing or incomplete.
   [junit4]   2> 3690165 INFO  (jetty-launcher-4817-thread-1) [    ] o.e.j.s.AbstractConnector Started ServerConnector@7a839366{HTTP/1.1,[http/1.1]}{127.0.0.1:34966}
   [junit4]   2> 3690165 INFO  (jetty-launcher-4817-thread-1) [    ] o.e.j.s.Server Started @3692773ms
   [junit4]   2> 3690165 INFO  (jetty-launcher-4817-thread-1) [    ] o.a.s.c.s.e.JettySolrRunner Jetty properties: {hostContext=/solr, hostPort=34966}
   [junit4]   2> 3690165 INFO  (jetty-launcher-4817-thread-2) [    ] o.a.s.s.SolrDispatchFilter  ___      _       Welcome to Apache Solr? version 8.0.0
   [junit4]   2> 3690165 INFO  (jetty-launcher-4817-thread-2) [    ] o.a.s.s.SolrDispatchFilter / __| ___| |_ _   Starting in cloud mode on port null
   [junit4]   2> 3690165 ERROR (jetty-launcher-4817-thread-1) [    ] o.a.s.u.StartupLoggingUtils Missing Java Option solr.log.dir. Logging may be missing or incomplete.
   [junit4]   2> 3690165 INFO  (jetty-launcher-4817-thread-2) [    ] o.a.s.s.SolrDispatchFilter \__ \/ _ \ | '_|  Install dir: null, Default config dir: null
   [junit4]   2> 3690165 INFO  (jetty-launcher-4817-thread-2) [    ] o.a.s.s.SolrDispatchFilter |___/\___/_|_|    Start time: 2017-10-20T04:22:23.977Z
   [junit4]   2> 3690165 INFO  (jetty-launcher-4817-thread-1) [    ] o.a.s.s.SolrDispatchFilter  ___      _       Welcome to Apache Solr? version 8.0.0
   [junit4]   2> 3690165 INFO  (jetty-launcher-4817-thread-1) [    ] o.a.s.s.SolrDispatchFilter / __| ___| |_ _   Starting in cloud mode on port null
   [junit4]   2> 3690165 INFO  (jetty-launcher-4817-thread-1) [    ] o.a.s.s.SolrDispatchFilter \__ \/ _ \ | '_|  Install dir: null, Default config dir: null
   [junit4]   2> 3690165 INFO  (jetty-launcher-4817-thread-1) [    ] o.a.s.s.SolrDispatchFilter |___/\___/_|_|    Start time: 2017-10-20T04:22:23.977Z
   [junit4]   2> 3690167 INFO  (jetty-launcher-4817-thread-2) [    ] o.a.s.s.SolrDispatchFilter solr.xml found in ZooKeeper. Loading...
   [junit4]   2> 3690174 INFO  (jetty-launcher-4817-thread-2) [    ] o.a.s.c.ZkContainer Zookeeper client=127.0.0.1:49146/solr
   [junit4]   2> 3690176 INFO  (jetty-launcher-4817-thread-1) [    ] o.a.s.s.SolrDispatchFilter solr.xml found in ZooKeeper. Loading...
   [junit4]   2> 3690183 INFO  (jetty-launcher-4817-thread-1) [    ] o.a.s.c.ZkContainer Zookeeper client=127.0.0.1:49146/solr
   [junit4]   2> 3690340 INFO  (jetty-launcher-4817-thread-1) [n:127.0.0.1:34966_solr    ] o.a.s.c.Overseer Overseer (id=null) closing
   [junit4]   2> 3690341 INFO  (jetty-launcher-4817-thread-2) [n:127.0.0.1:57209_solr    ] o.a.s.c.Overseer Overseer (id=null) closing
   [junit4]   2> 3690341 INFO  (jetty-launcher-4817-thread-1) [n:127.0.0.1:34966_solr    ] o.a.s.c.OverseerElectionContext I am going to be the leader 127.0.0.1:34966_solr
   [junit4]   2> 3690343 INFO  (jetty-launcher-4817-thread-1) [n:127.0.0.1:34966_solr    ] o.a.s.c.Overseer Overseer (id=98859309063929862-127.0.0.1:34966_solr-n_0000000000) starting
   [junit4]   2> 3690343 INFO  (jetty-launcher-4817-thread-2) [n:127.0.0.1:57209_solr    ] o.a.s.c.ZkController Register node as live in ZooKeeper:/live_nodes/127.0.0.1:57209_solr
   [junit4]   2> 3690345 INFO  (zkCallback-4829-thread-1-processing-n:127.0.0.1:34966_solr) [n:127.0.0.1:34966_solr    ] o.a.s.c.c.ZkStateReader Updated live nodes from ZooKeeper... (0) -> (1)
   [junit4]   2> 3690346 INFO  (zkCallback-4825-thread-1-processing-n:127.0.0.1:57209_solr) [n:127.0.0.1:57209_solr    ] o.a.s.c.c.ZkStateReader Updated live nodes from ZooKeeper... (0) -> (1)
   [junit4]   2> 3690354 DEBUG (OverseerAutoScalingTriggerThread-98859309063929862-127.0.0.1:34966_solr-n_0000000000) [n:127.0.0.1:34966_solr    ] o.a.s.c.a.OverseerTriggerThread Adding .autoAddReplicas trigger
   [junit4]   2> 3690356 DEBUG (OverseerAutoScalingTriggerThread-98859309063929862-127.0.0.1:34966_solr-n_0000000000) [n:127.0.0.1:34966_solr    ] o.a.s.c.a.OverseerTriggerThread Refreshing /autoscaling.json with znode version 1
   [junit4]   2> 3690357 INFO  (jetty-launcher-4817-thread-1) [n:127.0.0.1:34966_solr    ] o.a.s.c.ZkController Register node as live in ZooKeeper:/live_nodes/127.0.0.1:34966_solr
   [junit4]   2> 3690357 DEBUG (OverseerAutoScalingTriggerThread-98859309063929862-127.0.0.1:34966_solr-n_0000000000) [n:127.0.0.1:34966_solr    ] o.a.s.c.a.NodeLostTrigger Initial livenodes: [127.0.0.1:57209_solr]
   [junit4]   2> 3690357 DEBUG (OverseerAutoScalingTriggerThread-98859309063929862-127.0.0.1:34966_solr-n_0000000000) [n:127.0.0.1:34966_solr    ] o.a.s.c.a.OverseerTriggerThread Current znodeVersion 1, lastZnodeVersion -1
   [junit4]   2> 3690357 DEBUG (OverseerAutoScalingTriggerThread-98859309063929862-127.0.0.1:34966_solr-n_0000000000) [n:127.0.0.1:34966_solr    ] o.a.s.c.a.OverseerTriggerThread Processed trigger updates upto znodeVersion 1
   [junit4]   2> 3690359 INFO  (zkCallback-4829-thread-1-processing-n:127.0.0.1:34966_solr) [n:127.0.0.1:34966_solr    ] o.a.s.c.c.ZkStateReader Updated live nodes from ZooKeeper... (1) -> (2)
   [junit4]   2> 3690359 INFO  (zkCallback-4825-thread-1-processing-n:127.0.0.1:57209_solr) [n:127.0.0.1:57209_solr    ] o.a.s.c.c.ZkStateReader Updated live nodes from ZooKeeper... (1) -> (2)
   [junit4]   2> 3690360 DEBUG (OverseerAutoScalingTriggerThread-98859309063929862-127.0.0.1:34966_solr-n_0000000000) [n:127.0.0.1:34966_solr    ] o.a.s.c.a.OverseerTriggerThread -- clean old nodeAdded markers
   [junit4]   2> 3690360 DEBUG (OverseerAutoScalingTriggerThread-98859309063929862-127.0.0.1:34966_solr-n_0000000000) [n:127.0.0.1:34966_solr    ] o.a.s.c.a.OverseerTriggerThread Current znodeVersion 1, lastZnodeVersion 1
   [junit4]   2> 3690361 DEBUG (ScheduledTrigger-8713-thread-1) [n:127.0.0.1:34966_solr    ] o.a.s.c.a.NodeLostTrigger Running NodeLostTrigger: .auto_add_replicas with currently live nodes: [127.0.0.1:34966_solr, 127.0.0.1:57209_solr]
   [junit4]   2> 3690487 INFO  (jetty-launcher-4817-thread-2) [n:127.0.0.1:57209_solr    ] o.a.s.m.r.SolrJmxReporter JMX monitoring for 'solr_57209.solr.node' (registry 'solr.node') enabled at server: com.sun.jmx.mbeanserver.JmxMBeanServer@6b1234ae
   [junit4]   2> 3690492 INFO  (jetty-launcher-4817-thread-2) [n:127.0.0.1:57209_solr    ] o.a.s.m.r.SolrJmxReporter JMX monitoring for 'solr_57209.solr.jvm' (registry 'solr.jvm') enabled at server: com.sun.jmx.mbeanserver.JmxMBeanServer@6b1234ae
   [junit4]   2> 3690492 INFO  (jetty-launcher-4817-thread-2) [n:127.0.0.1:57209_solr    ] o.a.s.m.r.SolrJmxReporter JMX monitoring for 'solr_57209.solr.jetty' (registry 'solr.jetty') enabled at server: com.sun.jmx.mbeanserver.JmxMBeanServer@6b1234ae
   [junit4]   2> 3690493 INFO  (jetty-launcher-4817-thread-2) [n:127.0.0.1:57209_solr    ] o.a.s.c.CorePropertiesLocator Found 0 core definitions underneath /export/home/jenkins/workspace/Lucene-Solr-master-Solaris/solr/build/solr-core/test/J0/temp/solr.cloud.autoscaling.ExecutePlanActionTest_E749D7ECA26842A7-001/tempDir-001/node1/.
   [junit4]   2> 3690545 INFO  (jetty-launcher-4817-thread-1) [n:127.0.0.1:34966_solr    ] o.a.s.m.r.SolrJmxReporter JMX monitoring for 'solr_34966.solr.node' (registry 'solr.node') enabled at server: com.sun.jmx.mbeanserver.JmxMBeanServer@6b1234ae
   [junit4]   2> 3690550 INFO  (jetty-launcher-4817-thread-1) [n:127.0.0.1:34966_solr    ] o.a.s.m.r.SolrJmxReporter JMX monitoring for 'solr_34966.solr.jvm' (registry 'solr.jvm') enabled at server: com.sun.jmx.mbeanserver.JmxMBeanServer@6b1234ae
   [junit4]   2> 3690550 INFO  (jetty-launcher-4817-thread-1) [n:127.0.0.1:34966_solr    ] o.a.s.m.r.SolrJmxReporter JMX monitoring for 'solr_34966.solr.jetty' (registry 'solr.jetty') enabled at server: com.sun.jmx.mbeanserver.JmxMBeanServer@6b1234ae
   [junit4]   2> 3690551 INFO  (jetty-launcher-4817-thread-1) [n:127.0.0.1:34966_solr    ] o.a.s.c.CorePropertiesLocator Found 0 core definitions underneath /export/home/jenkins/workspace/Lucene-Solr-master-Solaris/solr/build/solr-core/test/J0/temp/solr.cloud.autoscaling.ExecutePlanActionTest_E749D7ECA26842A7-001/tempDir-001/node2/.
   [junit4]   2> 3690576 INFO  (SUITE-ExecutePlanActionTest-seed#[E749D7ECA26842A7]-worker) [    ] o.a.s.c.c.ZkStateReader Updated live nodes from ZooKeeper... (0) -> (2)
   [junit4]   2> 3690577 INFO  (SUITE-ExecutePlanActionTest-seed#[E749D7ECA26842A7]-worker) [    ] o.a.s.c.s.i.ZkClientClusterStateProvider Cluster at 127.0.0.1:49146/solr ready
   [junit4]   2> 3690598 INFO  (TEST-ExecutePlanActionTest.testExecute-seed#[E749D7ECA26842A7]) [    ] o.a.s.SolrTestCaseJ4 ###Starting testExecute
   [junit4]   2> 3690600 DEBUG (zkCallback-4829-thread-1-processing-n:127.0.0.1:34966_solr) [n:127.0.0.1:34966_solr    ] o.a.s.c.a.OverseerTriggerThread Refreshing /autoscaling.json with znode version 2
   [junit4]   2> 3690601 DEBUG (OverseerAutoScalingTriggerThread-98859309063929862-127.0.0.1:34966_solr-n_0000000000) [n:127.0.0.1:34966_solr    ] o.a.s.c.a.OverseerTriggerThread Processed trigger updates upto znodeVersion 2
   [junit4]   2> 3690602 WARN  (NIOServerCxn.Factory:0.0.0.0/0.0.0.0:0) [    ] o.a.z.s.NIOServerCnxn caught end of stream exception
   [junit4]   2> EndOfStreamException: Unable to read additional data from client sessionid 0x15f38048f7f0009, likely client has closed socket
   [junit4]   2> 	at org.apache.zookeeper.server.NIOServerCnxn.doIO(NIOServerCnxn.java:239)
   [junit4]   2> 	at org.apache.zookeeper.server.NIOServerCnxnFactory.run(NIOServerCnxnFactory.java:203)
   [junit4]   2> 	at java.lang.Thread.run(Thread.java:748)
   [junit4]   2> 3690604 INFO  (qtp1567667180-28601) [n:127.0.0.1:34966_solr    ] o.a.s.h.a.CollectionsHandler Invoked Collection Action :create with params replicationFactor=2&collection.configName=conf&maxShardsPerNode=1&name=testExecute&nrtReplicas=2&action=CREATE&numShards=1&wt=javabin&version=2 and sendToOCPQueue=true
   [junit4]   2> 3690606 DEBUG (OverseerAutoScalingTriggerThread-98859309063929862-127.0.0.1:34966_solr-n_0000000000) [n:127.0.0.1:34966_solr    ] o.a.s.c.a.OverseerTriggerThread -- clean old nodeLost markers
   [junit4]   2> 3690606 DEBUG (OverseerAutoScalingTriggerThread-98859309063929862-127.0.0.1:34966_solr-n_0000000000) [n:127.0.0.1:34966_solr    ] o.a.s.c.a.OverseerTriggerThread -- clean old nodeAdded markers
   [junit4]   2> 3690607 DEBUG (OverseerAutoScalingTriggerThread-98859309063929862-127.0.0.1:34966_solr-n_0000000000) [n:127.0.0.1:34966_solr    ] o.a.s.c.a.OverseerTriggerThread Current znodeVersion 2, lastZnodeVersion 2
   [junit4]   2> 3690608 INFO  (OverseerThreadFactory-8715-thread-1-processing-n:127.0.0.1:34966_solr) [n:127.0.0.1:34966_solr    ] o.a.s.c.CreateCollectionCmd Create collection testExecute
   [junit4]   2> 3690720 INFO  (OverseerStateUpdate-98859309063929862-127.0.0.1:34966_solr-n_0000000000) [n:127.0.0.1:34966_solr    ] o.a.s.c.o.SliceMutator createReplica() {
   [junit4]   2>   "operation":"ADDREPLICA",
   [junit4]   2>   "collection":"testExecute",
   [junit4]   2>   "shard":"shard1",
   [junit4]   2>   "core":"testExecute_shard1_replica_n1",
   [junit4]   2>   "state":"down",
   [junit4]   2>   "base_url":"http://127.0.0.1:34966/solr",
   [junit4]   2>   "type":"NRT",
   [junit4]   2>   "waitForFinalState":"false"} 
   [junit4]   2> 3690724 INFO  (OverseerStateUpdate-98859309063929862-127.0.0.1:34966_solr-n_0000000000) [n:127.0.0.1:34966_solr    ] o.a.s.c.o.SliceMutator createReplica() {
   [junit4]   2>   "operation":"ADDREPLICA",
   [junit4]   2>   "collection":"testExecute",
   [junit4]   2>   "shard":"shard1",
   [junit4]   2>   "core":"testExecute_shard1_replica_n2",
   [junit4]   2>   "state":"down",
   [junit4]   2>   "base_url":"http://127.0.0.1:57209/solr",
   [junit4]   2>   "type":"NRT",
   [junit4]   2>   "waitForFinalState":"false"} 
   [junit4]   2> 3690928 INFO  (qtp1567667180-28603) [n:127.0.0.1:34966_solr    ] o.a.s.h.a.CoreAdminOperation core create command qt=/admin/cores&coreNodeName=core_node3&collection.configName=conf&newCollection=true&name=testExecute_shard1_replica_n1&action=CREATE&numShards=1&collection=testExecute&shard=shard1&wt=javabin&version=2&replicaType=NRT
   [junit4]   2> 3690928 INFO  (qtp1567667180-28603) [n:127.0.0.1:34966_solr    ] o.a.s.c.TransientSolrCoreCacheDefault Allocating transient cache for 2147483647 transient cores
   [junit4]   2> 3690939 INFO  (qtp1240843966-28593) [n:127.0.0.1:57209_solr    ] o.a.s.h.a.CoreAdminOperation core create command qt=/admin/cores&coreNodeName=core_node4&collection.configName=conf&newCollection=true&name=testExecute_shard1_replica_n2&action=CREATE&numShards=1&collection=testExecute&shard=shard1&wt=javabin&version=2&replicaType=NRT
   [junit4]   2> 3690939 INFO  (qtp1240843966-28593) [n:127.0.0.1:57209_solr    ] o.a.s.c.TransientSolrCoreCacheDefault Allocating transient cache for 2147483647 transient cores
   [junit4]   2> 3691049 INFO  (zkCallback-4829-thread-1-processing-n:127.0.0.1:34966_solr) [n:127.0.0.1:34966_solr    ] o.a.s.c.c.ZkStateReader A cluster state change: [WatchedEvent state:SyncConnected type:NodeDataChanged path:/collections/testExecute/state.json] for collection [testExecute] has occurred - updating... (live nodes size: [2])
   [junit4]   2> 3691049 INFO  (zkCallback-4825-thread-1-processing-n:127.0.0.1:57209_solr) [n:127.0.0.1:57209_solr    ] o.a.s.c.c.ZkStateReader A cluster state change: [WatchedEvent state:SyncConnected type:NodeDataChanged path:/collections/testExecute/state.json] for collection [testExecute] has occurred - updating... (live nodes size: [2])
   [junit4]   2> 3691050 INFO  (zkCallback-4829-thread-2-processing-n:127.0.0.1:34966_solr) [n:127.0.0.1:34966_solr    ] o.a.s.c.c.ZkStateReader A cluster state change: [WatchedEvent state:SyncConnected type:NodeDataChanged path:/collections/testExecute/state.json] for collection [testExecute] has occurred - updating... (live nodes size: [2])
   [junit4]   2> 3691050 INFO  (zkCallback-4825-thread-2-processing-n:127.0.0.1:57209_solr) [n:127.0.0.1:57209_solr    ] o.a.s.c.c.ZkStateReader A cluster state change: [WatchedEvent state:SyncConnected type:NodeDataChanged path:/collections/testExecute/state.json] for collection [testExecute] has occurred - updating... (live nodes size: [2])
   [junit4]   2> 3691949 INFO  (qtp1567667180-28603) [n:127.0.0.1:34966_solr c:testExecute s:shard1 r:core_node3 x:testExecute_shard1_replica_n1] o.a.s.c.SolrConfig Using Lucene MatchVersion: 8.0.0
   [junit4]   2> 3691953 INFO  (qtp1240843966-28593) [n:127.0.0.1:57209_solr c:testExecute s:shard1 r:core_node4 x:testExecute_shard1_replica_n2] o.a.s.c.SolrConfig Using Lucene MatchVersion: 8.0.0
   [junit4]   2> 3691956 INFO  (qtp1567667180-28603) [n:127.0.0.1:34966_solr c:testExecute s:shard1 r:core_node3 x:testExecute_shard1_replica_n1] o.a.s.s.IndexSchema [testExecute_shard1_replica_n1] Schema name=minimal
   [junit4]   2> 3691959 INFO  (qtp1567667180-28603) [n:127.0.0.1:34966_solr c:testExecute s:shard1 r:core_node3 x:testExecute_shard1_replica_n1] o.a.s.s.IndexSchema Loaded schema minimal/1.1 with uniqueid field id
   [junit4]   2> 3691959 INFO  (qtp1567667180-28603) [n:127.0.0.1:34966_solr c:testExecute s:shard1 r:core_node3 x:testExecute_shard1_replica_n1] o.a.s.c.CoreContainer Creating SolrCore 'testExecute_shard1_replica_n1' using configuration from collection testExecute, trusted=true
   [junit4]   2> 3691959 INFO  (qtp1240843966-28593) [n:127.0.0.1:57209_solr c:testExecute s:shard1 r:core_node4 x:testExecute_shard1_replica_n2] o.a.s.s.IndexSchema [testExecute_shard1_replica_n2] Schema name=minimal
   [junit4]   2> 3691960 INFO  (qtp1567667180-28603) [n:127.0.0.1:34966_solr c:testExecute s:shard1 r:core_node3 x:testExecute_shard1_replica_n1] o.a.s.m.r.SolrJmxReporter JMX monitoring for 'solr_34966.solr.core.testExecute.shard1.replica_n1' (registry 'solr.core.testExecute.shard1.replica_n1') enabled at server: com.sun.jmx.mbeanserver.JmxMBeanServer@6b1234ae
   [junit4]   2> 3691960 INFO  (qtp1567667180-28603) [n:127.0.0.1:34966_solr c:testExecute s:shard1 r:core_node3 x:testExecute_shard1_replica_n1] o.a.s.c.SolrCore solr.RecoveryStrategy.Builder
   [junit4]   2> 3691960 INFO  (qtp1567667180-28603) [n:127.0.0.1:34966_solr c:testExecute s:shard1 r:core_node3 x:testExecute_shard1_replica_n1] o.a.s.c.SolrCore [[testExecute_shard1_replica_n1] ] Opening new SolrCore at [/export/home/jenkins/workspace/Lucene-Solr-master-Solaris/solr/build/solr-core/test/J0/temp/solr.cloud.autoscaling.ExecutePlanActionTest_E749D7ECA26842A7-001/tempDir-001/node2/testExecute_shard1_replica_n1], dataDir=[/export/home/jenkins/workspace/Lucene-Solr-master-Solaris/solr/build/solr-core/test/J0/temp/solr.cloud.autoscaling.ExecutePlanActionTest_E749D7ECA26842A7-001/tempDir-001/node2/./testExecute_shard1_replica_n1/data/]
   [junit4]   2> 3691961 INFO  (qtp1240843966-28593) [n:127.0.0.1:57209_solr c:testExecute s:shard1 r:core_node4 x:testExecute_shard1_replica_n2] o.a.s.s.IndexSchema Loaded schema minimal/1.1 with uniqueid field id
   [junit4]   2> 3691961 INFO  (qtp1240843966-28593) [n:127.0.0.1:57209_solr c:testExecute s:shard1 r:core_node4 x:testExecute_shard1_replica_n2] o.a.s.c.CoreContainer Creating SolrCore 'testExecute_shard1_replica_n2' using configuration from collection testExecute, trusted=true
   [junit4]   2> 3691961 INFO  (qtp1240843966-28593) [n:127.0.0.1:57209_solr c:testExecute s:shard1 r:core_node4 x:testExecute_shard1_replica_n2] o.a.s.m.r.SolrJmxReporter JMX monitoring for 'solr_57209.solr.core.testExecute.shard1.replica_n2' (registry 'solr.core.testExecute.shard1.replica_n2') enabled at server: com.sun.jmx.mbeanserver.JmxMBeanServer@6b1234ae
   [junit4]   2> 3691961 INFO  (qtp1240843966-28593) [n:127.0.0.1:57209_solr c:testExecute s:shard1 r:core_node4 x:testExecute_shard1_replica_n2] o.a.s.c.SolrCore solr.RecoveryStrategy.Builder
   [junit4]   2> 3691961 INFO  (qtp1240843966-28593) [n:127.0.0.1:57209_solr c:testExecute s:shard1 r:core_node4 x:testExecute_shard1_replica_n2] o.a.s.c.SolrCore [[testExecute_shard1_replica_n2] ] Opening new SolrCore at [/export/home/jenkins/workspace/Lucene-Solr-master-Solaris/solr/build/solr-core/test/J0/temp/solr.cloud.autoscaling.ExecutePlanActionTest_E749D7ECA26842A7-001/tempDir-001/node1/testExecute_shard1_replica_n2], dataDir=[/export/home/jenkins/workspace/Lucene-Solr-master-Solaris/solr/build/solr-core/test/J0/temp/solr.cloud.autoscaling.ExecutePlanActionTest_E749D7ECA26842A7-001/tempDir-001/node1/./testExecute_shard1_replica_n2/data/]
   [junit4]   2> 3692015 INFO  (qtp1240843966-28593) [n:127.0.0.1:57209_solr c:testExecute s:shard1 r:core_node4 x:testExecute_shard1_replica_n2] o.a.s.u.UpdateHandler Using UpdateLog implementation: org.apache.solr.update.UpdateLog
   [junit4]   2> 3692015 INFO  (qtp1240843966-28593) [n:127.0.0.1:57209_solr c:testExecute s:shard1 r:core_node4 x:testExecute_shard1_replica_n2] o.a.s.u.UpdateLog Initializing UpdateLog: dataDir=null defaultSyncLevel=FLUSH numRecordsToKeep=100 maxNumLogsToKeep=10 numVersionBuckets=65536
   [junit4]   2> 3692015 INFO  (qtp1567667180-28603) [n:127.0.0.1:34966_solr c:testExecute s:shard1 r:core_node3 x:testExecute_shard1_replica_n1] o.a.s.u.UpdateHandler Using UpdateLog implementation: org.apache.solr.update.UpdateLog
   [junit4]   2> 3692015 INFO  (qtp1567667180-28603) [n:127.0.0.1:34966_solr c:testExecute s:shard1 r:core_node3 x:testExecute_shard1_replica_n1] o.a.s.u.UpdateLog Initializing UpdateLog: dataDir=null defaultSyncLevel=FLUSH numRecordsToKeep=100 maxNumLogsToKeep=10 numVersionBuckets=65536
   [junit4]   2> 3692016 INFO  (qtp1240843966-28593) [n:127.0.0.1:57209_solr c:testExecute s:shard1 r:core_node4 x:testExecute_shard1_replica_n2] o.a.s.u.CommitTracker Hard AutoCommit: disabled
   [junit4]   2> 3692016 INFO  (qtp1240843966-28593) [n:127.0.0.1:57209_solr c:testExecute s:shard1 r:core_node4 x:testExecute_shard1_replica_n2] o.a.s.u.CommitTracker Soft AutoCommit: disabled
   [junit4]   2> 3692016 INFO  (qtp1567667180-28603) [n:127.0.0.1:34966_solr c:testExecute s:shard1 r:core_node3 x:testExecute_shard1_replica_n1] o.a.s.u.CommitTracker Hard AutoCommit: disabled
   [junit4]   2> 3692016 INFO  (qtp1567667180-28603) [n:127.0.0.1:34966_solr c:testExecute s:shard1 r:core_node3 x:testExecute_shard1_replica_n1] o.a.s.u.CommitTracker Soft AutoCommit: disabled
   [junit4]   2> 3692017 INFO  (qtp1240843966-28593) [n:127.0.0.1:57209_solr c:testExecute s:shard1 r:core_node4 x:testExecute_shard1_replica_n2] o.a.s.s.SolrIndexSearcher Opening [Searcher@51b58d84[testExecute_shard1_replica_n2] main]
   [junit4]   2> 3692017 INFO  (qtp1567667180-28603) [n:127.0.0.1:34966_solr c:testExecute s:shard1 r:core_node3 x:testExecute_shard1_replica_n1] o.a.s.s.SolrIndexSearcher Opening [Searcher@5bf16997[testExecute_shard1_replica_n1] main]
   [junit4]   2> 3692019 INFO  (qtp1240843966-28593) [n:127.0.0.1:57209_solr c:testExecute s:shard1 r:core_node4 x:testExecute_shard1_replica_n2] o.a.s.r.ManagedResourceStorage Configured ZooKeeperStorageIO with znodeBase: /configs/conf
   [junit4]   2> 3692019 INFO  (qtp1567667180-28603) [n:127.0.0.1:34966_solr c:testExecute s:shard1 r:core_node3 x:testExecute_shard1_replica_n1] o.a.s.r.ManagedResourceStorage Configured ZooKeeperStorageIO with znodeBase: /configs/conf
   [junit4]   2> 3692019 INFO  (qtp1240843966-28593) [n:127.0.0.1:57209_solr c:testExecute s:shard1 r:core_node4 x:testExecute_shard1_replica_n2] o.a.s.r.ManagedResourceStorage Loaded null at path _rest_managed.json using ZooKeeperStorageIO:path=/configs/conf
   [junit4]   2> 3692020 INFO  (qtp1567667180-28603) [n:127.0.0.1:34966_solr c:testExecute s:shard1 r:core_node3 x:testExecute_shard1_replica_n1] o.a.s.r.ManagedResourceStorage Loaded null at path _rest_managed.json using ZooKeeperStorageIO:path=/configs/conf
   [junit4]   2> 3692020 INFO  (qtp1240843966-28593) [n:127.0.0.1:57209_solr c:testExecute s:shard1 r:core_node4 x:testExecute_shard1_replica_n2] o.a.s.h.ReplicationHandler Commits will be reserved for 10000ms.
   [junit4]   2> 3692020 INFO  (qtp1567667180-28603) [n:127.0.0.1:34966_solr c:testExecute s:shard1 r:core_node3 x:testExecute_shard1_replica_n1] o.a.s.h.ReplicationHandler Commits will be reserved for 10000ms.
   [junit4]   2> 3692020 INFO  (qtp1240843966-28593) [n:127.0.0.1:57209_solr c:testExecute s:shard1 r:core_node4 x:testExecute_shard1_replica_n2] o.a.s.u.UpdateLog Could not find max version in index or recent updates, using new clock 1581748947079135232
   [junit4]   2> 3692020 INFO  (qtp1567667180-28603) [n:127.0.0.1:34966_solr c:testExecute s:shard1 r:core_node3 x:testExecute_shard1_replica_n1] o.a.s.u.UpdateLog Could not find max version in index or recent updates, using new clock 1581748947079135232
   [junit4]   2> 3692021 INFO  (searcherExecutor-8721-thread-1-processing-n:127.0.0.1:57209_solr x:testExecute_shard1_replica_n2 s:shard1 c:testExecute r:core_node4) [n:127.0.0.1:57209_solr c:testExecute s:shard1 r:core_node4 x:testExecute_shard1_replica_n2] o.a.s.c.SolrCore [testExecute_shard1_replica_n2] Registered new searcher Searcher@51b58d84[testExecute_shard1_replica_n2] main{ExitableDirectoryReader(UninvertingDirectoryReader())}
   [junit4]   2> 3692021 INFO  (searcherExecutor-8720-thread-1-processing-n:127.0.0.1:34966_solr x:testExecute_shard1_replica_n1 s:shard1 c:testExecute r:core_node3) [n:127.0.0.1:34966_solr c:testExecute s:shard1 r:core_node3 x:testExecute_shard1_replica_n1] o.a.s.c.SolrCore [testExecute_shard1_replica_n1] Registered new searcher Searcher@5bf16997[testExecute_shard1_replica_n1] main{ExitableDirectoryReader(UninvertingDirectoryReader())}
   [junit4]   2> 3692032 INFO  (qtp1567667180-28603) [n:127.0.0.1:34966_solr c:testExecute s:shard1 r:core_node3 x:testExecute_shard1_replica_n1] o.a.s.c.ShardLeaderElectionContext Enough replicas found to continue.
   [junit4]   2> 3692032 INFO  (qtp1567667180-28603) [n:127.0.0.1:34966_solr c:testExecute s:shard1 r:core_node3 x:testExecute_shard1_replica_n1] o.a.s.c.ShardLeaderElectionContext I may be the new leader - try and sync
   [junit4]   2> 3692032 INFO  (qtp1567667180-28603) [n:127.0.0.1:34966_solr c:testExecute s:shard1 r:core_node3 x:testExecute_shard1_replica_n1] o.a.s.c.SyncStrategy Sync replicas to http://127.0.0.1:34966/solr/testExecute_shard1_replica_n1/
   [junit4]   2> 3692033 INFO  (qtp1567667180-28603) [n:127.0.0.1:34966_solr c:testExecute s:shard1 r:core_node3 x:testExecute_shard1_replica_n1] o.a.s.u.PeerSync PeerSync: core=testExecute_shard1_replica_n1 url=http://127.0.0.1:34966/solr START replicas=[http://127.0.0.1:57209/solr/testExecute_shard1_replica_n2/] nUpdates=100
   [junit4]   2> 3692034 INFO  (qtp1240843966-28594) [n:127.0.0.1:57209_solr c:testExecute s:shard1 r:core_node4 x:testExecute_shard1_replica_n2] o.a.s.c.S.Request [testExecute_shard1_replica_n2]  webapp=/solr path=/get params={distrib=false&qt=/get&fingerprint=false&getVersions=100&wt=javabin&version=2} status=0 QTime=0
   [junit4]   2> 3692133 INFO  (zkCallback-4829-thread-1-processing-n:127.0.0.1:34966_solr) [n:127.0.0.1:34966_solr    ] o.a.s.c.c.ZkStateReader A cluster state change: [WatchedEvent state:SyncConnected type:NodeDataChanged path:/collections/testExecute/state.json] for collection [testExecute] has occurred - updating... (live nodes size: [2])
   [junit4]   2> 3692133 INFO  (zkCallback-4825-thread-1-processing-n:127.0.0.1:57209_solr) [n:127.0.0.1:57209_solr    ] o.a.s.c.c.ZkStateReader A cluster state change: [WatchedEvent state:SyncConnected type:NodeDataChanged path:/collections/testExecute/state.json] for collection [testExecute] has occurred - updating... (live nodes size: [2])
   [junit4]   2> 3692133 INFO  (zkCallback-4829-thread-2-processing-n:127.0.0.1:34966_solr) [n:127.0.0.1:34966_solr    ] o.a.s.c.c.ZkStateReader A cluster state change: [WatchedEvent state:SyncConnected type:NodeDataChanged path:/collections/testExecute/state.json] for collection [testExecute] has occurred - updating... (live nodes size: [2])
   [junit4]   2> 3692133 INFO  (zkCallback-4825-thread-2-processing-n:127.0.0.1:57209_solr) [n:127.0.0.1:57209_solr    ] o.a.s.c.c.ZkStateReader A cluster state change: [WatchedEvent state:SyncConnected type:NodeDataChanged path:/collections/testExecute/state.json] for collection [testExecute] has occurred - updating... (live nodes size: [2])
   [junit4]   2> 3692334 INFO  (qtp1567667180-28603) [n:127.0.0.1:34966_solr c:testExecute s:shard1 r:core_node3 x:testExecute_shard1_replica_n1] o.a.s.u.PeerSync PeerSync: core=testExecute_shard1_replica_n1 url=http://127.0.0.1:34966/solr DONE.  We have no versions.  sync failed.
   [junit4]   2> 3692334 INFO  (qtp1567667180-28603) [n:127.0.0.1:34966_solr c:testExecute s:shard1 r:core_node3 x:testExecute_shard1_replica_n1] o.a.s.c.SyncStrategy Leader's attempt to sync with shard failed, moving to the next candidate
   [junit4]   2> 3692334 INFO  (qtp1567667180-28603) [n:127.0.0.1:34966_solr c:testExecute s:shard1 r:core_node3 x:testExecute_shard1_replica_n1] o.a.s.c.ShardLeaderElectionContext We failed sync, but we have no versions - we can't sync in that case - we were active before, so become leader anyway
   [junit4]   2> 3692334 INFO  (qtp1567667180-28603) [n:127.0.0.1:34966_solr c:testExecute s:shard1 r:core_node3 x:testExecute_shard1_replica_n1] o.a.s.c.ShardLeaderElectionContext Found all replicas participating in election, clear LIR
   [junit4]   2> 3692339 INFO  (qtp1567667180-28603) [n:127.0.0.1:34966_solr c:testExecute s:shard1 r:core_node3 x:testExecute_shard1_replica_n1] o.a.s.c.ShardLeaderElectionContext I am the new leader: http://127.0.0.1:34966/solr/testExecute_shard1_replica_n1/ shard1
   [junit4]   2> 3692441 INFO  (zkCallback-4825-thread-2-processing-n:127.0.0.1:57209_solr) [n:127.0.0.1:57209_solr    ] o.a.s.c.c.ZkStateReader A cluster state change: [WatchedEvent state:SyncConnected type:NodeDataChanged path:/collections/testExecute/state.json] for collection [testExecute] has occurred - updating... (live nodes size: [2])
   [junit4]   2> 3692441 INFO  (zkCallback-4829-thread-2-processing-n:127.0.0.1:34966_solr) [n:127.0.0.1:34966_solr    ] o.a.s.c.c.ZkStateReader A cluster state change: [WatchedEvent state:SyncConnected type:NodeDataChanged path:/collections/testExecute/state.json] for collection [testExecute] has occurred - updating... (live nodes size: [2])
   [junit4]   2> 3692441 INFO  (zkCallback-4825-thread-1-processing-n:127.0.0.1:57209_solr) [n:127.0.0.1:57209_solr    ] o.a.s.c.c.ZkStateReader A cluster state change: [WatchedEvent state:SyncConnected type:NodeDataChanged path:/collections/testExecute/state.json] for collection [testExecute] has occurred - updating... (live nodes size: [2])
   [junit4]   2> 3692441 INFO  (zkCallback-4829-thread-1-processing-n:127.0.0.1:34966_solr) [n:127.0.0.1:34966_solr    ] o.a.s.c.c.ZkStateReader A cluster state change: [WatchedEvent state:SyncConnected type:NodeDataChanged path:/collections/testExecute/state.json] for collection [testExecute] has occurred - updating... (live nodes size: [2])
   [junit4]   2> 3692490 INFO  (qtp1567667180-28603) [n:127.0.0.1:34966_solr c:testExecute s:shard1 r:core_node3 x:testExecute_shard1_replica_n1] o.a.s.c.ZkController I am the leader, no recovery necessary
   [junit4]   2> 3692492 INFO  (qtp1567667180-28603) [n:127.0.0.1:34966_solr c:testExecute s:shard1 r:core_node3 x:testExecute_shard1_replica_n1] o.a.s.s.HttpSolrCall [admin] webapp=null path=/admin/cores params={qt=/admin/cores&coreNodeName=core_node3&collection.configName=conf&newCollection=true&name=testExecute_shard1_replica_n1&action=CREATE&numShards=1&collection=testExecute&shard=shard1&wt=javabin&version=2&replicaType=NRT} status=0 QTime=1565
   [junit4]   2> 3692593 INFO  (zkCallback-4829-thread-2-processing-n:127.0.0.1:34966_solr) [n:127.0.0.1:34966_solr    ] o.a.s.c.c.ZkStateReader A cluster state change: [WatchedEvent state:SyncConnected type:NodeDataChanged path:/collections/testExecute/state.json] for collection [testExecute] has occurred - updating... (live nodes size: [2])
   [junit4]   2> 3692593 INFO  (zkCallback-4829-thread-1-processing-n:127.0.0.1:34966_solr) [n:127.0.0.1:34966_solr    ] o.a.s.c.c.ZkStateReader A cluster state change: [WatchedEvent state:SyncConnected type:NodeDataChanged path:/collections/testExecute/state.json] for collection [testExecute] has occurred - updating... (live nodes size: [2])
   [junit4]   2> 3692594 INFO  (zkCallback-4825-thread-2-processing-n:127.0.0.1:57209_solr) [n:127.0.0.1:57209_solr    ] o.a.s.c.c.ZkStateReader A cluster state change: [WatchedEvent state:SyncConnected type:NodeDataChanged path:/collections/testExecute/state.json] for collection [testExecute] has occurred - updating... (live nodes size: [2])
   [junit4]   2> 3692593 INFO  (zkCallback-4825-thread-1-processing-n:127.0.0.1:57209_solr) [n:127.0.0.1:57209_solr    ] o.a.s.c.c.ZkStateReader A cluster state change: [WatchedEvent state:SyncConnected type:NodeDataChanged path:/collections/testExecute/state.json] for collection [testExecute] has occurred - updating... (live nodes size: [2])
   [junit4]   2> 3693036 INFO  (qtp1240843966-28593) [n:127.0.0.1:57209_solr c:testExecute s:shard1 r:core_node4 x:testExecute_shard1_replica_n2] o.a.s.s.HttpSolrCall [admin] webapp=null path=/admin/cores params={qt=/admin/cores&coreNodeName=core_node4&collection.configName=conf&newCollection=true&name=testExecute_shard1_replica_n2&action=CREATE&numShards=1&collection=testExecute&shard=shard1&wt=javabin&version=2&replicaType=NRT} status=0 QTime=2098
   [junit4]   2> 3693042 INFO  (qtp1567667180-28601) [n:127.0.0.1:34966_solr    ] o.a.s.h.a.CollectionsHandler Wait for new collection to be active for at most 30 seconds. Check all shard replicas
   [junit4]   2> 3693140 INFO  (zkCallback-4829-thread-3-processing-n:127.0.0.1:34966_solr) [n:127.0.0.1:34966_solr    ] o.a.s.c.c.ZkStateReader A cluster state change: [WatchedEvent state:SyncConnected type:NodeDataChanged path:/collections/testExecute/state.json] for collection [testExecute] has occurred - updating... (live nodes size: [2])
   [junit4]   2> 3693141 INFO  (zkCallback-4829-thread-1-processing-n:127.0.0.1:34966_solr) [n:127.0.0.1:34966_solr    ] o.a.s.c.c.ZkStateReader A cluster state change: [WatchedEvent state:SyncConnected type:NodeDataChanged path:/collections/testExecute/state.json] for collection [testExecute] has occurred - updating... (live nodes size: [2])
   [junit4]   2> 3693141 INFO  (zkCallback-4825-thread-2-processing-n:127.0.0.1:57209_solr) [n:127.0.0.1:57209_solr    ] o.a.s.c.c.ZkStateReader A cluster state change: [WatchedEvent state:SyncConnected type:NodeDataChanged path:/collections/testExecute/state.json] for collection [testExecute] has occurred - updating... (live nodes size: [2])
   [junit4]   2> 3693141 INFO  (zkCallback-4825-thread-1-processing-n:127.0.0.1:57209_solr) [n:127.0.0.1:57209_solr    ] o.a.s.c.c.ZkStateReader A cluster state change: [WatchedEvent state:SyncConnected type:NodeDataChanged path:/collections/testExecute/state.json] for collection [testExecute] has occurred - updating... (live nodes size: [2])
   [junit4]   2> 3694043 INFO  (qtp1567667180-28601) [n:127.0.0.1:34966_solr    ] o.a.s.s.HttpSolrCall [admin] webapp=null path=/admin/collections params={replicationFactor=2&collection.configName=conf&maxShardsPerNode=1&name=testExecute&nrtReplicas=2&action=CREATE&numShards=1&wt=javabin&version=2} status=0 QTime=3439
   [junit4]   2> 3694048 DEBUG (TEST-ExecutePlanActionTest.testExecute-seed#[E749D7ECA26842A7]) [    ] o.a.s.c.a.ExecutePlanAction -- processing event: {
   [junit4]   2>   "id":"14ef2c848447aac0Tep913hr4l0n0kgjgny97nmv96",
   [junit4]   2>   "source":"mock_trigger_name",
   [junit4]   2>   "eventTime":1508473347859000000,
   [junit4]   2>   "eventType":"NODELOST",
   [junit4]   2>   "properties":{
   [junit4]   2>     "eventTimes":[1508473347859000000],
   [junit4]   2>     "nodeNames":["127.0.0.1:57209_solr"]}} with context properties: {operations=[org.apache.solr.client.solrj.request.CollectionAdminRequest$MoveReplica@245c240f, org.apache.solr.cloud.autoscaling.ExecutePlanActionTest$1@54965648]}
   [junit4]   2> 3694048 INFO  (TEST-ExecutePlanActionTest.testExecute-seed#[E749D7ECA26842A7]) [    ] o.a.s.c.a.ExecutePlanAction Executing operation: action=MOVEREPLICA&collection=testExecute&targetNode=127.0.0.1:34966_solr&replica=core_node4
   [junit4]   2> 3694053 DEBUG (TEST-ExecutePlanActionTest.testExecute-seed#[E749D7ECA26842A7]) [    ] o.a.s.c.a.ExecutePlanAction Saved requestId: mock_trigger_name/14ef2c848447aac0Tep913hr4l0n0kgjgny97nmv96/0 in znode: /autoscaling/triggerState/mock_trigger_name/execute_plan/op-0000000000
   [junit4]   2> 3694054 INFO  (qtp1567667180-28600) [n:127.0.0.1:34966_solr    ] o.a.s.h.a.CollectionsHandler Invoked Collection Action :movereplica with params async=mock_trigger_name/14ef2c848447aac0Tep913hr4l0n0kgjgny97nmv96/0&replica=core_node4&action=MOVEREPLICA&collection=testExecute&targetNode=127.0.0.1:34966_solr&wt=javabin&version=2 and sendToOCPQueue=true
   [junit4]   2> 3694056 INFO  (qtp1567667180-28600) [n:127.0.0.1:34966_solr    ] o.a.s.s.HttpSolrCall [admin] webapp=null path=/admin/collections params={async=mock_trigger_name/14ef2c848447aac0Tep913hr4l0n0kgjgny97nmv96/0&replica=core_node4&action=MOVEREPLICA&collection=testExecute&targetNode=127.0.0.1:34966_solr&wt=javabin&version=2} status=0 QTime=2
   [junit4]   2> 3694057 INFO  (qtp1567667180-28605) [n:127.0.0.1:34966_solr    ] o.a.s.h.a.CollectionsHandler Invoked Collection Action :requeststatus with params requestid=mock_trigger_name/14ef2c848447aac0Tep913hr4l0n0kgjgny97nmv96/0&action=REQUESTSTATUS&wt=javabin&version=2 and sendToOCPQueue=true
   [junit4]   2> 3694059 INFO  (qtp1567667180-28605) [n:127.0.0.1:34966_solr    ] o.a.s.s.HttpSolrCall [admin] webapp=null path=/admin/collections params={requestid=mock_trigger_name/14ef2c848447aac0Tep913hr4l0n0kgjgny97nmv96/0&action=REQUESTSTATUS&wt=javabin&version=2} status=0 QTime=2
   [junit4]   2> 3694061 INFO  (OverseerThreadFactory-8715-thread-2-processing-n:127.0.0.1:34966_solr) [n:127.0.0.1:34966_solr    ] o.a.s.c.MoveReplicaCmd Replica will be moved core_node4:{"core":"testExecute_shard1_replica_n2","base_url":"http://127.0.0.1:57209/solr","node_name":"127.0.0.1:57209_solr","state":"active","type":"NRT"}
   [junit4]   2> 3694062 INFO  (OverseerCollectionConfigSetProcessor-98859309063929862-127.0.0.1:34966_solr-n_0000000000) [n:127.0.0.1:34966_solr    ] o.a.s.c.OverseerTaskQueue Response ZK path: /overseer/collection-queue-work/qnr-0000000000 doesn't exist.  Requestor may have disconnected from ZooKeeper
   [junit4]   2> 3694063 INFO  (OverseerThreadFactory-8715-thread-2-processing-n:127.0.0.1:34966_solr) [n:127.0.0.1:34966_solr    ] o.a.s.c.AddReplicaCmd Node Identified 127.0.0.1:34966_solr for creating new replica
   [junit4]   2> 3694065 INFO  (OverseerStateUpdate-98859309063929862-127.0.0.1:34966_solr-n_0000000000) [n:127.0.0.1:34966_solr    ] o.a.s.c.o.SliceMutator createReplica() {
   [junit4]   2>   "operation":"addreplica",
   [junit4]   2>   "collection":"testExecute",
   [junit4]   2>   "shard":"shard1",
   [junit4]   2>   "core":"testExecute_shard1_replica_n5",
   [junit4]   2>   "state":"down",
   [junit4]   2>   "base_url":"http://127.0.0.1:34966/solr",
   [junit4]   2>   "node_name":"127.0.0.1:34966_solr",
   [junit4]   2>   "type":"NRT"} 
   [junit4]   2> 3694167 INFO  (zkCallback-4829-thread-2-processing-n:127.0.0.1:34966_solr) [n:127.0.0.1:34966_solr    ] o.a.s.c.c.ZkStateReader A cluster state change: [WatchedEvent state:SyncConnected type:NodeDataChanged path:/collections/testExecute/state.json] for collection [testExecute] has occurred - updating... (live nodes size: [2])
   [junit4]   2> 3694167 INFO  (zkCallback-4829-thread-1-processing-n:127.0.0.1:34966_solr) [n:127.0.0.1:34966_solr    ] o.a.s.c.c.ZkStateReader A cluster state change: [WatchedEvent state:SyncConnected type:NodeDataChanged path:/collections/testExecute/state.json] for collection [testExecute] has occurred - updating... (live nodes size: [2])
   [junit4]   2> 3694167 INFO  (zkCallback-4825-thread-1-processing-n:127.0.0.1:57209_solr) [n:127.0.0.1:57209_solr    ] o.a.s.c.c.ZkStateReader A cluster state change: [WatchedEvent state:SyncConnected type:NodeDataChanged path:/collections/testExecute/state.json] for collection [testExecute] has occurred - updating... (live nodes size: [2])
   [junit4]   2> 3694168 INFO  (zkCallback-4825-thread-2-processing-n:127.0.0.1:57209_solr) [n:127.0.0.1:57209_solr    ] o.a.s.c.c.ZkStateReader A cluster state change: [WatchedEvent state:SyncConnected type:NodeDataChanged path:/collections/testExecute/state.json] for collection [testExecute] has occurred - updating... (live nodes size: [2])
   [junit4]   2> 3694268 INFO  (qtp1567667180-28599) [n:127.0.0.1:34966_solr    ] o.a.s.s.HttpSolrCall [admin] webapp=null path=/admin/cores params={async=mock_trigger_name/14ef2c848447aac0Tep913hr4l0n0kgjgny97nmv96/02651294903567213&qt=/admin/cores&coreNodeName=core_node6&collection.configName=conf&name=testExecute_shard1_replica_n5&action=CREATE&collection=testExecute&shard=shard1&wt=javabin&version=2&replicaType=NRT} status=0 QTime=0
   [junit4]   2> 3694269 INFO  (parallelCoreAdminExecutor-8718-thread-1-processing-n:127.0.0.1:34966_solr mock_trigger_name//14ef2c848447aac0Tep913hr4l0n0kgjgny97nmv96//02651294903567213 CREATE) [n:127.0.0.1:34966_solr    ] o.a.s.h.a.CoreAdminOperation core create command async=mock_trigger_name/14ef2c848447aac0Tep913hr4l0n0kgjgny97nmv96/02651294903567213&qt=/admin/cores&coreNodeName=core_node6&collection.configName=conf&name=testExecute_shard1_replica_n5&action=CREATE&collection=testExecute&shard=shard1&wt=javabin&version=2&replicaType=NRT
   [junit4]   2> 3694269 INFO  (qtp1567667180-28602) [n:127.0.0.1:34966_solr    ] o.a.s.h.a.CoreAdminOperation Checking request status for : mock_trigger_name/14ef2c848447aac0Tep913hr4l0n0kgjgny97nmv96/02651294903567213
   [junit4]   2> 3694270 INFO  (qtp1567667180-28602) [n:127.0.0.1:34966_solr    ] o.a.s.s.HttpSolrCall [admin] webapp=null path=/admin/cores params={qt=/admin/cores&requestid=mock_trigger_name/14ef2c848447aac0Tep913hr4l0n0kgjgny97nmv96/02651294903567213&action=REQUESTSTATUS&wt=javabin&version=2} status=0 QTime=0
   [junit4]   2> 3694315 INFO  (parallelCoreAdminExecutor-8718-thread-1-processing-n:127.0.0.1:34966_solr mock_trigger_name//14ef2c848447aac0Tep913hr4l0n0kgjgny97nmv96//02651294903567213 CREATE) [n:127.0.0.1:34966_solr c:testExecute s:shard1 r:core_node6 x:testExecute_shard1_replica_n5] o.a.s.c.SolrConfig Using Lucene MatchVersion: 8.0.0
   [junit4]   2> 3694323 INFO  (parallelCoreAdminExecutor-8718-thread-1-processing-n:127.0.0.1:34966_solr mock_trigger_name//14ef2c848447aac0Tep913hr4l0n0kgjgny97nmv96//02651294903567213 CREATE) [n:127.0.0.1:34966_solr c:testExecute s:shard1 r:core_node6 x:testExecute_shard1_replica_n5] o.a.s.s.IndexSchema [testExecute_shard1_replica_n5] Schema name=minimal
   [junit4]   2> 3694325 INFO  (parallelCoreAdminExecutor-8718-thread-1-processing-n:127.0.0.1:34966_solr mock_trigger_name//14ef2c848447aac0Tep913hr4l0n0kgjgny97nmv96//02651294903567213 CREATE) [n:127.0.0.1:34966_solr c:testExecute s:shard1 r:core_node6 x:testExecute_shard1_replica_n5] o.a.s.s.IndexSchema Loaded schema minimal/1.1 with uniqueid field id
   [junit4]   2> 3694325 INFO  (parallelCoreAdminExecutor-8718-thread-1-processing-n:127.0.0.1:34966_solr mock_trigger_name//14ef2c848447aac0Tep913hr4l0n0kgjgny97nmv96//02651294903567213 CREATE) [n:127.0.0.1:34966_solr c:testExecute s:shard1 r:core_node6 x:testExecute_shard1_replica_n5] o.a.s.c.CoreContainer Creating SolrCore 'testExecute_shard1_replica_n5' using configuration from collection testExecute, trusted=true
   [junit4]   2> 3694325 INFO  (parallelCoreAdminExecutor-8718-thread-1-processing-n:127.0.0.1:34966_solr mock_trigger_name//14ef2c848447aac0Tep913hr4l0n0kgjgny97nmv96//02651294903567213 CREATE) [n:127.0.0.1:34966_solr c:testExecute s:shard1 r:core_node6 x:testExecute_shard1_replica_n5] o.a.s.m.r.SolrJmxReporter JMX monitoring for 'solr_34966.solr.core.testExecute.shard1.replica_n5' (registry 'solr.core.testExecute.shard1.replica_n5') enabled at server: com.sun.jmx.mbeanserver.JmxMBeanServer@6b1234ae
   [junit4]   2> 3694325 INFO  (parallelCoreAdminExecutor-8718-thread-1-processing-n:127.0.0.1:34966_solr mock_trigger_name//14ef2c848447aac0Tep913hr4l0n0kgjgny97nmv96//02651294903567213 CREATE) [n:127.0.0.1:34966_solr c:testExecute s:shard1 r:core_node6 x:testExecute_shard1_replica_n5] o.a.s.c.SolrCore solr.RecoveryStrategy.Builder
   [junit4]   2> 3694325 INFO  (parallelCoreAdminExecutor-8718-thread-1-processing-n:127.0.0.1:34966_solr mock_trigger_name//14ef2c848447aac0Tep913hr4l0n0kgjgny97nmv96//02651294903567213 CREATE) [n:127.0.0.1:34966_solr c:testExecute s:shard1 r:core_node6 x:testExecute_shard1_replica_n5] o.a.s.c.SolrCore [[testExecute_shard1_replica_n5] ] Opening new SolrCore at [/export/home/jenkins/workspace/Lucene-Solr-master-Solaris/solr/build/solr-core/test/J0/temp/solr.cloud.autoscaling.ExecutePlanActionTest_E749D7ECA26842A7-001/tempDir-001/node2/testExecute_shard1_replica_n5], dataDir=[/export/home/jenkins/workspace/Lucene-Solr-master-Solaris/solr/build/solr-core/test/J0/temp/solr.cloud.autoscaling.ExecutePlanActionTest_E749D7ECA26842A7-001/tempDir-001/node2/./testExecute_shard1_replica_n5/data/]
   [junit4]   2> 3694363 INFO  (parallelCoreAdminExecutor-8718-thread-1-processing-n:127.0.0.1:34966_solr mock_trigger_name//14ef2c848447aac0Tep913hr4l0n0kgjgny97nmv96//02651294903567213 CREATE) [n:127.0.0.1:34966_solr c:testExecute s:shard1 r:core_node6 x:testExecute_shard1_replica_n5] o.a.s.u.UpdateHandler Using UpdateLog implementation: org.apache.solr.update.UpdateLog
   [junit4]   2> 3694363 INFO  (parallelCoreAdminExecutor-8718-thread-1-processing-n:127.0.0.1:34966_solr mock_trigger_name//14ef2c848447aac0Tep913hr4l0n0kgjgny97nmv96//02651294903567213 CREATE) [n:127.0.0.1:34966_solr c:testExecute s:shard1 r:core_node6 x:testExecute_shard1_replica_n5] o.a.s.u.UpdateLog Initializing UpdateLog: dataDir=null defaultSyncLevel=FLUSH numRecordsToKeep=100 maxNumLogsToKeep=10 numVersionBuckets=65536
   [junit4]   2> 3694364 INFO  (parallelCoreAdminExecutor-8718-thread-1-processing-n:127.0.0.1:34966_solr mock_trigger_name//14ef2c848447aac0Tep913hr4l0n0kgjgny97nmv96//02651294903567213 CREATE) [n:127.0.0.1:34966_solr c:testExecute s:shard1 r:core_node6 x:testExecute_shard1_replica_n5] o.a.s.u.CommitTracker Hard AutoCommit: disabled
   [junit4]   2> 3694364 INFO  (parallelCoreAdminExecutor-8718-thread-1-processing-n:127.0.0.1:34966_solr mock_trigger_name//14ef2c848447aac0Tep913hr4l0n0kgjgny97nmv96//02651294903567213 CREATE) [n:127.0.0.1:34966_solr c:testExecute s:shard1 r:core_node6 x:testExecute_shard1_replica_n5] o.a.s.u.CommitTracker Soft AutoCommit: disabled
   [junit4]   2> 3694364 INFO  (parallelCoreAdminExecutor-8718-thread-1-processing-n:127.0.0.1:34966_solr mock_trigger_name//14ef2c848447aac0Tep913hr4l0n0kgjgny97nmv96//02651294903567213 CREATE) [n:127.0.0.1:34966_solr c:testExecute s:shard1 r:core_node6 x:testExecute_shard1_replica_n5] o.a.s.s.SolrIndexSearcher Opening [Searcher@6ad93342[testExecute_shard1_replica_n5] main]
   [junit4]   2> 3694366 INFO  (parallelCoreAdminExecutor-8718-thread-1-processing-n:127.0.0.1:34966_solr mock_trigger_name//14ef2c848447aac0Tep913hr4l0n0kgjgny97nmv96//02651294903567213 CREATE) [n:127.0.0.1:34966_solr c:testExecute s:shard1 r:core_node6 x:testExecute_shard1_replica_n5] o.a.s.r.ManagedResourceStorage Configured ZooKeeperStorageIO with znodeBase: /configs/conf
   [junit4]   2> 3694367 INFO  (parallelCoreAdminExecutor-8718-thread-1-processing-n:127.0.0.1:34966_solr mock_trigger_name//14ef2c848447aac0Tep913hr4l0n0kgjgny97nmv96//02651294903567213 CREATE) [n:127.0.0.1:34966_solr c:testExecute s:shard1 r:core_node6 x:testExecute_shard1_replica_n5] o.a.s.r.ManagedResourceStorage Loaded null at path _rest_managed.json using ZooKeeperStorageIO:path=/configs/conf
   [junit4]   2> 3694367 INFO  (parallelCoreAdminExecutor-8718-thread-1-processing-n:127.0.0.1:34966_solr mock_trigger_name//14ef2c848447aac0Tep913hr4l0n0kgjgny97nmv96//02651294903567213 CREATE) [n:127.0.0.1:34966_solr c:testExecute s:shard1 r:core_node6 x:testExecute_shard1_replica_n5] o.a.s.h.ReplicationHandler Commits will be reserved for 10000ms.
   [junit4]   2> 3694367 INFO  (parallelCoreAdminExecutor-8718-thread-1-processing-n:127.0.0.1:34966_solr mock_trigger_name//14ef2c848447aac0Tep913hr4l0n0kgjgny97nmv96//02651294903567213 CREATE) [n:127.0.0.1:34966_solr c:testExecute s:shard1 r:core_node6 x:testExecute_shard1_replica_n5] o.a.s.u.UpdateLog Could not find max version in index or recent updates, using new clock 1581748949540143104
   [junit4]   2> 3694368 INFO  (searcherExecutor-8730-thread-1-processing-x:testExecute_shard1_replica_n5 r:core_node6 mock_trigger_name//14ef2c848447aac0Tep913hr4l0n0kgjgny97nmv96//02651294903567213 CREATE n:127.0.0.1:34966_solr s:shard1 c:testExecute) [n:127.0.0.1:34966_solr c:testExecute s:shard1 r:core_node6 x:testExecute_shard1_replica_n5] o.a.s.c.SolrCore [testExecute_shard1_replica_n5] Registered new searcher Searcher@6ad93342[testExecute_shard1_replica_n5] main{ExitableDirectoryReader(UninvertingDirectoryReader())}
   [junit4]   2> 3694370 INFO  (parallelCoreAdminExecutor-8718-thread-1-processing-n:127.0.0.1:34966_solr mock_trigger_name//14ef2c848447aac0Tep913hr4l0n0kgjgny97nmv96//02651294903567213 CREATE) [n:127.0.0.1:34966_solr c:testExecute s:shard1 r:core_node6 x:testExecute_shard1_replica_n5] o.a.s.c.ZkController Core needs to recover:testExecute_shard1_replica_n5
   [junit4]   2> 3694370 INFO  (updateExecutor-4826-thread-1-processing-x:testExecute_shard1_replica_n5 r:core_node6 mock_trigger_name//14ef2c848447aac0Tep913hr4l0n0kgjgny97nmv96//02651294903567213 CREATE n:127.0.0.1:34966_solr s:shard1 c:testExecute) [n:127.0.0.1:34966_solr c:testExecute s:shard1 r:core_node6 x:testExecute_shard1_replica_n5] o.a.s.u.DefaultSolrCoreState Running recovery
   [junit4]   2> 3694371 INFO  (recoveryExecutor-4827-thread-1-processing-x:testExecute_shard1_replica_n5 r:core_node6 mock_trigger_name//14ef2c848447aac0Tep913hr4l0n0kgjgny97nmv96//02651294903567213 CREATE n:127.0.0.1:34966_solr s:shard1 c:testExecute) [n:127.0.0.1:34966_solr c:testExecute s:shard1 r:core_node6 x:testExecute_shard1_replica_n5] o.a.s.c.RecoveryStrategy Starting recovery process. recoveringAfterStartup=true
   [junit4]   2> 3694371 INFO  (recoveryExecutor-4827-thread-1-processing-x:testExecute_shard1_replica_n5 r:core_node6 mock_trigger_name//14ef2c848447aac0Tep913hr4l0n0kgjgny97nmv96//02651294903567213 CREATE n:127.0.0.1:34966_solr s:shard1 c:testExecute) [n:127.0.0.1:34966_solr c:testExecute s:shard1 r:core_node6 x:testExecute_shard1_replica_n5] o.a.s.c.RecoveryStrategy ###### startupVersions=[[]]
   [junit4]   2> 3694371 INFO  (recoveryExecutor-4827-thread-1-processing-x:testExecute_shard1_replica_n5 r:core_node6 mock_trigger_name//14ef2c848447aac0Tep913hr4l0n0kgjgny97nmv96//02651294903567213 CREATE n:127.0.0.1:34966_solr s:shard1 c:testExecute) [n:127.0.0.1:34966_solr c:testExecute s:shard1 r:core_node6 x:testExecute_shard1_replica_n5] o.a.s.c.RecoveryStrategy Begin buffering updates. core=[testExecute_shard1_replica_n5]
   [junit4]   2> 3694371 INFO  (recoveryExecutor-4827-thread-1-processing-x:testExecute_shard1_replica_n5 r:core_node6 mock_trigger_name//14ef2c848447aac0Tep913hr4l0n0kgjgny97nmv96//02651294903567213 CREATE n:127.0.0.1:34966_solr s:shard1 c:testExecute) [n:127.0.0.1:34966_solr c:testExecute s:shard1 r:core_node6 x:testExecute_shard1_replica_n5] o.a.s.u.UpdateLog Starting to buffer updates. FSUpdateLog{state=ACTIVE, tlog=null}
   [junit4]   2> 3694371 INFO  (recoveryExecutor-4827-thread-1-processing-x:testExecute_shard1_replica_n5 r:core_node6 mock_trigger_name//14ef2c848447aac0Tep913hr4l0n0kgjgny97nmv96//02651294903567213 CREATE n:127.0.0.1:34966_solr s:shard1 c:testExecute) [n:127.0.0.1:34966_solr c:testExecute s:shard1 r:core_node6 x:testExecute_shard1_replica_n5] o.a.s.c.RecoveryStrategy Publishing state of core [testExecute_shard1_replica_n5] as recovering, leader is [http://127.0.0.1:34966/solr/testExecute_shard1_replica_n1/] and I am [http://127.0.0.1:34966/solr/testExecute_shard1_replica_n5/]
   [junit4]   2> 3694373 INFO  (recoveryExecutor-4827-thread-1-processing-x:testExecute_shard1_replica_n5 r:core_node6 mock_trigger_name//14ef2c848447aac0Tep913hr4l0n0kgjgny97nmv96//02651294903567213 CREATE n:127.0.0.1:34966_solr s:shard1 c:testExecute) [n:127.0.0.1:34966_solr c:testExecute s:shard1 r:core_node6 x:testExecute_shard1_replica_n5] o.a.s.c.RecoveryStrategy Sending prep recovery command to [http://127.0.0.1:34966/solr]; [WaitForState: action=PREPRECOVERY&core=testExecute_shard1_replica_n1&nodeName=127.0.0.1:34966_solr&coreNodeName=core_node6&state=recovering&checkLive=true&onlyIfLeader=true&onlyIfLeaderActive=true]
   [junit4]   2> 3694374 INFO  (qtp1567667180-28601) [n:127.0.0.1:34966_solr    ] o.a.s.h.a.PrepRecoveryOp Going to wait for coreNodeName: core_node6, state: recovering, checkLive: true, onlyIfLeader: true, onlyIfLeaderActive: true, maxTime: 183 s
   [junit4]   2> 3694375 INFO  (qtp1567667180-28601) [n:127.0.0.1:34966_solr    ] o.a.s.h.a.PrepRecoveryOp In WaitForState(recovering): collection=testExecute, shard=shard1, thisCore=testExecute_shard1_replica_n1, leaderDoesNotNeedRecovery=false, isLeader? true, live=true, checkLive=true, currentState=down, localState=active, nodeName=127.0.0.1:34966_solr, coreNodeName=core_node6, onlyIfActiveCheckResult=false, nodeProps: core_node6:{"core":"testExecute_shard1_replica_n5","base_url":"http://127.0.0.1:34966/solr","state":"down","node_name":"127.0.0.1:34966_solr","type":"NRT"}
   [junit4]   2> 3694476 INFO  (zkCallback-4829-thread-1-processing-n:127.0.0.1:34966_solr) [n:127.0.0.1:34966_solr    ] o.a.s.c.c.ZkStateReader A cluster state change: [WatchedEvent state:SyncConnected type:NodeDataChanged path:/collections/testExecute/state.json] for collection [testExecute] has occurred - updating... (live nodes size: [2])
   [junit4]   2> 3694476 INFO  (zkCallback-4825-thread-2-processing-n:127.0.0.1:57209_solr) [n:127.0.0.1:57209_solr    ] o.a.s.c.c.ZkStateReader A cluster state change: [WatchedEvent state:SyncConnected type:NodeDataChanged path:/collections/testExecute/state.json] for collection [testExecute] has occurred - updating... (live nodes size: [2])
   [junit4]   2> 3694476 INFO  (zkCallback-4825-thread-1-processing-n:127.0.0.1:57209_solr) [n:127.0.0.1:57209_solr    ] o.a.s.c.c.ZkStateReader A cluster state change: [WatchedEvent state:SyncConnected type:NodeDataChanged path:/collections/testExecute/state.json] for collection [testExecute] has occurred - updating... (live nodes size: [2])
   [junit4]   2> 3694476 INFO  (zkCallback-4829-thread-2-processing-n:127.0.0.1:34966_solr) [n:127.0.0.1:34966_solr    ] o.a.s.c.c.ZkStateReader A cluster state change: [WatchedEvent state:SyncConnected type:NodeDataChanged path:/collections/testExecute/state.json] for collection [testExecute] has occurred - updating... (live nodes size: [2])
   [junit4]   2> 3695272 INFO  (qtp1567667180-28604) [n:127.0.0.1:34966_solr    ] o.a.s.h.a.CoreAdminOperation Checking request status for : mock_trigger_name/14ef2c848447aac0Tep913hr4l0n0kgjgny97nmv96/02651294903567213
   [junit4]   2> 3695273 INFO  (qtp1567667180-28604) [n:127.0.0.1:34966_solr    ] o.a.s.s.HttpSolrCall [admin] webapp=null path=/admin/cores params={qt=/admin/cores&requestid=mock_trigger_name/14ef2c848447aac0Tep913hr4l0n0kgjgny97nmv96/02651294903567213&action=REQUESTSTATUS&wt=javabin&version=2} status=0 QTime=0
   [junit4]   2> 3695275 INFO  (qtp1240843966-28595) [n:127.0.0.1:57209_solr    ] o.a.s.s.HttpSolrCall [admin] webapp=null path=/admin/cores params={deleteInstanceDir=true&core=testExecute_shard1_replica_n2&async=mock_trigger_name/14ef2c848447aac0Tep913hr4l0n0kgjgny97nmv96/02651295909882485&qt=/admin/cores&deleteDataDir=true&action=UNLOAD&wt=javabin&version=2&deleteIndex=true} status=0 QTime=0
   [junit4]   2> 3695276 INFO  (parallelCoreAdminExecutor-8716-thread-1-processing-n:127.0.0.1:57209_solr mock_trigger_name//14ef2c848447aac0Tep913hr4l0n0kgjgny97nmv96//02651295909882485 UNLOAD) [n:127.0.0.1:57209_solr    ] o.a.s.m.SolrMetricManager Closing metric reporters for registry=solr.core.testExecute.shard1.replica_n2, tag=null
   [junit4]   2> 3695276 INFO  (parallelCoreAdminExecutor-8716-thread-1-processing-n:127.0.0.1:57209_solr mock_trigger_name//14ef2c848447aac0Tep913hr4l0n0kgjgny97nmv96//02651295909882485 UNLOAD) [n:127.0.0.1:57209_solr    ] o.a.s.m.r.SolrJmxReporter Closing reporter [org.apache.solr.metrics.reporters.SolrJmxReporter@e96c7c7: rootName = solr_57209, domain = solr.core.testExecute.shard1.replica_n2, service url = null, agent id = null] for registry solr.core.testExecute.shard1.replica_n2 / com.codahale.metrics.MetricRegistry@2b7391d
   [junit4]   2> 3695276 INFO  (qtp1240843966-28597) [n:127.0.0.1:57209_solr    ] o.a.s.h.a.CoreAdminOperation Checking request status for : mock_trigger_name/14ef2c848447aac0Tep913hr4l0n0kgjgny97nmv96/02651295909882485
   [junit4]   2> 3695277 INFO  (qtp1240843966-28597) [n:127.0.0.1:57209_solr    ] o.a.s.s.HttpSolrCall [admin] webapp=null path=/admin/cores params={qt=/admin/cores&requestid=mock_trigger_name/14ef2c848447aac0Tep913hr4l0n0kgjgny97nmv96/02651295909882485&action=REQUESTSTATUS&wt=javabin&version=2} status=0 QTime=1
   [junit4]   2> 3695287 INFO  (parallelCoreAdminExecutor-8716-thread-1-processing-n:127.0.0.1:57209_solr mock_trigger_name//14ef2c848447aac0Tep913hr4l0n0kgjgny97nmv96//02651295909882485 UNLOAD) [n:127.0.0.1:57209_solr    ] o.a.s.c.SolrCore [testExecute_shard1_replica_n2]  CLOSING SolrCore org.apache.solr.core.SolrCore@3224cbac
   [junit4]   2> 3695287 INFO  (parallelCoreAdminExecutor-8716-thread-1-processing-n:127.0.0.1:57209_solr mock_trigger_name//14ef2c848447aac0Tep913hr4l0n0kgjgny97nmv96//02651295909882485 UNLOAD) [n:127.0.0.1:57209_solr    ] o.a.s.m.SolrMetricManager Closing metric reporters for registry=solr.core.testExecute.shard1.replica_n2, tag=841272236
   [junit4]   2> 3695287 INFO  (parallelCoreAdminExecutor-8716-thread-1-processing-n:127.0.0.1:57209_solr mock_trigger_name//14ef2c848447aac0Tep913hr4l0n0kgjgny97nmv96//02651295909882485 UNLOAD) [n:127.0.0.1:57209_solr    ] o.a.s.m.SolrMetricManager Closing metric reporters for registry=solr.collection.testExecute.shard1.leader, tag=841272236
   [junit4]   2> 3695290 INFO  (parallelCoreAdminExecutor-8716-thread-1-processing-n:127.0.0.1:57209_solr mock_trigger_name//14ef2c848447aac0Tep913hr4l0n0kgjgny97nmv96//02651295909882485 UNLOAD) [n:127.0.0.1:57209_solr    ] o.a.s.c.ShardLeaderElectionContextBase No version found for ephemeral leader parent node, won't remove previous leader registration.
   [junit4]   2> 3695376 INFO  (qtp1567667180-28601) [n:127.0.0.1:34966_solr    ] o.a.s.h.a.PrepRecoveryOp In WaitForState(recovering): collection=testExecute, shard=shard1, thisCore=testExecute_shard1_replica_n1, leaderDoesNotNeedRecovery=false, isLeader? true, live=true, checkLive=true, currentState=recovering, localState=active, nodeName=127.0.0.1:34966_solr, coreNodeName=core_node6, onlyIfActiveCheckResult=false, nodeProps: core_node6:{"core":"testExecute_shard1_replica_n5","base_url":"http://127.0.0.1:34966/solr","node_name":"127.0.0.1:34966_solr","state":"recovering","type":"NRT"}
   [junit4]   2> 3695376 INFO  (qtp1567667180-28601) [n:127.0.0.1:34966_solr    ] o.a.s.h.a.PrepRecoveryOp Waited coreNodeName: core_node6, state: recovering, checkLive: true, onlyIfLeader: true for: 1 seconds.
   [junit4]   2> 3695376 INFO  (qtp1567667180-28601) [n:127.0.0.1:34966_solr    ] o.a.s.s.HttpSolrCall [admin] webapp=null path=/admin/cores params={nodeName=127.0.0.1:34966_solr&onlyIfLeaderActive=true&core=testExecute_shard1_replica_n1&coreNodeName=core_node6&action=PREPRECOVERY&checkLive=true&state=recovering&onlyIfLeader=true&wt=javabin&version=2} status=0 QTime=1001
   [junit4]   2> 3695393 INFO  (zkCallback-4829-thread-1-processing-n:127.0.0.1:34966_solr) [n:127.0.0.1:34966_solr    ] o.a.s.c.c.ZkStateReader A cluster state change: [WatchedEvent state:SyncConnected type:NodeDataChanged path:/collections/testExecute/state.json] for collection [testExecute] has occurred - updating... (live nodes size: [2])
   [junit4]   2> 3695393 INFO  (zkCallback-4829-thread-2-processing-n:127.0.0.1:34966_solr) [n:127.0.0.1:34966_solr    ] o.a.s.c.c.ZkStateReader A cluster state change: [WatchedEvent state:SyncConnected type:NodeDataChanged path:/collections/testExecute/state.json] for collection [testExecute] has occurred - updating... (live nodes size: [2])
   [junit4]   2> 3695877 INFO  (recoveryExecutor-4827-thread-1-processing-x:testExecute_shard1_replica_n5 r:core_node6 mock_trigger_name//14ef2c848447aac0Tep913hr4l0n0kgjgny97nmv96//02651294903567213 CREATE n:127.0.0.1:34966_solr s:shard1 c:testExecute) [n:127.0.0.1:34966_solr c:testExecute s:shard1 r:core_node6 x:testExecute_shard1_replica_n5] o.a.s.c.RecoveryStrategy Attempting to PeerSync from [http://127.0.0.1:34966/solr/testExecute_shard1_replica_n1/] - recoveringAfterStartup=[true]
   [junit4]   2> 3695877 INFO  (recoveryExecutor-4827-thread-1-processing-x:testExecute_shard1_replica_n5 r:core_node6 mock_trigger_name//14ef2c848447aac0Tep913hr4l0n0kgjgny97nmv96//02651294903567213 CREATE n:127.0.0.1:34966_solr s:shard1 c:testExecute) [n:127.0.0.1:34966_solr c:testExecute s:shard1 r:core_node6 x:testExecute_shard1_replica_n5] o.a.s.u.PeerSync PeerSync: core=testExecute_shard1_replica_n5 url=http://127.0.0.1:34966/solr START replicas=[http://127.0.0.1:34966/solr/testExecute_shard1_replica_n1/] nUpdates=100
   [junit4]   2> 3695879 INFO  (qtp1567667180-28602) [n:127.0.0.1:34966_solr c:testExecute s:shard1 r:core_node3 x:testExecute_shard1_replica_n1] o.a.s.u.IndexFingerprint IndexFingerprint millis:0.0 result:{maxVersionSpecified=9223372036854775807, maxVersionEncountered=0, maxInHash=0, versionsHash=0, numVersions=0, numDocs=0, maxDoc=0}
   [junit4]   2> 3695879 INFO  (qtp1567667180-28602) [n:127.0.0.1:34966_solr c:testExecute s:shard1 r:core_node3 x:testExecute_shard1_replica_n1] o.a.s.c.S.Request [testExecute_shard1_replica_n1]  webapp=/solr path=/get params={distrib=false&qt=/get&getFingerprint=9223372036854775807&wt=javabin&version=2} status=0 QTime=0
   [junit4]   2> 3695880 INFO  (recoveryExecutor-4827-thread-1-processing-x:testExecute_shard1_replica_n5 r:core_node6 mock_trigger_name//14ef2c848447aac0Tep913hr4l0n0kgjgny97nmv96//02651294903567213 CREATE n:127.0.0.1:34966_solr s:shard1 c:testExecute) [n:127.0.0.1:34966_solr c:testExecute s:shard1 r:core_node6 x:testExecute_shard1_replica_n5] o.a.s.u.IndexFingerprint IndexFingerprint millis:0.0 result:{maxVersionSpecified=9223372036854775807, maxVersionEncountered=0, maxInHash=0, versionsHash=0, numVersions=0, numDocs=0, maxDoc=0}
   [junit4]   2> 3695880 INFO  (recoveryExecutor-4827-thread-1-processing-x:testExecute_shard1_replica_n5 r:core_node6 mock_trigger_name//14ef2c848447aac0Tep913hr4l0n0kgjgny97nmv96//02651294903567213 CREATE n:127.0.0.1:34966_solr s:shard1 c:testExecute) [n:127.0.0.1:34966_solr c:testExecute s:shard1 r:core_node6 x:testExecute_shard1_replica_n5] o.a.s.u.PeerSync We are already in sync. No need to do a PeerSync 
   [junit4]   2> 3695880 INFO  (recoveryExecutor-4827-thread-1-processing-x:testExecute_shard1_replica_n5 r:core_node6 mock_trigger_name//14ef2c848447aac0Tep913hr4l0n0kgjgny97nmv96//02651294903567213 CREATE n:127.0.0.1:34966_solr s:shard1 c:testExecute) [n:127.0.0.1:34966_solr c:testExecute s:shard1 r:core_node6 x:testExecute_shard1_replica_n5] o.a.s.u.DirectUpdateHandler2 start commit{,optimize=false,openSearcher=true,waitSearcher=true,expungeDeletes=false,softCommit=false,prepareCommit=false}
   [junit4]   2> 3695880 INFO  (recoveryExecutor-4827-thread-1-processing-x:testExecute_shard1_replica_n5 r:core_node6 mock_trigger_name//14ef2c848447aac0Tep913hr4l0n0kgjgny97nmv96//02651294903567213 CREATE n:127.0.0.1:34966_solr s:shard1 c:testExecute) [n:127.0.0.1:34966_solr c:testExecute s:shard1 r:core_node6 x:testExecute_shard1_replica_n5] o.a.s.u.DirectUpdateHandler2 No uncommitted changes. Skipping IW.commit.
   [junit4]   2> 3695881 INFO  (recoveryExecutor-4827-thread-1-processing-x:testExecute_shard1_replica_n5 r:core_node6 mock_trigger_name//14ef2c848447aac0Tep913hr4l0n0kgjgny97nmv96//02651294903567213 CREATE n:127.0.0.1:34966_solr s:shard1 c:testExecute) [n:127.0.0.1:34966_solr c:testExecute s:shard1 r:core_node6 x:testExecute_shard1_replica_n5] o.a.s.u.DirectUpdateHandler2 end_commit_flush
   [junit4]   2> 3695881 INFO  (recoveryExecutor-4827-thread-1-processing-x:testExecute_shard1_replica_n5 r:core_node6 mock_trigger_name//14ef2c848447aac0Tep913hr4l0n0kgjgny97nmv96//02651294903567213 CREATE n:127.0.0.1:34966_solr s:shard1 c:testExecute) [n:127.0.0.1:34966_solr c:testExecute s:shard1 r:core_node6 x:testExecute_shard1_replica_n5] o.a.s.c.RecoveryStrategy PeerSync stage of recovery was successful.
   [junit4]   2> 3695881 INFO  (recoveryExecutor-4827-thread-1-processing-x:testExecute_shard1_replica_n5 r:core_node6 mock_trigger_name//14ef2c848447aac0Tep913hr4l0n0kgjgny97nmv96//02651294903567213 CREATE n:127.0.0.1:34966_solr s:shard1 c:testExecute) [n:127.0.0.1:34966_solr c:testExecute s:shard1 r:core_node6 x:testExecute_shard1_replica_n5] o.a.s.c.RecoveryStrategy Replaying updates buffered during PeerSync.
   [junit4]   2> 3695881 INFO  (recoveryExecutor-4827-thread-1-processing-x:testExecute_shard1_replica_n5 r:core_node6 mock_trigger_name//14ef2c848447aac0Tep913hr4l0n0kgjgny97nmv96//02651294903567213 CREATE n:127.0.0.1:34966_solr s:shard1 c:testExecute) [n:127.0.0.1:34966_solr c:testExecute s:shard1 r:core_node6 x:testExecute_shard1_replica_n5] o.a.s.c.RecoveryStrategy No replay needed.
   [junit4]   2> 3695881 INFO  (recoveryExecutor-4827-thread-1-processing-x:testExecute_shard1_replica_n5 r:core_node6 mock_trigger_name//14ef2c848447aac0Tep913hr4l0n0kgjgny97nmv96//02651294903567213 CREATE n:127.0.0.1:34966_solr s:shard1 c:testExecute) [n:127.0.0.1:34966_solr c:testExecute s:shard1 r:core_node6 x:testExecute_shard1_replica_n5] o.a.s.c.RecoveryStrategy Registering as Active after recovery.
   [junit4]   2> 3695987 INFO  (zkCallback-4829-thread-1-processing-n:127.0.0.1:34966_solr) [n:127.0.0.1:34966_solr    ] o.a.s.c.c.ZkStateReader A cluster state change: [WatchedEvent state:SyncConnected type:NodeDataChanged path:/collections/testExecute/state.json] for collection [testExecute] has occurred - updating... (live nodes size: [2])
   [junit4]   2> 3695987 INFO  (zkCallback-4829-thread-2-processing-n:127.0.0.1:34966_solr) [n:127.0.0.1:34966_solr    ] o.a.s.c.c.ZkStateReader A cluster state change: [WatchedEvent state:SyncConnected type:NodeDataChanged path:/collections/testExecute/state.json] for collection [testExecute] has occurred - updating... (live nodes size: [2])
   [junit4]   2> 3696278 INFO  (qtp1240843966-28596) [n:127.0.0.1:57209_solr    ] o.a.s.h.a.CoreAdminOperation Checking request status for : mock_trigger_name/14ef2c848447aac0Tep913hr4l0n0kgjgny97nmv96/02651295909882485
   [junit4]   2> 3696278 INFO  (qtp1240843966-28596) [n:127.0.0.1:57209_solr    ] o.a.s.s.HttpSolrCall [admin] webapp=null path=/admin/cores params={qt=/admin/cores&requestid=mock_trigger_name/14ef2c848447aac0Tep913hr4l0n0kgjgny97nmv96/02651295909882485&action=REQUESTSTATUS&wt=javabin&version=2} status=0 QTime=0
   [junit4]   2> 3696383 INFO  (OverseerThreadFactory-8715-thread-2-processing-n:127.0.0.1:34966_solr) [n:127.0.0.1:34966_solr    ] o.a.s.c.OverseerTaskQueue Response ZK path: /overseer/collection-queue-work/qnr-0000000002 doesn't exist.  Requestor may have disconnected from ZooKeeper
   [junit4]   2> 3698068 INFO  (OverseerCollectionConfigSetProcessor-98859309063929862-127.0.0.1:34966_solr-n_0000000000) [n:127.0.0.1:34966_solr    ] o.a.s.c.OverseerTaskQueue Response ZK path: /overseer/collection-queue-work/qnr-0000000002 doesn't exist.  Requestor may have disconnected from ZooKeeper
   [junit4]   2> 3699061 INFO  (qtp1567667180-28603) [n:127.0.0.1:34966_solr    ] o.a.s.h.a.CollectionsHandler Invoked Collection Action :requeststatus with params requestid=mock_trigger_name/14ef2c848447aac0Tep913hr4l0n0kgjgny97nmv96/0&action=REQUESTSTATUS&wt=javabin&version=2 and sendToOCPQueue=true
   [junit4]   2> 3699064 INFO  (qtp1567667180-28603) [n:127.0.0.1:34966_solr    ] o.a.s.s.HttpSolrCall [admin] webapp=null path=/admin/collections params={requestid=mock_trigger_name/14ef2c848447aac0Tep913hr4l0n0kgjgny97nmv96/0&action=REQUESTSTATUS&wt=javabin&version=2} status=0 QTime=2
   [junit4]   2> 3699065 INFO  (TEST-ExecutePlanActionTest.testExecute-seed#[E749D7ECA26842A7]) [    ] o.a.s.c.a.ExecutePlanAction Task with requestId=mock_trigger_name/14ef2c848447aac0Tep913hr4l0n0kgjgny97nmv96/0 finished with state=COMPLETED in 5s
   [junit4]   2> 3699065 INFO  (qtp1567667180-28604) [n:127.0.0.1:34966_solr    ] o.a.s.h.a.CollectionsHandler Invoked Collection Action :deletestatus with params requestid=mock_trigger_name/14ef2c848447aac0Tep913hr4l0n0kgjgny97nmv96/0&action=DELETESTATUS&wt=javabin&version=2 and sendToOCPQueue=true
   [junit4]   2> 3699066 INFO  (qtp1567667180-28604) [n:127.0.0.1:34966_solr    ] o.a.s.s.HttpSolrCall [admin] webapp=null path=/admin/collections params={requestid=mock_trigger_name/14ef2c848447aac0Tep913hr4l0n0kgjgny97nmv96/0&action=DELETESTATUS&wt=javabin&version=2} status=0 QTime=1
   [junit4]   2> 3699068 INFO  (TEST-ExecutePlanActionTest.testExecute-seed#[E749D7ECA26842A7]) [    ] o.a.s.c.a.ExecutePlanAction Executing operation: action=OVERSEERSTATUS
   [junit4]   2> 3699072 DEBUG (TEST-ExecutePlanActionTest.testExecute-seed#[E749D7ECA26842A7]) [    ] o.a.s.c.a.ExecutePlanAction Saved requestId: mock_trigger_name/14ef2c848447aac0Tep913hr4l0n0kgjgny97nmv96/0 in znode: /autoscaling/triggerState/mock_trigger_name/execute_plan/op-0000000001
   [junit4]   2> 3699074 INFO  (qtp1567667180-28601) [n:127.0.0.1:34966_solr    ] o.a.s.h.a.CollectionsHandler Invoked Collection Action :overseerstatus with params async=mock_trigger_name/14ef2c848447aac0Tep913hr4l0n0kgjgny97nmv96/0&action=OVERSEERSTATUS&wt=javabin&version=2 and sendToOCPQueue=true
   [junit4]   2> 3699078 INFO  (qtp1567667180-28601) [n:127.0.0.1:34966_solr    ] o.a.s.s.HttpSolrCall [admin] webapp=null path=/admin/collections params={async=mock_trigger_name/14ef2c848447aac0Tep913hr4l0n0kgjgny97nmv96/0&action=OVERSEERSTATUS&wt=javabin&version=2} status=0 QTime=4
   [junit4]   2> 3699079 INFO  (qtp1567667180-28600) [n:127.0.0.1:34966_solr    ] o.a.s.h.a.CollectionsHandler Invoked Collection Action :requeststatus with params requestid=mock_trigger_name/14ef2c848447aac0Tep913hr4l0n0kgjgny97nmv96/0&action=REQUESTSTATUS&wt=javabin&version=2 and sendToOCPQueue=true
   [junit4]   2> 3699082 INFO  (qtp1567667180-28600) [n:127.0.0.1:34966_solr    ] o.a.s.s.HttpSolrCall [admin] webapp=null path=/admin/collections params={requestid=mock_trigger_name/14ef2c848447aac0Tep913hr4l0n0kgjgny97nmv96/0&action=REQUESTSTATUS&wt=javabin&version=2} status=0 QTime=3
   [junit4]   2> 3699095 INFO  (OverseerThreadFactory-8715-thread-3-processing-n:127.0.0.1:34966_solr) [n:127.0.0.1:34966_solr    ] o.a.s.c.OverseerTaskQueue Response ZK path: /overseer/collection-queue-work/qnr-0000000003 doesn't exist.  Requestor may have disconnected from ZooKeeper
   [junit4]   2> 3701088 INFO  (OverseerCollectionConfigSetProcessor-98859309063929862-127.0.0.1:34966_solr-n_0000000000) [n:127.0.0.1:34966_solr    ] o.a.s.c.OverseerTaskQueue Response ZK path: /overseer/collection-queue-work/qnr-0000000003 doesn't exist.  Requestor may have disconnected from ZooKeeper
   [junit4]   2> 3704084 INFO  (qtp1567667180-28599) [n:127.0.0.1:34966_solr    ] o.a.s.h.a.CollectionsHandler Invoked Collection Action :requeststatus with params requestid=mock_trigger_name/14ef2c848447aac0Tep913hr4l0n0kgjgny97nmv96/0&action=REQUESTSTATUS&wt=javabin&version=2 and sendToOCPQueue=true
   [junit4]   2> 3704085 INFO  (qtp1567667180-28599) [n:127.0.0.1:34966_solr    ] o.a.s.s.HttpSolrCall [admin] webapp=null path=/admin/collections params={requestid=mock_trigger_name/14ef2c848447aac0Tep913hr4l0n0kgjgny97nmv96/0&action=REQUESTSTATUS&wt=javabin&version=2} status=0 QTime=1
   [junit4]   2> 3704085 INFO  (TEST-ExecutePlanActionTest.testExecute-seed#[E749D7ECA26842A7]) [    ] o.a.s.c.a.ExecutePlanAction Task with requestId=mock_trigger_name/14ef2c848447aac0Tep913hr4l0n0kgjgny97nmv96/0 finished with state=COMPLETED in 5s
   [junit4]   2> 3704086 INFO  (qtp1567667180-28605) [n:127.0.0.1:34966_solr    ] o.a.s.h.a.CollectionsHandler Invoked Collection Action :deletestatus with params requestid=mock_trigger_name/14ef2c848447aac0Tep913hr4l0n0kgjgny97nmv96/0&action=DELETESTATUS&wt=javabin&version=2 and sendToOCPQueue=true
   [junit4]   2> 3704086 INFO  (qtp1567667180-28605) [n:127.0.0.1:34966_solr    ] o.a.s.s.HttpSolrCall [admin] webapp=null path=/admin/collections params={requestid=mock_trigger_name/14ef2c848447aac0Tep913hr4l0n0kgjgny97nmv96/0&action=DELETESTATUS&wt=javabin&version=2} status=0 QTime=0
   [junit4]   2> 3704088 INFO  (TEST-ExecutePlanActionTest.testExecute-seed#[E749D7ECA26842A7]) [    ] o.a.s.SolrTestCaseJ4 ###Ending testExecute
   [junit4]   2> 3704107 INFO  (TEST-ExecutePlanActionTest.testIntegration-seed#[E749D7ECA26842A7]) [    ] o.a.s.SolrTestCaseJ4 ###Starting testIntegration
   [junit4]   2> 3704108 DEBUG (zkCallback-4829-thread-1-processing-n:127.0.0.1:34966_solr) [n:127.0.0.1:34966_solr    ] o.a.s.c.a.OverseerTriggerThread Refreshing /autoscaling.json with znode version 3
   [junit4]   2> 3704109 DEBUG (OverseerAutoScalingTriggerThread-98859309063929862-127.0.0.1:34966_solr-n_0000000000) [n:127.0.0.1:34966_solr    ] o.a.s.c.a.OverseerTriggerThread Processed trigger updates upto znodeVersion 3
   [junit4]   2> 3704109 DEBUG (OverseerAutoScalingTriggerThread-98859309063929862-127.0.0.1:34966_solr-n_0000000000) [n:127.0.0.1:34966_solr    ] o.a.s.c.a.OverseerTriggerThread -- clean old nodeLost markers
   [junit4]   2> 3704109 DEBUG (OverseerAutoScalingTriggerThread-98859309063929862-127.0.0.1:34966_solr-n_0000000000) [n:127.0.0.1:34966_solr    ] o.a.s.c.a.OverseerTriggerThread -- clean old nodeAdded markers
   [junit4]   2> 3704110 DEBUG (OverseerAutoScalingTriggerThread-98859309063929862-127.0.0.1:34966_solr-n_0000000000) [n:127.0.0.1:34966_solr    ] o.a.s.c.a.OverseerTriggerThread Current znodeVersion 3, lastZnodeVersion 3
   [junit4]   2> 3704116 INFO  (qtp1567667180-28602) [n:127.0.0.1:34966_solr    ] o.a.s.c.c.ZkStateReader Updated live nodes from ZooKeeper... (0) -> (2)
   [junit4]   2> 3704118 INFO  (qtp1567667180-28602) [n:127.0.0.1:34966_solr    ] o.a.s.c.s.i.ZkClientClusterStateProvider Cluster at 127.0.0.1:49146/solr ready
   [junit4]   2> 3704121 INFO  (qtp1567667180-28603) [n:127.0.0.1:34966_solr    ] o.a.s.s.HttpSolrCall [admin] webapp=null path=/admin/metrics params={prefix=CORE.coreName&wt=javabin&version=2&group=solr.core} status=0 QTime=0
   [junit4]   2> 3704124 INFO  (qtp1240843966-28590) [n:127.0.0.1:57209_solr    ] o.a.s.s.HttpSolrCall [admin] webapp=null path=/admin/metrics params={prefix=CORE.coreName&wt=javabin&version=2&group=solr.core} status=0 QTime=0
   [junit4]   2> 3704124 DEBUG (qtp1567667180-28602) [n:127.0.0.1:34966_solr    ] o.a.s.c.a.AutoScalingHandler Verified autoscaling configuration
   [junit4]   2> 3704125 INFO  (qtp1567667180-28602) [n:127.0.0.1:34966_solr    ] o.a.s.s.HttpSolrCall [admin] webapp=null path=/cluster/autoscaling params={wt=javabin&version=2} status=0 QTime=12
   [junit4]   2> 3704126 INFO  (qtp1567667180-28604) [n:127.0.0.1:34966_solr    ] o.a.s.h.a.CollectionsHandler Invoked Collection Action :create with params replicationFactor=2&collection.configName=conf&maxShardsPerNode=1&name=testIntegration&nrtReplicas=2&action=CREATE&numShards=1&wt=javabin&version=2 and sendToOCPQueue=true
   [junit4]   2> 3704126 DEBUG (zkCallback-4829-thread-1-processing-n:127.0.0.1:34966_solr) [n:127.0.0.1:34966_solr    ] o.a.s.c.a.OverseerTriggerThread Refreshing /autoscaling.json with znode version 4
   [junit4]   2> 3704127 DEBUG (zkCallback-4829-thread-1-processing-n:127.0.0.1:34966_solr) [n:127.0.0.1:34966_solr    ] o.a.s.c.a.NodeLostTrigger Initial livenodes: [127.0.0.1:34966_solr, 127.0.0.1:57209_solr]
   [junit4]   2> 3704127 DEBUG (OverseerAutoScalingTriggerThread-98859309063929862-127.0.0.1:34966_solr-n_0000000000) [n:127.0.0.1:34966_solr    ] o.a.s.c.a.OverseerTriggerThread Processed trigger updates upto znodeVersion 4
   [junit4]   2> 3704129 INFO  (OverseerThreadFactory-8715-thread-4-processing-n:127.0.0.1:34966_solr) [n:127.0.0.1:34966_solr    ] o.a.s.c.CreateCollectionCmd Create collection testIntegration
   [junit4]   2> 3704130 DEBUG (OverseerAutoScalingTriggerThread-98859309063929862-127.0.0.1:34966_solr-n_0000000000) [n:127.0.0.1:34966_solr    ] o.a.s.c.a.OverseerTriggerThread -- clean old nodeAdded markers
   [junit4]   2> 3704131 DEBUG (OverseerAutoScalingTriggerThread-98859309063929862-127.0.0.1:34966_solr-n_0000000000) [n:127.0.0.1:34966_solr    ] o.a.s.c.a.OverseerTriggerThread Current znodeVersion 4, lastZnodeVersion 4
   [junit4]   2> 3704132 DEBUG (ScheduledTrigger-8713-thread-2) [n:127.0.0.1:34966_solr    ] o.a.s.c.a.NodeLostTrigger Running NodeLostTrigger: node_lost_trigger with currently live nodes: [127.0.0.1:34966_solr, 127.0.0.1:57209_solr]
   [junit4]   2> 3704243 INFO  (OverseerStateUpdate-98859309063929862-127.0.0.1:34966_solr-n_0000000000) [n:127.0.0.1:34966_solr    ] o.a.s.c.o.SliceMutator createReplica() {
   [junit4]   2>   "operation":"ADDREPLICA",
   [junit4]   2>   "collection":"testIntegration",
   [junit4]   2>   "shard":"shard1",
   [junit4]   2>   "core":"testIntegration_shard1_replica_n1",
   [junit4]   2>   "state":"down",
   [junit4]   2>   "base_url":"http://127.0.0.1:57209/solr",
   [junit4]   2>   "type":"NRT",
   [junit4]   2>   "waitForFinalState":"false"} 
   [junit4]   2> 3704245 INFO  (OverseerStateUpdate-98859309063929862-127.0.0.1:34966_solr-n_0000000000) [n:127.0.0.1:34966_solr    ] o.a.s.c.o.SliceMutator createReplica() {
   [junit4]   2>   "operation":"ADDREPLICA",
   [junit4]   2>   "collection":"testIntegration",
   [junit4]   2>   "shard":"shard1",
   [junit4]   2>   "core":"testIntegration_shard1_replica_n2",
   [junit4]   2>   "state":"down",
   [junit4]   2>   "base_url":"http://127.0.0.1:34966/solr",
   [junit4]   2>   "type":"NRT",
   [junit4]   2>   "waitForFinalState":"false"} 
   [junit4]   2> 3704447 INFO  (qtp1567667180-28601) [n:127.0.0.1:34966_solr    ] o.a.s.h.a.CoreAdminOperation core create command qt=/admin/cores&coreNodeName=core_node4&collection.configName=conf&newCollection=true&name=testIntegration_shard1_replica_n2&action=CREATE&numShards=1&collection=testIntegration&shard=shard1&wt=javabin&version=2&replicaType=NRT
   [junit4]   2> 3704447 INFO  (qtp1240843966-28592) [n:127.0.0.1:57209_solr    ] o.a.s.h.a.CoreAdminOperation core create command qt=/admin/cores&coreNodeName=core_node3&collection.configName=conf&newCollection=true&name=testIntegration_shard1_replica_n1&action=CREATE&numShards=1&collection=testIntegration&shard=shard1&wt=javabin&version=2&replicaType=NRT
   [junit4]   2> 3704552 INFO  (zkCallback-4829-thread-2-processing-n:127.0.0.1:34966_solr) [n:127.0.0.1:34966_solr    ] o.a.s.c.c.ZkStateReader A cluster state change: [WatchedEvent state:SyncConnected type:NodeDataChanged path:/collections/testIntegration/state.json] for collection [testIntegration] has occurred - updating... (live nodes size: [2])
   [junit4]   2> 3704552 INFO  (zkCallback-4825-thread-2-processing-n:127.0.0.1:57209_solr) [n:127.0.0.1:57209_solr    ] o.a.s.c.c.ZkStateReader A cluster state change: [WatchedEvent state:SyncConnected type:NodeDataChanged path:/collections/testIntegration/state.json] for collection [testIntegration] has occurred - updating... (live nodes size: [2])
   [junit4]   2> 3704552 INFO  (zkCallback-4825-thread-1-processing-n:127.0.0.1:57209_solr) [n:127.0.0.1:57209_solr    ] o.a.s.c.c.ZkStateReader A cluster state change: [WatchedEvent state:SyncConnected type:NodeDataChanged path:/collections/testIntegration/state.json] for collection [testIntegration] has occurred - updating... (live nodes size: [2])
   [junit4]   2> 3704552 INFO  (zkCallback-4829-thread-1-processing-n:127.0.0.1:34966_solr) [n:127.0.0.1:34966_solr    ] o.a.s.c.c.ZkStateReader A cluster state change: [WatchedEvent state:SyncConnected type:NodeDataChanged path:/collections/testIntegration/state.json] for collection [testIntegration] has occurred - updating... (live nodes size: [2])
   [junit4]   2> 3705134 DEBUG (ScheduledTrigger-8713-thread-2) [n:127.0.0.1:34966_solr    ] o.a.s.c.a.NodeLostTrigger Running NodeLostTrigger: node_lost_trigger with currently live nodes: [127.0.0.1:34966_solr, 127.0.0.1:57209_solr]
   [junit4]   2> 3705462 INFO  (qtp1240843966-28592) [n:127.0.0.1:57209_solr c:testIntegration s:shard1 r:core_node3 x:testIntegration_shard1_replica_n1] o.a.s.c.SolrConfig Using Lucene MatchVersion: 8.0.0
   [junit4]   2> 3705465 INFO  (qtp1567667180-28601) [n:127.0.0.1:34966_solr c:testIntegration s:shard1 r:core_node4 x:testIntegration_shard1_replica_n2] o.a.s.c.SolrConfig Using Lucene MatchVersion: 8.0.0
   [junit4]   2> 3705470 INFO  (qtp1240843966-28592) [n:127.0.0.1:57209_solr c:testIntegration s:shard1 r:core_node3 x:testIntegration_shard1_replica_n1] o.a.s.s.IndexSchema [testIntegration_shard1_replica_n1] Schema name=minimal
   [junit4]   2> 3705472 INFO  (qtp1567667180-28601) [n:127.0.0.1:34966_solr c:testIntegration s:shard1 r:core_node4 x:testIntegration_shard1_replica_n2] o.a.s.s.IndexSchema [testIntegration_shard1_replica_n2] Schema name=minimal
   [junit4]   2> 3705473 INFO  (qtp1240843966-28592) [n:127.0.0.1:57209_solr c:testIntegration s:shard1 r:core_node3 x:testIntegration_shard1_replica_n1] o.a.s.s.IndexSchema Loaded schema minimal/1.1 with uniqueid field id
   [junit4]   2> 3705473 INFO  (qtp1240843966-28592) [n:127.0.0.1:57209_solr c:testIntegration s:shard1 r:core_node3 x:testIntegration_shard1_replica_n1] o.a.s.c.CoreContainer Creating SolrCore 'testIntegration_shard1_replica_n1' using configuration from collection testIntegration, trusted=true
   [junit4]   2> 3705473 INFO  (qtp1240843966-28592) [n:127.

[...truncated too long message...]

lr.client.solrj.impl.CloudSolrClient.sendRequest(CloudSolrClient.java:1086)
   [junit4]   2> 	at org.apache.solr.client.solrj.impl.CloudSolrClient.requestWithRetryOnStaleState(CloudSolrClient.java:867)
   [junit4]   2> 	at org.apache.solr.client.solrj.impl.CloudSolrClient.request(CloudSolrClient.java:800)
   [junit4]   2> 	at org.apache.solr.client.solrj.SolrRequest.process(SolrRequest.java:178)
   [junit4]   2> 	at org.apache.solr.client.solrj.SolrRequest.process(SolrRequest.java:195)
   [junit4]   2> 	at org.apache.solr.client.solrj.impl.SolrClientCloudManager.request(SolrClientCloudManager.java:99)
   [junit4]   2> 	... 9 more
   [junit4]   2> 4319946 WARN  (OverseerThreadFactory-8750-thread-1-processing-n:127.0.0.1:57209_solr) [n:127.0.0.1:57209_solr    ] o.a.s.c.MoveReplicaCmd Timed out waiting for leader's replica to recover, collection=testExecute shard=shard1 on node=127.0.0.1:57209_solr
   [junit4]   2> 4319960 INFO  (OverseerThreadFactory-8750-thread-1-processing-n:127.0.0.1:57209_solr) [n:127.0.0.1:57209_solr    ] o.a.s.c.OverseerTaskQueue Response ZK path: /overseer/collection-queue-work/qnr-0000000006 doesn't exist.  Requestor may have disconnected from ZooKeeper
   [junit4]   2> 4319963 WARN  (OverseerAutoScalingTriggerThread-98859309063929860-127.0.0.1:57209_solr-n_0000000001) [n:127.0.0.1:57209_solr    ] o.a.s.c.a.OverseerTriggerThread OverseerTriggerThread woken up but we are closed, exiting.
   [junit4]   2> 4319964 DEBUG (jetty-closer-4818-thread-1) [    ] o.a.s.c.a.OverseerTriggerThread OverseerTriggerThread has been closed explicitly
   [junit4]   2> 4319967 INFO  (jetty-closer-4818-thread-1) [    ] o.e.j.s.h.ContextHandler Stopped o.e.j.s.ServletContextHandler@213ccef4{/solr,null,UNAVAILABLE}
   [junit4]   2> 4319971 ERROR (SUITE-ExecutePlanActionTest-seed#[E749D7ECA26842A7]-worker) [    ] o.a.z.s.ZooKeeperServer ZKShutdownHandler is not registered, so ZooKeeper server won't take any action on ERROR or SHUTDOWN server state changes
   [junit4]   2> 4319972 INFO  (SUITE-ExecutePlanActionTest-seed#[E749D7ECA26842A7]-worker) [    ] o.a.s.c.ZkTestServer connecting to 127.0.0.1:49146 49146
   [junit4]   2> 4320028 INFO  (Thread-6410) [    ] o.a.s.c.ZkTestServer connecting to 127.0.0.1:49146 49146
   [junit4]   2> 4320031 WARN  (Thread-6410) [    ] o.a.s.c.ZkTestServer Watch limit violations: 
   [junit4]   2> Maximum concurrent create/delete watches above limit:
   [junit4]   2> 
   [junit4]   2> 	4	/solr/aliases.json
   [junit4]   2> 	4	/solr/clusterprops.json
   [junit4]   2> 	3	/solr/configs/conf
   [junit4]   2> 	2	/solr/security.json
   [junit4]   2> 
   [junit4]   2> Maximum concurrent data watches above limit:
   [junit4]   2> 
   [junit4]   2> 	20	/solr/collections/testExecute/state.json
   [junit4]   2> 	17	/solr/collections/testIntegration/state.json
   [junit4]   2> 	4	/solr/clusterstate.json
   [junit4]   2> 	2	/solr/autoscaling.json
   [junit4]   2> 	2	/solr/collections/testExecute/leader_elect/shard1/election/98859309063929862-core_node3-n_0000000000
   [junit4]   2> 
   [junit4]   2> Maximum concurrent children watches above limit:
   [junit4]   2> 
   [junit4]   2> 	4	/solr/live_nodes
   [junit4]   2> 	4	/solr/collections
   [junit4]   2> 	2	/solr/overseer/queue
   [junit4]   2> 	2	/solr/autoscaling/events/.auto_add_replicas
   [junit4]   2> 	2	/solr/autoscaling/events/node_lost_trigger
   [junit4]   2> 	2	/solr/overseer/collection-queue-work
   [junit4]   2> 	2	/solr/overseer/queue-work
   [junit4]   2> 
   [junit4]   2> NOTE: leaving temporary files on disk at: /export/home/jenkins/workspace/Lucene-Solr-master-Solaris/solr/build/solr-core/test/J0/temp/solr.cloud.autoscaling.ExecutePlanActionTest_E749D7ECA26842A7-001
   [junit4]   2> Oct 20, 2017 4:32:53 AM com.carrotsearch.randomizedtesting.ThreadLeakControl checkThreadLeaks
   [junit4]   2> WARNING: Will linger awaiting termination of 2 leaked thread(s).
   [junit4]   2> NOTE: test params are: codec=Asserting(Lucene70): {}, docValues:{}, maxPointsInLeafNode=1365, maxMBSortInHeap=7.496974137504797, sim=RandomSimilarity(queryNorm=false): {}, locale=et, timezone=Pacific/Pago_Pago
   [junit4]   2> NOTE: SunOS 5.11 amd64/Oracle Corporation 1.8.0_141 (64-bit)/cpus=3,threads=1,free=44554856,total=522190848
   [junit4]   2> NOTE: All tests run in this JVM: [TestBulkSchemaConcurrent, TestIntervalFaceting, DefaultValueUpdateProcessorTest, TestRTimerTree, TestNonDefinedSimilarityFactory, OverseerTest, SolrCmdDistributorTest, TestExportWriter, SolrInfoBeanTest, TestDynamicFieldCollectionResource, TestMacroExpander, SliceStateTest, ChaosMonkeySafeLeaderWithPullReplicasTest, OverseerStatusTest, ReturnFieldsTest, DirectUpdateHandlerTest, InfoHandlerTest, TestPrepRecovery, ShardRoutingTest, TestCloudJSONFacetJoinDomain, TestDistributedStatsComponentCardinality, HdfsChaosMonkeyNothingIsSafeTest, DocValuesMissingTest, TestInitParams, HdfsRestartWhileUpdatingTest, TestCloudSearcherWarming, QueryParsingTest, TestLegacyFieldCache, TestCloudDeleteByQuery, BooleanFieldTest, TestTolerantUpdateProcessorRandomCloud, TestSolrCoreParser, TestMaxTokenLenTokenizer, TestFieldCacheVsDocValues, SolrMetricsIntegrationTest, XmlUpdateRequestHandlerTest, ConvertedLegacyTest, TestFieldCache, DisMaxRequestHandlerTest, TestNestedDocsSort, TestGraphMLResponseWriter, CursorPagingTest, HLLSerializationTest, TestTestInjection, BJQParserTest, IndexBasedSpellCheckerTest, TestSQLHandlerNonCloud, TestSha256AuthenticationProvider, SuggesterTest, ShufflingReplicaListTransformerTest, SignatureUpdateProcessorFactoryTest, UUIDUpdateProcessorFallbackTest, PropertiesRequestHandlerTest, TestOmitPositions, RollingRestartTest, DistributedSpellCheckComponentTest, HdfsThreadLeakTest, TestLegacyNumericUtils, ConfigSetsAPITest, DeleteInactiveReplicaTest, TestJoin, CurrencyFieldTypeTest, TriLevelCompositeIdRoutingTest, TestManagedStopFilterFactory, TestZkAclsWithHadoopAuth, TestStressInPlaceUpdates, HdfsLockFactoryTest, MoveReplicaTest, TestDeleteCollectionOnDownNodes, TestSchemaNameResource, TestSegmentSorting, OverseerModifyCollectionTest, DistribJoinFromCollectionTest, DistributedFacetPivotLongTailTest, NotRequiredUniqueKeyTest, SolrCLIZkUtilsTest, TestStressRecovery, TestNamedUpdateProcessors, TestInPlaceUpdatesStandalone, SpellCheckCollatorWithCollapseTest, ExplicitHLLTest, TestSubQueryTransformer, URLClassifyProcessorTest, TestDFRSimilarityFactory, TestReversedWildcardFilterFactory, SearchHandlerTest, ZkFailoverTest, TestBlendedInfixSuggestions, MetricsConfigTest, FieldAnalysisRequestHandlerTest, TestRestoreCore, RankQueryTest, TestStandardQParsers, PeerSyncReplicationTest, DirectSolrConnectionTest, TestUtils, TestPushWriter, TestFilteredDocIdSet, HdfsCollectionsAPIDistributedZkTest, TestHashQParserPlugin, TestMiniSolrCloudClusterSSL, TestSolrCloudWithSecureImpersonation, ResourceLoaderTest, DirectUpdateHandlerOptimizeTest, TestHttpShardHandlerFactory, DistributedQueryElevationComponentTest, TestHalfAndHalfDocValues, ParsingFieldUpdateProcessorsTest, TestIBSimilarityFactory, TimeZoneUtilsTest, RemoteQueryErrorTest, ScriptEngineTest, DeleteNodeTest, NoCacheHeaderTest, LeaderInitiatedRecoveryOnCommitTest, TestCodecSupport, TestSchemaSimilarityResource, ResponseLogComponentTest, ResponseHeaderTest, HdfsRecoverLeaseTest, GraphQueryTest, SolrCloudReportersTest, TestCustomStream, TestSweetSpotSimilarityFactory, TestSimpleTextCodec, MoveReplicaHDFSFailoverTest, TestLegacyNumericRangeQueryBuilder, TestReloadAndDeleteDocs, TestHighlightDedupGrouping, RecoveryZkTest, TestConfigSetsAPI, TestRandomDVFaceting, SharedFSAutoReplicaFailoverTest, DocExpirationUpdateProcessorFactoryTest, AnalyticsQueryTest, TestBackupRepositoryFactory, FastVectorHighlighterTest, TestPayloadCheckQParserPlugin, PrimUtilsTest, CircularListTest, TestXIncludeConfig, TestSchemalessBufferedUpdates, TestConfigSetImmutable, TestComplexPhraseLeadingWildcard, TestImpersonationWithHadoopAuth, TestSolrXml, DistributedQueryComponentCustomSortTest, TestCursorMarkWithoutUniqueKey, InfixSuggestersTest, MigrateRouteKeyTest, TestSolr4Spatial, TestQuerySenderListener, HttpPartitionTest, ZkCLITest, SuggestComponentContextFilterQueryTest, CdcrReplicationHandlerTest, ClassificationUpdateProcessorTest, TestEmbeddedSolrServerAdminHandler, TestPointFields, AddBlockUpdateTest, OverriddenZkACLAndCredentialsProvidersTest, ChaosMonkeyNothingIsSafeTest, BasicAuthIntegrationTest, AutoAddReplicasPlanActionTest, TestAddFieldRealTimeGet, TestUpdate, TestBinaryResponseWriter, AddReplicaTest, UnloadDistributedZkTest, BlockCacheTest, TestPseudoReturnFields, TestRecoveryHdfs, TestPKIAuthenticationPlugin, AlternateDirectoryTest, DistanceFunctionTest, TestReplicationHandlerBackup, AsyncCallRequestStatusResponseTest, CdcrUpdateLogTest, TestRealTimeGet, OutputWriterTest, TestManagedResourceStorage, TestConfigReload, BasicDistributedZkTest, TestZkChroot, ShardRoutingCustomTest, TestDistributedSearch, ZkControllerTest, TestRangeQuery, StatsComponentTest, TestFiltering, TestFunctionQuery, TestLazyCores, SoftAutoCommitTest, ActionThrottleTest, AssignBackwardCompatibilityTest, CdcrReplicationDistributedZkTest, CdcrVersionReplicationTest, ChaosMonkeyNothingIsSafeWithPullReplicasTest, CollectionsAPIAsyncDistributedZkTest, ConcurrentDeleteAndCreateCollectionTest, CreateCollectionCleanupTest, CustomCollectionTest, DeleteStatusTest, DistribDocExpirationUpdateProcessorTest, ForceLeaderTest, TestCloudInspectUtil, TestCloudPseudoReturnFields, TestCollectionsAPIViaSolrCloudCluster, TestDistribDocBasedVersion, TestLeaderElectionZkExpiry, TestLocalFSCloudBackupRestore, TestRandomFlRTGCloud, TestRandomRequestDistribution, TestRequestStatusCollectionAPI, TestSolrCloudWithDelegationTokens, TestStressCloudBlindAtomicUpdates, TestStressLiveNodes, TlogReplayBufferedWhileIndexingTest, AutoAddReplicasIntegrationTest, AutoScalingHandlerTest, ExecutePlanActionTest]
   [junit4] Completed [606/745 (1!)] on J0 in 630.25s, 2 tests, 1 failure <<< FAILURES!

[...truncated 47579 lines...]

Mime
View raw message