lucene-dev mailing list archives

Site index · List index
Message view « Date » · « Thread »
Top « Date » · « Thread »
From Apache Jenkins Server <jenk...@builds.apache.org>
Subject [JENKINS] Lucene-Solr-NightlyTests-7.x - Build # 57 - Still unstable
Date Sat, 07 Oct 2017 04:59:13 GMT
Build: https://builds.apache.org/job/Lucene-Solr-NightlyTests-7.x/57/

9 tests failed.
FAILED:  org.apache.lucene.spatial3d.TestGeo3DPoint.testRandomBig

Error Message:
Test abandoned because suite timeout was reached.

Stack Trace:
java.lang.Exception: Test abandoned because suite timeout was reached.
	at __randomizedtesting.SeedInfo.seed([75F854A4F550C671]:0)


FAILED:  junit.framework.TestSuite.org.apache.lucene.spatial3d.TestGeo3DPoint

Error Message:
Suite timeout exceeded (>= 7200000 msec).

Stack Trace:
java.lang.Exception: Suite timeout exceeded (>= 7200000 msec).
	at __randomizedtesting.SeedInfo.seed([75F854A4F550C671]:0)


FAILED:  org.apache.solr.cloud.ChaosMonkeySafeLeaderWithPullReplicasTest.test

Error Message:
The Monkey ran for over 45 seconds and no jetties were stopped - this is worth investigating!

Stack Trace:
java.lang.AssertionError: The Monkey ran for over 45 seconds and no jetties were stopped - this is worth investigating!
	at __randomizedtesting.SeedInfo.seed([1187D051961EF9D9:99D3EF8B38E29421]:0)
	at org.junit.Assert.fail(Assert.java:93)
	at org.apache.solr.cloud.ChaosMonkey.stopTheMonkey(ChaosMonkey.java:587)
	at org.apache.solr.cloud.ChaosMonkeySafeLeaderWithPullReplicasTest.test(ChaosMonkeySafeLeaderWithPullReplicasTest.java:174)
	at sun.reflect.NativeMethodAccessorImpl.invoke0(Native Method)
	at sun.reflect.NativeMethodAccessorImpl.invoke(NativeMethodAccessorImpl.java:62)
	at sun.reflect.DelegatingMethodAccessorImpl.invoke(DelegatingMethodAccessorImpl.java:43)
	at java.lang.reflect.Method.invoke(Method.java:498)
	at com.carrotsearch.randomizedtesting.RandomizedRunner.invoke(RandomizedRunner.java:1737)
	at com.carrotsearch.randomizedtesting.RandomizedRunner$8.evaluate(RandomizedRunner.java:934)
	at com.carrotsearch.randomizedtesting.RandomizedRunner$9.evaluate(RandomizedRunner.java:970)
	at com.carrotsearch.randomizedtesting.RandomizedRunner$10.evaluate(RandomizedRunner.java:984)
	at org.apache.solr.BaseDistributedSearchTestCase$ShardsRepeatRule$ShardsFixedStatement.callStatement(BaseDistributedSearchTestCase.java:993)
	at org.apache.solr.BaseDistributedSearchTestCase$ShardsRepeatRule$ShardsStatement.evaluate(BaseDistributedSearchTestCase.java:968)
	at com.carrotsearch.randomizedtesting.rules.SystemPropertiesRestoreRule$1.evaluate(SystemPropertiesRestoreRule.java:57)
	at org.apache.lucene.util.TestRuleSetupTeardownChained$1.evaluate(TestRuleSetupTeardownChained.java:49)
	at org.apache.lucene.util.AbstractBeforeAfterRule$1.evaluate(AbstractBeforeAfterRule.java:45)
	at org.apache.lucene.util.TestRuleThreadAndTestName$1.evaluate(TestRuleThreadAndTestName.java:48)
	at org.apache.lucene.util.TestRuleIgnoreAfterMaxFailures$1.evaluate(TestRuleIgnoreAfterMaxFailures.java:64)
	at org.apache.lucene.util.TestRuleMarkFailure$1.evaluate(TestRuleMarkFailure.java:47)
	at com.carrotsearch.randomizedtesting.rules.StatementAdapter.evaluate(StatementAdapter.java:36)
	at com.carrotsearch.randomizedtesting.ThreadLeakControl$StatementRunner.run(ThreadLeakControl.java:368)
	at com.carrotsearch.randomizedtesting.ThreadLeakControl.forkTimeoutingTask(ThreadLeakControl.java:817)
	at com.carrotsearch.randomizedtesting.ThreadLeakControl$3.evaluate(ThreadLeakControl.java:468)
	at com.carrotsearch.randomizedtesting.RandomizedRunner.runSingleTest(RandomizedRunner.java:943)
	at com.carrotsearch.randomizedtesting.RandomizedRunner$5.evaluate(RandomizedRunner.java:829)
	at com.carrotsearch.randomizedtesting.RandomizedRunner$6.evaluate(RandomizedRunner.java:879)
	at com.carrotsearch.randomizedtesting.RandomizedRunner$7.evaluate(RandomizedRunner.java:890)
	at com.carrotsearch.randomizedtesting.rules.StatementAdapter.evaluate(StatementAdapter.java:36)
	at com.carrotsearch.randomizedtesting.rules.SystemPropertiesRestoreRule$1.evaluate(SystemPropertiesRestoreRule.java:57)
	at org.apache.lucene.util.AbstractBeforeAfterRule$1.evaluate(AbstractBeforeAfterRule.java:45)
	at com.carrotsearch.randomizedtesting.rules.StatementAdapter.evaluate(StatementAdapter.java:36)
	at org.apache.lucene.util.TestRuleStoreClassName$1.evaluate(TestRuleStoreClassName.java:41)
	at com.carrotsearch.randomizedtesting.rules.NoShadowingOrOverridesOnMethodsRule$1.evaluate(NoShadowingOrOverridesOnMethodsRule.java:40)
	at com.carrotsearch.randomizedtesting.rules.NoShadowingOrOverridesOnMethodsRule$1.evaluate(NoShadowingOrOverridesOnMethodsRule.java:40)
	at com.carrotsearch.randomizedtesting.rules.StatementAdapter.evaluate(StatementAdapter.java:36)
	at com.carrotsearch.randomizedtesting.rules.StatementAdapter.evaluate(StatementAdapter.java:36)
	at com.carrotsearch.randomizedtesting.rules.StatementAdapter.evaluate(StatementAdapter.java:36)
	at org.apache.lucene.util.TestRuleAssertionsRequired$1.evaluate(TestRuleAssertionsRequired.java:53)
	at org.apache.lucene.util.TestRuleMarkFailure$1.evaluate(TestRuleMarkFailure.java:47)
	at org.apache.lucene.util.TestRuleIgnoreAfterMaxFailures$1.evaluate(TestRuleIgnoreAfterMaxFailures.java:64)
	at org.apache.lucene.util.TestRuleIgnoreTestSuites$1.evaluate(TestRuleIgnoreTestSuites.java:54)
	at com.carrotsearch.randomizedtesting.rules.StatementAdapter.evaluate(StatementAdapter.java:36)
	at com.carrotsearch.randomizedtesting.ThreadLeakControl$StatementRunner.run(ThreadLeakControl.java:368)
	at java.lang.Thread.run(Thread.java:748)


FAILED:  junit.framework.TestSuite.org.apache.solr.cloud.ChaosMonkeySafeLeaderWithPullReplicasTest

Error Message:
8 threads leaked from SUITE scope at org.apache.solr.cloud.ChaosMonkeySafeLeaderWithPullReplicasTest:     1) Thread[id=132397, name=StoppableIndexingThread, state=TIMED_WAITING, group=TGRP-ChaosMonkeySafeLeaderWithPullReplicasTest]         at java.lang.Thread.sleep(Native Method)         at org.apache.solr.cloud.StoppableIndexingThread.run(StoppableIndexingThread.java:135)    2) Thread[id=132668, name=StoppableIndexingThread-EventThread, state=WAITING, group=TGRP-ChaosMonkeySafeLeaderWithPullReplicasTest]         at sun.misc.Unsafe.park(Native Method)         at java.util.concurrent.locks.LockSupport.park(LockSupport.java:175)         at java.util.concurrent.locks.AbstractQueuedSynchronizer$ConditionObject.await(AbstractQueuedSynchronizer.java:2039)         at java.util.concurrent.LinkedBlockingQueue.take(LinkedBlockingQueue.java:442)         at org.apache.zookeeper.ClientCnxn$EventThread.run(ClientCnxn.java:501)    3) Thread[id=132671, name=zkCallback-25888-thread-1, state=TIMED_WAITING, group=TGRP-ChaosMonkeySafeLeaderWithPullReplicasTest]         at sun.misc.Unsafe.park(Native Method)         at java.util.concurrent.locks.LockSupport.parkNanos(LockSupport.java:215)         at java.util.concurrent.SynchronousQueue$TransferStack.awaitFulfill(SynchronousQueue.java:460)         at java.util.concurrent.SynchronousQueue$TransferStack.transfer(SynchronousQueue.java:362)         at java.util.concurrent.SynchronousQueue.poll(SynchronousQueue.java:941)         at java.util.concurrent.ThreadPoolExecutor.getTask(ThreadPoolExecutor.java:1073)         at java.util.concurrent.ThreadPoolExecutor.runWorker(ThreadPoolExecutor.java:1134)         at java.util.concurrent.ThreadPoolExecutor$Worker.run(ThreadPoolExecutor.java:624)         at java.lang.Thread.run(Thread.java:748)    4) Thread[id=132396, name=StoppableIndexingThread, state=TIMED_WAITING, group=TGRP-ChaosMonkeySafeLeaderWithPullReplicasTest]         at java.lang.Thread.sleep(Native Method)         at org.apache.solr.cloud.StoppableIndexingThread.run(StoppableIndexingThread.java:135)    5) Thread[id=132734, name=zkCallback-25888-thread-3, state=TIMED_WAITING, group=TGRP-ChaosMonkeySafeLeaderWithPullReplicasTest]         at sun.misc.Unsafe.park(Native Method)         at java.util.concurrent.locks.LockSupport.parkNanos(LockSupport.java:215)         at java.util.concurrent.SynchronousQueue$TransferStack.awaitFulfill(SynchronousQueue.java:460)         at java.util.concurrent.SynchronousQueue$TransferStack.transfer(SynchronousQueue.java:362)         at java.util.concurrent.SynchronousQueue.poll(SynchronousQueue.java:941)         at java.util.concurrent.ThreadPoolExecutor.getTask(ThreadPoolExecutor.java:1073)         at java.util.concurrent.ThreadPoolExecutor.runWorker(ThreadPoolExecutor.java:1134)         at java.util.concurrent.ThreadPoolExecutor$Worker.run(ThreadPoolExecutor.java:624)         at java.lang.Thread.run(Thread.java:748)    6) Thread[id=132398, name=StoppableCommitThread, state=TIMED_WAITING, group=TGRP-ChaosMonkeySafeLeaderWithPullReplicasTest]         at java.lang.Thread.sleep(Native Method)         at org.apache.solr.cloud.StoppableCommitThread.run(StoppableCommitThread.java:55)    7) Thread[id=132733, name=zkCallback-25888-thread-2, state=TIMED_WAITING, group=TGRP-ChaosMonkeySafeLeaderWithPullReplicasTest]         at sun.misc.Unsafe.park(Native Method)         at java.util.concurrent.locks.LockSupport.parkNanos(LockSupport.java:215)         at java.util.concurrent.SynchronousQueue$TransferStack.awaitFulfill(SynchronousQueue.java:460)         at java.util.concurrent.SynchronousQueue$TransferStack.transfer(SynchronousQueue.java:362)         at java.util.concurrent.SynchronousQueue.poll(SynchronousQueue.java:941)         at java.util.concurrent.ThreadPoolExecutor.getTask(ThreadPoolExecutor.java:1073)         at java.util.concurrent.ThreadPoolExecutor.runWorker(ThreadPoolExecutor.java:1134)         at java.util.concurrent.ThreadPoolExecutor$Worker.run(ThreadPoolExecutor.java:624)         at java.lang.Thread.run(Thread.java:748)    8) Thread[id=132667, name=StoppableIndexingThread-SendThread(127.0.0.1:40618), state=TIMED_WAITING, group=TGRP-ChaosMonkeySafeLeaderWithPullReplicasTest]         at java.lang.Thread.sleep(Native Method)         at org.apache.zookeeper.client.StaticHostProvider.next(StaticHostProvider.java:101)         at org.apache.zookeeper.ClientCnxn$SendThread.startConnect(ClientCnxn.java:997)         at org.apache.zookeeper.ClientCnxn$SendThread.run(ClientCnxn.java:1060)

Stack Trace:
com.carrotsearch.randomizedtesting.ThreadLeakError: 8 threads leaked from SUITE scope at org.apache.solr.cloud.ChaosMonkeySafeLeaderWithPullReplicasTest: 
   1) Thread[id=132397, name=StoppableIndexingThread, state=TIMED_WAITING, group=TGRP-ChaosMonkeySafeLeaderWithPullReplicasTest]
        at java.lang.Thread.sleep(Native Method)
        at org.apache.solr.cloud.StoppableIndexingThread.run(StoppableIndexingThread.java:135)
   2) Thread[id=132668, name=StoppableIndexingThread-EventThread, state=WAITING, group=TGRP-ChaosMonkeySafeLeaderWithPullReplicasTest]
        at sun.misc.Unsafe.park(Native Method)
        at java.util.concurrent.locks.LockSupport.park(LockSupport.java:175)
        at java.util.concurrent.locks.AbstractQueuedSynchronizer$ConditionObject.await(AbstractQueuedSynchronizer.java:2039)
        at java.util.concurrent.LinkedBlockingQueue.take(LinkedBlockingQueue.java:442)
        at org.apache.zookeeper.ClientCnxn$EventThread.run(ClientCnxn.java:501)
   3) Thread[id=132671, name=zkCallback-25888-thread-1, state=TIMED_WAITING, group=TGRP-ChaosMonkeySafeLeaderWithPullReplicasTest]
        at sun.misc.Unsafe.park(Native Method)
        at java.util.concurrent.locks.LockSupport.parkNanos(LockSupport.java:215)
        at java.util.concurrent.SynchronousQueue$TransferStack.awaitFulfill(SynchronousQueue.java:460)
        at java.util.concurrent.SynchronousQueue$TransferStack.transfer(SynchronousQueue.java:362)
        at java.util.concurrent.SynchronousQueue.poll(SynchronousQueue.java:941)
        at java.util.concurrent.ThreadPoolExecutor.getTask(ThreadPoolExecutor.java:1073)
        at java.util.concurrent.ThreadPoolExecutor.runWorker(ThreadPoolExecutor.java:1134)
        at java.util.concurrent.ThreadPoolExecutor$Worker.run(ThreadPoolExecutor.java:624)
        at java.lang.Thread.run(Thread.java:748)
   4) Thread[id=132396, name=StoppableIndexingThread, state=TIMED_WAITING, group=TGRP-ChaosMonkeySafeLeaderWithPullReplicasTest]
        at java.lang.Thread.sleep(Native Method)
        at org.apache.solr.cloud.StoppableIndexingThread.run(StoppableIndexingThread.java:135)
   5) Thread[id=132734, name=zkCallback-25888-thread-3, state=TIMED_WAITING, group=TGRP-ChaosMonkeySafeLeaderWithPullReplicasTest]
        at sun.misc.Unsafe.park(Native Method)
        at java.util.concurrent.locks.LockSupport.parkNanos(LockSupport.java:215)
        at java.util.concurrent.SynchronousQueue$TransferStack.awaitFulfill(SynchronousQueue.java:460)
        at java.util.concurrent.SynchronousQueue$TransferStack.transfer(SynchronousQueue.java:362)
        at java.util.concurrent.SynchronousQueue.poll(SynchronousQueue.java:941)
        at java.util.concurrent.ThreadPoolExecutor.getTask(ThreadPoolExecutor.java:1073)
        at java.util.concurrent.ThreadPoolExecutor.runWorker(ThreadPoolExecutor.java:1134)
        at java.util.concurrent.ThreadPoolExecutor$Worker.run(ThreadPoolExecutor.java:624)
        at java.lang.Thread.run(Thread.java:748)
   6) Thread[id=132398, name=StoppableCommitThread, state=TIMED_WAITING, group=TGRP-ChaosMonkeySafeLeaderWithPullReplicasTest]
        at java.lang.Thread.sleep(Native Method)
        at org.apache.solr.cloud.StoppableCommitThread.run(StoppableCommitThread.java:55)
   7) Thread[id=132733, name=zkCallback-25888-thread-2, state=TIMED_WAITING, group=TGRP-ChaosMonkeySafeLeaderWithPullReplicasTest]
        at sun.misc.Unsafe.park(Native Method)
        at java.util.concurrent.locks.LockSupport.parkNanos(LockSupport.java:215)
        at java.util.concurrent.SynchronousQueue$TransferStack.awaitFulfill(SynchronousQueue.java:460)
        at java.util.concurrent.SynchronousQueue$TransferStack.transfer(SynchronousQueue.java:362)
        at java.util.concurrent.SynchronousQueue.poll(SynchronousQueue.java:941)
        at java.util.concurrent.ThreadPoolExecutor.getTask(ThreadPoolExecutor.java:1073)
        at java.util.concurrent.ThreadPoolExecutor.runWorker(ThreadPoolExecutor.java:1134)
        at java.util.concurrent.ThreadPoolExecutor$Worker.run(ThreadPoolExecutor.java:624)
        at java.lang.Thread.run(Thread.java:748)
   8) Thread[id=132667, name=StoppableIndexingThread-SendThread(127.0.0.1:40618), state=TIMED_WAITING, group=TGRP-ChaosMonkeySafeLeaderWithPullReplicasTest]
        at java.lang.Thread.sleep(Native Method)
        at org.apache.zookeeper.client.StaticHostProvider.next(StaticHostProvider.java:101)
        at org.apache.zookeeper.ClientCnxn$SendThread.startConnect(ClientCnxn.java:997)
        at org.apache.zookeeper.ClientCnxn$SendThread.run(ClientCnxn.java:1060)
	at __randomizedtesting.SeedInfo.seed([1187D051961EF9D9]:0)


FAILED:  junit.framework.TestSuite.org.apache.solr.cloud.ChaosMonkeySafeLeaderWithPullReplicasTest

Error Message:
There are still zombie threads that couldn't be terminated:    1) Thread[id=132397, name=StoppableIndexingThread, state=RUNNABLE, group=TGRP-ChaosMonkeySafeLeaderWithPullReplicasTest]         at java.lang.Throwable.fillInStackTrace(Native Method)         at java.lang.Throwable.fillInStackTrace(Throwable.java:783)         at java.lang.Throwable.<init>(Throwable.java:265)         at java.lang.Exception.<init>(Exception.java:66)         at java.lang.RuntimeException.<init>(RuntimeException.java:62)         at java.lang.IllegalStateException.<init>(IllegalStateException.java:55)         at org.apache.http.util.Asserts.check(Asserts.java:34)         at org.apache.http.pool.AbstractConnPool.lease(AbstractConnPool.java:189)         at org.apache.http.impl.conn.PoolingHttpClientConnectionManager.requestConnection(PoolingHttpClientConnectionManager.java:257)         at org.apache.http.impl.execchain.MainClientExec.execute(MainClientExec.java:176)         at org.apache.http.impl.execchain.ProtocolExec.execute(ProtocolExec.java:185)         at org.apache.http.impl.execchain.RetryExec.execute(RetryExec.java:89)         at org.apache.http.impl.execchain.RedirectExec.execute(RedirectExec.java:111)         at org.apache.http.impl.client.InternalHttpClient.doExecute(InternalHttpClient.java:185)         at org.apache.http.impl.client.CloseableHttpClient.execute(CloseableHttpClient.java:83)         at org.apache.http.impl.client.CloseableHttpClient.execute(CloseableHttpClient.java:56)         at org.apache.solr.client.solrj.impl.HttpSolrClient.executeMethod(HttpSolrClient.java:526)         at org.apache.solr.client.solrj.impl.HttpSolrClient.request(HttpSolrClient.java:253)         at org.apache.solr.client.solrj.impl.HttpSolrClient.request(HttpSolrClient.java:242)         at org.apache.solr.client.solrj.SolrRequest.process(SolrRequest.java:178)         at org.apache.solr.client.solrj.SolrRequest.process(SolrRequest.java:195)         at org.apache.solr.cloud.StoppableIndexingThread.indexDocs(StoppableIndexingThread.java:176)         at org.apache.solr.cloud.StoppableIndexingThread.run(StoppableIndexingThread.java:115)    2) Thread[id=132671, name=zkCallback-25888-thread-1, state=TIMED_WAITING, group=TGRP-ChaosMonkeySafeLeaderWithPullReplicasTest]         at sun.misc.Unsafe.park(Native Method)         at java.util.concurrent.locks.LockSupport.parkNanos(LockSupport.java:215)         at java.util.concurrent.SynchronousQueue$TransferStack.awaitFulfill(SynchronousQueue.java:460)         at java.util.concurrent.SynchronousQueue$TransferStack.transfer(SynchronousQueue.java:362)         at java.util.concurrent.SynchronousQueue.poll(SynchronousQueue.java:941)         at java.util.concurrent.ThreadPoolExecutor.getTask(ThreadPoolExecutor.java:1073)         at java.util.concurrent.ThreadPoolExecutor.runWorker(ThreadPoolExecutor.java:1134)         at java.util.concurrent.ThreadPoolExecutor$Worker.run(ThreadPoolExecutor.java:624)         at java.lang.Thread.run(Thread.java:748)    3) Thread[id=132396, name=StoppableIndexingThread, state=RUNNABLE, group=TGRP-ChaosMonkeySafeLeaderWithPullReplicasTest]         at org.apache.solr.common.util.JavaBinCodec.writeKnownType(JavaBinCodec.java:328)         at org.apache.solr.common.util.JavaBinCodec.writeVal(JavaBinCodec.java:228)         at org.apache.solr.common.util.JavaBinCodec.writeSolrInputDocument(JavaBinCodec.java:616)         at org.apache.solr.common.util.JavaBinCodec.writeKnownType(JavaBinCodec.java:355)         at org.apache.solr.common.util.JavaBinCodec.writeVal(JavaBinCodec.java:228)         at org.apache.solr.common.util.JavaBinCodec.writeMapEntry(JavaBinCodec.java:764)         at org.apache.solr.common.util.JavaBinCodec.writeKnownType(JavaBinCodec.java:383)         at org.apache.solr.common.util.JavaBinCodec.writeVal(JavaBinCodec.java:228)         at org.apache.solr.common.util.JavaBinCodec.writeIterator(JavaBinCodec.java:705)         at org.apache.solr.common.util.JavaBinCodec.writeKnownType(JavaBinCodec.java:367)         at org.apache.solr.common.util.JavaBinCodec.writeVal(JavaBinCodec.java:228)         at org.apache.solr.common.util.JavaBinCodec.writeNamedList(JavaBinCodec.java:223)         at org.apache.solr.common.util.JavaBinCodec.writeKnownType(JavaBinCodec.java:330)         at org.apache.solr.common.util.JavaBinCodec.writeVal(JavaBinCodec.java:228)         at org.apache.solr.common.util.JavaBinCodec.marshal(JavaBinCodec.java:155)         at org.apache.solr.client.solrj.request.JavaBinUpdateRequestCodec.marshal(JavaBinUpdateRequestCodec.java:91)         at org.apache.solr.client.solrj.impl.BinaryRequestWriter.getContentStream(BinaryRequestWriter.java:67)         at org.apache.solr.client.solrj.request.RequestWriter$LazyContentStream.getDelegate(RequestWriter.java:94)         at org.apache.solr.client.solrj.request.RequestWriter$LazyContentStream.getName(RequestWriter.java:104)         at org.apache.solr.client.solrj.impl.HttpSolrClient.createMethod(HttpSolrClient.java:382)         at org.apache.solr.client.solrj.impl.HttpSolrClient.request(HttpSolrClient.java:251)         at org.apache.solr.client.solrj.impl.HttpSolrClient.request(HttpSolrClient.java:242)         at org.apache.solr.client.solrj.SolrRequest.process(SolrRequest.java:178)         at org.apache.solr.client.solrj.SolrRequest.process(SolrRequest.java:195)         at org.apache.solr.cloud.StoppableIndexingThread.indexDocs(StoppableIndexingThread.java:176)         at org.apache.solr.cloud.StoppableIndexingThread.run(StoppableIndexingThread.java:115)    4) Thread[id=132734, name=zkCallback-25888-thread-3, state=TIMED_WAITING, group=TGRP-ChaosMonkeySafeLeaderWithPullReplicasTest]         at sun.misc.Unsafe.park(Native Method)         at java.util.concurrent.locks.LockSupport.parkNanos(LockSupport.java:215)         at java.util.concurrent.SynchronousQueue$TransferStack.awaitFulfill(SynchronousQueue.java:460)         at java.util.concurrent.SynchronousQueue$TransferStack.transfer(SynchronousQueue.java:362)         at java.util.concurrent.SynchronousQueue.poll(SynchronousQueue.java:941)         at java.util.concurrent.ThreadPoolExecutor.getTask(ThreadPoolExecutor.java:1073)         at java.util.concurrent.ThreadPoolExecutor.runWorker(ThreadPoolExecutor.java:1134)         at java.util.concurrent.ThreadPoolExecutor$Worker.run(ThreadPoolExecutor.java:624)         at java.lang.Thread.run(Thread.java:748)    5) Thread[id=132733, name=zkCallback-25888-thread-2, state=TIMED_WAITING, group=TGRP-ChaosMonkeySafeLeaderWithPullReplicasTest]         at sun.misc.Unsafe.park(Native Method)         at java.util.concurrent.locks.LockSupport.parkNanos(LockSupport.java:215)         at java.util.concurrent.SynchronousQueue$TransferStack.awaitFulfill(SynchronousQueue.java:460)         at java.util.concurrent.SynchronousQueue$TransferStack.transfer(SynchronousQueue.java:362)         at java.util.concurrent.SynchronousQueue.poll(SynchronousQueue.java:941)         at java.util.concurrent.ThreadPoolExecutor.getTask(ThreadPoolExecutor.java:1073)         at java.util.concurrent.ThreadPoolExecutor.runWorker(ThreadPoolExecutor.java:1134)         at java.util.concurrent.ThreadPoolExecutor$Worker.run(ThreadPoolExecutor.java:624)         at java.lang.Thread.run(Thread.java:748)    6) Thread[id=132667, name=StoppableIndexingThread-SendThread(127.0.0.1:40618), state=TIMED_WAITING, group=TGRP-ChaosMonkeySafeLeaderWithPullReplicasTest]         at java.lang.Thread.sleep(Native Method)         at org.apache.zookeeper.client.StaticHostProvider.next(StaticHostProvider.java:101)         at org.apache.zookeeper.ClientCnxn$SendThread.startConnect(ClientCnxn.java:997)         at org.apache.zookeeper.ClientCnxn$SendThread.run(ClientCnxn.java:1060)

Stack Trace:
com.carrotsearch.randomizedtesting.ThreadLeakError: There are still zombie threads that couldn't be terminated:
   1) Thread[id=132397, name=StoppableIndexingThread, state=RUNNABLE, group=TGRP-ChaosMonkeySafeLeaderWithPullReplicasTest]
        at java.lang.Throwable.fillInStackTrace(Native Method)
        at java.lang.Throwable.fillInStackTrace(Throwable.java:783)
        at java.lang.Throwable.<init>(Throwable.java:265)
        at java.lang.Exception.<init>(Exception.java:66)
        at java.lang.RuntimeException.<init>(RuntimeException.java:62)
        at java.lang.IllegalStateException.<init>(IllegalStateException.java:55)
        at org.apache.http.util.Asserts.check(Asserts.java:34)
        at org.apache.http.pool.AbstractConnPool.lease(AbstractConnPool.java:189)
        at org.apache.http.impl.conn.PoolingHttpClientConnectionManager.requestConnection(PoolingHttpClientConnectionManager.java:257)
        at org.apache.http.impl.execchain.MainClientExec.execute(MainClientExec.java:176)
        at org.apache.http.impl.execchain.ProtocolExec.execute(ProtocolExec.java:185)
        at org.apache.http.impl.execchain.RetryExec.execute(RetryExec.java:89)
        at org.apache.http.impl.execchain.RedirectExec.execute(RedirectExec.java:111)
        at org.apache.http.impl.client.InternalHttpClient.doExecute(InternalHttpClient.java:185)
        at org.apache.http.impl.client.CloseableHttpClient.execute(CloseableHttpClient.java:83)
        at org.apache.http.impl.client.CloseableHttpClient.execute(CloseableHttpClient.java:56)
        at org.apache.solr.client.solrj.impl.HttpSolrClient.executeMethod(HttpSolrClient.java:526)
        at org.apache.solr.client.solrj.impl.HttpSolrClient.request(HttpSolrClient.java:253)
        at org.apache.solr.client.solrj.impl.HttpSolrClient.request(HttpSolrClient.java:242)
        at org.apache.solr.client.solrj.SolrRequest.process(SolrRequest.java:178)
        at org.apache.solr.client.solrj.SolrRequest.process(SolrRequest.java:195)
        at org.apache.solr.cloud.StoppableIndexingThread.indexDocs(StoppableIndexingThread.java:176)
        at org.apache.solr.cloud.StoppableIndexingThread.run(StoppableIndexingThread.java:115)
   2) Thread[id=132671, name=zkCallback-25888-thread-1, state=TIMED_WAITING, group=TGRP-ChaosMonkeySafeLeaderWithPullReplicasTest]
        at sun.misc.Unsafe.park(Native Method)
        at java.util.concurrent.locks.LockSupport.parkNanos(LockSupport.java:215)
        at java.util.concurrent.SynchronousQueue$TransferStack.awaitFulfill(SynchronousQueue.java:460)
        at java.util.concurrent.SynchronousQueue$TransferStack.transfer(SynchronousQueue.java:362)
        at java.util.concurrent.SynchronousQueue.poll(SynchronousQueue.java:941)
        at java.util.concurrent.ThreadPoolExecutor.getTask(ThreadPoolExecutor.java:1073)
        at java.util.concurrent.ThreadPoolExecutor.runWorker(ThreadPoolExecutor.java:1134)
        at java.util.concurrent.ThreadPoolExecutor$Worker.run(ThreadPoolExecutor.java:624)
        at java.lang.Thread.run(Thread.java:748)
   3) Thread[id=132396, name=StoppableIndexingThread, state=RUNNABLE, group=TGRP-ChaosMonkeySafeLeaderWithPullReplicasTest]
        at org.apache.solr.common.util.JavaBinCodec.writeKnownType(JavaBinCodec.java:328)
        at org.apache.solr.common.util.JavaBinCodec.writeVal(JavaBinCodec.java:228)
        at org.apache.solr.common.util.JavaBinCodec.writeSolrInputDocument(JavaBinCodec.java:616)
        at org.apache.solr.common.util.JavaBinCodec.writeKnownType(JavaBinCodec.java:355)
        at org.apache.solr.common.util.JavaBinCodec.writeVal(JavaBinCodec.java:228)
        at org.apache.solr.common.util.JavaBinCodec.writeMapEntry(JavaBinCodec.java:764)
        at org.apache.solr.common.util.JavaBinCodec.writeKnownType(JavaBinCodec.java:383)
        at org.apache.solr.common.util.JavaBinCodec.writeVal(JavaBinCodec.java:228)
        at org.apache.solr.common.util.JavaBinCodec.writeIterator(JavaBinCodec.java:705)
        at org.apache.solr.common.util.JavaBinCodec.writeKnownType(JavaBinCodec.java:367)
        at org.apache.solr.common.util.JavaBinCodec.writeVal(JavaBinCodec.java:228)
        at org.apache.solr.common.util.JavaBinCodec.writeNamedList(JavaBinCodec.java:223)
        at org.apache.solr.common.util.JavaBinCodec.writeKnownType(JavaBinCodec.java:330)
        at org.apache.solr.common.util.JavaBinCodec.writeVal(JavaBinCodec.java:228)
        at org.apache.solr.common.util.JavaBinCodec.marshal(JavaBinCodec.java:155)
        at org.apache.solr.client.solrj.request.JavaBinUpdateRequestCodec.marshal(JavaBinUpdateRequestCodec.java:91)
        at org.apache.solr.client.solrj.impl.BinaryRequestWriter.getContentStream(BinaryRequestWriter.java:67)
        at org.apache.solr.client.solrj.request.RequestWriter$LazyContentStream.getDelegate(RequestWriter.java:94)
        at org.apache.solr.client.solrj.request.RequestWriter$LazyContentStream.getName(RequestWriter.java:104)
        at org.apache.solr.client.solrj.impl.HttpSolrClient.createMethod(HttpSolrClient.java:382)
        at org.apache.solr.client.solrj.impl.HttpSolrClient.request(HttpSolrClient.java:251)
        at org.apache.solr.client.solrj.impl.HttpSolrClient.request(HttpSolrClient.java:242)
        at org.apache.solr.client.solrj.SolrRequest.process(SolrRequest.java:178)
        at org.apache.solr.client.solrj.SolrRequest.process(SolrRequest.java:195)
        at org.apache.solr.cloud.StoppableIndexingThread.indexDocs(StoppableIndexingThread.java:176)
        at org.apache.solr.cloud.StoppableIndexingThread.run(StoppableIndexingThread.java:115)
   4) Thread[id=132734, name=zkCallback-25888-thread-3, state=TIMED_WAITING, group=TGRP-ChaosMonkeySafeLeaderWithPullReplicasTest]
        at sun.misc.Unsafe.park(Native Method)
        at java.util.concurrent.locks.LockSupport.parkNanos(LockSupport.java:215)
        at java.util.concurrent.SynchronousQueue$TransferStack.awaitFulfill(SynchronousQueue.java:460)
        at java.util.concurrent.SynchronousQueue$TransferStack.transfer(SynchronousQueue.java:362)
        at java.util.concurrent.SynchronousQueue.poll(SynchronousQueue.java:941)
        at java.util.concurrent.ThreadPoolExecutor.getTask(ThreadPoolExecutor.java:1073)
        at java.util.concurrent.ThreadPoolExecutor.runWorker(ThreadPoolExecutor.java:1134)
        at java.util.concurrent.ThreadPoolExecutor$Worker.run(ThreadPoolExecutor.java:624)
        at java.lang.Thread.run(Thread.java:748)
   5) Thread[id=132733, name=zkCallback-25888-thread-2, state=TIMED_WAITING, group=TGRP-ChaosMonkeySafeLeaderWithPullReplicasTest]
        at sun.misc.Unsafe.park(Native Method)
        at java.util.concurrent.locks.LockSupport.parkNanos(LockSupport.java:215)
        at java.util.concurrent.SynchronousQueue$TransferStack.awaitFulfill(SynchronousQueue.java:460)
        at java.util.concurrent.SynchronousQueue$TransferStack.transfer(SynchronousQueue.java:362)
        at java.util.concurrent.SynchronousQueue.poll(SynchronousQueue.java:941)
        at java.util.concurrent.ThreadPoolExecutor.getTask(ThreadPoolExecutor.java:1073)
        at java.util.concurrent.ThreadPoolExecutor.runWorker(ThreadPoolExecutor.java:1134)
        at java.util.concurrent.ThreadPoolExecutor$Worker.run(ThreadPoolExecutor.java:624)
        at java.lang.Thread.run(Thread.java:748)
   6) Thread[id=132667, name=StoppableIndexingThread-SendThread(127.0.0.1:40618), state=TIMED_WAITING, group=TGRP-ChaosMonkeySafeLeaderWithPullReplicasTest]
        at java.lang.Thread.sleep(Native Method)
        at org.apache.zookeeper.client.StaticHostProvider.next(StaticHostProvider.java:101)
        at org.apache.zookeeper.ClientCnxn$SendThread.startConnect(ClientCnxn.java:997)
        at org.apache.zookeeper.ClientCnxn$SendThread.run(ClientCnxn.java:1060)
	at __randomizedtesting.SeedInfo.seed([1187D051961EF9D9]:0)


FAILED:  org.apache.solr.handler.TestReplicationHandler.doTestReplicateAfterCoreReload

Error Message:
expected:<[{indexVersion=1507347347538,generation=2,filelist=[_5.cfe, _5.cfs, _5.si, _6.cfe, _6.cfs, _6.si, _7.cfe, _7.cfs, _7.si, _8.cfe, _8.cfs, _8.si, segments_2]}]> but was:<[{indexVersion=1507347347538,generation=2,filelist=[_5.cfe, _5.cfs, _5.si, _6.cfe, _6.cfs, _6.si, _7.cfe, _7.cfs, _7.si, _8.cfe, _8.cfs, _8.si, segments_2]}, {indexVersion=1507347347538,generation=3,filelist=[_8.cfe, _8.cfs, _8.si, _9.cfe, _9.cfs, _9.si, segments_3]}]>

Stack Trace:
java.lang.AssertionError: expected:<[{indexVersion=1507347347538,generation=2,filelist=[_5.cfe, _5.cfs, _5.si, _6.cfe, _6.cfs, _6.si, _7.cfe, _7.cfs, _7.si, _8.cfe, _8.cfs, _8.si, segments_2]}]> but was:<[{indexVersion=1507347347538,generation=2,filelist=[_5.cfe, _5.cfs, _5.si, _6.cfe, _6.cfs, _6.si, _7.cfe, _7.cfs, _7.si, _8.cfe, _8.cfs, _8.si, segments_2]}, {indexVersion=1507347347538,generation=3,filelist=[_8.cfe, _8.cfs, _8.si, _9.cfe, _9.cfs, _9.si, segments_3]}]>
	at __randomizedtesting.SeedInfo.seed([1187D051961EF9D9:3450CB61E656F7DA]:0)
	at org.junit.Assert.fail(Assert.java:93)
	at org.junit.Assert.failNotEquals(Assert.java:647)
	at org.junit.Assert.assertEquals(Assert.java:128)
	at org.junit.Assert.assertEquals(Assert.java:147)
	at org.apache.solr.handler.TestReplicationHandler.doTestReplicateAfterCoreReload(TestReplicationHandler.java:1277)
	at sun.reflect.NativeMethodAccessorImpl.invoke0(Native Method)
	at sun.reflect.NativeMethodAccessorImpl.invoke(NativeMethodAccessorImpl.java:62)
	at sun.reflect.DelegatingMethodAccessorImpl.invoke(DelegatingMethodAccessorImpl.java:43)
	at java.lang.reflect.Method.invoke(Method.java:498)
	at com.carrotsearch.randomizedtesting.RandomizedRunner.invoke(RandomizedRunner.java:1737)
	at com.carrotsearch.randomizedtesting.RandomizedRunner$8.evaluate(RandomizedRunner.java:934)
	at com.carrotsearch.randomizedtesting.RandomizedRunner$9.evaluate(RandomizedRunner.java:970)
	at com.carrotsearch.randomizedtesting.RandomizedRunner$10.evaluate(RandomizedRunner.java:984)
	at com.carrotsearch.randomizedtesting.rules.SystemPropertiesRestoreRule$1.evaluate(SystemPropertiesRestoreRule.java:57)
	at org.apache.lucene.util.TestRuleSetupTeardownChained$1.evaluate(TestRuleSetupTeardownChained.java:49)
	at org.apache.lucene.util.AbstractBeforeAfterRule$1.evaluate(AbstractBeforeAfterRule.java:45)
	at org.apache.lucene.util.TestRuleThreadAndTestName$1.evaluate(TestRuleThreadAndTestName.java:48)
	at org.apache.lucene.util.TestRuleIgnoreAfterMaxFailures$1.evaluate(TestRuleIgnoreAfterMaxFailures.java:64)
	at org.apache.lucene.util.TestRuleMarkFailure$1.evaluate(TestRuleMarkFailure.java:47)
	at com.carrotsearch.randomizedtesting.rules.StatementAdapter.evaluate(StatementAdapter.java:36)
	at com.carrotsearch.randomizedtesting.ThreadLeakControl$StatementRunner.run(ThreadLeakControl.java:368)
	at com.carrotsearch.randomizedtesting.ThreadLeakControl.forkTimeoutingTask(ThreadLeakControl.java:817)
	at com.carrotsearch.randomizedtesting.ThreadLeakControl$3.evaluate(ThreadLeakControl.java:468)
	at com.carrotsearch.randomizedtesting.RandomizedRunner.runSingleTest(RandomizedRunner.java:943)
	at com.carrotsearch.randomizedtesting.RandomizedRunner$5.evaluate(RandomizedRunner.java:829)
	at com.carrotsearch.randomizedtesting.RandomizedRunner$6.evaluate(RandomizedRunner.java:879)
	at com.carrotsearch.randomizedtesting.RandomizedRunner$7.evaluate(RandomizedRunner.java:890)
	at com.carrotsearch.randomizedtesting.rules.StatementAdapter.evaluate(StatementAdapter.java:36)
	at com.carrotsearch.randomizedtesting.rules.SystemPropertiesRestoreRule$1.evaluate(SystemPropertiesRestoreRule.java:57)
	at org.apache.lucene.util.AbstractBeforeAfterRule$1.evaluate(AbstractBeforeAfterRule.java:45)
	at com.carrotsearch.randomizedtesting.rules.StatementAdapter.evaluate(StatementAdapter.java:36)
	at org.apache.lucene.util.TestRuleStoreClassName$1.evaluate(TestRuleStoreClassName.java:41)
	at com.carrotsearch.randomizedtesting.rules.NoShadowingOrOverridesOnMethodsRule$1.evaluate(NoShadowingOrOverridesOnMethodsRule.java:40)
	at com.carrotsearch.randomizedtesting.rules.NoShadowingOrOverridesOnMethodsRule$1.evaluate(NoShadowingOrOverridesOnMethodsRule.java:40)
	at com.carrotsearch.randomizedtesting.rules.StatementAdapter.evaluate(StatementAdapter.java:36)
	at com.carrotsearch.randomizedtesting.rules.StatementAdapter.evaluate(StatementAdapter.java:36)
	at com.carrotsearch.randomizedtesting.rules.StatementAdapter.evaluate(StatementAdapter.java:36)
	at org.apache.lucene.util.TestRuleAssertionsRequired$1.evaluate(TestRuleAssertionsRequired.java:53)
	at org.apache.lucene.util.TestRuleMarkFailure$1.evaluate(TestRuleMarkFailure.java:47)
	at org.apache.lucene.util.TestRuleIgnoreAfterMaxFailures$1.evaluate(TestRuleIgnoreAfterMaxFailures.java:64)
	at org.apache.lucene.util.TestRuleIgnoreTestSuites$1.evaluate(TestRuleIgnoreTestSuites.java:54)
	at com.carrotsearch.randomizedtesting.rules.StatementAdapter.evaluate(StatementAdapter.java:36)
	at com.carrotsearch.randomizedtesting.ThreadLeakControl$StatementRunner.run(ThreadLeakControl.java:368)
	at java.lang.Thread.run(Thread.java:748)


FAILED:  org.apache.solr.cloud.RollingRestartTest.test

Error Message:
KeeperErrorCode = Session expired for /overseer_elect/leader

Stack Trace:
org.apache.zookeeper.KeeperException$SessionExpiredException: KeeperErrorCode = Session expired for /overseer_elect/leader
	at __randomizedtesting.SeedInfo.seed([1187D051961EF9D9:99D3EF8B38E29421]:0)
	at org.apache.zookeeper.KeeperException.create(KeeperException.java:127)
	at org.apache.zookeeper.KeeperException.create(KeeperException.java:51)
	at org.apache.zookeeper.ZooKeeper.getData(ZooKeeper.java:1212)
	at org.apache.solr.common.cloud.SolrZkClient$7.execute(SolrZkClient.java:357)
	at org.apache.solr.common.cloud.SolrZkClient$7.execute(SolrZkClient.java:354)
	at org.apache.solr.common.cloud.ZkCmdExecutor.retryOperation(ZkCmdExecutor.java:60)
	at org.apache.solr.common.cloud.SolrZkClient.getData(SolrZkClient.java:354)
	at org.apache.solr.cloud.OverseerTaskProcessor.getLeaderId(OverseerTaskProcessor.java:374)
	at org.apache.solr.cloud.OverseerTaskProcessor.getLeaderNode(OverseerTaskProcessor.java:365)
	at org.apache.solr.cloud.RollingRestartTest.waitUntilOverseerDesignateIsLeader(RollingRestartTest.java:137)
	at org.apache.solr.cloud.RollingRestartTest.restartWithRolesTest(RollingRestartTest.java:104)
	at org.apache.solr.cloud.RollingRestartTest.test(RollingRestartTest.java:52)
	at sun.reflect.NativeMethodAccessorImpl.invoke0(Native Method)
	at sun.reflect.NativeMethodAccessorImpl.invoke(NativeMethodAccessorImpl.java:62)
	at sun.reflect.DelegatingMethodAccessorImpl.invoke(DelegatingMethodAccessorImpl.java:43)
	at java.lang.reflect.Method.invoke(Method.java:498)
	at com.carrotsearch.randomizedtesting.RandomizedRunner.invoke(RandomizedRunner.java:1737)
	at com.carrotsearch.randomizedtesting.RandomizedRunner$8.evaluate(RandomizedRunner.java:934)
	at com.carrotsearch.randomizedtesting.RandomizedRunner$9.evaluate(RandomizedRunner.java:970)
	at com.carrotsearch.randomizedtesting.RandomizedRunner$10.evaluate(RandomizedRunner.java:984)
	at org.apache.solr.BaseDistributedSearchTestCase$ShardsRepeatRule$ShardsFixedStatement.callStatement(BaseDistributedSearchTestCase.java:993)
	at org.apache.solr.BaseDistributedSearchTestCase$ShardsRepeatRule$ShardsStatement.evaluate(BaseDistributedSearchTestCase.java:968)
	at com.carrotsearch.randomizedtesting.rules.SystemPropertiesRestoreRule$1.evaluate(SystemPropertiesRestoreRule.java:57)
	at org.apache.lucene.util.TestRuleSetupTeardownChained$1.evaluate(TestRuleSetupTeardownChained.java:49)
	at org.apache.lucene.util.AbstractBeforeAfterRule$1.evaluate(AbstractBeforeAfterRule.java:45)
	at org.apache.lucene.util.TestRuleThreadAndTestName$1.evaluate(TestRuleThreadAndTestName.java:48)
	at org.apache.lucene.util.TestRuleIgnoreAfterMaxFailures$1.evaluate(TestRuleIgnoreAfterMaxFailures.java:64)
	at org.apache.lucene.util.TestRuleMarkFailure$1.evaluate(TestRuleMarkFailure.java:47)
	at com.carrotsearch.randomizedtesting.rules.StatementAdapter.evaluate(StatementAdapter.java:36)
	at com.carrotsearch.randomizedtesting.ThreadLeakControl$StatementRunner.run(ThreadLeakControl.java:368)
	at com.carrotsearch.randomizedtesting.ThreadLeakControl.forkTimeoutingTask(ThreadLeakControl.java:817)
	at com.carrotsearch.randomizedtesting.ThreadLeakControl$3.evaluate(ThreadLeakControl.java:468)
	at com.carrotsearch.randomizedtesting.RandomizedRunner.runSingleTest(RandomizedRunner.java:943)
	at com.carrotsearch.randomizedtesting.RandomizedRunner$5.evaluate(RandomizedRunner.java:829)
	at com.carrotsearch.randomizedtesting.RandomizedRunner$6.evaluate(RandomizedRunner.java:879)
	at com.carrotsearch.randomizedtesting.RandomizedRunner$7.evaluate(RandomizedRunner.java:890)
	at com.carrotsearch.randomizedtesting.rules.StatementAdapter.evaluate(StatementAdapter.java:36)
	at com.carrotsearch.randomizedtesting.rules.SystemPropertiesRestoreRule$1.evaluate(SystemPropertiesRestoreRule.java:57)
	at org.apache.lucene.util.AbstractBeforeAfterRule$1.evaluate(AbstractBeforeAfterRule.java:45)
	at com.carrotsearch.randomizedtesting.rules.StatementAdapter.evaluate(StatementAdapter.java:36)
	at org.apache.lucene.util.TestRuleStoreClassName$1.evaluate(TestRuleStoreClassName.java:41)
	at com.carrotsearch.randomizedtesting.rules.NoShadowingOrOverridesOnMethodsRule$1.evaluate(NoShadowingOrOverridesOnMethodsRule.java:40)
	at com.carrotsearch.randomizedtesting.rules.NoShadowingOrOverridesOnMethodsRule$1.evaluate(NoShadowingOrOverridesOnMethodsRule.java:40)
	at com.carrotsearch.randomizedtesting.rules.StatementAdapter.evaluate(StatementAdapter.java:36)
	at com.carrotsearch.randomizedtesting.rules.StatementAdapter.evaluate(StatementAdapter.java:36)
	at com.carrotsearch.randomizedtesting.rules.StatementAdapter.evaluate(StatementAdapter.java:36)
	at org.apache.lucene.util.TestRuleAssertionsRequired$1.evaluate(TestRuleAssertionsRequired.java:53)
	at org.apache.lucene.util.TestRuleMarkFailure$1.evaluate(TestRuleMarkFailure.java:47)
	at org.apache.lucene.util.TestRuleIgnoreAfterMaxFailures$1.evaluate(TestRuleIgnoreAfterMaxFailures.java:64)
	at org.apache.lucene.util.TestRuleIgnoreTestSuites$1.evaluate(TestRuleIgnoreTestSuites.java:54)
	at com.carrotsearch.randomizedtesting.rules.StatementAdapter.evaluate(StatementAdapter.java:36)
	at com.carrotsearch.randomizedtesting.ThreadLeakControl$StatementRunner.run(ThreadLeakControl.java:368)
	at java.lang.Thread.run(Thread.java:748)


FAILED:  org.apache.solr.cloud.TestTlogReplica.testOnlyLeaderIndexes

Error Message:
expected:<2> but was:<3>

Stack Trace:
java.lang.AssertionError: expected:<2> but was:<3>
	at __randomizedtesting.SeedInfo.seed([1187D051961EF9D9:D86ADDCE3BB874A]:0)
	at org.junit.Assert.fail(Assert.java:93)
	at org.junit.Assert.failNotEquals(Assert.java:647)
	at org.junit.Assert.assertEquals(Assert.java:128)
	at org.junit.Assert.assertEquals(Assert.java:472)
	at org.junit.Assert.assertEquals(Assert.java:456)
	at org.apache.solr.cloud.TestTlogReplica.assertCopyOverOldUpdates(TestTlogReplica.java:909)
	at org.apache.solr.cloud.TestTlogReplica.testOnlyLeaderIndexes(TestTlogReplica.java:501)
	at sun.reflect.NativeMethodAccessorImpl.invoke0(Native Method)
	at sun.reflect.NativeMethodAccessorImpl.invoke(NativeMethodAccessorImpl.java:62)
	at sun.reflect.DelegatingMethodAccessorImpl.invoke(DelegatingMethodAccessorImpl.java:43)
	at java.lang.reflect.Method.invoke(Method.java:498)
	at com.carrotsearch.randomizedtesting.RandomizedRunner.invoke(RandomizedRunner.java:1737)
	at com.carrotsearch.randomizedtesting.RandomizedRunner$8.evaluate(RandomizedRunner.java:934)
	at com.carrotsearch.randomizedtesting.RandomizedRunner$9.evaluate(RandomizedRunner.java:970)
	at com.carrotsearch.randomizedtesting.RandomizedRunner$10.evaluate(RandomizedRunner.java:984)
	at com.carrotsearch.randomizedtesting.rules.SystemPropertiesRestoreRule$1.evaluate(SystemPropertiesRestoreRule.java:57)
	at org.apache.lucene.util.TestRuleSetupTeardownChained$1.evaluate(TestRuleSetupTeardownChained.java:49)
	at org.apache.lucene.util.AbstractBeforeAfterRule$1.evaluate(AbstractBeforeAfterRule.java:45)
	at org.apache.lucene.util.TestRuleThreadAndTestName$1.evaluate(TestRuleThreadAndTestName.java:48)
	at org.apache.lucene.util.TestRuleIgnoreAfterMaxFailures$1.evaluate(TestRuleIgnoreAfterMaxFailures.java:64)
	at org.apache.lucene.util.TestRuleMarkFailure$1.evaluate(TestRuleMarkFailure.java:47)
	at com.carrotsearch.randomizedtesting.rules.StatementAdapter.evaluate(StatementAdapter.java:36)
	at com.carrotsearch.randomizedtesting.ThreadLeakControl$StatementRunner.run(ThreadLeakControl.java:368)
	at com.carrotsearch.randomizedtesting.ThreadLeakControl.forkTimeoutingTask(ThreadLeakControl.java:817)
	at com.carrotsearch.randomizedtesting.ThreadLeakControl$3.evaluate(ThreadLeakControl.java:468)
	at com.carrotsearch.randomizedtesting.RandomizedRunner.runSingleTest(RandomizedRunner.java:943)
	at com.carrotsearch.randomizedtesting.RandomizedRunner$5.evaluate(RandomizedRunner.java:829)
	at com.carrotsearch.randomizedtesting.RandomizedRunner$6.evaluate(RandomizedRunner.java:879)
	at com.carrotsearch.randomizedtesting.RandomizedRunner$7.evaluate(RandomizedRunner.java:890)
	at com.carrotsearch.randomizedtesting.rules.StatementAdapter.evaluate(StatementAdapter.java:36)
	at com.carrotsearch.randomizedtesting.rules.SystemPropertiesRestoreRule$1.evaluate(SystemPropertiesRestoreRule.java:57)
	at org.apache.lucene.util.AbstractBeforeAfterRule$1.evaluate(AbstractBeforeAfterRule.java:45)
	at com.carrotsearch.randomizedtesting.rules.StatementAdapter.evaluate(StatementAdapter.java:36)
	at org.apache.lucene.util.TestRuleStoreClassName$1.evaluate(TestRuleStoreClassName.java:41)
	at com.carrotsearch.randomizedtesting.rules.NoShadowingOrOverridesOnMethodsRule$1.evaluate(NoShadowingOrOverridesOnMethodsRule.java:40)
	at com.carrotsearch.randomizedtesting.rules.NoShadowingOrOverridesOnMethodsRule$1.evaluate(NoShadowingOrOverridesOnMethodsRule.java:40)
	at com.carrotsearch.randomizedtesting.rules.StatementAdapter.evaluate(StatementAdapter.java:36)
	at com.carrotsearch.randomizedtesting.rules.StatementAdapter.evaluate(StatementAdapter.java:36)
	at com.carrotsearch.randomizedtesting.rules.StatementAdapter.evaluate(StatementAdapter.java:36)
	at org.apache.lucene.util.TestRuleAssertionsRequired$1.evaluate(TestRuleAssertionsRequired.java:53)
	at org.apache.lucene.util.TestRuleMarkFailure$1.evaluate(TestRuleMarkFailure.java:47)
	at org.apache.lucene.util.TestRuleIgnoreAfterMaxFailures$1.evaluate(TestRuleIgnoreAfterMaxFailures.java:64)
	at org.apache.lucene.util.TestRuleIgnoreTestSuites$1.evaluate(TestRuleIgnoreTestSuites.java:54)
	at com.carrotsearch.randomizedtesting.rules.StatementAdapter.evaluate(StatementAdapter.java:36)
	at com.carrotsearch.randomizedtesting.ThreadLeakControl$StatementRunner.run(ThreadLeakControl.java:368)
	at java.lang.Thread.run(Thread.java:748)


FAILED:  org.apache.solr.cloud.SharedFSAutoReplicaFailoverTest.test

Error Message:
expected:<2> but was:<3>

Stack Trace:
java.lang.AssertionError: expected:<2> but was:<3>
	at __randomizedtesting.SeedInfo.seed([1187D051961EF9D9:99D3EF8B38E29421]:0)
	at org.junit.Assert.fail(Assert.java:93)
	at org.junit.Assert.failNotEquals(Assert.java:647)
	at org.junit.Assert.assertEquals(Assert.java:128)
	at org.junit.Assert.assertEquals(Assert.java:472)
	at org.junit.Assert.assertEquals(Assert.java:456)
	at org.apache.solr.cloud.SharedFSAutoReplicaFailoverTest.assertSliceAndReplicaCount(SharedFSAutoReplicaFailoverTest.java:403)
	at org.apache.solr.cloud.SharedFSAutoReplicaFailoverTest.testBasics(SharedFSAutoReplicaFailoverTest.java:248)
	at org.apache.solr.cloud.SharedFSAutoReplicaFailoverTest.test(SharedFSAutoReplicaFailoverTest.java:136)
	at sun.reflect.NativeMethodAccessorImpl.invoke0(Native Method)
	at sun.reflect.NativeMethodAccessorImpl.invoke(NativeMethodAccessorImpl.java:62)
	at sun.reflect.DelegatingMethodAccessorImpl.invoke(DelegatingMethodAccessorImpl.java:43)
	at java.lang.reflect.Method.invoke(Method.java:498)
	at com.carrotsearch.randomizedtesting.RandomizedRunner.invoke(RandomizedRunner.java:1737)
	at com.carrotsearch.randomizedtesting.RandomizedRunner$8.evaluate(RandomizedRunner.java:934)
	at com.carrotsearch.randomizedtesting.RandomizedRunner$9.evaluate(RandomizedRunner.java:970)
	at com.carrotsearch.randomizedtesting.RandomizedRunner$10.evaluate(RandomizedRunner.java:984)
	at org.apache.solr.BaseDistributedSearchTestCase$ShardsRepeatRule$ShardsFixedStatement.callStatement(BaseDistributedSearchTestCase.java:993)
	at org.apache.solr.BaseDistributedSearchTestCase$ShardsRepeatRule$ShardsStatement.evaluate(BaseDistributedSearchTestCase.java:968)
	at com.carrotsearch.randomizedtesting.rules.SystemPropertiesRestoreRule$1.evaluate(SystemPropertiesRestoreRule.java:57)
	at org.apache.lucene.util.TestRuleSetupTeardownChained$1.evaluate(TestRuleSetupTeardownChained.java:49)
	at org.apache.lucene.util.AbstractBeforeAfterRule$1.evaluate(AbstractBeforeAfterRule.java:45)
	at org.apache.lucene.util.TestRuleThreadAndTestName$1.evaluate(TestRuleThreadAndTestName.java:48)
	at org.apache.lucene.util.TestRuleIgnoreAfterMaxFailures$1.evaluate(TestRuleIgnoreAfterMaxFailures.java:64)
	at org.apache.lucene.util.TestRuleMarkFailure$1.evaluate(TestRuleMarkFailure.java:47)
	at com.carrotsearch.randomizedtesting.rules.StatementAdapter.evaluate(StatementAdapter.java:36)
	at com.carrotsearch.randomizedtesting.ThreadLeakControl$StatementRunner.run(ThreadLeakControl.java:368)
	at com.carrotsearch.randomizedtesting.ThreadLeakControl.forkTimeoutingTask(ThreadLeakControl.java:817)
	at com.carrotsearch.randomizedtesting.ThreadLeakControl$3.evaluate(ThreadLeakControl.java:468)
	at com.carrotsearch.randomizedtesting.RandomizedRunner.runSingleTest(RandomizedRunner.java:943)
	at com.carrotsearch.randomizedtesting.RandomizedRunner$5.evaluate(RandomizedRunner.java:829)
	at com.carrotsearch.randomizedtesting.RandomizedRunner$6.evaluate(RandomizedRunner.java:879)
	at com.carrotsearch.randomizedtesting.RandomizedRunner$7.evaluate(RandomizedRunner.java:890)
	at com.carrotsearch.randomizedtesting.rules.StatementAdapter.evaluate(StatementAdapter.java:36)
	at com.carrotsearch.randomizedtesting.rules.SystemPropertiesRestoreRule$1.evaluate(SystemPropertiesRestoreRule.java:57)
	at org.apache.lucene.util.AbstractBeforeAfterRule$1.evaluate(AbstractBeforeAfterRule.java:45)
	at com.carrotsearch.randomizedtesting.rules.StatementAdapter.evaluate(StatementAdapter.java:36)
	at org.apache.lucene.util.TestRuleStoreClassName$1.evaluate(TestRuleStoreClassName.java:41)
	at com.carrotsearch.randomizedtesting.rules.NoShadowingOrOverridesOnMethodsRule$1.evaluate(NoShadowingOrOverridesOnMethodsRule.java:40)
	at com.carrotsearch.randomizedtesting.rules.NoShadowingOrOverridesOnMethodsRule$1.evaluate(NoShadowingOrOverridesOnMethodsRule.java:40)
	at com.carrotsearch.randomizedtesting.rules.StatementAdapter.evaluate(StatementAdapter.java:36)
	at com.carrotsearch.randomizedtesting.rules.StatementAdapter.evaluate(StatementAdapter.java:36)
	at com.carrotsearch.randomizedtesting.rules.StatementAdapter.evaluate(StatementAdapter.java:36)
	at org.apache.lucene.util.TestRuleAssertionsRequired$1.evaluate(TestRuleAssertionsRequired.java:53)
	at org.apache.lucene.util.TestRuleMarkFailure$1.evaluate(TestRuleMarkFailure.java:47)
	at org.apache.lucene.util.TestRuleIgnoreAfterMaxFailures$1.evaluate(TestRuleIgnoreAfterMaxFailures.java:64)
	at org.apache.lucene.util.TestRuleIgnoreTestSuites$1.evaluate(TestRuleIgnoreTestSuites.java:54)
	at com.carrotsearch.randomizedtesting.rules.StatementAdapter.evaluate(StatementAdapter.java:36)
	at com.carrotsearch.randomizedtesting.ThreadLeakControl$StatementRunner.run(ThreadLeakControl.java:368)
	at java.lang.Thread.run(Thread.java:748)




Build Log:
[...truncated 10848 lines...]
   [junit4] Suite: org.apache.lucene.spatial3d.TestGeo3DPoint
   [junit4]   2> ott 07, 2017 10:18:53 AM com.carrotsearch.randomizedtesting.ThreadLeakControl$2 evaluate
   [junit4]   2> WARNING: Suite execution timed out: org.apache.lucene.spatial3d.TestGeo3DPoint
   [junit4]   2>    1) Thread[id=1, name=main, state=WAITING, group=main]
   [junit4]   2>         at java.lang.Object.wait(Native Method)
   [junit4]   2>         at java.lang.Thread.join(Thread.java:1252)
   [junit4]   2>         at java.lang.Thread.join(Thread.java:1326)
   [junit4]   2>         at com.carrotsearch.randomizedtesting.RandomizedRunner.runSuite(RandomizedRunner.java:636)
   [junit4]   2>         at com.carrotsearch.randomizedtesting.RandomizedRunner.run(RandomizedRunner.java:493)
   [junit4]   2>         at com.carrotsearch.ant.tasks.junit4.slave.SlaveMain.execute(SlaveMain.java:251)
   [junit4]   2>         at com.carrotsearch.ant.tasks.junit4.slave.SlaveMain.main(SlaveMain.java:368)
   [junit4]   2>         at com.carrotsearch.ant.tasks.junit4.slave.SlaveMainSafe.main(SlaveMainSafe.java:13)
   [junit4]   2>    2) Thread[id=9, name=JUnit4-serializer-daemon, state=TIMED_WAITING, group=main]
   [junit4]   2>         at java.lang.Thread.sleep(Native Method)
   [junit4]   2>         at com.carrotsearch.ant.tasks.junit4.events.Serializer$1.run(Serializer.java:50)
   [junit4]   2>    3) Thread[id=13, name=SUITE-TestGeo3DPoint-seed#[75F854A4F550C671], state=RUNNABLE, group=TGRP-TestGeo3DPoint]
   [junit4]   2>         at java.lang.Thread.getStackTrace(Thread.java:1559)
   [junit4]   2>         at com.carrotsearch.randomizedtesting.ThreadLeakControl$4.run(ThreadLeakControl.java:696)
   [junit4]   2>         at com.carrotsearch.randomizedtesting.ThreadLeakControl$4.run(ThreadLeakControl.java:693)
   [junit4]   2>         at java.security.AccessController.doPrivileged(Native Method)
   [junit4]   2>         at com.carrotsearch.randomizedtesting.ThreadLeakControl.getStackTrace(ThreadLeakControl.java:693)
   [junit4]   2>         at com.carrotsearch.randomizedtesting.ThreadLeakControl.getThreadsWithTraces(ThreadLeakControl.java:709)
   [junit4]   2>         at com.carrotsearch.randomizedtesting.ThreadLeakControl.formatThreadStacksFull(ThreadLeakControl.java:689)
   [junit4]   2>         at com.carrotsearch.randomizedtesting.ThreadLeakControl.access$1000(ThreadLeakControl.java:65)
   [junit4]   2>         at com.carrotsearch.randomizedtesting.ThreadLeakControl$2.evaluate(ThreadLeakControl.java:415)
   [junit4]   2>         at com.carrotsearch.randomizedtesting.RandomizedRunner.runSuite(RandomizedRunner.java:705)
   [junit4]   2>         at com.carrotsearch.randomizedtesting.RandomizedRunner.access$200(RandomizedRunner.java:139)
   [junit4]   2>         at com.carrotsearch.randomizedtesting.RandomizedRunner$2.run(RandomizedRunner.java:626)
   [junit4]   2>    4) Thread[id=14, name=TEST-TestGeo3DPoint.testRandomBig-seed#[75F854A4F550C671], state=RUNNABLE, group=TGRP-TestGeo3DPoint]
   [junit4]   2>         at org.apache.lucene.spatial3d.geom.GeoConvexPolygon.getBounds(GeoConvexPolygon.java:480)
   [junit4]   2>         at org.apache.lucene.spatial3d.geom.GeoBaseCompositeShape.getBounds(GeoBaseCompositeShape.java:131)
   [junit4]   2>         at org.apache.lucene.spatial3d.TestGeo3DPoint.verify(TestGeo3DPoint.java:846)
   [junit4]   2>         at org.apache.lucene.spatial3d.TestGeo3DPoint.doTestRandom(TestGeo3DPoint.java:548)
   [junit4]   2>         at org.apache.lucene.spatial3d.TestGeo3DPoint.testRandomBig(TestGeo3DPoint.java:480)
   [junit4]   2>         at sun.reflect.NativeMethodAccessorImpl.invoke0(Native Method)
   [junit4]   2>         at sun.reflect.NativeMethodAccessorImpl.invoke(NativeMethodAccessorImpl.java:62)
   [junit4]   2>         at sun.reflect.DelegatingMethodAccessorImpl.invoke(DelegatingMethodAccessorImpl.java:43)
   [junit4]   2>         at java.lang.reflect.Method.invoke(Method.java:498)
   [junit4]   2>         at com.carrotsearch.randomizedtesting.RandomizedRunner.invoke(RandomizedRunner.java:1737)
   [junit4]   2>         at com.carrotsearch.randomizedtesting.RandomizedRunner$8.evaluate(RandomizedRunner.java:934)
   [junit4]   2>         at com.carrotsearch.randomizedtesting.RandomizedRunner$9.evaluate(RandomizedRunner.java:970)
   [junit4]   2>         at com.carrotsearch.randomizedtesting.RandomizedRunner$10.evaluate(RandomizedRunner.java:984)
   [junit4]   2>         at org.apache.lucene.util.TestRuleSetupTeardownChained$1.evaluate(TestRuleSetupTeardownChained.java:49)
   [junit4]   2>         at org.apache.lucene.util.AbstractBeforeAfterRule$1.evaluate(AbstractBeforeAfterRule.java:45)
   [junit4]   2>         at org.apache.lucene.util.TestRuleThreadAndTestName$1.evaluate(TestRuleThreadAndTestName.java:48)
   [junit4]   2>         at org.apache.lucene.util.TestRuleIgnoreAfterMaxFailures$1.evaluate(TestRuleIgnoreAfterMaxFailures.java:64)
   [junit4]   2>         at org.apache.lucene.util.TestRuleMarkFailure$1.evaluate(TestRuleMarkFailure.java:47)
   [junit4]   2>         at com.carrotsearch.randomizedtesting.rules.StatementAdapter.evaluate(StatementAdapter.java:36)
   [junit4]   2>         at com.carrotsearch.randomizedtesting.ThreadLeakControl$StatementRunner.run(ThreadLeakControl.java:368)
   [junit4]   2>         at com.carrotsearch.randomizedtesting.ThreadLeakControl.forkTimeoutingTask(ThreadLeakControl.java:817)
   [junit4]   2>         at com.carrotsearch.randomizedtesting.ThreadLeakControl$3.evaluate(ThreadLeakControl.java:468)
   [junit4]   2>         at com.carrotsearch.randomizedtesting.RandomizedRunner.runSingleTest(RandomizedRunner.java:943)
   [junit4]   2>         at com.carrotsearch.randomizedtesting.RandomizedRunner$5.evaluate(RandomizedRunner.java:829)
   [junit4]   2>         at com.carrotsearch.randomizedtesting.RandomizedRunner$6.evaluate(RandomizedRunner.java:879)
   [junit4]   2>         at com.carrotsearch.randomizedtesting.RandomizedRunner$7.evaluate(RandomizedRunner.java:890)
   [junit4]   2>         at org.apache.lucene.util.AbstractBeforeAfterRule$1.evaluate(AbstractBeforeAfterRule.java:45)
   [junit4]   2>         at com.carrotsearch.randomizedtesting.rules.StatementAdapter.evaluate(StatementAdapter.java:36)
   [junit4]   2>         at org.apache.lucene.util.TestRuleStoreClassName$1.evaluate(TestRuleStoreClassName.java:41)
   [junit4]   2>         at com.carrotsearch.randomizedtesting.rules.NoShadowingOrOverridesOnMethodsRule$1.evaluate(NoShadowingOrOverridesOnMethodsRule.java:40)
   [junit4]   2>         at com.carrotsearch.randomizedtesting.rules.NoShadowingOrOverridesOnMethodsRule$1.evaluate(NoShadowingOrOverridesOnMethodsRule.java:40)
   [junit4]   2>         at com.carrotsearch.randomizedtesting.rules.StatementAdapter.evaluate(StatementAdapter.java:36)
   [junit4]   2>         at com.carrotsearch.randomizedtesting.rules.StatementAdapter.evaluate(StatementAdapter.java:36)
   [junit4]   2>         at com.carrotsearch.randomizedtesting.rules.StatementAdapter.evaluate(StatementAdapter.java:36)
   [junit4]   2>         at org.apache.lucene.util.TestRuleAssertionsRequired$1.evaluate(TestRuleAssertionsRequired.java:53)
   [junit4]   2>         at org.apache.lucene.util.TestRuleMarkFailure$1.evaluate(TestRuleMarkFailure.java:47)
   [junit4]   2>         at org.apache.lucene.util.TestRuleIgnoreAfterMaxFailures$1.evaluate(TestRuleIgnoreAfterMaxFailures.java:64)
   [junit4]   2>         at org.apache.lucene.util.TestRuleIgnoreTestSuites$1.evaluate(TestRuleIgnoreTestSuites.java:54)
   [junit4]   2>         at com.carrotsearch.randomizedtesting.rules.StatementAdapter.evaluate(StatementAdapter.java:36)
   [junit4]   2>         at com.carrotsearch.randomizedtesting.ThreadLeakControl$StatementRunner.run(ThreadLeakControl.java:368)
   [junit4]   2>         at java.lang.Thread.run(Thread.java:748)
   [junit4]   2> NOTE: download the large Jenkins line-docs file by running 'ant get-jenkins-line-docs' in the lucene directory.
   [junit4]   2> NOTE: reproduce with: ant test  -Dtestcase=TestGeo3DPoint -Dtests.method=testRandomBig -Dtests.seed=75F854A4F550C671 -Dtests.multiplier=2 -Dtests.nightly=true -Dtests.slow=true -Dtests.linedocsfile=/home/jenkins/jenkins-slave/workspace/Lucene-Solr-NightlyTests-7.x/test-data/enwiki.random.lines.txt -Dtests.locale=it-IT -Dtests.timezone=Australia/Eucla -Dtests.asserts=true -Dtests.file.encoding=US-ASCII
   [junit4] ERROR   7106s J0 | TestGeo3DPoint.testRandomBig <<<
   [junit4]    > Throwable #1: java.lang.Exception: Test abandoned because suite timeout was reached.
   [junit4]    > 	at __randomizedtesting.SeedInfo.seed([75F854A4F550C671]:0)
   [junit4]   2> ott 07, 2017 10:18:53 AM com.carrotsearch.randomizedtesting.ThreadLeakControl checkThreadLeaks
   [junit4]   2> WARNING: Will linger awaiting termination of 1 leaked thread(s).
   [junit4]   2> ott 07, 2017 10:19:13 AM com.carrotsearch.randomizedtesting.ThreadLeakControl checkThreadLeaks
   [junit4]   2> SEVERE: 1 thread leaked from SUITE scope at org.apache.lucene.spatial3d.TestGeo3DPoint: 
   [junit4]   2>    1) Thread[id=14, name=TEST-TestGeo3DPoint.testRandomBig-seed#[75F854A4F550C671], state=RUNNABLE, group=TGRP-TestGeo3DPoint]
   [junit4]   2>         at org.apache.lucene.spatial3d.geom.Plane.findIntersectionBounds(Plane.java:1073)
   [junit4]   2>         at org.apache.lucene.spatial3d.geom.Plane.recordBounds(Plane.java:1214)
   [junit4]   2>         at org.apache.lucene.spatial3d.geom.XYZBounds.addIntersection(XYZBounds.java:262)
   [junit4]   2>         at org.apache.lucene.spatial3d.geom.GeoConvexPolygon.getBounds(GeoConvexPolygon.java:486)
   [junit4]   2>         at org.apache.lucene.spatial3d.geom.GeoBaseCompositeShape.getBounds(GeoBaseCompositeShape.java:131)
   [junit4]   2>         at org.apache.lucene.spatial3d.TestGeo3DPoint.verify(TestGeo3DPoint.java:846)
   [junit4]   2>         at org.apache.lucene.spatial3d.TestGeo3DPoint.doTestRandom(TestGeo3DPoint.java:548)
   [junit4]   2>         at org.apache.lucene.spatial3d.TestGeo3DPoint.testRandomBig(TestGeo3DPoint.java:480)
   [junit4]   2>         at sun.reflect.NativeMethodAccessorImpl.invoke0(Native Method)
   [junit4]   2>         at sun.reflect.NativeMethodAccessorImpl.invoke(NativeMethodAccessorImpl.java:62)
   [junit4]   2>         at sun.reflect.DelegatingMethodAccessorImpl.invoke(DelegatingMethodAccessorImpl.java:43)
   [junit4]   2>         at java.lang.reflect.Method.invoke(Method.java:498)
   [junit4]   2>         at com.carrotsearch.randomizedtesting.RandomizedRunner.invoke(RandomizedRunner.java:1737)
   [junit4]   2>         at com.carrotsearch.randomizedtesting.RandomizedRunner$8.evaluate(RandomizedRunner.java:934)
   [junit4]   2>         at com.carrotsearch.randomizedtesting.RandomizedRunner$9.evaluate(RandomizedRunner.java:970)
   [junit4]   2>         at com.carrotsearch.randomizedtesting.RandomizedRunner$10.evaluate(RandomizedRunner.java:984)
   [junit4]   2>         at org.apache.lucene.util.TestRuleSetupTeardownChained$1.evaluate(TestRuleSetupTeardownChained.java:49)
   [junit4]   2>         at org.apache.lucene.util.AbstractBeforeAfterRule$1.evaluate(AbstractBeforeAfterRule.java:45)
   [junit4]   2>         at org.apache.lucene.util.TestRuleThreadAndTestName$1.evaluate(TestRuleThreadAndTestName.java:48)
   [junit4]   2>         at org.apache.lucene.util.TestRuleIgnoreAfterMaxFailures$1.evaluate(TestRuleIgnoreAfterMaxFailures.java:64)
   [junit4]   2>         at org.apache.lucene.util.TestRuleMarkFailure$1.evaluate(TestRuleMarkFailure.java:47)
   [junit4]   2>         at com.carrotsearch.randomizedtesting.rules.StatementAdapter.evaluate(StatementAdapter.java:36)
   [junit4]   2>         at com.carrotsearch.randomizedtesting.ThreadLeakControl$StatementRunner.run(ThreadLeakControl.java:368)
   [junit4]   2>         at com.carrotsearch.randomizedtesting.ThreadLeakControl.forkTimeoutingTask(ThreadLeakControl.java:817)
   [junit4]   2>         at com.carrotsearch.randomizedtesting.ThreadLeakControl$3.evaluate(ThreadLeakControl.java:468)
   [junit4]   2>         at com.carrotsearch.randomizedtesting.RandomizedRunner.runSingleTest(RandomizedRunner.java:943)
   [junit4]   2>         at com.carrotsearch.randomizedtesting.RandomizedRunner$5.evaluate(RandomizedRunner.java:829)
   [junit4]   2>         at com.carrotsearch.randomizedtesting.RandomizedRunner$6.evaluate(RandomizedRunner.java:879)
   [junit4]   2>         at com.carrotsearch.randomizedtesting.RandomizedRunner$7.evaluate(RandomizedRunner.java:890)
   [junit4]   2>         at org.apache.lucene.util.AbstractBeforeAfterRule$1.evaluate(AbstractBeforeAfterRule.java:45)
   [junit4]   2>         at com.carrotsearch.randomizedtesting.rules.StatementAdapter.evaluate(StatementAdapter.java:36)
   [junit4]   2>         at org.apache.lucene.util.TestRuleStoreClassName$1.evaluate(TestRuleStoreClassName.java:41)
   [junit4]   2>         at com.carrotsearch.randomizedtesting.rules.NoShadowingOrOverridesOnMethodsRule$1.evaluate(NoShadowingOrOverridesOnMethodsRule.java:40)
   [junit4]   2>         at com.carrotsearch.randomizedtesting.rules.NoShadowingOrOverridesOnMethodsRule$1.evaluate(NoShadowingOrOverridesOnMethodsRule.java:40)
   [junit4]   2>         at com.carrotsearch.randomizedtesting.rules.StatementAdapter.evaluate(StatementAdapter.java:36)
   [junit4]   2>         at com.carrotsearch.randomizedtesting.rules.StatementAdapter.evaluate(StatementAdapter.java:36)
   [junit4]   2>         at com.carrotsearch.randomizedtesting.rules.StatementAdapter.evaluate(StatementAdapter.java:36)
   [junit4]   2>         at org.apache.lucene.util.TestRuleAssertionsRequired$1.evaluate(TestRuleAssertionsRequired.java:53)
   [junit4]   2>         at org.apache.lucene.util.TestRuleMarkFailure$1.evaluate(TestRuleMarkFailure.java:47)
   [junit4]   2>         at org.apache.lucene.util.TestRuleIgnoreAfterMaxFailures$1.evaluate(TestRuleIgnoreAfterMaxFailures.java:64)
   [junit4]   2>         at org.apache.lucene.util.TestRuleIgnoreTestSuites$1.evaluate(TestRuleIgnoreTestSuites.java:54)
   [junit4]   2>         at com.carrotsearch.randomizedtesting.rules.StatementAdapter.evaluate(StatementAdapter.java:36)
   [junit4]   2>         at com.carrotsearch.randomizedtesting.ThreadLeakControl$StatementRunner.run(ThreadLeakControl.java:368)
   [junit4]   2>         at java.lang.Thread.run(Thread.java:748)
   [junit4]   2> ott 07, 2017 10:19:13 AM com.carrotsearch.randomizedtesting.ThreadLeakControl tryToInterruptAll
   [junit4]   2> INFO: Starting to interrupt leaked threads:
   [junit4]   2>    1) Thread[id=14, name=TEST-TestGeo3DPoint.testRandomBig-seed#[75F854A4F550C671], state=RUNNABLE, group=TGRP-TestGeo3DPoint]
   [junit4]   2> NOTE: leaving temporary files on disk at: /home/jenkins/jenkins-slave/workspace/Lucene-Solr-NightlyTests-7.x/checkout/lucene/build/spatial3d/test/J0/temp/lucene.spatial3d.TestGeo3DPoint_75F854A4F550C671-001
   [junit4]   2> Oct 07, 2017 1:34:13 AM com.carrotsearch.randomizedtesting.ThreadLeakControl tryToInterruptAll
   [junit4]   2> INFO: All leaked threads terminated.
   [junit4]   2> NOTE: test params are: codec=Asserting(Lucene70): {id=FSTOrd50}, docValues:{id=DocValuesFormat(name=Lucene70), point=DocValuesFormat(name=Lucene70)}, maxPointsInLeafNode=1454, maxMBSortInHeap=6.510090742005915, sim=RandomSimilarity(queryNorm=false): {}, locale=it-IT, timezone=Australia/Eucla
   [junit4]   2> NOTE: Linux 4.4.0-83-generic amd64/Oracle Corporation 1.8.0_144 (64-bit)/cpus=4,threads=1,free=200143840,total=461373440
   [junit4]   2> NOTE: All tests run in this JVM: [TestGeo3DDocValues, TestGeo3DPoint]
   [junit4]   2> NOTE: download the large Jenkins line-docs file by running 'ant get-jenkins-line-docs' in the lucene directory.
   [junit4]   2> NOTE: reproduce with: ant test  -Dtestcase=TestGeo3DPoint -Dtests.seed=75F854A4F550C671 -Dtests.multiplier=2 -Dtests.nightly=true -Dtests.slow=true -Dtests.linedocsfile=/home/jenkins/jenkins-slave/workspace/Lucene-Solr-NightlyTests-7.x/test-data/enwiki.random.lines.txt -Dtests.locale=it-IT -Dtests.timezone=Australia/Eucla -Dtests.asserts=true -Dtests.file.encoding=US-ASCII
   [junit4] ERROR   0.00s J0 | TestGeo3DPoint (suite) <<<
   [junit4]    > Throwable #1: java.lang.Exception: Suite timeout exceeded (>= 7200000 msec).
   [junit4]    > 	at __randomizedtesting.SeedInfo.seed([75F854A4F550C671]:0)
   [junit4] Completed [15/15 (1!)] on J0 in 7220.57s, 6 tests, 2 errors <<< FAILURES!

[...truncated 2814 lines...]
   [junit4] Suite: org.apache.solr.cloud.TestTlogReplica
   [junit4]   2> 4320999 INFO  (SUITE-TestTlogReplica-seed#[1187D051961EF9D9]-worker) [    ] o.a.s.SolrTestCaseJ4 SecureRandom sanity checks: test.solr.allowed.securerandom=null & java.security.egd=file:/dev/./urandom
   [junit4]   2> Creating dataDir: /home/jenkins/jenkins-slave/workspace/Lucene-Solr-NightlyTests-7.x/checkout/solr/build/solr-core/test/J2/temp/solr.cloud.TestTlogReplica_1187D051961EF9D9-001/init-core-data-001
   [junit4]   2> 4320999 WARN  (SUITE-TestTlogReplica-seed#[1187D051961EF9D9]-worker) [    ] o.a.s.SolrTestCaseJ4 startTrackingSearchers: numOpens=1 numCloses=1
   [junit4]   2> 4321000 INFO  (SUITE-TestTlogReplica-seed#[1187D051961EF9D9]-worker) [    ] o.a.s.SolrTestCaseJ4 Using PointFields (NUMERIC_POINTS_SYSPROP=true) w/NUMERIC_DOCVALUES_SYSPROP=false
   [junit4]   2> 4321013 INFO  (SUITE-TestTlogReplica-seed#[1187D051961EF9D9]-worker) [    ] o.a.s.SolrTestCaseJ4 Randomized ssl (true) and clientAuth (false) via: @org.apache.solr.util.RandomizeSSL(reason=, ssl=NaN, value=NaN, clientAuth=NaN)
   [junit4]   2> 4321014 INFO  (SUITE-TestTlogReplica-seed#[1187D051961EF9D9]-worker) [    ] o.a.s.c.MiniSolrCloudCluster Starting cluster of 2 servers in /home/jenkins/jenkins-slave/workspace/Lucene-Solr-NightlyTests-7.x/checkout/solr/build/solr-core/test/J2/temp/solr.cloud.TestTlogReplica_1187D051961EF9D9-001/tempDir-001
   [junit4]   2> 4321014 INFO  (SUITE-TestTlogReplica-seed#[1187D051961EF9D9]-worker) [    ] o.a.s.c.ZkTestServer STARTING ZK TEST SERVER
   [junit4]   2> 4321026 INFO  (Thread-7608) [    ] o.a.s.c.ZkTestServer client port:0.0.0.0/0.0.0.0:0
   [junit4]   2> 4321026 INFO  (Thread-7608) [    ] o.a.s.c.ZkTestServer Starting server
   [junit4]   2> 4321106 ERROR (Thread-7608) [    ] o.a.z.s.ZooKeeperServer ZKShutdownHandler is not registered, so ZooKeeper server won't take any action on ERROR or SHUTDOWN server state changes
   [junit4]   2> 4321134 INFO  (SUITE-TestTlogReplica-seed#[1187D051961EF9D9]-worker) [    ] o.a.s.c.ZkTestServer start zk server on port:37503
   [junit4]   2> 4321322 INFO  (jetty-launcher-5380-thread-2) [    ] o.e.j.s.Server jetty-9.3.20.v20170531
   [junit4]   2> 4321322 INFO  (jetty-launcher-5380-thread-1) [    ] o.e.j.s.Server jetty-9.3.20.v20170531
   [junit4]   2> 4321323 INFO  (jetty-launcher-5380-thread-1) [    ] o.e.j.s.h.ContextHandler Started o.e.j.s.ServletContextHandler@7794dcf4{/solr,null,AVAILABLE}
   [junit4]   2> 4321323 INFO  (jetty-launcher-5380-thread-1) [    ] o.e.j.s.AbstractConnector Started ServerConnector@77d40620{SSL,[ssl, http/1.1]}{127.0.0.1:33132}
   [junit4]   2> 4321323 INFO  (jetty-launcher-5380-thread-1) [    ] o.e.j.s.Server Started @4334971ms
   [junit4]   2> 4321323 INFO  (jetty-launcher-5380-thread-1) [    ] o.a.s.c.s.e.JettySolrRunner Jetty properties: {hostContext=/solr, hostPort=33132}
   [junit4]   2> 4321324 ERROR (jetty-launcher-5380-thread-1) [    ] o.a.s.u.StartupLoggingUtils Missing Java Option solr.log.dir. Logging may be missing or incomplete.
   [junit4]   2> 4321324 INFO  (jetty-launcher-5380-thread-1) [    ] o.a.s.s.SolrDispatchFilter  ___      _       Welcome to Apache Solr™ version 7.1.0
   [junit4]   2> 4321324 INFO  (jetty-launcher-5380-thread-1) [    ] o.a.s.s.SolrDispatchFilter / __| ___| |_ _   Starting in cloud mode on port null
   [junit4]   2> 4321324 INFO  (jetty-launcher-5380-thread-1) [    ] o.a.s.s.SolrDispatchFilter \__ \/ _ \ | '_|  Install dir: null, Default config dir: null
   [junit4]   2> 4321324 INFO  (jetty-launcher-5380-thread-1) [    ] o.a.s.s.SolrDispatchFilter |___/\___/_|_|    Start time: 2017-10-07T02:55:02.472Z
   [junit4]   2> 4321324 INFO  (jetty-launcher-5380-thread-2) [    ] o.e.j.s.h.ContextHandler Started o.e.j.s.ServletContextHandler@762c1deb{/solr,null,AVAILABLE}
   [junit4]   2> 4321325 INFO  (jetty-launcher-5380-thread-2) [    ] o.e.j.s.AbstractConnector Started ServerConnector@79627a7c{SSL,[ssl, http/1.1]}{127.0.0.1:33036}
   [junit4]   2> 4321325 INFO  (jetty-launcher-5380-thread-2) [    ] o.e.j.s.Server Started @4334973ms
   [junit4]   2> 4321325 INFO  (jetty-launcher-5380-thread-2) [    ] o.a.s.c.s.e.JettySolrRunner Jetty properties: {hostContext=/solr, hostPort=33036}
   [junit4]   2> 4321325 ERROR (jetty-launcher-5380-thread-2) [    ] o.a.s.u.StartupLoggingUtils Missing Java Option solr.log.dir. Logging may be missing or incomplete.
   [junit4]   2> 4321325 INFO  (jetty-launcher-5380-thread-2) [    ] o.a.s.s.SolrDispatchFilter  ___      _       Welcome to Apache Solr™ version 7.1.0
   [junit4]   2> 4321325 INFO  (jetty-launcher-5380-thread-2) [    ] o.a.s.s.SolrDispatchFilter / __| ___| |_ _   Starting in cloud mode on port null
   [junit4]   2> 4321325 INFO  (jetty-launcher-5380-thread-2) [    ] o.a.s.s.SolrDispatchFilter \__ \/ _ \ | '_|  Install dir: null, Default config dir: null
   [junit4]   2> 4321325 INFO  (jetty-launcher-5380-thread-2) [    ] o.a.s.s.SolrDispatchFilter |___/\___/_|_|    Start time: 2017-10-07T02:55:02.473Z
   [junit4]   2> 4321498 INFO  (jetty-launcher-5380-thread-2) [    ] o.a.s.s.SolrDispatchFilter solr.xml found in ZooKeeper. Loading...
   [junit4]   2> 4321509 INFO  (jetty-launcher-5380-thread-1) [    ] o.a.s.s.SolrDispatchFilter solr.xml found in ZooKeeper. Loading...
   [junit4]   2> 4321573 WARN  (NIOServerCxn.Factory:0.0.0.0/0.0.0.0:0) [    ] o.a.z.s.NIOServerCnxn caught end of stream exception
   [junit4]   2> EndOfStreamException: Unable to read additional data from client sessionid 0x15ef4c1e81f0002, likely client has closed socket
   [junit4]   2> 	at org.apache.zookeeper.server.NIOServerCnxn.doIO(NIOServerCnxn.java:239)
   [junit4]   2> 	at org.apache.zookeeper.server.NIOServerCnxnFactory.run(NIOServerCnxnFactory.java:203)
   [junit4]   2> 	at java.lang.Thread.run(Thread.java:748)
   [junit4]   2> 4321576 INFO  (jetty-launcher-5380-thread-2) [    ] o.a.s.c.ZkContainer Zookeeper client=127.0.0.1:37503/solr
   [junit4]   2> 4321577 INFO  (jetty-launcher-5380-thread-1) [    ] o.a.s.c.ZkContainer Zookeeper client=127.0.0.1:37503/solr
   [junit4]   2> 4321608 WARN  (NIOServerCxn.Factory:0.0.0.0/0.0.0.0:0) [    ] o.a.z.s.NIOServerCnxn caught end of stream exception
   [junit4]   2> EndOfStreamException: Unable to read additional data from client sessionid 0x15ef4c1e81f0004, likely client has closed socket
   [junit4]   2> 	at org.apache.zookeeper.server.NIOServerCnxn.doIO(NIOServerCnxn.java:239)
   [junit4]   2> 	at org.apache.zookeeper.server.NIOServerCnxnFactory.run(NIOServerCnxnFactory.java:203)
   [junit4]   2> 	at java.lang.Thread.run(Thread.java:748)
   [junit4]   2> 4321750 INFO  (jetty-launcher-5380-thread-2) [n:127.0.0.1:33036_solr    ] o.a.s.c.Overseer Overseer (id=null) closing
   [junit4]   2> 4321769 INFO  (jetty-launcher-5380-thread-2) [n:127.0.0.1:33036_solr    ] o.a.s.c.OverseerElectionContext I am going to be the leader 127.0.0.1:33036_solr
   [junit4]   2> 4321770 INFO  (jetty-launcher-5380-thread-2) [n:127.0.0.1:33036_solr    ] o.a.s.c.Overseer Overseer (id=98785355508940805-127.0.0.1:33036_solr-n_0000000000) starting
   [junit4]   2> 4321830 INFO  (jetty-launcher-5380-thread-2) [n:127.0.0.1:33036_solr    ] o.a.s.c.ZkController Register node as live in ZooKeeper:/live_nodes/127.0.0.1:33036_solr
   [junit4]   2> 4321830 INFO  (zkCallback-5391-thread-1-processing-n:127.0.0.1:33036_solr) [n:127.0.0.1:33036_solr    ] o.a.s.c.c.ZkStateReader Updated live nodes from ZooKeeper... (0) -> (1)
   [junit4]   2> 4321973 INFO  (jetty-launcher-5380-thread-1) [n:127.0.0.1:33132_solr    ] o.a.s.c.c.ZkStateReader Updated live nodes from ZooKeeper... (0) -> (1)
   [junit4]   2> 4321974 INFO  (jetty-launcher-5380-thread-1) [n:127.0.0.1:33132_solr    ] o.a.s.c.Overseer Overseer (id=null) closing
   [junit4]   2> 4321994 INFO  (jetty-launcher-5380-thread-1) [n:127.0.0.1:33132_solr    ] o.a.s.c.ZkController Register node as live in ZooKeeper:/live_nodes/127.0.0.1:33132_solr
   [junit4]   2> 4321995 INFO  (zkCallback-5391-thread-1-processing-n:127.0.0.1:33036_solr) [n:127.0.0.1:33036_solr    ] o.a.s.c.c.ZkStateReader Updated live nodes from ZooKeeper... (1) -> (2)
   [junit4]   2> 4322028 INFO  (zkCallback-5392-thread-1-processing-n:127.0.0.1:33132_solr) [n:127.0.0.1:33132_solr    ] o.a.s.c.c.ZkStateReader Updated live nodes from ZooKeeper... (1) -> (2)
   [junit4]   2> 4322137 INFO  (jetty-launcher-5380-thread-2) [n:127.0.0.1:33036_solr    ] o.a.s.m.r.SolrJmxReporter JMX monitoring for 'solr_33036.solr.node' (registry 'solr.node') enabled at server: com.sun.jmx.mbeanserver.JmxMBeanServer@5ac94aa0
   [junit4]   2> 4322161 INFO  (jetty-launcher-5380-thread-2) [n:127.0.0.1:33036_solr    ] o.a.s.m.r.SolrJmxReporter JMX monitoring for 'solr_33036.solr.jvm' (registry 'solr.jvm') enabled at server: com.sun.jmx.mbeanserver.JmxMBeanServer@5ac94aa0
   [junit4]   2> 4322161 INFO  (jetty-launcher-5380-thread-2) [n:127.0.0.1:33036_solr    ] o.a.s.m.r.SolrJmxReporter JMX monitoring for 'solr_33036.solr.jetty' (registry 'solr.jetty') enabled at server: com.sun.jmx.mbeanserver.JmxMBeanServer@5ac94aa0
   [junit4]   2> 4322174 INFO  (jetty-launcher-5380-thread-2) [n:127.0.0.1:33036_solr    ] o.a.s.c.CorePropertiesLocator Found 0 core definitions underneath /home/jenkins/jenkins-slave/workspace/Lucene-Solr-NightlyTests-7.x/checkout/solr/build/solr-core/test/J2/temp/solr.cloud.TestTlogReplica_1187D051961EF9D9-001/tempDir-001/node2/.
   [junit4]   2> 4322411 INFO  (jetty-launcher-5380-thread-1) [n:127.0.0.1:33132_solr    ] o.a.s.m.r.SolrJmxReporter JMX monitoring for 'solr_33132.solr.node' (registry 'solr.node') enabled at server: com.sun.jmx.mbeanserver.JmxMBeanServer@5ac94aa0
   [junit4]   2> 4322442 INFO  (jetty-launcher-5380-thread-1) [n:127.0.0.1:33132_solr    ] o.a.s.m.r.SolrJmxReporter JMX monitoring for 'solr_33132.solr.jvm' (registry 'solr.jvm') enabled at server: com.sun.jmx.mbeanserver.JmxMBeanServer@5ac94aa0
   [junit4]   2> 4322442 INFO  (jetty-launcher-5380-thread-1) [n:127.0.0.1:33132_solr    ] o.a.s.m.r.SolrJmxReporter JMX monitoring for 'solr_33132.solr.jetty' (registry 'solr.jetty') enabled at server: com.sun.jmx.mbeanserver.JmxMBeanServer@5ac94aa0
   [junit4]   2> 4322443 INFO  (jetty-launcher-5380-thread-1) [n:127.0.0.1:33132_solr    ] o.a.s.c.CorePropertiesLocator Found 0 core definitions underneath /home/jenkins/jenkins-slave/workspace/Lucene-Solr-NightlyTests-7.x/checkout/solr/build/solr-core/test/J2/temp/solr.cloud.TestTlogReplica_1187D051961EF9D9-001/tempDir-001/node1/.
   [junit4]   2> 4322521 INFO  (SUITE-TestTlogReplica-seed#[1187D051961EF9D9]-worker) [    ] o.a.s.c.c.ZkStateReader Updated live nodes from ZooKeeper... (0) -> (2)
   [junit4]   2> 4322522 INFO  (SUITE-TestTlogReplica-seed#[1187D051961EF9D9]-worker) [    ] o.a.s.c.s.i.ZkClientClusterStateProvider Cluster at 127.0.0.1:37503/solr ready
   [junit4]   2> 4322523 INFO  (SUITE-TestTlogReplica-seed#[1187D051961EF9D9]-worker) [    ] o.a.s.c.TestTlogReplica Using legacyCloud?: true
   [junit4]   2> 4322675 INFO  (qtp1101234141-21761) [n:127.0.0.1:33036_solr    ] o.a.s.h.a.CollectionsHandler Invoked Collection Action :clusterprop with params val=true&name=legacyCloud&action=CLUSTERPROP&wt=javabin&version=2 and sendToOCPQueue=true
   [junit4]   2> 4322676 INFO  (qtp1101234141-21761) [n:127.0.0.1:33036_solr    ] o.a.s.s.HttpSolrCall [admin] webapp=null path=/admin/collections params={val=true&name=legacyCloud&action=CLUSTERPROP&wt=javabin&version=2} status=0 QTime=0
   [junit4]   2> 4322694 INFO  (TEST-TestTlogReplica.testRemoveLeader-seed#[1187D051961EF9D9]) [    ] o.a.s.SolrTestCaseJ4 ###Starting testRemoveLeader
   [junit4]   2> 4322717 INFO  (qtp1101234141-21757) [n:127.0.0.1:33036_solr    ] o.a.s.h.a.CollectionsHandler Invoked Collection Action :create with params pullReplicas=0&replicationFactor=0&collection.configName=conf&maxShardsPerNode=100&name=tlog_replica_test_remove_leader&nrtReplicas=0&action=CREATE&numShards=1&tlogReplicas=2&wt=javabin&version=2 and sendToOCPQueue=true
   [junit4]   2> 4322752 INFO  (OverseerThreadFactory-5017-thread-1-processing-n:127.0.0.1:33036_solr) [n:127.0.0.1:33036_solr    ] o.a.s.c.CreateCollectionCmd Create collection tlog_replica_test_remove_leader
   [junit4]   2> 4323008 INFO  (qtp1101234141-21751) [n:127.0.0.1:33036_solr    ] o.a.s.h.a.CoreAdminOperation core create command qt=/admin/cores&collection.configName=conf&newCollection=true&name=tlog_replica_test_remove_leader_shard1_replica_t1&action=CREATE&numShards=1&collection=tlog_replica_test_remove_leader&shard=shard1&wt=javabin&version=2&replicaType=TLOG
   [junit4]   2> 4323008 INFO  (qtp1101234141-21751) [n:127.0.0.1:33036_solr    ] o.a.s.c.TransientSolrCoreCacheDefault Allocating transient cache for 2147483647 transient cores
   [junit4]   2> 4323168 INFO  (qtp1670006388-21762) [n:127.0.0.1:33132_solr    ] o.a.s.h.a.CoreAdminOperation core create command qt=/admin/cores&collection.configName=conf&newCollection=true&name=tlog_replica_test_remove_leader_shard1_replica_t2&action=CREATE&numShards=1&collection=tlog_replica_test_remove_leader&shard=shard1&wt=javabin&version=2&replicaType=TLOG
   [junit4]   2> 4323168 INFO  (qtp1670006388-21762) [n:127.0.0.1:33132_solr    ] o.a.s.c.TransientSolrCoreCacheDefault Allocating transient cache for 2147483647 transient cores
   [junit4]   2> 4323365 INFO  (zkCallback-5391-thread-2-processing-n:127.0.0.1:33036_solr) [n:127.0.0.1:33036_solr    ] o.a.s.c.c.ZkStateReader A cluster state change: [WatchedEvent state:SyncConnected type:NodeDataChanged path:/collections/tlog_replica_test_remove_leader/state.json] for collection [tlog_replica_test_remove_leader] has occurred - updating... (live nodes size: [2])
   [junit4]   2> 4323365 INFO  (zkCallback-5392-thread-1-processing-n:127.0.0.1:33132_solr) [n:127.0.0.1:33132_solr    ] o.a.s.c.c.ZkStateReader A cluster state change: [WatchedEvent state:SyncConnected type:NodeDataChanged path:/collections/tlog_replica_test_remove_leader/state.json] for collection [tlog_replica_test_remove_leader] has occurred - updating... (live nodes size: [2])
   [junit4]   2> 4324241 INFO  (qtp1101234141-21751) [n:127.0.0.1:33036_solr c:tlog_replica_test_remove_leader s:shard1  x:tlog_replica_test_remove_leader_shard1_replica_t1] o.a.s.c.SolrConfig Using Lucene MatchVersion: 7.1.0
   [junit4]   2> 4324284 INFO  (qtp1101234141-21751) [n:127.0.0.1:33036_solr c:tlog_replica_test_remove_leader s:shard1  x:tlog_replica_test_remove_leader_shard1_replica_t1] o.a.s.s.IndexSchema [tlog_replica_test_remove_leader_shard1_replica_t1] Schema name=minimal
   [junit4]   2> 4324286 INFO  (qtp1101234141-21751) [n:127.0.0.1:33036_solr c:tlog_replica_test_remove_leader s:shard1  x:tlog_replica_test_remove_leader_shard1_replica_t1] o.a.s.s.IndexSchema Loaded schema minimal/1.1 with uniqueid field id
   [junit4]   2> 4324286 INFO  (qtp1101234141-21751) [n:127.0.0.1:33036_solr c:tlog_replica_test_remove_leader s:shard1  x:tlog_replica_test_remove_leader_shard1_replica_t1] o.a.s.c.CoreContainer Creating SolrCore 'tlog_replica_test_remove_leader_shard1_replica_t1' using configuration from collection tlog_replica_test_remove_leader, trusted=true
   [junit4]   2> 4324286 INFO  (qtp1101234141-21751) [n:127.0.0.1:33036_solr c:tlog_replica_test_remove_leader s:shard1  x:tlog_replica_test_remove_leader_shard1_replica_t1] o.a.s.m.r.SolrJmxReporter JMX monitoring for 'solr_33036.solr.core.tlog_replica_test_remove_leader.shard1.replica_t1' (registry 'solr.core.tlog_replica_test_remove_leader.shard1.replica_t1') enabled at server: com.sun.jmx.mbeanserver.JmxMBeanServer@5ac94aa0
   [junit4]   2> 4324287 INFO  (qtp1101234141-21751) [n:127.0.0.1:33036_solr c:tlog_replica_test_remove_leader s:shard1  x:tlog_replica_test_remove_leader_shard1_replica_t1] o.a.s.c.SolrCore solr.RecoveryStrategy.Builder
   [junit4]   2> 4324287 INFO  (qtp1101234141-21751) [n:127.0.0.1:33036_solr c:tlog_replica_test_remove_leader s:shard1  x:tlog_replica_test_remove_leader_shard1_replica_t1] o.a.s.c.SolrCore [[tlog_replica_test_remove_leader_shard1_replica_t1] ] Opening new SolrCore at [/home/jenkins/jenkins-slave/workspace/Lucene-Solr-NightlyTests-7.x/checkout/solr/build/solr-core/test/J2/temp/solr.cloud.TestTlogReplica_1187D051961EF9D9-001/tempDir-001/node2/tlog_replica_test_remove_leader_shard1_replica_t1], dataDir=[/home/jenkins/jenkins-slave/workspace/Lucene-Solr-NightlyTests-7.x/checkout/solr/build/solr-core/test/J2/temp/solr.cloud.TestTlogReplica_1187D051961EF9D9-001/tempDir-001/node2/./tlog_replica_test_remove_leader_shard1_replica_t1/data/]
   [junit4]   2> 4324345 INFO  (qtp1670006388-21762) [n:127.0.0.1:33132_solr c:tlog_replica_test_remove_leader s:shard1  x:tlog_replica_test_remove_leader_shard1_replica_t2] o.a.s.c.SolrConfig Using Lucene MatchVersion: 7.1.0
   [junit4]   2> 4324410 INFO  (qtp1670006388-21762) [n:127.0.0.1:33132_solr c:tlog_replica_test_remove_leader s:shard1  x:tlog_replica_test_remove_leader_shard1_replica_t2] o.a.s.s.IndexSchema [tlog_replica_test_remove_leader_shard1_replica_t2] Schema name=minimal
   [junit4]   2> 4324412 INFO  (qtp1670006388-21762) [n:127.0.0.1:33132_solr c:tlog_replica_test_remove_leader s:shard1  x:tlog_replica_test_remove_leader_shard1_replica_t2] o.a.s.s.IndexSchema Loaded schema minimal/1.1 with uniqueid field id
   [junit4]   2> 4324412 INFO  (qtp1670006388-21762) [n:127.0.0.1:33132_solr c:tlog_replica_test_remove_leader s:shard1  x:tlog_replica_test_remove_leader_shard1_replica_t2] o.a.s.c.CoreContainer Creating SolrCore 'tlog_replica_test_remove_leader_shard1_replica_t2' using configuration from collection tlog_replica_test_remove_leader, trusted=true
   [junit4]   2> 4324425 INFO  (qtp1670006388-21762) [n:127.0.0.1:33132_solr c:tlog_replica_test_remove_leader s:shard1  x:tlog_replica_test_remove_leader_shard1_replica_t2] o.a.s.m.r.SolrJmxReporter JMX monitoring for 'solr_33132.solr.core.tlog_replica_test_remove_leader.shard1.replica_t2' (registry 'solr.core.tlog_replica_test_remove_leader.shard1.replica_t2') enabled at server: com.sun.jmx.mbeanserver.JmxMBeanServer@5ac94aa0
   [junit4]   2> 4324425 INFO  (qtp1670006388-21762) [n:127.0.0.1:33132_solr c:tlog_replica_test_remove_leader s:shard1  x:tlog_replica_test_remove_leader_shard1_replica_t2] o.a.s.c.SolrCore solr.RecoveryStrategy.Builder
   [junit4]   2> 4324426 INFO  (qtp1670006388-21762) [n:127.0.0.1:33132_solr c:tlog_replica_test_remove_leader s:shard1  x:tlog_replica_test_remove_leader_shard1_replica_t2] o.a.s.c.SolrCore [[tlog_replica_test_remove_leader_shard1_replica_t2] ] Opening new SolrCore at [/home/jenkins/jenkins-slave/workspace/Lucene-Solr-NightlyTests-7.x/checkout/solr/build/solr-core/test/J2/temp/solr.cloud.TestTlogReplica_1187D051961EF9D9-001/tempDir-001/node1/tlog_replica_test_remove_leader_shard1_replica_t2], dataDir=[/home/jenkins/jenkins-slave/workspace/Lucene-Solr-NightlyTests-7.x/checkout/solr/build/solr-core/test/J2/temp/solr.cloud.TestTlogReplica_1187D051961EF9D9-001/tempDir-001/node1/./tlog_replica_test_remove_leader_shard1_replica_t2/data/]
   [junit4]   2> 4324499 INFO  (qtp1101234141-21751) [n:127.0.0.1:33036_solr c:tlog_replica_test_remove_leader s:shard1  x:tlog_replica_test_remove_leader_shard1_replica_t1] o.a.s.u.UpdateHandler Using UpdateLog implementation: org.apache.solr.update.UpdateLog
   [junit4]   2> 4324499 INFO  (qtp1101234141-21751) [n:127.0.0.1:33036_solr c:tlog_replica_test_remove_leader s:shard1  x:tlog_replica_test_remove_leader_shard1_replica_t1] o.a.s.u.UpdateLog Initializing UpdateLog: dataDir=null defaultSyncLevel=FLUSH numRecordsToKeep=100 maxNumLogsToKeep=10 numVersionBuckets=65536
   [junit4]   2> 4324592 INFO  (qtp1101234141-21751) [n:127.0.0.1:33036_solr c:tlog_replica_test_remove_leader s:shard1  x:tlog_replica_test_remove_leader_shard1_replica_t1] o.a.s.u.CommitTracker Hard AutoCommit: disabled
   [junit4]   2> 4324592 INFO  (qtp1101234141-21751) [n:127.0.0.1:33036_solr c:tlog_replica_test_remove_leader s:shard1  x:tlog_replica_test_remove_leader_shard1_replica_t1] o.a.s.u.CommitTracker Soft AutoCommit: disabled
   [junit4]   2> 4324594 INFO  (qtp1101234141-21751) [n:127.0.0.1:33036_solr c:tlog_replica_test_remove_leader s:shard1  x:tlog_replica_test_remove_leader_shard1_replica_t1] o.a.s.s.SolrIndexSearcher Opening [Searcher@59d9314b[tlog_replica_test_remove_leader_shard1_replica_t1] main]
   [junit4]   2> 4324594 INFO  (qtp1101234141-21751) [n:127.0.0.1:33036_solr c:tlog_replica_test_remove_leader s:shard1  x:tlog_replica_test_remove_leader_shard1_replica_t1] o.a.s.r.ManagedResourceStorage Configured ZooKeeperStorageIO with znodeBase: /configs/conf
   [junit4]   2> 4324612 INFO  (qtp1101234141-21751) [n:127.0.0.1:33036_solr c:tlog_replica_test_remove_leader s:shard1  x:tlog_replica_test_remove_leader_shard1_replica_t1] o.a.s.r.ManagedResourceStorage Loaded null at path _rest_managed.json using ZooKeeperStorageIO:path=/configs/conf
   [junit4]   2> 4324612 INFO  (qtp1101234141-21751) [n:127.0.0.1:33036_solr c:tlog_replica_test_remove_leader s:shard1  x:tlog_replica_test_remove_leader_shard1_replica_t1] o.a.s.h.ReplicationHandler Commits will be reserved for 10000ms.
   [junit4]   2> 4324612 INFO  (qtp1101234141-21751) [n:127.0.0.1:33036_solr c:tlog_replica_test_remove_leader s:shard1  x:tlog_replica_test_remove_leader_shard1_replica_t1] o.a.s.u.UpdateLog Could not find max version in index or recent updates, using new clock 1580565691902197760
   [junit4]   2> 4324647 INFO  (searcherExecutor-5022-thread-1-processing-n:127.0.0.1:33036_solr x:tlog_replica_test_remove_leader_shard1_replica_t1 s:shard1 c:tlog_replica_test_remove_leader) [n:127.0.0.1:33036_solr c:tlog_replica_test_remove_leader s:shard1  x:tlog_replica_test_remove_leader_shard1_replica_t1] o.a.s.c.SolrCore [tlog_replica_test_remove_leader_shard1_replica_t1] Registered new searcher Searcher@59d9314b[tlog_replica_test_remove_leader_shard1_replica_t1] main{ExitableDirectoryReader(UninvertingDirectoryReader())}
   [junit4]   2> 4324662 INFO  (qtp1101234141-21751) [n:127.0.0.1:33036_solr c:tlog_replica_test_remove_leader s:shard1  x:tlog_replica_test_remove_leader_shard1_replica_t1] o.a.s.c.ShardLeaderElectionContext Waiting until we see more replicas up for shard shard1: total=2 found=1 timeoutin=9999ms
   [junit4]   2> 4324722 INFO  (qtp1670006388-21762) [n:127.0.0.1:33132_solr c:tlog_replica_test_remove_leader s:shard1  x:tlog_replica_test_remove_leader_shard1_replica_t2] o.a.s.u.UpdateHandler Using UpdateLog implementation: org.apache.solr.update.UpdateLog
   [junit4]   2> 4324722 INFO  (qtp1670006388-21762) [n:127.0.0.1:33132_solr c:tlog_replica_test_remove_leader s:shard1  x:tlog_replica_test_remove_leader_shard1_replica_t2] o.a.s.u.UpdateLog Initializing UpdateLog: dataDir=null defaultSyncLevel=FLUSH numRecordsToKeep=100 maxNumLogsToKeep=10 numVersionBuckets=65536
   [junit4]   2> 4324723 INFO  (qtp1670006388-21762) [n:127.0.0.1:33132_solr c:tlog_replica_test_remove_leader s:shard1  x:tlog_replica_test_remove_leader_shard1_replica_t2] o.a.s.u.CommitTracker Hard AutoCommit: disabled
   [junit4]   2> 4324723 INFO  (qtp1670006388-21762) [n:127.0.0.1:33132_solr c:tlog_replica_test_remove_leader s:shard1  x:tlog_replica_test_remove_leader_shard1_replica_t2] o.a.s.u.CommitTracker Soft 

[...truncated too long message...]

	13	/solr/collections
   [junit4]   2> 	8	/solr/live_nodes
   [junit4]   2> 	5	/solr/overseer/queue
   [junit4]   2> 	5	/solr/overseer/collection-queue-work
   [junit4]   2> 	3	/solr/overseer/queue-work
   [junit4]   2> 
   [junit4]   2> NOTE: download the large Jenkins line-docs file by running 'ant get-jenkins-line-docs' in the lucene directory.
   [junit4]   2> NOTE: reproduce with: ant test  -Dtestcase=SharedFSAutoReplicaFailoverTest -Dtests.method=test -Dtests.seed=1187D051961EF9D9 -Dtests.multiplier=2 -Dtests.nightly=true -Dtests.slow=true -Dtests.linedocsfile=/home/jenkins/jenkins-slave/workspace/Lucene-Solr-NightlyTests-7.x/test-data/enwiki.random.lines.txt -Dtests.locale=es-MX -Dtests.timezone=Europe/Belfast -Dtests.asserts=true -Dtests.file.encoding=UTF-8
   [junit4] FAILURE  117s J2 | SharedFSAutoReplicaFailoverTest.test <<<
   [junit4]    > Throwable #1: java.lang.AssertionError: expected:<2> but was:<3>
   [junit4]    > 	at __randomizedtesting.SeedInfo.seed([1187D051961EF9D9:99D3EF8B38E29421]:0)
   [junit4]    > 	at org.apache.solr.cloud.SharedFSAutoReplicaFailoverTest.assertSliceAndReplicaCount(SharedFSAutoReplicaFailoverTest.java:403)
   [junit4]    > 	at org.apache.solr.cloud.SharedFSAutoReplicaFailoverTest.testBasics(SharedFSAutoReplicaFailoverTest.java:248)
   [junit4]    > 	at org.apache.solr.cloud.SharedFSAutoReplicaFailoverTest.test(SharedFSAutoReplicaFailoverTest.java:136)
   [junit4]    > 	at org.apache.solr.BaseDistributedSearchTestCase$ShardsRepeatRule$ShardsFixedStatement.callStatement(BaseDistributedSearchTestCase.java:993)
   [junit4]    > 	at org.apache.solr.BaseDistributedSearchTestCase$ShardsRepeatRule$ShardsStatement.evaluate(BaseDistributedSearchTestCase.java:968)
   [junit4]    > 	at java.lang.Thread.run(Thread.java:748)
   [junit4]   2> 8097509 WARN  (SUITE-SharedFSAutoReplicaFailoverTest-seed#[1187D051961EF9D9]-worker) [    ] o.a.h.h.s.d.DirectoryScanner DirectoryScanner: shutdown has been called
   [junit4]   2> 8097568 INFO  (SUITE-SharedFSAutoReplicaFailoverTest-seed#[1187D051961EF9D9]-worker) [    ] o.m.log Stopped HttpServer2$SelectChannelConnectorWithSafeStartup@localhost:0
   [junit4]   2> 8097669 WARN  (DataNode: [[[DISK]file:/home/jenkins/jenkins-slave/workspace/Lucene-Solr-NightlyTests-7.x/checkout/solr/build/solr-core/test/J2/temp/solr.cloud.SharedFSAutoReplicaFailoverTest_1187D051961EF9D9-001/tempDir-001/hdfsBaseDir/data/data3/, [DISK]file:/home/jenkins/jenkins-slave/workspace/Lucene-Solr-NightlyTests-7.x/checkout/solr/build/solr-core/test/J2/temp/solr.cloud.SharedFSAutoReplicaFailoverTest_1187D051961EF9D9-001/tempDir-001/hdfsBaseDir/data/data4/]]  heartbeating to lucene2-us-west.apache.org/127.0.0.1:32902) [    ] o.a.h.h.s.d.IncrementalBlockReportManager IncrementalBlockReportManager interrupted
   [junit4]   2> 8097669 WARN  (DataNode: [[[DISK]file:/home/jenkins/jenkins-slave/workspace/Lucene-Solr-NightlyTests-7.x/checkout/solr/build/solr-core/test/J2/temp/solr.cloud.SharedFSAutoReplicaFailoverTest_1187D051961EF9D9-001/tempDir-001/hdfsBaseDir/data/data3/, [DISK]file:/home/jenkins/jenkins-slave/workspace/Lucene-Solr-NightlyTests-7.x/checkout/solr/build/solr-core/test/J2/temp/solr.cloud.SharedFSAutoReplicaFailoverTest_1187D051961EF9D9-001/tempDir-001/hdfsBaseDir/data/data4/]]  heartbeating to lucene2-us-west.apache.org/127.0.0.1:32902) [    ] o.a.h.h.s.d.DataNode Ending block pool service for: Block pool BP-957641662-127.0.0.1-1507348554410 (Datanode Uuid cb2b8202-cfb8-4e9e-89ee-706fac124a74) service to lucene2-us-west.apache.org/127.0.0.1:32902
   [junit4]   2> 8097670 WARN  (SUITE-SharedFSAutoReplicaFailoverTest-seed#[1187D051961EF9D9]-worker) [    ] o.a.h.h.s.d.DirectoryScanner DirectoryScanner: shutdown has been called
   [junit4]   2> 8097718 INFO  (SUITE-SharedFSAutoReplicaFailoverTest-seed#[1187D051961EF9D9]-worker) [    ] o.m.log Stopped HttpServer2$SelectChannelConnectorWithSafeStartup@localhost:0
   [junit4]   2> 8097819 WARN  (DataNode: [[[DISK]file:/home/jenkins/jenkins-slave/workspace/Lucene-Solr-NightlyTests-7.x/checkout/solr/build/solr-core/test/J2/temp/solr.cloud.SharedFSAutoReplicaFailoverTest_1187D051961EF9D9-001/tempDir-001/hdfsBaseDir/data/data1/, [DISK]file:/home/jenkins/jenkins-slave/workspace/Lucene-Solr-NightlyTests-7.x/checkout/solr/build/solr-core/test/J2/temp/solr.cloud.SharedFSAutoReplicaFailoverTest_1187D051961EF9D9-001/tempDir-001/hdfsBaseDir/data/data2/]]  heartbeating to lucene2-us-west.apache.org/127.0.0.1:32902) [    ] o.a.h.h.s.d.IncrementalBlockReportManager IncrementalBlockReportManager interrupted
   [junit4]   2> 8097820 WARN  (DataNode: [[[DISK]file:/home/jenkins/jenkins-slave/workspace/Lucene-Solr-NightlyTests-7.x/checkout/solr/build/solr-core/test/J2/temp/solr.cloud.SharedFSAutoReplicaFailoverTest_1187D051961EF9D9-001/tempDir-001/hdfsBaseDir/data/data1/, [DISK]file:/home/jenkins/jenkins-slave/workspace/Lucene-Solr-NightlyTests-7.x/checkout/solr/build/solr-core/test/J2/temp/solr.cloud.SharedFSAutoReplicaFailoverTest_1187D051961EF9D9-001/tempDir-001/hdfsBaseDir/data/data2/]]  heartbeating to lucene2-us-west.apache.org/127.0.0.1:32902) [    ] o.a.h.h.s.d.DataNode Ending block pool service for: Block pool BP-957641662-127.0.0.1-1507348554410 (Datanode Uuid 2c39b754-8535-450e-87a5-b00391a327f0) service to lucene2-us-west.apache.org/127.0.0.1:32902
   [junit4]   2> 8097853 INFO  (SUITE-SharedFSAutoReplicaFailoverTest-seed#[1187D051961EF9D9]-worker) [    ] o.m.log Stopped HttpServer2$SelectChannelConnectorWithSafeStartup@lucene2-us-west.apache.org:0
   [junit4]   2> NOTE: leaving temporary files on disk at: /home/jenkins/jenkins-slave/workspace/Lucene-Solr-NightlyTests-7.x/checkout/solr/build/solr-core/test/J2/temp/solr.cloud.SharedFSAutoReplicaFailoverTest_1187D051961EF9D9-001
   [junit4]   2> Oct 07, 2017 3:57:59 AM com.carrotsearch.randomizedtesting.ThreadLeakControl checkThreadLeaks
   [junit4]   2> WARNING: Will linger awaiting termination of 34 leaked thread(s).
   [junit4]   2> NOTE: test params are: codec=CheapBastard, sim=RandomSimilarity(queryNorm=false): {}, locale=es-MX, timezone=Europe/Belfast
   [junit4]   2> NOTE: Linux 4.4.0-83-generic amd64/Oracle Corporation 1.8.0_144 (64-bit)/cpus=4,threads=2,free=192798200,total=523239424
   [junit4]   2> NOTE: All tests run in this JVM: [TestNumericTokenStream, TestIndexSearcher, TestLegacyNumericRangeQueryBuilder, TestSolrCoreProperties, TestShortCircuitedRequests, TestConfigSetsAPI, PolyFieldTest, TestSolrCoreParser, RankQueryTest, TestRebalanceLeaders, AutoCommitTest, CollectionsAPISolrJTest, SuggesterFSTTest, TestDownShardTolerantSearch, JSONWriterTest, TestMinMaxOnMultiValuedField, BlobRepositoryCloudTest, ReplaceNodeTest, TestTrie, TestConfigsApi, PropertiesRequestHandlerTest, DistributedFacetPivotWhiteBoxTest, TestCustomDocTransformer, UtilsToolTest, BadIndexSchemaTest, OverriddenZkACLAndCredentialsProvidersTest, DateMathParserTest, DeleteInactiveReplicaTest, TestReplicationHandlerBackup, SpellPossibilityIteratorTest, TestNamedUpdateProcessors, PeerSyncReplicationTest, TestFieldCollectionResource, TestFieldTypeResource, DistributedExpandComponentTest, TestXmlQParserPlugin, TestCustomStream, DocValuesMissingTest, TestRecoveryHdfs, XsltUpdateRequestHandlerTest, TestLegacyFieldCache, CursorMarkTest, TestTrackingShardHandlerFactory, DeleteReplicaTest, TestSolrQueryResponse, StatsReloadRaceTest, BaseCdcrDistributedZkTest, TestSchemaManager, ResponseLogComponentTest, TestEmbeddedSolrServerConstructors, TestPullReplicaErrorHandling, CopyFieldTest, CdcrUpdateLogTest, ConfigureRecoveryStrategyTest, HttpSolrCallGetCoreTest, PrimitiveFieldTypeTest, PingRequestHandlerTest, SparseHLLTest, V2StandaloneTest, HdfsBasicDistributedZk2Test, TestReversedWildcardFilterFactory, TestFastWriter, TestExpandComponent, HdfsDirectoryTest, TestSuggestSpellingConverter, FullHLLTest, TestJsonRequest, DistanceUnitsTest, LeaderFailoverAfterPartitionTest, DirectUpdateHandlerTest, TestStreamBody, TestManagedSchemaAPI, UpdateLogTest, TestStressUserVersions, TestGroupingSearch, ShardSplitTest, TestLeaderElectionWithEmptyReplica, ConnectionReuseTest, TestSolrConfigHandlerConcurrent, SearchHandlerTest, DocExpirationUpdateProcessorFactoryTest, SuggesterTest, TestUniqueKeyFieldResource, TestSimpleQParserPlugin, SpellCheckCollatorWithCollapseTest, TestHdfsUpdateLog, ForceLeaderTest, ReturnFieldsTest, CoreMergeIndexesAdminHandlerTest, OverseerRolesTest, TestClusterProperties, HdfsRecoverLeaseTest, TestBulkSchemaConcurrent, CleanupOldIndexTest, ChangedSchemaMergeTest, BlockCacheTest, UnloadDistributedZkTest, SubstringBytesRefFilterTest, ZkFailoverTest, OverseerTest, FullSolrCloudDistribCmdsTest, LeaderInitiatedRecoveryOnShardRestartTest, PKIAuthenticationIntegrationTest, TestSolrCloudWithDelegationTokens, TestRuleBasedAuthorizationPlugin, MultiTermTest, SolrMetricReporterTest, TestTlogReplica, TestUnifiedSolrHighlighter, ReplicaListTransformerTest, TestLMJelinekMercerSimilarityFactory, TestRawResponseWriter, TestUseDocValuesAsStored2, DistribCursorPagingTest, ConnectionManagerTest, RollingRestartTest, PreAnalyzedUpdateProcessorTest, ClassificationUpdateProcessorIntegrationTest, DirectUpdateHandlerOptimizeTest, ChaosMonkeySafeLeaderTest, CollectionsAPIDistributedZkTest, BasicZkTest, RecoveryZkTest, TestReplicationHandler, TestRangeQuery, SolrRequestParserTest, SolrCoreCheckLockOnStartupTest, TestAtomicUpdateErrorCases, SortByFunctionTest, DocValuesMultiTest, TestSolrDeletionPolicy1, TestSurroundQueryParser, DisMaxRequestHandlerTest, RequestHandlersTest, DocumentBuilderTest, MoreLikeThisHandlerTest, FieldAnalysisRequestHandlerTest, FastVectorHighlighterTest, SolrPluginUtilsTest, UpdateRequestProcessorFactoryTest, MBeansHandlerTest, TestStressRecovery, CdcrReplicationHandlerTest, ChaosMonkeyNothingIsSafeWithPullReplicasTest, ConcurrentDeleteAndCreateCollectionTest, SharedFSAutoReplicaFailoverTest]
   [junit4] Completed [734/734 (5!)] on J2 in 134.55s, 1 test, 1 failure <<< FAILURES!

[...truncated 46862 lines...]

Mime
View raw message