lucene-dev mailing list archives

Site index · List index
Message view « Date » · « Thread »
Top « Date » · « Thread »
From Policeman Jenkins Server <jenk...@thetaphi.de>
Subject [JENKINS] Lucene-Solr-master-Windows (32bit/jdk1.8.0_144) - Build # 6970 - Still Unstable!
Date Sun, 22 Oct 2017 00:22:37 GMT
Build: https://jenkins.thetaphi.de/job/Lucene-Solr-master-Windows/6970/
Java: 32bit/jdk1.8.0_144 -client -XX:+UseSerialGC

2 tests failed.
FAILED:  org.apache.solr.cloud.autoscaling.TriggerIntegrationTest.testTriggerThrottling

Error Message:
Both triggers should have fired by now

Stack Trace:
java.lang.AssertionError: Both triggers should have fired by now
	at __randomizedtesting.SeedInfo.seed([1512AC03D11329CE:EE30042603B9CA5C]:0)
	at org.junit.Assert.fail(Assert.java:93)
	at org.apache.solr.cloud.autoscaling.TriggerIntegrationTest.testTriggerThrottling(TriggerIntegrationTest.java:194)
	at sun.reflect.NativeMethodAccessorImpl.invoke0(Native Method)
	at sun.reflect.NativeMethodAccessorImpl.invoke(NativeMethodAccessorImpl.java:62)
	at sun.reflect.DelegatingMethodAccessorImpl.invoke(DelegatingMethodAccessorImpl.java:43)
	at java.lang.reflect.Method.invoke(Method.java:498)
	at com.carrotsearch.randomizedtesting.RandomizedRunner.invoke(RandomizedRunner.java:1737)
	at com.carrotsearch.randomizedtesting.RandomizedRunner$8.evaluate(RandomizedRunner.java:934)
	at com.carrotsearch.randomizedtesting.RandomizedRunner$9.evaluate(RandomizedRunner.java:970)
	at com.carrotsearch.randomizedtesting.RandomizedRunner$10.evaluate(RandomizedRunner.java:984)
	at com.carrotsearch.randomizedtesting.rules.SystemPropertiesRestoreRule$1.evaluate(SystemPropertiesRestoreRule.java:57)
	at org.apache.lucene.util.TestRuleSetupTeardownChained$1.evaluate(TestRuleSetupTeardownChained.java:49)
	at org.apache.lucene.util.AbstractBeforeAfterRule$1.evaluate(AbstractBeforeAfterRule.java:45)
	at org.apache.lucene.util.TestRuleThreadAndTestName$1.evaluate(TestRuleThreadAndTestName.java:48)
	at org.apache.lucene.util.TestRuleIgnoreAfterMaxFailures$1.evaluate(TestRuleIgnoreAfterMaxFailures.java:64)
	at org.apache.lucene.util.TestRuleMarkFailure$1.evaluate(TestRuleMarkFailure.java:47)
	at com.carrotsearch.randomizedtesting.rules.StatementAdapter.evaluate(StatementAdapter.java:36)
	at com.carrotsearch.randomizedtesting.ThreadLeakControl$StatementRunner.run(ThreadLeakControl.java:368)
	at com.carrotsearch.randomizedtesting.ThreadLeakControl.forkTimeoutingTask(ThreadLeakControl.java:817)
	at com.carrotsearch.randomizedtesting.ThreadLeakControl$3.evaluate(ThreadLeakControl.java:468)
	at com.carrotsearch.randomizedtesting.RandomizedRunner.runSingleTest(RandomizedRunner.java:943)
	at com.carrotsearch.randomizedtesting.RandomizedRunner$5.evaluate(RandomizedRunner.java:829)
	at com.carrotsearch.randomizedtesting.RandomizedRunner$6.evaluate(RandomizedRunner.java:879)
	at com.carrotsearch.randomizedtesting.RandomizedRunner$7.evaluate(RandomizedRunner.java:890)
	at com.carrotsearch.randomizedtesting.rules.StatementAdapter.evaluate(StatementAdapter.java:36)
	at com.carrotsearch.randomizedtesting.rules.SystemPropertiesRestoreRule$1.evaluate(SystemPropertiesRestoreRule.java:57)
	at org.apache.lucene.util.AbstractBeforeAfterRule$1.evaluate(AbstractBeforeAfterRule.java:45)
	at com.carrotsearch.randomizedtesting.rules.StatementAdapter.evaluate(StatementAdapter.java:36)
	at org.apache.lucene.util.TestRuleStoreClassName$1.evaluate(TestRuleStoreClassName.java:41)
	at com.carrotsearch.randomizedtesting.rules.NoShadowingOrOverridesOnMethodsRule$1.evaluate(NoShadowingOrOverridesOnMethodsRule.java:40)
	at com.carrotsearch.randomizedtesting.rules.NoShadowingOrOverridesOnMethodsRule$1.evaluate(NoShadowingOrOverridesOnMethodsRule.java:40)
	at com.carrotsearch.randomizedtesting.rules.StatementAdapter.evaluate(StatementAdapter.java:36)
	at com.carrotsearch.randomizedtesting.rules.StatementAdapter.evaluate(StatementAdapter.java:36)
	at com.carrotsearch.randomizedtesting.rules.StatementAdapter.evaluate(StatementAdapter.java:36)
	at org.apache.lucene.util.TestRuleAssertionsRequired$1.evaluate(TestRuleAssertionsRequired.java:53)
	at org.apache.lucene.util.TestRuleMarkFailure$1.evaluate(TestRuleMarkFailure.java:47)
	at org.apache.lucene.util.TestRuleIgnoreAfterMaxFailures$1.evaluate(TestRuleIgnoreAfterMaxFailures.java:64)
	at org.apache.lucene.util.TestRuleIgnoreTestSuites$1.evaluate(TestRuleIgnoreTestSuites.java:54)
	at com.carrotsearch.randomizedtesting.rules.StatementAdapter.evaluate(StatementAdapter.java:36)
	at com.carrotsearch.randomizedtesting.ThreadLeakControl$StatementRunner.run(ThreadLeakControl.java:368)
	at java.lang.Thread.run(Thread.java:748)


FAILED:  org.apache.solr.handler.admin.AutoscalingHistoryHandlerTest.testHistory

Error Message:
action did not execute

Stack Trace:
java.lang.AssertionError: action did not execute
	at __randomizedtesting.SeedInfo.seed([1512AC03D11329CE:78EE08FE6B5BD6C9]:0)
	at org.junit.Assert.fail(Assert.java:93)
	at org.junit.Assert.assertTrue(Assert.java:43)
	at org.apache.solr.handler.admin.AutoscalingHistoryHandlerTest.testHistory(AutoscalingHistoryHandlerTest.java:260)
	at sun.reflect.NativeMethodAccessorImpl.invoke0(Native Method)
	at sun.reflect.NativeMethodAccessorImpl.invoke(NativeMethodAccessorImpl.java:62)
	at sun.reflect.DelegatingMethodAccessorImpl.invoke(DelegatingMethodAccessorImpl.java:43)
	at java.lang.reflect.Method.invoke(Method.java:498)
	at com.carrotsearch.randomizedtesting.RandomizedRunner.invoke(RandomizedRunner.java:1737)
	at com.carrotsearch.randomizedtesting.RandomizedRunner$8.evaluate(RandomizedRunner.java:934)
	at com.carrotsearch.randomizedtesting.RandomizedRunner$9.evaluate(RandomizedRunner.java:970)
	at com.carrotsearch.randomizedtesting.RandomizedRunner$10.evaluate(RandomizedRunner.java:984)
	at com.carrotsearch.randomizedtesting.rules.SystemPropertiesRestoreRule$1.evaluate(SystemPropertiesRestoreRule.java:57)
	at org.apache.lucene.util.TestRuleSetupTeardownChained$1.evaluate(TestRuleSetupTeardownChained.java:49)
	at org.apache.lucene.util.AbstractBeforeAfterRule$1.evaluate(AbstractBeforeAfterRule.java:45)
	at org.apache.lucene.util.TestRuleThreadAndTestName$1.evaluate(TestRuleThreadAndTestName.java:48)
	at org.apache.lucene.util.TestRuleIgnoreAfterMaxFailures$1.evaluate(TestRuleIgnoreAfterMaxFailures.java:64)
	at org.apache.lucene.util.TestRuleMarkFailure$1.evaluate(TestRuleMarkFailure.java:47)
	at com.carrotsearch.randomizedtesting.rules.StatementAdapter.evaluate(StatementAdapter.java:36)
	at com.carrotsearch.randomizedtesting.ThreadLeakControl$StatementRunner.run(ThreadLeakControl.java:368)
	at com.carrotsearch.randomizedtesting.ThreadLeakControl.forkTimeoutingTask(ThreadLeakControl.java:817)
	at com.carrotsearch.randomizedtesting.ThreadLeakControl$3.evaluate(ThreadLeakControl.java:468)
	at com.carrotsearch.randomizedtesting.RandomizedRunner.runSingleTest(RandomizedRunner.java:943)
	at com.carrotsearch.randomizedtesting.RandomizedRunner$5.evaluate(RandomizedRunner.java:829)
	at com.carrotsearch.randomizedtesting.RandomizedRunner$6.evaluate(RandomizedRunner.java:879)
	at com.carrotsearch.randomizedtesting.RandomizedRunner$7.evaluate(RandomizedRunner.java:890)
	at com.carrotsearch.randomizedtesting.rules.StatementAdapter.evaluate(StatementAdapter.java:36)
	at com.carrotsearch.randomizedtesting.rules.SystemPropertiesRestoreRule$1.evaluate(SystemPropertiesRestoreRule.java:57)
	at org.apache.lucene.util.AbstractBeforeAfterRule$1.evaluate(AbstractBeforeAfterRule.java:45)
	at com.carrotsearch.randomizedtesting.rules.StatementAdapter.evaluate(StatementAdapter.java:36)
	at org.apache.lucene.util.TestRuleStoreClassName$1.evaluate(TestRuleStoreClassName.java:41)
	at com.carrotsearch.randomizedtesting.rules.NoShadowingOrOverridesOnMethodsRule$1.evaluate(NoShadowingOrOverridesOnMethodsRule.java:40)
	at com.carrotsearch.randomizedtesting.rules.NoShadowingOrOverridesOnMethodsRule$1.evaluate(NoShadowingOrOverridesOnMethodsRule.java:40)
	at com.carrotsearch.randomizedtesting.rules.StatementAdapter.evaluate(StatementAdapter.java:36)
	at com.carrotsearch.randomizedtesting.rules.StatementAdapter.evaluate(StatementAdapter.java:36)
	at com.carrotsearch.randomizedtesting.rules.StatementAdapter.evaluate(StatementAdapter.java:36)
	at org.apache.lucene.util.TestRuleAssertionsRequired$1.evaluate(TestRuleAssertionsRequired.java:53)
	at org.apache.lucene.util.TestRuleMarkFailure$1.evaluate(TestRuleMarkFailure.java:47)
	at org.apache.lucene.util.TestRuleIgnoreAfterMaxFailures$1.evaluate(TestRuleIgnoreAfterMaxFailures.java:64)
	at org.apache.lucene.util.TestRuleIgnoreTestSuites$1.evaluate(TestRuleIgnoreTestSuites.java:54)
	at com.carrotsearch.randomizedtesting.rules.StatementAdapter.evaluate(StatementAdapter.java:36)
	at com.carrotsearch.randomizedtesting.ThreadLeakControl$StatementRunner.run(ThreadLeakControl.java:368)
	at java.lang.Thread.run(Thread.java:748)




Build Log:
[...truncated 11711 lines...]
   [junit4] Suite: org.apache.solr.handler.admin.AutoscalingHistoryHandlerTest
   [junit4]   2> 177381 INFO  (SUITE-AutoscalingHistoryHandlerTest-seed#[1512AC03D11329CE]-worker) [    ] o.a.s.SolrTestCaseJ4 SecureRandom sanity checks: test.solr.allowed.securerandom=null & java.security.egd=file:/dev/./urandom
   [junit4]   2> Creating dataDir: C:\Users\jenkins\workspace\Lucene-Solr-master-Windows\solr\build\solr-core\test\J0\temp\solr.handler.admin.AutoscalingHistoryHandlerTest_1512AC03D11329CE-001\init-core-data-001
   [junit4]   2> 177390 WARN  (SUITE-AutoscalingHistoryHandlerTest-seed#[1512AC03D11329CE]-worker) [    ] o.a.s.SolrTestCaseJ4 startTrackingSearchers: numOpens=7 numCloses=7
   [junit4]   2> 177390 INFO  (SUITE-AutoscalingHistoryHandlerTest-seed#[1512AC03D11329CE]-worker) [    ] o.a.s.SolrTestCaseJ4 Using PointFields (NUMERIC_POINTS_SYSPROP=true) w/NUMERIC_DOCVALUES_SYSPROP=true
   [junit4]   2> 177398 INFO  (SUITE-AutoscalingHistoryHandlerTest-seed#[1512AC03D11329CE]-worker) [    ] o.a.s.SolrTestCaseJ4 Randomized ssl (false) and clientAuth (false) via: @org.apache.solr.util.RandomizeSSL(reason=, value=NaN, ssl=NaN, clientAuth=NaN)
   [junit4]   2> 177402 INFO  (SUITE-AutoscalingHistoryHandlerTest-seed#[1512AC03D11329CE]-worker) [    ] o.a.s.c.MiniSolrCloudCluster Starting cluster of 3 servers in C:\Users\jenkins\workspace\Lucene-Solr-master-Windows\solr\build\solr-core\test\J0\temp\solr.handler.admin.AutoscalingHistoryHandlerTest_1512AC03D11329CE-001\tempDir-001
   [junit4]   2> 177402 INFO  (SUITE-AutoscalingHistoryHandlerTest-seed#[1512AC03D11329CE]-worker) [    ] o.a.s.c.ZkTestServer STARTING ZK TEST SERVER
   [junit4]   2> 177405 INFO  (Thread-237) [    ] o.a.s.c.ZkTestServer client port:0.0.0.0/0.0.0.0:0
   [junit4]   2> 177405 INFO  (Thread-237) [    ] o.a.s.c.ZkTestServer Starting server
   [junit4]   2> 177411 ERROR (Thread-237) [    ] o.a.z.s.ZooKeeperServer ZKShutdownHandler is not registered, so ZooKeeper server won't take any action on ERROR or SHUTDOWN server state changes
   [junit4]   2> 177504 INFO  (SUITE-AutoscalingHistoryHandlerTest-seed#[1512AC03D11329CE]-worker) [    ] o.a.s.c.ZkTestServer start zk server on port:49262
   [junit4]   2> 177529 WARN  (NIOServerCxn.Factory:0.0.0.0/0.0.0.0:0) [    ] o.a.z.s.NIOServerCnxn caught end of stream exception
   [junit4]   2> EndOfStreamException: Unable to read additional data from client sessionid 0x15f41339b730000, likely client has closed socket
   [junit4]   2> 	at org.apache.zookeeper.server.NIOServerCnxn.doIO(NIOServerCnxn.java:239)
   [junit4]   2> 	at org.apache.zookeeper.server.NIOServerCnxnFactory.run(NIOServerCnxnFactory.java:203)
   [junit4]   2> 	at java.lang.Thread.run(Thread.java:748)
   [junit4]   2> 177532 INFO  (jetty-launcher-402-thread-2) [    ] o.e.j.s.Server jetty-9.3.20.v20170531
   [junit4]   2> 177538 INFO  (jetty-launcher-402-thread-2) [    ] o.e.j.s.h.ContextHandler Started o.e.j.s.ServletContextHandler@11f493b{/solr,null,AVAILABLE}
   [junit4]   2> 177543 INFO  (jetty-launcher-402-thread-3) [    ] o.e.j.s.Server jetty-9.3.20.v20170531
   [junit4]   2> 177545 INFO  (jetty-launcher-402-thread-3) [    ] o.e.j.s.h.ContextHandler Started o.e.j.s.ServletContextHandler@1b108ff{/solr,null,AVAILABLE}
   [junit4]   2> 177549 INFO  (jetty-launcher-402-thread-3) [    ] o.e.j.s.AbstractConnector Started ServerConnector@1c2776a{HTTP/1.1,[http/1.1]}{127.0.0.1:49272}
   [junit4]   2> 177549 INFO  (jetty-launcher-402-thread-3) [    ] o.e.j.s.Server Started @184726ms
   [junit4]   2> 177549 INFO  (jetty-launcher-402-thread-3) [    ] o.a.s.c.s.e.JettySolrRunner Jetty properties: {hostContext=/solr, hostPort=49272}
   [junit4]   2> 177549 ERROR (jetty-launcher-402-thread-3) [    ] o.a.s.u.StartupLoggingUtils Missing Java Option solr.log.dir. Logging may be missing or incomplete.
   [junit4]   2> 177549 INFO  (jetty-launcher-402-thread-3) [    ] o.a.s.s.SolrDispatchFilter  ___      _       Welcome to Apache Solr™ version 8.0.0
   [junit4]   2> 177549 INFO  (jetty-launcher-402-thread-2) [    ] o.e.j.s.AbstractConnector Started ServerConnector@1ec68b{HTTP/1.1,[http/1.1]}{127.0.0.1:49269}
   [junit4]   2> 177549 INFO  (jetty-launcher-402-thread-3) [    ] o.a.s.s.SolrDispatchFilter / __| ___| |_ _   Starting in cloud mode on port null
   [junit4]   2> 177549 INFO  (jetty-launcher-402-thread-2) [    ] o.e.j.s.Server Started @184727ms
   [junit4]   2> 177549 INFO  (jetty-launcher-402-thread-2) [    ] o.a.s.c.s.e.JettySolrRunner Jetty properties: {hostContext=/solr, hostPort=49269}
   [junit4]   2> 177549 ERROR (jetty-launcher-402-thread-2) [    ] o.a.s.u.StartupLoggingUtils Missing Java Option solr.log.dir. Logging may be missing or incomplete.
   [junit4]   2> 177549 INFO  (jetty-launcher-402-thread-3) [    ] o.a.s.s.SolrDispatchFilter \__ \/ _ \ | '_|  Install dir: null, Default config dir: null
   [junit4]   2> 177567 INFO  (jetty-launcher-402-thread-3) [    ] o.a.s.s.SolrDispatchFilter |___/\___/_|_|    Start time: 2017-10-21T23:10:22.225Z
   [junit4]   2> 177567 INFO  (jetty-launcher-402-thread-2) [    ] o.a.s.s.SolrDispatchFilter  ___      _       Welcome to Apache Solr™ version 8.0.0
   [junit4]   2> 177568 INFO  (jetty-launcher-402-thread-2) [    ] o.a.s.s.SolrDispatchFilter / __| ___| |_ _   Starting in cloud mode on port null
   [junit4]   2> 177568 INFO  (jetty-launcher-402-thread-2) [    ] o.a.s.s.SolrDispatchFilter \__ \/ _ \ | '_|  Install dir: null, Default config dir: null
   [junit4]   2> 177568 INFO  (jetty-launcher-402-thread-2) [    ] o.a.s.s.SolrDispatchFilter |___/\___/_|_|    Start time: 2017-10-21T23:10:22.226Z
   [junit4]   2> 177559 INFO  (jetty-launcher-402-thread-1) [    ] o.e.j.s.Server jetty-9.3.20.v20170531
   [junit4]   2> 177572 INFO  (jetty-launcher-402-thread-1) [    ] o.e.j.s.h.ContextHandler Started o.e.j.s.ServletContextHandler@17c44a4{/solr,null,AVAILABLE}
   [junit4]   2> 177573 INFO  (jetty-launcher-402-thread-1) [    ] o.e.j.s.AbstractConnector Started ServerConnector@1d0a824{HTTP/1.1,[http/1.1]}{127.0.0.1:49279}
   [junit4]   2> 177573 INFO  (jetty-launcher-402-thread-1) [    ] o.e.j.s.Server Started @184749ms
   [junit4]   2> 177576 INFO  (jetty-launcher-402-thread-1) [    ] o.a.s.c.s.e.JettySolrRunner Jetty properties: {hostContext=/solr, hostPort=49279}
   [junit4]   2> 177576 ERROR (jetty-launcher-402-thread-1) [    ] o.a.s.u.StartupLoggingUtils Missing Java Option solr.log.dir. Logging may be missing or incomplete.
   [junit4]   2> 177577 INFO  (jetty-launcher-402-thread-1) [    ] o.a.s.s.SolrDispatchFilter  ___      _       Welcome to Apache Solr™ version 8.0.0
   [junit4]   2> 177577 INFO  (jetty-launcher-402-thread-1) [    ] o.a.s.s.SolrDispatchFilter / __| ___| |_ _   Starting in cloud mode on port null
   [junit4]   2> 177577 INFO  (jetty-launcher-402-thread-1) [    ] o.a.s.s.SolrDispatchFilter \__ \/ _ \ | '_|  Install dir: null, Default config dir: null
   [junit4]   2> 177577 INFO  (jetty-launcher-402-thread-1) [    ] o.a.s.s.SolrDispatchFilter |___/\___/_|_|    Start time: 2017-10-21T23:10:22.235Z
   [junit4]   2> 177587 INFO  (jetty-launcher-402-thread-3) [    ] o.a.s.s.SolrDispatchFilter solr.xml found in ZooKeeper. Loading...
   [junit4]   2> 177597 INFO  (jetty-launcher-402-thread-1) [    ] o.a.s.s.SolrDispatchFilter solr.xml found in ZooKeeper. Loading...
   [junit4]   2> 177597 INFO  (jetty-launcher-402-thread-2) [    ] o.a.s.s.SolrDispatchFilter solr.xml found in ZooKeeper. Loading...
   [junit4]   2> 177653 INFO  (jetty-launcher-402-thread-3) [    ] o.a.s.c.ZkContainer Zookeeper client=127.0.0.1:49262/solr
   [junit4]   2> 177653 INFO  (jetty-launcher-402-thread-2) [    ] o.a.s.c.ZkContainer Zookeeper client=127.0.0.1:49262/solr
   [junit4]   2> 177665 INFO  (jetty-launcher-402-thread-1) [    ] o.a.s.c.ZkContainer Zookeeper client=127.0.0.1:49262/solr
   [junit4]   2> 177679 WARN  (NIOServerCxn.Factory:0.0.0.0/0.0.0.0:0) [    ] o.a.z.s.NIOServerCnxn caught end of stream exception
   [junit4]   2> EndOfStreamException: Unable to read additional data from client sessionid 0x15f41339b730005, likely client has closed socket
   [junit4]   2> 	at org.apache.zookeeper.server.NIOServerCnxn.doIO(NIOServerCnxn.java:239)
   [junit4]   2> 	at org.apache.zookeeper.server.NIOServerCnxnFactory.run(NIOServerCnxnFactory.java:203)
   [junit4]   2> 	at java.lang.Thread.run(Thread.java:748)
   [junit4]   2> 178076 INFO  (jetty-launcher-402-thread-3) [n:127.0.0.1:49272_solr    ] o.a.s.c.Overseer Overseer (id=null) closing
   [junit4]   2> 178081 INFO  (jetty-launcher-402-thread-2) [n:127.0.0.1:49269_solr    ] o.a.s.c.Overseer Overseer (id=null) closing
   [junit4]   2> 178082 INFO  (jetty-launcher-402-thread-3) [n:127.0.0.1:49272_solr    ] o.a.s.c.OverseerElectionContext I am going to be the leader 127.0.0.1:49272_solr
   [junit4]   2> 178093 INFO  (jetty-launcher-402-thread-2) [n:127.0.0.1:49269_solr    ] o.a.s.c.ZkController Register node as live in ZooKeeper:/live_nodes/127.0.0.1:49269_solr
   [junit4]   2> 178093 INFO  (jetty-launcher-402-thread-3) [n:127.0.0.1:49272_solr    ] o.a.s.c.Overseer Overseer (id=98869406732582919-127.0.0.1:49272_solr-n_0000000000) starting
   [junit4]   2> 178096 INFO  (jetty-launcher-402-thread-1) [n:127.0.0.1:49279_solr    ] o.a.s.c.c.ZkStateReader Updated live nodes from ZooKeeper... (0) -> (1)
   [junit4]   2> 178096 INFO  (zkCallback-418-thread-1-processing-n:127.0.0.1:49269_solr) [n:127.0.0.1:49269_solr    ] o.a.s.c.c.ZkStateReader Updated live nodes from ZooKeeper... (0) -> (1)
   [junit4]   2> 178096 INFO  (zkCallback-417-thread-1-processing-n:127.0.0.1:49272_solr) [n:127.0.0.1:49272_solr    ] o.a.s.c.c.ZkStateReader Updated live nodes from ZooKeeper... (0) -> (1)
   [junit4]   2> 178100 INFO  (jetty-launcher-402-thread-1) [n:127.0.0.1:49279_solr    ] o.a.s.c.Overseer Overseer (id=null) closing
   [junit4]   2> 178103 INFO  (jetty-launcher-402-thread-1) [n:127.0.0.1:49279_solr    ] o.a.s.c.ZkController Register node as live in ZooKeeper:/live_nodes/127.0.0.1:49279_solr
   [junit4]   2> 178107 INFO  (zkCallback-417-thread-1-processing-n:127.0.0.1:49272_solr) [n:127.0.0.1:49272_solr    ] o.a.s.c.c.ZkStateReader Updated live nodes from ZooKeeper... (1) -> (2)
   [junit4]   2> 178108 INFO  (zkCallback-418-thread-1-processing-n:127.0.0.1:49269_solr) [n:127.0.0.1:49269_solr    ] o.a.s.c.c.ZkStateReader Updated live nodes from ZooKeeper... (1) -> (2)
   [junit4]   2> 178108 INFO  (zkCallback-419-thread-1-processing-n:127.0.0.1:49279_solr) [n:127.0.0.1:49279_solr    ] o.a.s.c.c.ZkStateReader Updated live nodes from ZooKeeper... (1) -> (2)
   [junit4]   2> 178109 INFO  (jetty-launcher-402-thread-3) [n:127.0.0.1:49272_solr    ] o.a.s.c.ZkController Register node as live in ZooKeeper:/live_nodes/127.0.0.1:49272_solr
   [junit4]   2> 178271 DEBUG (OverseerAutoScalingTriggerThread-98869406732582919-127.0.0.1:49272_solr-n_0000000000) [n:127.0.0.1:49272_solr    ] o.a.s.c.a.OverseerTriggerThread Adding .autoAddReplicas trigger
   [junit4]   2> 178272 DEBUG (OverseerStateUpdate-98869406732582919-127.0.0.1:49272_solr-n_0000000000) [n:127.0.0.1:49272_solr    ] o.a.s.c.Overseer Starting to work on the main queue
   [junit4]   2> 178274 INFO  (zkCallback-419-thread-1-processing-n:127.0.0.1:49279_solr) [n:127.0.0.1:49279_solr    ] o.a.s.c.c.ZkStateReader Updated live nodes from ZooKeeper... (2) -> (3)
   [junit4]   2> 178276 INFO  (zkCallback-418-thread-1-processing-n:127.0.0.1:49269_solr) [n:127.0.0.1:49269_solr    ] o.a.s.c.c.ZkStateReader Updated live nodes from ZooKeeper... (2) -> (3)
   [junit4]   2> 178279 DEBUG (OverseerAutoScalingTriggerThread-98869406732582919-127.0.0.1:49272_solr-n_0000000000) [n:127.0.0.1:49272_solr    ] o.a.s.c.a.OverseerTriggerThread Refreshing /autoscaling.json with znode version 1
   [junit4]   2> 178290 INFO  (OverseerStateUpdate-98869406732582919-127.0.0.1:49272_solr-n_0000000000) [n:127.0.0.1:49272_solr    ] o.a.s.c.c.ZkStateReader Updated live nodes from ZooKeeper... (2) -> (3)
   [junit4]   2> 178290 DEBUG (OverseerAutoScalingTriggerThread-98869406732582919-127.0.0.1:49272_solr-n_0000000000) [n:127.0.0.1:49272_solr    ] o.a.s.c.a.NodeLostTrigger Initial livenodes: [127.0.0.1:49269_solr, 127.0.0.1:49272_solr, 127.0.0.1:49279_solr]
   [junit4]   2> 178291 DEBUG (OverseerAutoScalingTriggerThread-98869406732582919-127.0.0.1:49272_solr-n_0000000000) [n:127.0.0.1:49272_solr    ] o.a.s.c.a.OverseerTriggerThread Current znodeVersion 1, lastZnodeVersion -1
   [junit4]   2> 178291 DEBUG (OverseerAutoScalingTriggerThread-98869406732582919-127.0.0.1:49272_solr-n_0000000000) [n:127.0.0.1:49272_solr    ] o.a.s.c.a.OverseerTriggerThread Processed trigger updates upto znodeVersion 1
   [junit4]   2> 178295 DEBUG (OverseerStateUpdate-98869406732582919-127.0.0.1:49272_solr-n_0000000000) [n:127.0.0.1:49272_solr    ] o.a.s.c.Overseer processMessage: queueSize: 2, message = {
   [junit4]   2>   "operation":"downnode",
   [junit4]   2>   "node_name":"127.0.0.1:49279_solr"} current state version: 0
   [junit4]   2> 178295 DEBUG (OverseerStateUpdate-98869406732582919-127.0.0.1:49272_solr-n_0000000000) [n:127.0.0.1:49272_solr    ] o.a.s.c.o.NodeMutator DownNode state invoked for node: 127.0.0.1:49279_solr
   [junit4]   2> 178295 DEBUG (OverseerStateUpdate-98869406732582919-127.0.0.1:49272_solr-n_0000000000) [n:127.0.0.1:49272_solr    ] o.a.s.c.Overseer processMessage: queueSize: 2, message = {
   [junit4]   2>   "operation":"downnode",
   [junit4]   2>   "node_name":"127.0.0.1:49272_solr"} current state version: 0
   [junit4]   2> 178295 DEBUG (OverseerStateUpdate-98869406732582919-127.0.0.1:49272_solr-n_0000000000) [n:127.0.0.1:49272_solr    ] o.a.s.c.o.NodeMutator DownNode state invoked for node: 127.0.0.1:49272_solr
   [junit4]   2> 178296 DEBUG (OverseerAutoScalingTriggerThread-98869406732582919-127.0.0.1:49272_solr-n_0000000000) [n:127.0.0.1:49272_solr    ] o.a.s.c.a.OverseerTriggerThread -- clean old nodeAdded markers
   [junit4]   2> 178296 DEBUG (OverseerAutoScalingTriggerThread-98869406732582919-127.0.0.1:49272_solr-n_0000000000) [n:127.0.0.1:49272_solr    ] o.a.s.c.a.OverseerTriggerThread Current znodeVersion 1, lastZnodeVersion 1
   [junit4]   2> 178371 DEBUG (ScheduledTrigger-636-thread-1) [n:127.0.0.1:49272_solr    ] o.a.s.c.a.NodeLostTrigger Running NodeLostTrigger: .auto_add_replicas with currently live nodes: [127.0.0.1:49269_solr, 127.0.0.1:49272_solr, 127.0.0.1:49279_solr]
   [junit4]   2> 178518 INFO  (jetty-launcher-402-thread-3) [n:127.0.0.1:49272_solr    ] o.a.s.m.r.SolrJmxReporter JMX monitoring for 'solr_49272.solr.node' (registry 'solr.node') enabled at server: com.sun.jmx.mbeanserver.JmxMBeanServer@d21752
   [junit4]   2> 178524 INFO  (jetty-launcher-402-thread-1) [n:127.0.0.1:49279_solr    ] o.a.s.m.r.SolrJmxReporter JMX monitoring for 'solr_49279.solr.node' (registry 'solr.node') enabled at server: com.sun.jmx.mbeanserver.JmxMBeanServer@d21752
   [junit4]   2> 178537 INFO  (jetty-launcher-402-thread-1) [n:127.0.0.1:49279_solr    ] o.a.s.m.r.SolrJmxReporter JMX monitoring for 'solr_49279.solr.jvm' (registry 'solr.jvm') enabled at server: com.sun.jmx.mbeanserver.JmxMBeanServer@d21752
   [junit4]   2> 178538 INFO  (jetty-launcher-402-thread-1) [n:127.0.0.1:49279_solr    ] o.a.s.m.r.SolrJmxReporter JMX monitoring for 'solr_49279.solr.jetty' (registry 'solr.jetty') enabled at server: com.sun.jmx.mbeanserver.JmxMBeanServer@d21752
   [junit4]   2> 178540 INFO  (jetty-launcher-402-thread-1) [n:127.0.0.1:49279_solr    ] o.a.s.c.CorePropertiesLocator Found 0 core definitions underneath C:\Users\jenkins\workspace\Lucene-Solr-master-Windows\solr\build\solr-core\test\J0\temp\solr.handler.admin.AutoscalingHistoryHandlerTest_1512AC03D11329CE-001\tempDir-001\node1\.
   [junit4]   2> 178564 INFO  (jetty-launcher-402-thread-3) [n:127.0.0.1:49272_solr    ] o.a.s.m.r.SolrJmxReporter JMX monitoring for 'solr_49272.solr.jvm' (registry 'solr.jvm') enabled at server: com.sun.jmx.mbeanserver.JmxMBeanServer@d21752
   [junit4]   2> 178564 INFO  (jetty-launcher-402-thread-3) [n:127.0.0.1:49272_solr    ] o.a.s.m.r.SolrJmxReporter JMX monitoring for 'solr_49272.solr.jetty' (registry 'solr.jetty') enabled at server: com.sun.jmx.mbeanserver.JmxMBeanServer@d21752
   [junit4]   2> 178566 INFO  (jetty-launcher-402-thread-3) [n:127.0.0.1:49272_solr    ] o.a.s.c.CorePropertiesLocator Found 0 core definitions underneath C:\Users\jenkins\workspace\Lucene-Solr-master-Windows\solr\build\solr-core\test\J0\temp\solr.handler.admin.AutoscalingHistoryHandlerTest_1512AC03D11329CE-001\tempDir-001\node3\.
   [junit4]   2> 178816 INFO  (jetty-launcher-402-thread-2) [n:127.0.0.1:49269_solr    ] o.a.s.m.r.SolrJmxReporter JMX monitoring for 'solr_49269.solr.node' (registry 'solr.node') enabled at server: com.sun.jmx.mbeanserver.JmxMBeanServer@d21752
   [junit4]   2> 178831 INFO  (jetty-launcher-402-thread-2) [n:127.0.0.1:49269_solr    ] o.a.s.m.r.SolrJmxReporter JMX monitoring for 'solr_49269.solr.jvm' (registry 'solr.jvm') enabled at server: com.sun.jmx.mbeanserver.JmxMBeanServer@d21752
   [junit4]   2> 178831 INFO  (jetty-launcher-402-thread-2) [n:127.0.0.1:49269_solr    ] o.a.s.m.r.SolrJmxReporter JMX monitoring for 'solr_49269.solr.jetty' (registry 'solr.jetty') enabled at server: com.sun.jmx.mbeanserver.JmxMBeanServer@d21752
   [junit4]   2> 178832 INFO  (jetty-launcher-402-thread-2) [n:127.0.0.1:49269_solr    ] o.a.s.c.CorePropertiesLocator Found 0 core definitions underneath C:\Users\jenkins\workspace\Lucene-Solr-master-Windows\solr\build\solr-core\test\J0\temp\solr.handler.admin.AutoscalingHistoryHandlerTest_1512AC03D11329CE-001\tempDir-001\node2\.
   [junit4]   2> 178989 WARN  (NIOServerCxn.Factory:0.0.0.0/0.0.0.0:0) [    ] o.a.z.s.NIOServerCnxn caught end of stream exception
   [junit4]   2> EndOfStreamException: Unable to read additional data from client sessionid 0x15f41339b73000a, likely client has closed socket
   [junit4]   2> 	at org.apache.zookeeper.server.NIOServerCnxn.doIO(NIOServerCnxn.java:239)
   [junit4]   2> 	at org.apache.zookeeper.server.NIOServerCnxnFactory.run(NIOServerCnxnFactory.java:203)
   [junit4]   2> 	at java.lang.Thread.run(Thread.java:748)
   [junit4]   2> 179042 INFO  (SUITE-AutoscalingHistoryHandlerTest-seed#[1512AC03D11329CE]-worker) [    ] o.a.s.c.c.ZkStateReader Updated live nodes from ZooKeeper... (0) -> (3)
   [junit4]   2> 179057 INFO  (SUITE-AutoscalingHistoryHandlerTest-seed#[1512AC03D11329CE]-worker) [    ] o.a.s.c.s.i.ZkClientClusterStateProvider Cluster at 127.0.0.1:49262/solr ready
   [junit4]   2> 179088 INFO  (qtp26840041-1774) [n:127.0.0.1:49269_solr    ] o.a.s.h.a.CollectionsHandler Invoked Collection Action :create with params replicationFactor=3&name=AutoscalingHistoryHandlerTest_collection&nrtReplicas=3&action=CREATE&numShards=1&wt=javabin&version=2 and sendToOCPQueue=true
   [junit4]   2> 179100 INFO  (OverseerThreadFactory-638-thread-1-processing-n:127.0.0.1:49272_solr) [n:127.0.0.1:49272_solr    ] o.a.s.c.CreateCollectionCmd Create collection AutoscalingHistoryHandlerTest_collection
   [junit4]   2> 179101 INFO  (OverseerThreadFactory-638-thread-1-processing-n:127.0.0.1:49272_solr) [n:127.0.0.1:49272_solr    ] o.a.s.c.CreateCollectionCmd Only _default config set found, using it.
   [junit4]   2> 179119 INFO  (OverseerThreadFactory-638-thread-1-processing-n:127.0.0.1:49272_solr) [n:127.0.0.1:49272_solr    ] o.a.s.c.c.ZkConfigManager Copying zk node /configs/_default/managed-schema to /configs/AutoscalingHistoryHandlerTest_collection/managed-schema
   [junit4]   2> 179174 INFO  (OverseerThreadFactory-638-thread-1-processing-n:127.0.0.1:49272_solr) [n:127.0.0.1:49272_solr    ] o.a.s.c.c.ZkConfigManager Copying zk node /configs/_default/protwords.txt to /configs/AutoscalingHistoryHandlerTest_collection/protwords.txt
   [junit4]   2> 179209 INFO  (OverseerThreadFactory-638-thread-1-processing-n:127.0.0.1:49272_solr) [n:127.0.0.1:49272_solr    ] o.a.s.c.c.ZkConfigManager Copying zk node /configs/_default/solrconfig.xml to /configs/AutoscalingHistoryHandlerTest_collection/solrconfig.xml
   [junit4]   2> 179213 INFO  (OverseerThreadFactory-638-thread-1-processing-n:127.0.0.1:49272_solr) [n:127.0.0.1:49272_solr    ] o.a.s.c.c.ZkConfigManager Copying zk node /configs/_default/synonyms.txt to /configs/AutoscalingHistoryHandlerTest_collection/synonyms.txt
   [junit4]   2> 179224 INFO  (OverseerThreadFactory-638-thread-1-processing-n:127.0.0.1:49272_solr) [n:127.0.0.1:49272_solr    ] o.a.s.c.c.ZkConfigManager Copying zk node /configs/_default/stopwords.txt to /configs/AutoscalingHistoryHandlerTest_collection/stopwords.txt
   [junit4]   2> 179228 INFO  (OverseerThreadFactory-638-thread-1-processing-n:127.0.0.1:49272_solr) [n:127.0.0.1:49272_solr    ] o.a.s.c.c.ZkConfigManager Copying zk node /configs/_default/lang/contractions_it.txt to /configs/AutoscalingHistoryHandlerTest_collection/lang/contractions_it.txt
   [junit4]   2> 179234 INFO  (OverseerThreadFactory-638-thread-1-processing-n:127.0.0.1:49272_solr) [n:127.0.0.1:49272_solr    ] o.a.s.c.c.ZkConfigManager Copying zk node /configs/_default/lang/contractions_ca.txt to /configs/AutoscalingHistoryHandlerTest_collection/lang/contractions_ca.txt
   [junit4]   2> 179245 INFO  (OverseerThreadFactory-638-thread-1-processing-n:127.0.0.1:49272_solr) [n:127.0.0.1:49272_solr    ] o.a.s.c.c.ZkConfigManager Copying zk node /configs/_default/lang/stemdict_nl.txt to /configs/AutoscalingHistoryHandlerTest_collection/lang/stemdict_nl.txt
   [junit4]   2> 179248 INFO  (OverseerThreadFactory-638-thread-1-processing-n:127.0.0.1:49272_solr) [n:127.0.0.1:49272_solr    ] o.a.s.c.c.ZkConfigManager Copying zk node /configs/_default/lang/stopwords_hy.txt to /configs/AutoscalingHistoryHandlerTest_collection/lang/stopwords_hy.txt
   [junit4]   2> 179253 INFO  (OverseerThreadFactory-638-thread-1-processing-n:127.0.0.1:49272_solr) [n:127.0.0.1:49272_solr    ] o.a.s.c.c.ZkConfigManager Copying zk node /configs/_default/lang/stopwords_no.txt to /configs/AutoscalingHistoryHandlerTest_collection/lang/stopwords_no.txt
   [junit4]   2> 179256 INFO  (OverseerThreadFactory-638-thread-1-processing-n:127.0.0.1:49272_solr) [n:127.0.0.1:49272_solr    ] o.a.s.c.c.ZkConfigManager Copying zk node /configs/_default/lang/stopwords_id.txt to /configs/AutoscalingHistoryHandlerTest_collection/lang/stopwords_id.txt
   [junit4]   2> 179259 INFO  (OverseerThreadFactory-638-thread-1-processing-n:127.0.0.1:49272_solr) [n:127.0.0.1:49272_solr    ] o.a.s.c.c.ZkConfigManager Copying zk node /configs/_default/lang/stopwords_da.txt to /configs/AutoscalingHistoryHandlerTest_collection/lang/stopwords_da.txt
   [junit4]   2> 179267 INFO  (OverseerThreadFactory-638-thread-1-processing-n:127.0.0.1:49272_solr) [n:127.0.0.1:49272_solr    ] o.a.s.c.c.ZkConfigManager Copying zk node /configs/_default/lang/stopwords_ga.txt to /configs/AutoscalingHistoryHandlerTest_collection/lang/stopwords_ga.txt
   [junit4]   2> 179278 INFO  (OverseerThreadFactory-638-thread-1-processing-n:127.0.0.1:49272_solr) [n:127.0.0.1:49272_solr    ] o.a.s.c.c.ZkConfigManager Copying zk node /configs/_default/lang/stopwords_hi.txt to /configs/AutoscalingHistoryHandlerTest_collection/lang/stopwords_hi.txt
   [junit4]   2> 179281 INFO  (OverseerThreadFactory-638-thread-1-processing-n:127.0.0.1:49272_solr) [n:127.0.0.1:49272_solr    ] o.a.s.c.c.ZkConfigManager Copying zk node /configs/_default/lang/stopwords_ja.txt to /configs/AutoscalingHistoryHandlerTest_collection/lang/stopwords_ja.txt
   [junit4]   2> 179291 INFO  (OverseerThreadFactory-638-thread-1-processing-n:127.0.0.1:49272_solr) [n:127.0.0.1:49272_solr    ] o.a.s.c.c.ZkConfigManager Copying zk node /configs/_default/lang/stopwords_pt.txt to /configs/AutoscalingHistoryHandlerTest_collection/lang/stopwords_pt.txt
   [junit4]   2> 179293 INFO  (OverseerThreadFactory-638-thread-1-processing-n:127.0.0.1:49272_solr) [n:127.0.0.1:49272_solr    ] o.a.s.c.c.ZkConfigManager Copying zk node /configs/_default/lang/stopwords_hu.txt to /configs/AutoscalingHistoryHandlerTest_collection/lang/stopwords_hu.txt
   [junit4]   2> 179297 INFO  (OverseerThreadFactory-638-thread-1-processing-n:127.0.0.1:49272_solr) [n:127.0.0.1:49272_solr    ] o.a.s.c.c.ZkConfigManager Copying zk node /configs/_default/lang/stopwords_el.txt to /configs/AutoscalingHistoryHandlerTest_collection/lang/stopwords_el.txt
   [junit4]   2> 179313 INFO  (OverseerThreadFactory-638-thread-1-processing-n:127.0.0.1:49272_solr) [n:127.0.0.1:49272_solr    ] o.a.s.c.c.ZkConfigManager Copying zk node /configs/_default/lang/stopwords_ru.txt to /configs/AutoscalingHistoryHandlerTest_collection/lang/stopwords_ru.txt
   [junit4]   2> 179316 INFO  (OverseerThreadFactory-638-thread-1-processing-n:127.0.0.1:49272_solr) [n:127.0.0.1:49272_solr    ] o.a.s.c.c.ZkConfigManager Copying zk node /configs/_default/lang/stopwords_tr.txt to /configs/AutoscalingHistoryHandlerTest_collection/lang/stopwords_tr.txt
   [junit4]   2> 179318 INFO  (OverseerThreadFactory-638-thread-1-processing-n:127.0.0.1:49272_solr) [n:127.0.0.1:49272_solr    ] o.a.s.c.c.ZkConfigManager Copying zk node /configs/_default/lang/stopwords_ar.txt to /configs/AutoscalingHistoryHandlerTest_collection/lang/stopwords_ar.txt
   [junit4]   2> 179321 INFO  (OverseerThreadFactory-638-thread-1-processing-n:127.0.0.1:49272_solr) [n:127.0.0.1:49272_solr    ] o.a.s.c.c.ZkConfigManager Copying zk node /configs/_default/lang/userdict_ja.txt to /configs/AutoscalingHistoryHandlerTest_collection/lang/userdict_ja.txt
   [junit4]   2> 179331 INFO  (OverseerThreadFactory-638-thread-1-processing-n:127.0.0.1:49272_solr) [n:127.0.0.1:49272_solr    ] o.a.s.c.c.ZkConfigManager Copying zk node /configs/_default/lang/stopwords_eu.txt to /configs/AutoscalingHistoryHandlerTest_collection/lang/stopwords_eu.txt
   [junit4]   2> 179335 INFO  (OverseerThreadFactory-638-thread-1-processing-n:127.0.0.1:49272_solr) [n:127.0.0.1:49272_solr    ] o.a.s.c.c.ZkConfigManager Copying zk node /configs/_default/lang/stopwords_it.txt to /configs/AutoscalingHistoryHandlerTest_collection/lang/stopwords_it.txt
   [junit4]   2> 179366 INFO  (OverseerThreadFactory-638-thread-1-processing-n:127.0.0.1:49272_solr) [n:127.0.0.1:49272_solr    ] o.a.s.c.c.ZkConfigManager Copying zk node /configs/_default/lang/stopwords_cz.txt to /configs/AutoscalingHistoryHandlerTest_collection/lang/stopwords_cz.txt
   [junit4]   2> 179370 INFO  (OverseerThreadFactory-638-thread-1-processing-n:127.0.0.1:49272_solr) [n:127.0.0.1:49272_solr    ] o.a.s.c.c.ZkConfigManager Copying zk node /configs/_default/lang/stoptags_ja.txt to /configs/AutoscalingHistoryHandlerTest_collection/lang/stoptags_ja.txt
   [junit4]   2> 179377 DEBUG (ScheduledTrigger-636-thread-1) [n:127.0.0.1:49272_solr    ] o.a.s.c.a.NodeLostTrigger Running NodeLostTrigger: .auto_add_replicas with currently live nodes: [127.0.0.1:49269_solr, 127.0.0.1:49272_solr, 127.0.0.1:49279_solr]
   [junit4]   2> 179381 INFO  (OverseerThreadFactory-638-thread-1-processing-n:127.0.0.1:49272_solr) [n:127.0.0.1:49272_solr    ] o.a.s.c.c.ZkConfigManager Copying zk node /configs/_default/lang/contractions_fr.txt to /configs/AutoscalingHistoryHandlerTest_collection/lang/contractions_fr.txt
   [junit4]   2> 179383 INFO  (OverseerThreadFactory-638-thread-1-processing-n:127.0.0.1:49272_solr) [n:127.0.0.1:49272_solr    ] o.a.s.c.c.ZkConfigManager Copying zk node /configs/_default/lang/stopwords_de.txt to /configs/AutoscalingHistoryHandlerTest_collection/lang/stopwords_de.txt
   [junit4]   2> 179386 INFO  (OverseerThreadFactory-638-thread-1-processing-n:127.0.0.1:49272_solr) [n:127.0.0.1:49272_solr    ] o.a.s.c.c.ZkConfigManager Copying zk node /configs/_default/lang/stopwords_fa.txt to /configs/AutoscalingHistoryHandlerTest_collection/lang/stopwords_fa.txt
   [junit4]   2> 179399 INFO  (OverseerThreadFactory-638-thread-1-processing-n:127.0.0.1:49272_solr) [n:127.0.0.1:49272_solr    ] o.a.s.c.c.ZkConfigManager Copying zk node /configs/_default/lang/contractions_ga.txt to /configs/AutoscalingHistoryHandlerTest_collection/lang/contractions_ga.txt
   [junit4]   2> 179415 INFO  (OverseerThreadFactory-638-thread-1-processing-n:127.0.0.1:49272_solr) [n:127.0.0.1:49272_solr    ] o.a.s.c.c.ZkConfigManager Copying zk node /configs/_default/lang/stopwords_ca.txt to /configs/AutoscalingHistoryHandlerTest_collection/lang/stopwords_ca.txt
   [junit4]   2> 179433 INFO  (OverseerThreadFactory-638-thread-1-processing-n:127.0.0.1:49272_solr) [n:127.0.0.1:49272_solr    ] o.a.s.c.c.ZkConfigManager Copying zk node /configs/_default/lang/stopwords_nl.txt to /configs/AutoscalingHistoryHandlerTest_collection/lang/stopwords_nl.txt
   [junit4]   2> 179433 INFO  (OverseerThreadFactory-638-thread-1-processing-n:127.0.0.1:49272_solr) [n:127.0.0.1:49272_solr    ] o.a.s.c.c.ZkConfigManager Copying zk node /configs/_default/lang/stopwords_bg.txt to /configs/AutoscalingHistoryHandlerTest_collection/lang/stopwords_bg.txt
   [junit4]   2> 179440 INFO  (OverseerThreadFactory-638-thread-1-processing-n:127.0.0.1:49272_solr) [n:127.0.0.1:49272_solr    ] o.a.s.c.c.ZkConfigManager Copying zk node /configs/_default/lang/stopwords_en.txt to /configs/AutoscalingHistoryHandlerTest_collection/lang/stopwords_en.txt
   [junit4]   2> 179449 INFO  (OverseerThreadFactory-638-thread-1-processing-n:127.0.0.1:49272_solr) [n:127.0.0.1:49272_solr    ] o.a.s.c.c.ZkConfigManager Copying zk node /configs/_default/lang/stopwords_es.txt to /configs/AutoscalingHistoryHandlerTest_collection/lang/stopwords_es.txt
   [junit4]   2> 179465 INFO  (OverseerThreadFactory-638-thread-1-processing-n:127.0.0.1:49272_solr) [n:127.0.0.1:49272_solr    ] o.a.s.c.c.ZkConfigManager Copying zk node /configs/_default/lang/stopwords_lv.txt to /configs/AutoscalingHistoryHandlerTest_collection/lang/stopwords_lv.txt
   [junit4]   2> 179473 INFO  (OverseerThreadFactory-638-thread-1-processing-n:127.0.0.1:49272_solr) [n:127.0.0.1:49272_solr    ] o.a.s.c.c.ZkConfigManager Copying zk node /configs/_default/lang/stopwords_ro.txt to /configs/AutoscalingHistoryHandlerTest_collection/lang/stopwords_ro.txt
   [junit4]   2> 179473 INFO  (OverseerThreadFactory-638-thread-1-processing-n:127.0.0.1:49272_solr) [n:127.0.0.1:49272_solr    ] o.a.s.c.c.ZkConfigManager Copying zk node /configs/_default/lang/stopwords_th.txt to /configs/AutoscalingHistoryHandlerTest_collection/lang/stopwords_th.txt
   [junit4]   2> 179478 INFO  (OverseerThreadFactory-638-thread-1-processing-n:127.0.0.1:49272_solr) [n:127.0.0.1:49272_solr    ] o.a.s.c.c.ZkConfigManager Copying zk node /configs/_default/lang/stopwords_fr.txt to /configs/AutoscalingHistoryHandlerTest_collection/lang/stopwords_fr.txt
   [junit4]   2> 179486 INFO  (OverseerThreadFactory-638-thread-1-processing-n:127.0.0.1:49272_solr) [n:127.0.0.1:49272_solr    ] o.a.s.c.c.ZkConfigManager Copying zk node /configs/_default/lang/stopwords_sv.txt to /configs/AutoscalingHistoryHandlerTest_collection/lang/stopwords_sv.txt
   [junit4]   2> 179488 INFO  (OverseerThreadFactory-638-thread-1-processing-n:127.0.0.1:49272_solr) [n:127.0.0.1:49272_solr    ] o.a.s.c.c.ZkConfigManager Copying zk node /configs/_default/lang/stopwords_fi.txt to /configs/AutoscalingHistoryHandlerTest_collection/lang/stopwords_fi.txt
   [junit4]   2> 179494 INFO  (OverseerThreadFactory-638-thread-1-processing-n:127.0.0.1:49272_solr) [n:127.0.0.1:49272_solr    ] o.a.s.c.c.ZkConfigManager Copying zk node /configs/_default/lang/hyphenations_ga.txt to /configs/AutoscalingHistoryHandlerTest_collection/lang/hyphenations_ga.txt
   [junit4]   2> 179494 INFO  (OverseerThreadFactory-638-thread-1-processing-n:127.0.0.1:49272_solr) [n:127.0.0.1:49272_solr    ] o.a.s.c.c.ZkConfigManager Copying zk node /configs/_default/lang/stopwords_gl.txt to /configs/AutoscalingHistoryHandlerTest_collection/lang/stopwords_gl.txt
   [junit4]   2> 179499 INFO  (OverseerThreadFactory-638-thread-1-processing-n:127.0.0.1:49272_solr) [n:127.0.0.1:49272_solr    ] o.a.s.c.c.ZkConfigManager Copying zk node /configs/_default/params.json to /configs/AutoscalingHistoryHandlerTest_collection/params.json
   [junit4]   2> 179535 DEBUG (OverseerStateUpdate-98869406732582919-127.0.0.1:49272_solr-n_0000000000) [n:127.0.0.1:49272_solr    ] o.a.s.c.Overseer processMessage: queueSize: 1, message = {
   [junit4]   2>   "name":"AutoscalingHistoryHandlerTest_collection",
   [junit4]   2>   "fromApi":"true",
   [junit4]   2>   "replicationFactor":"3",
   [junit4]   2>   "numShards":"1",
   [junit4]   2>   "nrtReplicas":"3",
   [junit4]   2>   "stateFormat":"2",
   [junit4]   2>   "operation":"create"} current state version: 0
   [junit4]   2> 179535 DEBUG (OverseerStateUpdate-98869406732582919-127.0.0.1:49272_solr-n_0000000000) [n:127.0.0.1:49272_solr    ] o.a.s.c.o.ClusterStateMutator building a new cName: AutoscalingHistoryHandlerTest_collection
   [junit4]   2> 179535 DEBUG (OverseerStateUpdate-98869406732582919-127.0.0.1:49272_solr-n_0000000000) [n:127.0.0.1:49272_solr    ] o.a.s.c.o.ZkStateWriter going to create_collection /collections/AutoscalingHistoryHandlerTest_collection/state.json
   [junit4]   2> 179642 DEBUG (OverseerStateUpdate-98869406732582919-127.0.0.1:49272_solr-n_0000000000) [n:127.0.0.1:49272_solr    ] o.a.s.c.Overseer processMessage: queueSize: 1, message = {
   [junit4]   2>   "operation":"ADDREPLICA",
   [junit4]   2>   "collection":"AutoscalingHistoryHandlerTest_collection",
   [junit4]   2>   "shard":"shard1",
   [junit4]   2>   "core":"AutoscalingHistoryHandlerTest_collection_shard1_replica_n1",
   [junit4]   2>   "state":"down",
   [junit4]   2>   "base_url":"http://127.0.0.1:49269/solr",
   [junit4]   2>   "type":"NRT",
   [junit4]   2>   "waitForFinalState":"false"} current state version: 0
   [junit4]   2> 179642 INFO  (OverseerStateUpdate-98869406732582919-127.0.0.1:49272_solr-n_0000000000) [n:127.0.0.1:49272_solr    ] o.a.s.c.o.SliceMutator createReplica() {
   [junit4]   2>   "operation":"ADDREPLICA",
   [junit4]   2>   "collection":"AutoscalingHistoryHandlerTest_collection",
   [junit4]   2>   "shard":"shard1",
   [junit4]   2>   "core":"AutoscalingHistoryHandlerTest_collection_shard1_replica_n1",
   [junit4]   2>   "state":"down",
   [junit4]   2>   "base_url":"http://127.0.0.1:49269/solr",
   [junit4]   2>   "type":"NRT",
   [junit4]   2>   "waitForFinalState":"false"} 
   [junit4]   2> 179649 DEBUG (OverseerStateUpdate-98869406732582919-127.0.0.1:49272_solr-n_0000000000) [n:127.0.0.1:49272_solr    ] o.a.s.c.o.SliceMutator Old Slice: shard1:{
   [junit4]   2>   "range":"80000000-7fffffff",
   [junit4]   2>   "state":"active",
   [junit4]   2>   "replicas":{}}
   [junit4]   2> 179649 DEBUG (OverseerStateUpdate-98869406732582919-127.0.0.1:49272_solr-n_0000000000) [n:127.0.0.1:49272_solr    ] o.a.s.c.o.SliceMutator New Slice: shard1:{
   [junit4]   2>   "range":"80000000-7fffffff",
   [junit4]   2>   "state":"active",
   [junit4]   2>   "replicas":{"core_node3":{
   [junit4]   2>       "core":"AutoscalingHistoryHandlerTest_collection_shard1_replica_n1",
   [junit4]   2>       "base_url":"http://127.0.0.1:49269/solr",
   [junit4]   2>       "state":"down",
   [junit4]   2>       "node_name":null,
   [junit4]   2>       "type":"NRT"}}}
   [junit4]   2> 179651 DEBUG (OverseerStateUpdate-98869406732582919-127.0.0.1:49272_solr-n_0000000000) [n:127.0.0.1:49272_solr    ] o.a.s.c.Overseer processMessage: queueSize: 2, message = {
   [junit4]   2>   "operation":"ADDREPLICA",
   [junit4]   2>   "collection":"AutoscalingHistoryHandlerTest_collection",
   [junit4]   2>   "shard":"shard1",
   [junit4]   2>   "core":"AutoscalingHistoryHandlerTest_collection_shard1_replica_n2",
   [junit4]   2>   "state":"down",
   [junit4]   2>   "base_url":"http://127.0.0.1:49272/solr",
   [junit4]   2>   "type":"NRT",
   [junit4]   2>   "waitForFinalState":"false"} current state version: 0
   [junit4]   2> 179651 INFO  (OverseerStateUpdate-98869406732582919-127.0.0.1:49272_solr-n_0000000000) [n:127.0.0.1:49272_solr    ] o.a.s.c.o.SliceMutator createReplica() {
   [junit4]   2>   "operation":"ADDREPLICA",
   [junit4]   2>   "collection":"AutoscalingHistoryHandlerTest_collection",
   [junit4]   2>   "shard":"shard1",
   [junit4]   2>   "core":"AutoscalingHistoryHandlerTest_collection_shard1_replica_n2",
   [junit4]   2>   "state":"down",
   [junit4]   2>   "base_url":"http://127.0.0.1:49272/solr",
   [junit4]   2>   "type":"NRT",
   [junit4]   2>   "waitForFinalState":"false"} 
   [junit4]   2> 179654 DEBUG (OverseerStateUpdate-98869406732582919-127.0.0.1:49272_solr-n_0000000000) [n:127.0.0.1:49272_solr    ] o.a.s.c.o.SliceMutator Old Slice: shard1:{
   [junit4]   2>   "range":"80000000-7fffffff",
   [junit4]   2>   "state":"active",
   [junit4]   2>   "replicas":{"core_node3":{
   [junit4]   2>       "core":"AutoscalingHistoryHandlerTest_collection_shard1_replica_n1",
   [junit4]   2>       "base_url":"http://127.0.0.1:49269/solr",
   [junit4]   2>       "state":"down",
   [junit4]   2>       "node_name":null,
   [junit4]   2>       "type":"NRT"}}}
   [junit4]   2> 179654 DEBUG (OverseerStateUpdate-98869406732582919-127.0.0.1:49272_solr-n_0000000000) [n:127.0.0.1:49272_solr    ] o.a.s.c.o.SliceMutator New Slice: shard1:{
   [junit4]   2>   "range":"80000000-7fffffff",
   [junit4]   2>   "state":"active",
   [junit4]   2>   "replicas":{
   [junit4]   2>     "core_node3":{
   [junit4]   2>       "core":"AutoscalingHistoryHandlerTest_collection_shard1_replica_n1",
   [junit4]   2>       "base_url":"http://127.0.0.1:49269/solr",
   [junit4]   2>       "state":"down",
   [junit4]   2>       "node_name":null,
   [junit4]   2>       "type":"NRT"},
   [junit4]   2>     "core_node5":{
   [junit4]   2>       "core":"AutoscalingHistoryHandlerTest_collection_shard1_replica_n2",
   [junit4]   2>       "base_url":"http://127.0.0.1:49272/solr",
   [junit4]   2>       "state":"down",
   [junit4]   2>       "node_name":null,
   [junit4]   2>       "type":"NRT"}}}
   [junit4]   2> 179657 DEBUG (OverseerStateUpdate-98869406732582919-127.0.0.1:49272_solr-n_0000000000) [n:127.0.0.1:49272_solr    ] o.a.s.c.Overseer processMessage: queueSize: 3, message = {
   [junit4]   2>   "operation":"ADDREPLICA",
   [junit4]   2>   "collection":"AutoscalingHistoryHandlerTest_collection",
   [junit4]   2>   "shard":"shard1",
   [junit4]   2>   "core":"AutoscalingHistoryHandlerTest_collection_shard1_replica_n4",
   [junit4]   2>   "state":"down",
   [junit4]   2>   "base_url":"http://127.0.0.1:49279/solr",
   [junit4]   2>   "type":"NRT",
   [junit4]   2>   "waitForFinalState":"false"} current state version: 0
   [junit4]   2> 179657 INFO  (OverseerStateUpdate-98869406732582919-127.0.0.1:49272_solr-n_0000000000) [n:127.0.0.1:49272_solr    ] o.a.s.c.o.SliceMutator createReplica() {
   [junit4]   2>   "operation":"ADDREPLICA",
   [junit4]   2>   "collection":"AutoscalingHistoryHandlerTest_collection",
   [junit4]   2>   "shard":"shard1",
   [junit4]   2>   "core":"AutoscalingHistoryHandlerTest_collection_shard1_replica_n4",
   [junit4]   2>   "state":"down",
   [junit4]   2>   "base_url":"http://127.0.0.1:49279/solr",
   [junit4]   2>   "type":"NRT",
   [junit4]   2>   "waitForFinalState":"false"} 
   [junit4]   2> 179660 DEBUG (OverseerStateUpdate-98869406732582919-127.0.0.1:49272_solr-n_0000000000) [n:127.0.0.1:49272_solr    ] o.a.s.c.o.SliceMutator Old Slice: shard1:{
   [junit4]   2>   "range":"80000000-7fffffff",
   [junit4]   2>   "state":"active",
   [junit4]   2>   "replicas":{
   [junit4]   2>     "core_node3":{
   [junit4]   2>       "core":"AutoscalingHistoryHandlerTest_collection_shard1_replica_n1",
   [junit4]   2>       "base_url":"http://127.0.0.1:49269/solr",
   [junit4]   2>       "state":"down",
   [junit4]   2>       "node_name":null,
   [junit4]   2>       "type":"NRT"},
   [junit4]   2>     "core_node5":{
   [junit4]   2>       "core":"AutoscalingHistoryHandlerTest_collection_shard1_replica_n2",
   [junit4]   2>       "base_url":"http://127.0.0.1:49272/solr",
   [junit4]   2>       "state":"down",
   [junit4]   2>       "node_name":null,
   [junit4]   2>       "type":"NRT"}}}
   [junit4]   2> 179660 DEBUG (OverseerStateUpdate-98869406732582919-127.0.0.1:49272_solr-n_0000000000) [n:127.0.0.1:49272_solr    ] o.a.s.c.o.SliceMutator New Slice: shard1:{
   [junit4]   2>   "range":"80000000-7fffffff",
   [junit4]   2>   "state":"active",
   [junit4]   2>   "replicas":{
   [junit4]   2>     "core_node3":{
   [junit4]   2>       "core":"AutoscalingHistoryHandlerTest_collection_shard1_replica_n1",
   [junit4]   2>       "base_url":"http://127.0.0.1:49269/solr",
   [junit4]   2>       "state":"down",
   [junit4]   2>       "node_name":null,
   [junit4]   2>       "type":"NRT"},
   [junit4]   2>     "core_node5":{
   [junit4]   2>       "core":"AutoscalingHistoryHandlerTest_collection_shard1_replica_n2",
   [junit4]   2>       "base_url":"http://127.0.0.1:49272/solr",
   [junit4]   2>       "state":"down",
   [junit4]   2>       "node_name":null,
   [junit4]   2>       "type":"NRT"},
   [junit4]   2>     "core_node6":{
   [junit4]   2>       "core":"AutoscalingHistoryHandlerTest_collection_shard1_replica_n4",
   [junit4]   2>       "base_url":"http://127.0.0.1:49279/solr",
   [junit4]   2>       "state":"down",
   [junit4]   2>       "node_name":null,
   [junit4]   2>       "type":"NRT"}}}
   [junit4]   2> 179763 DEBUG (OverseerStateUpdate-98869406732582919-127.0.0.1:49272_solr-n_0000000000) [n:127.0.0.1:49272_solr    ] o.a.s.c.o.ZkStateWriter going to update_collection /collections/AutoscalingHistoryHandlerTest_collection/state.json version: 0
   [junit4]   2> 179869 INFO  (qtp26840041-1771) [n:127.0.0.1:49269_solr    ] o.a.s.h.a.CoreAdminOperation core create command qt=/admin/cores&coreNodeName=core_node3&collection.configName=AutoscalingHistoryHandlerTest_collection&newCollection=true&name=AutoscalingHistoryHandlerTest_collection_shard1_replica_n1&action=CREATE&numShards=1&collection=AutoscalingHistoryHandlerTest_collection&shard=shard1&wt=javabin&version=2&replicaType=NRT
   [junit4]   2> 179874 INFO  (qtp11425198-1790) [n:127.0.0.1:49279_solr    ] o.a.s.h.a.CoreAdminOperation core create command qt=/admin/cores&coreNodeName=core_node6&collection.configName=AutoscalingHistoryHandlerTest_collection&newCollection=true&name=AutoscalingHistoryHandlerTest_collection_shard1_replica_n4&action=CREATE&numShards=1&collection=AutoscalingHistoryHandlerTest_collection&shard=shard1&wt=javabin&version=2&replicaType=NRT
   [junit4]   2> 179875 INFO  (qtp6865436-1782) [n:127.0.0.1:49272_solr    ] o.a.s.h.a.CoreAdminOperation core create command qt=/admin/cores&coreNodeName=core_node5&collection.configName=AutoscalingHistoryHandlerTest_collection&newCollection=true&name=AutoscalingHistoryHandlerTest_collection_shard1_replica_n2&action=CREATE&numShards=1&collection=AutoscalingHistoryHandlerTest_collection&shard=shard1&wt=javabin&version=2&replicaType=NRT
   [junit4]   2> 179881 INFO  (qtp11425198-1790) [n:127.0.0.1:49279_solr    ] o.a.s.c.TransientSolrCoreCacheDefault Allocating transient cache for 2147483647 transient cores
   [junit4]   2> 179882 INFO  (qtp26840041-1771) [n:127.0.0.1:49269_solr    ] o.a.s.c.TransientSolrCoreCacheDefault Allocating transient cache for 2147483647 transient cores
   [junit4]   2> 179884 INFO  (qtp6865436-1782) [n:127.0.0.1:49272_solr    ] o.a.s.c.TransientSolrCoreCacheDefault Allocating transient cache for 2147483647 transient cores
   [junit4]   2> 179913 DEBUG (OverseerStateUpdate-98869406732582919-127.0.0.1:49272_solr-n_0000000000) [n:127.0.0.1:49272_solr    ] o.a.s.c.Overseer processMessage: queueSize: 3, message = {
   [junit4]   2>   "core":"AutoscalingHistoryHandlerTest_collection_shard1_replica_n4",
   [junit4]   2>   "core_node_name":"core_node6",
   [junit4]   2>   "roles":null,
   [junit4]   2>   "base_url":"http://127.0.0.1:49279/solr",
   [junit4]   2>   "node_name":"127.0.0.1:49279_solr",
   [junit4]   2>   "numShards":"1",
   [junit4]   2>   "state":"down",
   [junit4]   2>   "shard":"shard1",
   [junit4]   2>   "collection":"AutoscalingHistoryHandlerTest_collection",
   [junit4]   2>   "type":"NRT",
   [junit4]   2>   "operation":"state"} current state version: 0
   [junit4]   2> 179917 DEBUG (OverseerStateUpdate-98869406732582919-127.0.0.1:49272_solr-n_0000000000) [n:127.0.0.1:49272_solr    ] o.a.s.c.o.ReplicaMutator Update state numShards=1 message={
   [junit4]   2>   "core":"AutoscalingHistoryHandlerTest_collection_shard1_replica_n4",
   [junit4]   2>   "core_node_name":"core_node6",
   [junit4]   2>   "roles":null,
   [junit4]   2>   "base_url":"http://127.0.0.1:49279/solr",
   [junit4]   2>   "node_name":"127.0.0.1:49279_solr",
   [junit4]   2>   "numShards":"1",
   [junit4]   2>   "state":"down",
   [junit4]   2>   "shard":"shard1",
   [junit4]   2>   "collection":"AutoscalingHistoryHandlerTest_collection",
   [junit4]   2>   "type":"NRT",
   [junit4]   2>   "operation":"state"}
   [junit4]   2> 179917 DEBUG (OverseerStateUpdate-98869406732582919-127.0.0.1:49272_solr-n_0000000000) [n:127.0.0.1:49272_solr    ] o.a.s.c.o.ReplicaMutator Will update state for replica: core_node6:{"core":"AutoscalingHistoryHandlerTest_collection_shard1_replica_n4","base_url":"http://127.0.0.1:49279/solr","node_name":"127.0.0.1:49279_solr","state":"down","type":"NRT"}
   [junit4]   2> 179917 DEBUG (OverseerStateUpdate-98869406732582919-127.0.0.1:49272_solr-n_0000000000) [n:127.0.0.1:49272_solr    ] o.a.s.c.o.ReplicaMutator Collection is now: DocCollection(AutoscalingHistoryHandlerTest_collection//collections/AutoscalingHistoryHandlerTest_collection/state.json/1)={
   [junit4]   2>   "pullReplicas":"0",
   [junit4]   2>   "replicationFactor":"3",
   [junit4]   2>   "router":{"name":"compositeId"},
   [junit4]   2>   "maxShardsPerNode":"1",
   [junit4]   2>   "autoAddReplicas":"false",
   [junit4]   2>   "nrtReplicas":"3",
   [junit4]   2>   "tlogReplicas":"0",
   [junit4]   2>   "shards":{"shard1":{
   [junit4]   2>       "range":"80000000-7fffffff",
   [junit4]   2>       "state":"active",
   [junit4]   2>       "replicas":{
   [junit4]   2>         "core_node3":{
   [junit4]   2>           "core":"AutoscalingHistoryHandlerTest_collection_shard1_replica_n1",
   [junit4]   2>           "base_url":"http://127.0.0.1:49269/solr",
   [junit4]   2>           "state":"down",
   [junit4]   2>           "node_name":null,
   [junit4]   2>           "type":"NRT"},
   [junit4]   2>         "core_node5":{
   [junit4]   2>           "core":"AutoscalingHistoryHandlerTest_collection_shard1_replica_n2",
   [junit4]   2>           "base_url":"http://127.0.0.1:49272/solr",
   [junit4]   2>           "state":"down",
   [junit4]   2>           "node_name":null,
   [junit4]   2>           "type":"NRT"},
   [junit4]   2>         "core_node6":{
   [junit4]   2>           "core":"AutoscalingHistoryHandlerTest_collection_shard1_replica_n4",
   [junit4]   2>           "base_url":"http://127.0.0.1:49279/solr",
   [junit4]   2>           "node_name":"127.0.0.1:49279_solr",
   [junit4]   2>           "state":"down",
   [junit4]   2>           "type":"NRT"}}}}}
   [junit4]   2> 179917 DEBUG (OverseerStateUpdate-98869406732582919-127.0.0.1:49272_solr-n_0000000000) [n:127.0.0.1:49272_solr    ] o.a.s.c.Overseer processMessage: queueSize: 3, message = {
   [junit4]   2>   "core":"AutoscalingHistoryHandlerTest_collection_shard1_replica_n1",
   [junit4]   2>   "core_node_name":"core_node3",
   [junit4]   2>   "roles":null,
   [junit4]   2>   "base_url":"http://127.0.0.1:49269/solr",
   [junit4]   2>   "node_name":"127.0.0.1:49269_solr",
   [junit4]   2>   "numShards":"1",
   [junit4]   2>   "state":"down",
   [junit4]   2>   "shard":"shard1",
   [junit4]   2>   "collection":"AutoscalingHistoryHandlerTest_collection",
   [junit4]   2>   "type":"NRT",
   [junit4]   2>   "operation":"state"} current state version: 0
   [junit4]   2> 179917 DEBUG (OverseerStateUpdate-98869406732582919-127.0.0.1:49272_solr-n_0000000000) [n:127.0.0.1:49272_solr    ] o.a.s.c.o.ReplicaMutator Update state numShards=1 message={
   [junit4]   2>   "core":"AutoscalingHistoryHandlerTest_collection_shard1_replica_n1",
   [junit4]   2>   "core_node_name":"core_node3",
   [junit4]   2>   "roles":null,
   [junit4]   2>   "base_url":"http://127.0.0.1:49269/solr",
   [junit4]   2>   "node_name":"127.0.0.1:49269_solr",
   [junit4]   2>   "numShards":"1",
   [junit4]   2>   "state":"down",
   [junit4]   2>   "shard":"shard1",
   [junit4]   2>   "collection":"AutoscalingHistoryHandlerTest_collection",
   [junit4]   2>   "type":"NRT",
   [junit4]   2>   "operation":"state"}
   [junit4]   2> 179918 DEBUG (OverseerStateUpdate-98869406732582919-127.0.0.1:49272_solr-n_0000000000) [n:127.0.0.1:49272_solr    ] o.a.s.c.o.ReplicaMutator Will update state for replica: core_node3:{"core":"AutoscalingHistoryHandlerTest_collection_shard1_replica_n1","base_url":"http://127.0.0.1:49269/solr","node_name":"127.0.0.1:49269_solr","state":"down","type":"NRT"}
   [junit4]   2> 179918 DEBUG (OverseerStateUpdate-98869406732582919-127.0.0.1:49272_solr-n_0000000000) [n:127.0.0.1:49272_solr    ] o.a.s.c.o.ReplicaMutator Collection is now: DocCollection(AutoscalingHistoryHandlerTest_collection//collections/AutoscalingHistoryHandlerTest_collection/state.json/1)={
   [junit4]   2>   "pullReplicas":"0",
   [junit4]   2>   "replicationFactor":"3",
   [junit4]   2>   "router":{"name":"compositeId"},
   [junit4]   2>   "maxShardsPerNode":"1",
   [junit4]   2>   "autoAddReplicas":"false",
   [junit4]   2>   "nrtReplicas":"3",
   [junit4]   2>   "tlogReplicas":"0",
   [junit4]   2>   "shards":{"shard1":{
   [junit4]   2>       "range":"80000000-7fffffff",
   [junit4]   2>       "state":"active",
   [junit4]   2>       "replicas":{
   [junit4]   2>         "core_node3":{
   [junit4]   2>           "core":"AutoscalingHistoryHandlerTest_collection_shard1_replica_n1",
   [junit4]   2>           "base_url":"http://127.0.0.1:49269/solr",
   [junit4]   2>           "node_name":"127.0.0.1:49269_solr",
   [junit4]   2>           "state":"down",
   [junit4]   2>           "type":"NRT"},
   [junit4]   2>         "core_node5":{
   [junit4]   2>           "core":"AutoscalingHistoryHandlerTest_collection_shard1_replica_n2",
   [junit4]   2>           "base_url":"http://127.0.0.1:49272/solr",
   [junit4]   2>           "state":"down",
   [junit4]   2>           "node_name":null,
   [junit4]   2>           "type":"NRT"},
   [junit4]   2>         "core_node6":{
   [junit4]   2>           "core":"AutoscalingHistoryHandlerTest_collection_shard1_replica_n4",
   [junit4]   2>           "base_url":"http://127.0.0.1:49279/solr",
   [junit4]   2>           "node_name":"127.0.0.1:49279_solr",
   [junit4]   2>           "state":"down",
   [junit4]   2>           "type":"NRT"}}}}}
   [junit4]   2> 179918 DEBUG (OverseerStateUpdate-98869406732582919-127.0.0.1:49272_solr-n_0000000000) [n:127.0.0.1:49272_solr    ] o.a.s.c.Overseer processMessage: queueSize: 3, message = {
   [junit4]   2>   "core":"AutoscalingHistoryHandlerTest_collection_shard1_replica_n2",
   [junit4]   2>   "core_node_name":"core_node5",
   [junit4]   2>   "roles":null,
   [junit4]   2>   "base_url":"http://127.0.0.1:49272/solr",
   [junit4]   2>   "node_name":"127.0.0.1:49272_solr",
   [junit4]   2>   "numShards":"1",
   [junit4]   2>   "state":"down",
   [junit4]   2>   "shard":"shard1",
   [junit4]   2>   "collection":"AutoscalingHistoryHandlerTest_collection",
   [junit4]   2>   "type":"NRT",
   [junit4]   2>   "operation":"state"} current state version: 0
   [junit4]   2> 179918 DEBUG (OverseerStateUpdate-98869406732582919-127.0.0.1:49272_solr-n_0000000000) [n:127.0.0.1:49272_solr    ] o.a.s.c.o.ReplicaMutator Update state numShards=1 message={
   [junit4]   2>   "core":"AutoscalingHistoryHandlerTest_collection_shard1_replica_n2",
   [junit4]   2>   "core_node_name":"core_node5",
   [junit4]   2>   "roles":null,
   [junit4]   2>   "base_url":"http://127.0.0.1:49272/solr",
   [junit4]   2>   "node_name":"127.0.0.1:49272_solr",
   [junit4]   2>   "numShards":"1",
   [junit4]   2>   "state":"down",
   [junit4]   2>   "shard":"shard1",
   [junit4]   2>   "collection":"AutoscalingHistoryHandlerTest_collection",
   [junit4]   2>   "type":"NRT",
   [junit4]   2>   "operation":"state"}
   [junit4]   2> 179918 DEBUG (OverseerStateUpdate-98869406732582919-127.0.0.1:49272_solr-n_0000000000) [n:127.0.0.1:49272_solr    ] o.a.s.c.o.ReplicaMutator Will update state for replica: core_node5:{"core":"AutoscalingHistoryHandlerTest_collection_shard1_replica_n2","base_url":"http://127.0.0.1:49272/solr","node_name":"127.0.0.1:49272_solr","state":"down","type":"NRT"}
   [junit4]   2> 179918 DEBUG (OverseerStateUpdate-98869406732582919-127.0.0.1:49272_solr-n_0000000000) [n:127.0.0.1:49272_solr    ] o.a.s.c.o.ReplicaMutator Collection is now: DocCollection(AutoscalingHistoryHandlerTest_collection//collections/AutoscalingHistoryHandlerTest_collection/state.json/1)={
   [junit4]   2>   "pullReplicas":"0",
   [junit4]   2>   "replicationFactor":"3",
   [junit4]   2>   "router":{"name":"compositeId"},
   [junit4]   2>   "maxShardsPerNode":"1",
   [junit4]   2>   "autoAddReplicas":"false",
   [junit4]   2>   "nrtReplicas":"3",
   [junit4]   2>   "tlogReplicas":"0",
   [junit4]   2>   "shards":{"shard1":{
   [junit4]   2>       "range":"80000000-7fffffff",
   [junit4]   2>       "state":"active",
   [junit4]   2>       "replicas":{
   [junit4]   2>         "core_node3":{
   [junit4]   2>           "core":"AutoscalingHistoryHandlerTest_collection_shard1_replica_n1",
   [junit4]   2>           "base_url":"http://127.0.0.1:49269/solr",
   [junit4]   2>           "node_name":"127.0.0.1:49269_solr",
   [junit4]   2>           "state":"down",
   [junit4]   2>           "type":"NRT"},
   [junit4]   2>         "core_node5":{
   [junit4]   2>           "core":"AutoscalingHistoryHandlerTest_collection_shard1_replica_n2",
   [junit4]   2>           "base_url":"http://127.0.0.1:49272/solr",
   [junit4]   2>           "node_name":"127.0.0.1:49272_solr",
   [junit4]   2>           "state":"down",
   [junit4]   2>           "type":"NRT"},
   [junit4]   2>         "core_node6":{
   [junit4]   2>           "core":"AutoscalingHistoryHandlerTest_collection_shard1_replica_n4",
   [junit4]   2>           "base_url":"http://127.0.0.1:49279/solr",
   [junit4]   2>           "node_name":"127.0.0.1:49279_solr",
   [junit4]   2>           "state":"down",
   [junit4]   2>           "type":"NRT"}}}}}
   [junit4]   2> 180057 DEBUG (OverseerStateUpdate-98869406732582919-127.0.0.1:49272_solr-n_0000000000) [n:127.0.0.1:49272_solr    ] o.a.s.c.o.ZkStateWriter going to update_collection /collections/AutoscalingHistoryHandlerTest_collection/state.json version: 1
   [junit4]   2> 180059 INFO  (zkCallback-418-thread-1-processing-n:127.0.0.1:49269_solr) [n:127.0.0.1:49269_solr    ] o.a.s.c.c.ZkStateReader A cluster state change: [WatchedEvent state:SyncConnected type:NodeDataChanged path:/collections/AutoscalingHistoryHandlerTest_collection/state.json] for collection [AutoscalingHistoryHandlerTest_collection] has occurred - updating... (live nodes size: [3])
   [junit4]   2> 180060 INFO  (zkCallback-417-thread-1-processing-n:127.0.0.1:49272_solr) [n:127.0.0.1:49272_solr    ] o.a.s.c.c.ZkStateReader A cluster state change: [WatchedEvent state:SyncConnected type:NodeDataChanged path:/collections/AutoscalingHistoryHandlerTest_collection/state.json] for collection [AutoscalingHistoryHandlerTest_collection] has occurred - updating... (live nodes size: [3])
   [junit4]   2> 180060 INFO  (zkCallback-419-thread-1-processing-n:127.0.0.1:49279_solr) [n:127.0.0.1:49279_solr    ] o.a.s.c.c.ZkStateReader A cluster state change: [WatchedEvent state:SyncConnected type:NodeDataChanged path:/collections/AutoscalingHistoryHandlerTest_collection/state.json] for collection [AutoscalingHistoryHandlerTest_collection] has occurred - updating... (live nodes size: [3])
   [junit4]   2> 180064 INFO  (zkCallback-417-thread-2-processing-n:127.0.0.1:49272_solr) [n:127.0.0.1:49272_solr    ] o.a.s.c.c.ZkStateReader A cluster state change: [WatchedEvent state:SyncConnected type:NodeDataChanged path:/collections/AutoscalingHistoryHandlerTest_collection/state.json] for collection [AutoscalingHistoryHandlerTest_collection] has occurred - updating... (live nodes size: [3])
   [junit4]   2> 180064 INFO  (zkCallback-419-thread-2-processing-n:127.0.0.1:49279_solr) [n:127.0.0.1:49279_solr    ] o.a.s.c.c.ZkStateReader A cluster state change: [WatchedEvent state:SyncConnected type:NodeDataChanged path:/collections/AutoscalingHistoryHandlerTest_collection/state.json] for collection [AutoscalingHistoryHandlerTest_collection] has occurred - updating... (live nodes size: [3])
   [junit4]   2> 180066 INFO  (zkCallback-418-thread-2-processing-n:127.0.0.1:49269_solr) [n:127.0.0.1:49269_solr    ] o.a.s.c.c.ZkStateReader A cluster state change: [WatchedEvent state:SyncConnected type:NodeDataChanged path:/collections/AutoscalingHistoryHandlerTest_collection/state.json] for collection [AutoscalingHistoryHandlerTest_collection] has occurred - updating... (live nodes size: [3])
   [junit4]   2> 180387 DEBUG (ScheduledTrigger-636-thread-2) [n:127.0.0.1:49272_solr    ] o.a.s.c.a.NodeLostTrigger Running NodeLostTrigger: .auto_add_replicas with currently live nodes: [127.0.0.1:49269_solr, 127.0.0.1:49272_solr, 127.0.0.1:49279_solr]
   [junit4]   2> 180974 INFO  (qtp26840041-1771) [n:127.0.0.1:49269_solr c:AutoscalingHistoryHandlerTest_collection s:shard1 r:core_node3 x:AutoscalingHistoryHandlerTest_collection_shard1_replica_n1] o.a.s.c.RequestParams conf resource params.json loaded . version : 0 
   [junit4]   2> 180975 INFO  (qtp6865436-1782) [n:127.0.0.1:49272_solr c:AutoscalingHistoryHandlerTest_collection s:shard1 r:core_node5 x:AutoscalingHistoryHandlerTest_collection_shard1_replica_n2] o.a.s.c.RequestParams conf resource params.json loaded . version : 0 
   [junit4]   2> 180976 INFO  (qtp11425198-1790) [n:127.0.0.1:49279_solr c:AutoscalingHistoryHandlerTest_collection s:shard1 r:core_node6 x:AutoscalingHistoryHandlerTest_collection_shard1_replica_n4] o.a.s.c.RequestParams conf resource params.json loaded . version : 0 
   [junit4]   2> 180977 INFO  (qtp26840041-1771) [n:127.0.0.1:49269_solr c:AutoscalingHistoryHandlerTest_collection s:shard1 r:core_node3 x:AutoscalingHistoryHandlerTest_collection_shard1_replica_n1] o.a.s.c.RequestParams request params refreshed to version 0
   [junit4]   2> 180977 INFO  (qtp11425198-1790) [n:127.0.0.1:49279_solr c:AutoscalingHistoryHandlerTest_collection s:shard1 r:core_node6 x:AutoscalingHistoryHandlerTest_collection_shard1_replica_n4] o.a.s.c.RequestParams request params refreshed to version 0
   [junit4]   2> 180982 INFO  (qtp6865436-1782) [n:127.0.0.1:49272_solr c:AutoscalingHistoryHandlerTest_collection s:shard1 r:core_node5 x:AutoscalingHistoryHandlerTest_collection_shard1_replica_n2] o.a.s.c.RequestParams request params refreshed to version 0
   [junit4]   2> 180986 WARN  (qtp6865436-1782) [n:127.0.0.1:49272_solr c:AutoscalingHistoryHandlerTest_collection s:shard1 r:core_node5 x:AutoscalingHistoryHandlerTest_collection_shard1_replica_n2] o.a.s.c.SolrConfig Couldn't add files from C:\Users\jenkins\workspace\Lucene-Solr-master-Windows\solr\build\solr-core\test\J0\temp\solr.handler.admin.AutoscalingHistoryHandlerTest_1512AC03D11329CE-001\tempDir-001\node3\AutoscalingHistoryHandlerTest_collection_shard1_replica_n2\..\..\..\..\contrib\extraction\lib filtered by .*\.jar to classpath: C:\Users\jenkins\workspace\Lucene-Solr-master-Windows\solr\build\solr-core\test\J0\temp\solr.handler.admin.AutoscalingHistoryHandlerTest_1512AC03D11329CE-001\tempDir-001\node3\AutoscalingHistoryHandlerTest_collection_shard1_replica_n2\..\..\..\..\contrib\extraction\lib
   [junit4]   2> 180986 WARN  (qtp11425198-1790) [n:127.0.0.1:49279_solr c:AutoscalingHistoryHandlerTest_collection s:shard1 r:core_node6 x:AutoscalingHistoryHandlerTest_collection_shard1_replica_n4] o.a.s.c.SolrConfig Couldn't add files from C:\Users\jenkins\workspace\Lucene-Solr-master-Windows\solr\build\solr-core\test\J0\temp\solr.handler.admin.AutoscalingHistoryHandlerTest_1512AC03D11329CE-001\tempDir-001\node1\AutoscalingHistoryHandlerTest_collection_shard1_replica_n4\..\..\..\..\contrib\extraction\lib filtered by .*\.jar to classpath: C:\Users\jenkins\workspace\Lucene-Solr-master-Windows\solr\build\solr-core\test\J0\temp\solr.handler.admin.AutoscalingHistoryHandlerTest_1512AC03D11329CE-001\tempDir-001\node1\AutoscalingHistoryHandlerTest_collection_shard1_replica_n4\..\..\..\..\contrib\extraction\lib
   [junit4]   2> 180986 WARN  (qtp26840041-1771) [n:127.0.0.1:49269_solr c:AutoscalingHistoryHandlerTest_collection s:shard1 r:core_node3 x:AutoscalingHistoryHandlerTest_collection_shard1_replica_n1] o.a.s.c.SolrConfig Couldn't add files from C:\Users\jenkins\workspace\Lucene-Solr-master-Windows\solr\build\solr-core\test\J0\temp\solr.handler.admin.AutoscalingHistoryHandlerTest_1512AC03D11329CE-001\tempDir-001\node2\AutoscalingHistoryHandlerTest_collection_shard1_replica_n1\..\..\..\..\contrib\extraction\lib filtered by .*\.jar to classpath: C:\Users\jenkins\workspace\Lucene-Solr-master-Windows\solr\build\solr-core\test\J0\temp\solr.handler.admin.AutoscalingHistoryHandlerTest_1512AC03D11329CE-001\tempDir-001\node2\AutoscalingHistoryHandlerTest_collection_shard1_replica_n1\..\..\..\..\contrib\extraction\lib
   [junit4]   2> 181002 WARN  (qtp26840041-1771) [n:127.0.0.1:49269_solr c:AutoscalingHistoryHandlerTest_collection s:shard1 r:core_node3 x:AutoscalingHistoryHandlerTest_collection_shard1_replica_n1] o.a.s.c.SolrConfig Couldn't add files from C:\Users\jenkins\workspace\Lucene-Solr-master-Windows\solr\build\solr-core\test\J0\temp\solr.handler.admin.AutoscalingHistoryHandlerTest_1512AC03D11329CE-001\tempDir-001\node2\AutoscalingHistoryHandlerTest_collection_shard1_replica_n1\..\..\..\..\dist filtered by solr-cell-\d.*\.jar to classpath: C:\Users\jenkins\workspace\Lucene-Solr-master-Windows\solr\build\solr-core\test\J0\temp\solr.handler.admin.AutoscalingHistoryHandlerTest_1512AC03D11329CE-001\tempDir-001\node2\AutoscalingHistoryHandlerTest_collection_shard1_replica_n1\..\..\..\..\dist
   [junit4]   2> 181003 WARN  (qtp6865436-1782) [n:127.0.0.1:49272_solr c:AutoscalingHistoryHandlerTest_collection s:shard1 r:core_node5 x:AutoscalingHistoryHandlerTest_collection_shard1_replica_n2] o.a.s.c.SolrConfig Couldn't add files from C:\Users\jenkins\workspace\Lucene-Solr-master-Windows\solr\build\solr-core\test\J0\temp\solr.handler.admin.AutoscalingHistoryHandlerTest_1512AC03D11329CE-001\tempDir-001\node3\AutoscalingHistoryHandlerTest_collection_shard1_replica_n2\..\..\..\..\dist filtered by solr-cell-\d.*\.jar to classpath: C:\Users\jenkins\workspace\Lucene-Solr-master-Windows\solr\build\solr-core\test\J0\temp\solr.handler.admin.AutoscalingHistoryHandlerTest_1512AC03D11329CE-001\tempDir-001\node3\AutoscalingHistoryHandlerTest_collection_shard1_replica_n2\..\..\..\..\dist
   [junit4]   2> 181003 WARN  (qtp11425198-1790) [n:127.0.0.1:49279_solr c:AutoscalingHistoryHandlerTest_collection s:shard1 r:core_node6 x:AutoscalingHistoryHandlerTest_collection_shard1_replica_n4] o.a.s.c.SolrConfig Couldn't add files from C:\Users\jenkins\workspace\Lucene-Solr-master-Windows\solr\build\solr-core\test\J0\temp\solr.handler.admin.AutoscalingHistoryHandlerTest_1512AC03D11329CE-001\tempDir-001\node1\AutoscalingHistoryHandlerTest_collection_shard1_replica_n4\..\..\..\..\dist filtered by solr-cell-\d.*\.jar to classpath: C:\Users\jenkins\workspace\Lucene-Solr-master-Windows\solr\build\solr-core\test\J0\temp\solr.handler.admin.AutoscalingHistoryHandlerTest_1512AC03D11329CE-001\tempDir-001\node1\AutoscalingHistoryHandlerTest_collection_shard1_replica_n4\..\..\..\..\dist
   [junit4]   2> 181003 WARN  (qtp26840041-1771) [n:127.0.0.1:49269_solr c:AutoscalingHistoryHandlerTest_collection s:shard1 r:core_node3 x:AutoscalingHistoryHandlerTest_collection_shard1_replica_n1] o.a.s.c.SolrConfig Couldn't add files from C:\Users\jenkins\workspace\Lucene-Solr-master-Windows\solr\build\solr-core\test\J0\temp\solr.handler.admin.AutoscalingHistoryHandlerTest_1512AC03D11329CE-001\tempDir-001\node2\AutoscalingHistoryHandlerTest_collection_shard1_replica_n1\..\..\..\..\contrib\clustering\lib filtered by .*\.jar to classpath: C:\Users\jenkins\workspace\Lucene-Solr-master-Windows\solr\build\solr-core\test\J0\temp\solr.handler.admin.AutoscalingHistoryHandlerTest_1512AC03D11329CE-001\tempDir-001\node2\AutoscalingHistoryHandlerTest_collection_shard1_replica_n1\..\..\..\..\contrib\clustering\lib
   [junit4]   2> 181004 WARN  (qtp26840041-1771) [n:127.0.0.1:49269_solr c:AutoscalingHistoryHandlerTest_collection s:shard1 r:core_node3 x:AutoscalingHistoryHandlerTest_collection_shard1_replica_n1] o.a.s.c.SolrConfig Couldn't add files from C:\Users\jenkins\workspace\Lucene-Solr-master-Windows\solr\build\solr-core\test\J0\temp\solr.handler.admin.AutoscalingHistoryHandlerTest_1512AC03D11329CE-001\tempDir-001\node2\AutoscalingHistoryHandlerTest_collection_shard1_replica_n1\..\..\..\..\dist filtered by solr-clustering-\d.*\.jar to classpath: C:\Users\jenkins\workspace\Lucene-Solr-master-Windows\solr\build\solr-core\test\J0\temp\solr.handler.admin.AutoscalingHistoryHandlerTest_1512AC03D11329CE-001\tempDir-001\node2\AutoscalingHistoryHandlerTest_collection_shard1_replica_n1\..\..\..\..\dist
   [junit4]   2> 181004 WARN  (qtp11425198-1790) [n:127.0.0.1:49279_solr c:AutoscalingHistoryHandlerTest_collection s:shard1 r:core_node6 x:AutoscalingHistoryHandlerTest_collection_shard1_replica_n4] o.a.s.c.SolrConfig Couldn't add files from C:\Users\jenkins\workspace\Lucene-Solr-master-Windows\solr\build\solr-core\test\J0\temp\solr.handler.admin.AutoscalingHistoryHandlerTest_1512AC03D11329CE-001\tempDir-001\node1\AutoscalingHistoryHandlerTest_collection_shard1_replica_n4\..\..\..\..\contrib\clustering\lib filtered by .*\.jar to classpath: C:\Users\jenkins\workspace\Lucene-Solr-master-Windows\solr\build\solr-core\test\J0\temp\solr.handler.admin.AutoscalingHistoryHandlerTest_1512AC03D11329CE-001\tempDir-001\node1\AutoscalingHistoryHandlerTest_collection_shard1_replica_n4\..\..\..\..\contrib\clustering\lib
   [junit4]   2> 181004 WARN  (qtp6865436-1782) [n:127.0.0.1:49272_solr c:AutoscalingHistoryHandlerTest_collection s:shard1 r:core_node5 x:AutoscalingHistoryHandlerTest_collection_shard1_replica_n2] o.a.s.c.SolrConfig Couldn't add files from C:\Users\jenkins\workspace\Lucene-Solr-master-Windows\solr\build\solr-core\test\J0\temp\solr.handler.admin.AutoscalingHistoryHandlerTest_1512AC03D11329CE-001\tempDir-001\node3\AutoscalingHistoryHandlerTest_collection_shard1_replica_n2\..\..\..\..\contrib\clustering\lib filtered by .*\.jar to classpath: C:\Users\jenkins\workspace\Lucene-Solr-master-Windows\solr\build\solr-core\test\J0\temp\solr.handler.admin.AutoscalingHistoryHandlerTest_1512AC03D11329CE-001\tempDir-001\node3\AutoscalingHistoryHandlerTest_collection_shard1_replica_n2\..\..\..\..\contrib\clustering\lib
   [junit4]   2> 181004 WARN  (qtp11425198-1790) [n:127.0.0.1:49279_solr c:AutoscalingHistoryHandlerTest_collection s:shard1 r:core_node6 x:AutoscalingHistoryHandlerTest_collection_shard1_replica_n4] o.a.s.c.SolrConfig Couldn't add files from C:\Users\jenkins\workspace\Lucene-Solr-master-Windows\solr\build\solr-core\test\J0\temp\solr.handler.admin.AutoscalingHistoryHandlerTest_1512AC03D11329CE-001\tempDir-001\node1\AutoscalingHistoryHandlerTest_collection_shard1_replica_n4\..\..\..\..\dist filtered by solr-clustering-\d.*\.jar to classpath: C:\Users\jenkins\workspace\Lucene-Solr-master-Windows\solr\build\solr-core\test\J0\temp\solr.handler.admin.AutoscalingHistoryHandlerTest_1512AC03D11329CE-001\tempDir-001\node1\AutoscalingHistoryHandlerTest_collection_shard1_replica_n4\..\..\..\..\dist
   [junit4]   2> 181004 WARN  (qtp6865436-1782) [n:127.0.0.1:49272_solr c:AutoscalingHistoryHandlerTest_collection s:shard1 r:core_node5 x:AutoscalingHistoryHandlerTest_collection_shard1_replica_n2] o.a.s.c.SolrConfig Couldn't add files from C:\Users\jenkins\workspace\Lucene-Solr-master-Windows\solr\build\solr-core\test\J0\temp\solr.handler.admin.AutoscalingHistoryHandlerTest_1512AC03D11329CE-001\tempDir-001\node3\AutoscalingHistoryHandlerTest_collection_shard1_replica_n2\..\..\..\..\dist filtered by solr-clustering-\d.*\.jar to classpath: C:\Users\jenkins\workspace\Lucene-Solr-master-Windows\solr\build\solr-core\test\J0\temp\solr.handler.admin.AutoscalingHistoryHandlerTest_1512AC03D11329CE-001\tempDir-001\node3\AutoscalingHistoryHandlerTest_collection_shard1_replica_n2\..\..\..\..\dist
   [junit4]   2> 181004 WARN  (qtp26840041-1771) [n:127.0.0.1:49269_solr c:AutoscalingHistoryHandlerTest_collection s:shard1 r:core_node3 x:AutoscalingHistoryHandlerTest_collection_shard1_replica_n1] o.a.s.c.SolrConfig Couldn't add files from C:\Users\jenkins\workspace\Lucene-Solr-master-Windows\solr\build\solr-core\test\J0\temp\solr.handler.admin.AutoscalingHistoryHandlerTest_1512AC03D11329CE-001\tempDir-001\node2\AutoscalingHistoryHandlerTest_collection_shard1_replica_n1\..\..\..\..\contrib\langid\lib filtered by .*\.jar to classpath: C:\Users\jenkins\workspace\Lucene-Solr-master-Windows\solr\build\solr-core\test\J0\temp\solr.handler.admin.AutoscalingHistoryHandlerTest_1512AC03D11329CE-001\tempDir-001\node2\AutoscalingHistoryHandlerTest_collection_shard1_replica_n1\..\..\..\..\contrib\langid\lib
   [junit4]   2> 181005 WARN  (qtp6865436-1782) [n:127.0.0.1:49272_solr c:AutoscalingHistoryHandlerTest_collection s:shard1 r:core_node5 x:AutoscalingHistoryHandlerTest_collection_shard1_replica_n2] o.a.s.c.SolrConfig Couldn't add files from C:\Users\jenkins\workspace\Lucene-Solr-master-Windows\solr\build\solr-core\test\J0\temp\solr.handler.admin.AutoscalingHistoryHandlerTest_1512AC03D11329CE-001\tempDir-001\node3\AutoscalingHistoryHandlerTest_collection_shard1_replica_n2\..\..\..\..\contrib\langid\lib filtered by .*\.jar to classpath: C:\Users\jenkins\workspace\Lucene-Solr-master-Windows\solr\build\solr-core\test\J0\temp\solr.handler.admin.AutoscalingHistoryHandlerTest_1512AC03D11329CE-001\tempDir-001\node3\AutoscalingHistoryHandlerTest_collection_shard1_replica_n2\..\..\..\..\contrib\langid\lib
   [junit4]   2> 181005 WARN  (qtp11425198-1790) [n:127.0.0.1:49279_solr c:AutoscalingHistoryHandlerTest_collection s:shard1 r:core_node6 x:AutoscalingHistoryHandlerTest_collection_shard1_replica_n4] o.a.s.c.SolrConfig Couldn't add files from C:\Users\jenkins\workspace\Lucene-Solr-master-Windows\solr\build\solr-core\test\J0\temp\solr.handler.admin.AutoscalingHistoryHandlerTest_1512AC03D11329CE-001\tempDir-001\node1\AutoscalingHistoryHandlerTest_collection_shard1_replica_n4\..\..\..\..\contrib\langid\lib filtered by .*\.jar to classpath: C:\Users\jenkins\workspace\Lucene-Solr-master-Windows\solr\build\solr-core\test\J0\temp\solr.handler.admin.AutoscalingHistoryHandlerTest_1512AC03D11329CE-001\tempDir-001\node1\AutoscalingHistoryHandlerTest_collection_shard1_replica_n4\..\..\..\..\contrib\langid\lib
   [junit4]   2> 181005 WARN  (qtp6865436-1782) [n:127.0.0.1:49272_solr c:AutoscalingHistoryHandlerTest_collection s:shard1 r:core_node5 x:AutoscalingHistoryHandlerTest_collection_shard1_replica_n2] o.a.s.c.SolrConfig Couldn't add files from C:\Users\jenkins\workspace\Lucene-Solr-master-Windows\solr\build\solr-core\test\J0\temp\solr.handler.admin.AutoscalingHistoryHandlerTest_1512AC03D11329CE-001\tempDir-001\node3\AutoscalingHistoryHandlerTest_collection_shard1_replica_n2\..\..\..\..\dist filtered by solr-langid-\d.*\.jar to classpath: C:\Users\jenkins\workspace\Lucene-Solr-master-Windows\solr\build\solr-core\test\J0\temp\solr.handler.admin.AutoscalingHistoryHandlerTest_1512AC03D11329CE-001\tempDir-001\node3\AutoscalingHistoryHandlerTest_collection_shard1_replica_n2\..\..\..\..\dist
   [junit4]   2> 181005 WARN  (qtp26840041-1771) [n:127.0.0.1:49269_solr c:AutoscalingHistoryHandlerTest_collection s:shard1 r:core_node3 x:AutoscalingHistoryHandlerTest_collection_shard1_replica_n1] o.a.s.c.SolrConfig Couldn't add files from C:\Users\jenkins\workspace\Lucene-Solr-master-Windows\solr\build\solr-core\test\J0\temp\solr.handler.admin.AutoscalingHistoryHandlerTest_1512AC03D11329CE-001\tempDir-001\node2\AutoscalingHistoryHandlerTest_collection_shard1_replica_n1\..\..\..\..\dist filtered by solr-langid-\d.*\.jar to classpath: C:\Users\jenkins\workspace\Lucene-Solr-master-Windows\solr\build\solr-core\test\J0\temp\solr.handler.admin.AutoscalingHistoryHandlerTest_1512AC03D11329CE-001\tempDir-001\node2\AutoscalingHistoryHandlerTest_collection_shard1_replica_n1\..\..\..\..\dist
   [junit4]   2> 181006 WARN  (qtp6865436-1782) [n:127.0.0.1:49272_solr c:AutoscalingHistoryHandlerTest_collection s:shard1 r:core_node5 x:AutoscalingHistoryHandlerTest_collection_shard1_replica_n2] o.a.s.c.SolrConfig Couldn't add files from C:\Users\jenkins\workspace\Lucene-Solr-master-Windows\solr\build\solr-core\test\J0\temp\solr.handler.admin.AutoscalingHistoryHandlerTest_1512AC03D11329CE-001\tempDir-001\node3\AutoscalingHistoryHandlerTest_collection_shard1_replica_n2\..\..\..\..\contrib\velocity\lib filtered by .*\.jar to classpath: C:\Users\jenkins\workspace\Lucene-Solr-master-Windows\solr\build\solr-core\test\J0\temp\solr.handler.admin.AutoscalingHistoryHandlerTest_1512AC03D11329CE-001\tempDir-001\node3\AutoscalingHistoryHandlerTest_collection_shard1_replica_n2\..\..\..\..\contrib\velocity\lib
   [junit4]   2> 181006 WARN  (qtp26840041-1771) [n:127.0.0.1:49269_solr c:AutoscalingHistoryHandlerTest_collection s:shard1 r:core_node3 x:AutoscalingHistoryHandlerTest_collection_shard1_replica_n1] o.a.s.c.SolrConfig Couldn't add files from C:\Users\jenkins\workspace\Lucene-Solr-master-Windows\solr\build\solr-core\test\J0\temp\solr.handler.admin.AutoscalingHistoryHandlerTest_1512AC03D11329CE-001\tempDir-001\node2\AutoscalingHistoryHandlerTest_collection_shard1_replica_n1\..\..\..\..\contrib\velocity\lib filtered by .*\.jar to classpath: C:\Users\jenkins\workspace\Lucene-Solr-master-Windows\solr\build\solr-core\test\J0\temp\solr.handler.admin.AutoscalingHistoryHandlerTest_1512AC03D11329CE-001\tempDir-001\node2\AutoscalingHistoryHandlerTest_collection_shard1_replica_n1\..\..\..\..\contrib\velocity\lib
   [junit4]   2> 181006 WARN  (qtp6865436-1782) [n:127.0.0.1:49272_solr c:AutoscalingHistoryHandlerTest_collection s:shard1 r:core_node5 x:AutoscalingHistoryHandlerTest_collection_shard1_replica_n2] o.a.s.c.SolrConfig Couldn't add files from C:\Users\jenkins\workspace\Lucene-Solr-master-Windows\solr\build\solr-core\test\J0\temp\solr.handler.admin.AutoscalingHistoryHandlerTest_1512AC03D11329CE-001\tempDir-001\node3\AutoscalingHistoryHandlerTest_collection_shard1_replica_n2\..\..\..\..\dist filtered by solr-velocity-\d.*\.jar to classpath: C:\Users\jenkins\workspace\Lucene-Solr-master-Windows\solr\build\solr-core\test\J0\temp\solr.handler.admin.AutoscalingHistoryHandlerTest_1512AC03D11329CE-001\tempDir-001\node3\AutoscalingHistoryHandlerTest_collection_shard1_replica_n2\..\..\..\..\dist
   [junit4]   2> 181007 WARN  (qtp26840041-1771) [n:127.0.0.1:49269_solr c:AutoscalingHistoryHandlerTest_collection s:shard1 r:core_node3 x:AutoscalingHistoryHandlerTest_collection_shard1_replica_n1] o.a.s.c.SolrConfig Couldn't add files from C:\Users\jenkins\workspace\Lucene-Solr-master-Windows\solr\build\solr-core\test\J0\temp\solr.handler.admin.AutoscalingHistoryHandlerTest_1512AC03D11329CE-001\tempDir-001\node2\AutoscalingHistoryHandlerTest_collection_shard1_replica_n1\..\..\..\..\dist filtered by solr-velocity-\d.*\.jar to classpath: C:\Users\jenkins\workspace\Lucene-Solr-master-Windows\solr\build\solr-core\test\J0\temp\solr.handler.admin.AutoscalingHistoryHandlerTest_1512AC03D11329CE-001\tempDir-001\node2\AutoscalingHistoryHandlerTest_collection_shard1_replica_n1\..\..\..\..\dist
   [junit4]   2> 181005 WARN  (qtp11425198-1790) [n:127.0.0.1:49279_solr c:AutoscalingHistoryHandlerTest_collection s:shard1 r:core_node6 x:AutoscalingHistoryHandlerTest_collection_shard1_replica_n4] o.a.s.c.SolrConfig Couldn't add files from C:\Users\jenkins\workspace\Lucene-Solr-master-Windows\solr\build\solr-core\test\J0\temp\solr.handler.admin.AutoscalingHistoryHandlerTest_1512AC03D11329CE-001\tempDir-001\node1\AutoscalingHistoryHandlerTest_collection_shard1_replica_n4\..\..\..\..\dist filtered by solr-langid-\d.*\.jar to classpath: C:\Users\jenkins\workspace\Lucene-Solr-master-Windows\solr\build\solr-core\test\J0\temp\solr.handler.admin.AutoscalingHistoryHandlerTest_1512AC03D11329CE-001\tempDir-001\node1\AutoscalingHistoryHandlerTest_collection_shard1_replica_n4\..\..\..\..\dist
   [junit4]   2> 181007 WARN  (qtp11425198-1790) [n:127.0.0.1:49279_solr c:AutoscalingHistoryHandlerTest_collection s:shard1 r:core_node6 x:AutoscalingHistoryHandlerTest_collection_shard1_replica_n4] o.a.s.c.SolrConfig Couldn't add files from C:\Users\jenkins\workspace\Lucene-Solr-master-Windows\solr\build\solr-core\test\J0\temp\solr.handler.admin.AutoscalingHistoryHandlerTest_1512AC03D11329CE-001\tempDir-001\node1\AutoscalingHistoryHandlerTest_collection_shard1_replica_n4\..\..\..\..\contrib\velocity\lib filtered by .*\.jar to classpath: C:\Users\jenkins\workspace\Lucene-Solr-master-Windows\solr\build\solr-core\test\J0\temp\solr.handler.admin.AutoscalingHistoryHandlerTest_1512AC03D11329CE-001\tempDir-001\node1\AutoscalingHistoryHandlerTest_collection_shard1_replica_n4\..\..\..\..\contrib\velocity\lib
   [junit4]   2> 181007 WARN  (qtp11425198-1790) [n:127.0.0.1:49279_solr c:AutoscalingHistoryHandlerTest_collection s:shard1 r:core_node6 x:AutoscalingHistoryHandlerTest_collection_shard1_replica_n4] o.a.s.c.SolrConfig Couldn't add files from C:\Users\jenkins\workspace\Lucene-Solr-master-Windows\solr\build\solr-core\test\J0\temp\solr.handler.admin.AutoscalingHistoryHandlerTest_1512AC03D11329CE-001\tempDir-001\node1\AutoscalingHistoryHandlerTest_collection_shard1_replica_n4\..\..\..\..\dist filtered by solr-velocity-\d.*\.jar to classpath: C:\Users\jenkins\workspace\Lucene-Solr-master-Windows\solr\build\solr-core\test\J0\temp\solr.handler.admin.AutoscalingHistoryHandlerTest_1512AC03D11329CE-001\tempDir-001\node1\AutoscalingHistoryHandlerTest_collection_shard1_replica_n4\..\..\..\..\dist
   [junit4]   2> 181034 INFO  (qtp6865436-1782) [n:127.0.0.1:49272_solr c:AutoscalingHistoryHandlerTest_collection s:shard1 r:core_node5 x:AutoscalingHistoryHandlerTest_collection_shard1_replica_n2] o.a.s.c.SolrConfig Using Lucene MatchVersion: 8.0.0
   [junit4]   2> 181037 INFO  (qtp26840041-1771) [n:127.0.0.1:49269_solr c:AutoscalingHistoryHandlerTest_collection s:shard1 r:core_node3 x:AutoscalingHistoryHandlerTest_collection_shard1_replica_n1] o.a.s.c.SolrConfig Using Lucene MatchVersion: 8.0.0
   [junit4]   2> 181050 INFO  (qtp11425198-1790) [n:127.0.0.1:49279_solr c:AutoscalingHistoryHandlerTest_collection s:shard1 r:core_node6 x:AutoscalingHistoryHandlerTest_collection_shard1_replica_n4] o.a.s.c.SolrConfig Using Lucene MatchVersion: 8.0.0
   [junit4]   2> 181115 INFO  (qtp26840041-1771) [n:127.0.0.1:49269_solr c:AutoscalingHistoryHandlerTest_collection s:shard1 r:core_node3 x:AutoscalingHistoryHandlerTest_collection_shard1_replica_n1] o.a.s.s.IndexSchema [AutoscalingHistoryHandlerTest_collection_shard1_replica_n1] Schema name=default-config
   [junit4]   2> 181121 INFO  (qtp6865436-1782) [n:127.0.0.1:49272_solr c:AutoscalingHistoryHandlerTest_collection s:shard1 r:core_node5 x:AutoscalingHistoryHandlerTest_collection_shard1_replica_n2] o.a.s.s.IndexSchema [AutoscalingHistoryHandlerTest_collection_shard1_replica_n2] Schema name=default-config
   [junit4]   2> 181153 INFO  (qtp11425198-1790) [n:127.0.0.1:49279_solr c:AutoscalingHistoryHandlerTest_collection s:shard1 r:core_node6 x:AutoscalingHistoryHandlerTest_collection_shard1_replica_n4] o.a.s.s.IndexSchema [AutoscalingHistoryHandlerTest_collection_shard1_replica_n4] Schema name=default-config
   [junit4]   2> 181394 DEBUG (ScheduledTrigger-636-thread-2) [n:127.0.0.1:49272_solr    ] o.a.s.c.a.NodeLostTrigger Running NodeLostTrigger: .auto_add_replicas with currently live nodes: [127.0.0.1:49269_solr, 127.0.0.1:49272_solr, 127.0.0.1:49279_solr]
   [junit4]   2> 181940 INFO  (qtp11425198-1790) [n:127.0.0.1:49279_solr c:AutoscalingHistoryHandlerTest_collection s:shard1 r:core_node6 x:AutoscalingHistoryHandlerTest_collection_shard1_replica_n4] o.a.s.s.IndexSchema Loaded schema default-config/1.6 with uniqueid field id
   [junit4]   2> 181945 INFO  (qtp26840041-1771) [n:127.0.0.1:49269_solr c:AutoscalingHistoryHandlerTest_collection s:shard1 r:core_node3 x:AutoscalingHistoryHandlerTest_collection_shard1_replica_n1] o.a.s.s.IndexSchema Loaded schema default-config/1.6 with uniqueid field id
   [junit4]   2> 181945 INFO  (qtp6865436-1782) [n:127.0.0.1:49272_solr c:AutoscalingHisto

[...truncated too long message...]

.c.c.ZkStateReader Updated live nodes from ZooKeeper... (5) -> (4)
   [junit4]   2> 777813 INFO  (zkCallback-840-thread-1-processing-n:127.0.0.1:52736_solr) [n:127.0.0.1:52736_solr    ] o.a.s.c.c.ZkStateReader Updated live nodes from ZooKeeper... (5) -> (4)
   [junit4]   2> 777817 INFO  (jetty-closer-692-thread-3) [    ] o.a.s.m.SolrMetricManager Closing metric reporters for registry=solr.jetty, tag=null
   [junit4]   2> 777817 INFO  (jetty-closer-692-thread-3) [    ] o.a.s.m.r.SolrJmxReporter Closing reporter [org.apache.solr.metrics.reporters.SolrJmxReporter@1e131b6: rootName = solr_52554, domain = solr.jetty, service url = null, agent id = null] for registry solr.jetty / com.codahale.metrics.MetricRegistry@d2bc1d
   [junit4]   2> 777820 INFO  (jetty-closer-692-thread-4) [    ] o.a.s.c.ZkController Remove node as live in ZooKeeper:/live_nodes/127.0.0.1:52585_solr
   [junit4]   2> 777820 INFO  (jetty-closer-692-thread-7) [    ] o.a.s.c.ZkController Remove node as live in ZooKeeper:/live_nodes/127.0.0.1:52736_solr
   [junit4]   2> 777820 INFO  (jetty-closer-692-thread-5) [    ] o.a.s.c.ZkController Remove node as live in ZooKeeper:/live_nodes/127.0.0.1:52600_solr
   [junit4]   2> 777821 INFO  (zkCallback-803-thread-2-processing-n:127.0.0.1:52554_solr) [n:127.0.0.1:52554_solr    ] o.a.s.c.OverseerElectionContext I am going to be the leader 127.0.0.1:52554_solr
   [junit4]   2> 777824 INFO  (zkCallback-812-thread-1-processing-n:127.0.0.1:52585_solr) [n:127.0.0.1:52585_solr    ] o.a.s.c.c.ZkStateReader Updated live nodes from ZooKeeper... (4) -> (1)
   [junit4]   2> 777824 INFO  (zkCallback-840-thread-1-processing-n:127.0.0.1:52736_solr) [n:127.0.0.1:52736_solr    ] o.a.s.c.c.ZkStateReader Updated live nodes from ZooKeeper... (4) -> (1)
   [junit4]   2> 777824 INFO  (zkCallback-818-thread-1-processing-n:127.0.0.1:52600_solr) [n:127.0.0.1:52600_solr    ] o.a.s.c.c.ZkStateReader Updated live nodes from ZooKeeper... (4) -> (1)
   [junit4]   2> 777823 INFO  (zkCallback-803-thread-1-processing-n:127.0.0.1:52554_solr) [n:127.0.0.1:52554_solr    ] o.a.s.c.c.ZkStateReader Updated live nodes from ZooKeeper... (4) -> (1)
   [junit4]   2> 777823 INFO  (jetty-closer-692-thread-5) [    ] o.a.s.m.SolrMetricManager Closing metric reporters for registry=solr.cluster, tag=null
   [junit4]   2> 777824 INFO  (jetty-closer-692-thread-5) [    ] o.a.s.c.TransientSolrCoreCacheDefault Allocating transient cache for 2147483647 transient cores
   [junit4]   2> 777823 INFO  (jetty-closer-692-thread-7) [    ] o.a.s.m.SolrMetricManager Closing metric reporters for registry=solr.cluster, tag=null
   [junit4]   2> 777825 INFO  (jetty-closer-692-thread-7) [    ] o.a.s.c.TransientSolrCoreCacheDefault Allocating transient cache for 2147483647 transient cores
   [junit4]   2> 777822 INFO  (jetty-closer-692-thread-4) [    ] o.a.s.m.SolrMetricManager Closing metric reporters for registry=solr.cluster, tag=null
   [junit4]   2> 777826 INFO  (jetty-closer-692-thread-4) [    ] o.a.s.c.TransientSolrCoreCacheDefault Allocating transient cache for 2147483647 transient cores
   [junit4]   2> 777822 INFO  (jetty-closer-692-thread-3) [    ] o.a.s.c.ZkController Remove node as live in ZooKeeper:/live_nodes/127.0.0.1:52554_solr
   [junit4]   2> 777828 INFO  (jetty-closer-692-thread-5) [    ] o.e.j.s.h.ContextHandler Stopped o.e.j.s.ServletContextHandler@1437bb6{/solr,null,UNAVAILABLE}
   [junit4]   2> 777829 INFO  (jetty-closer-692-thread-4) [    ] o.e.j.s.h.ContextHandler Stopped o.e.j.s.ServletContextHandler@633030{/solr,null,UNAVAILABLE}
   [junit4]   2> 777830 INFO  (jetty-closer-692-thread-3) [    ] o.a.s.m.SolrMetricManager Closing metric reporters for registry=solr.cluster, tag=null
   [junit4]   2> 777830 INFO  (jetty-closer-692-thread-3) [    ] o.a.s.c.TransientSolrCoreCacheDefault Allocating transient cache for 2147483647 transient cores
   [junit4]   2> 777836 INFO  (jetty-closer-692-thread-7) [    ] o.e.j.s.h.ContextHandler Stopped o.e.j.s.ServletContextHandler@853e2d{/solr,null,UNAVAILABLE}
   [junit4]   2> 779297 WARN  (zkCallback-792-thread-1-processing-n:127.0.0.1:52470_solr) [n:127.0.0.1:52470_solr    ] o.a.s.c.c.ZkStateReader ZooKeeper watch triggered, but Solr cannot talk to ZK: [KeeperErrorCode = Session expired for /live_nodes]
   [junit4]   2> 779297 INFO  (jetty-closer-692-thread-2) [    ] o.e.j.s.h.ContextHandler Stopped o.e.j.s.ServletContextHandler@e1e197{/solr,null,UNAVAILABLE}
   [junit4]   2> 779359 WARN  (zkCallback-834-thread-1-processing-n:127.0.0.1:52697_solr) [n:127.0.0.1:52697_solr    ] o.a.s.c.c.ZkStateReader ZooKeeper watch triggered, but Solr cannot talk to ZK: [KeeperErrorCode = Session expired for /live_nodes]
   [junit4]   2> 779359 WARN  (zkCallback-803-thread-1-processing-n:127.0.0.1:52554_solr) [n:127.0.0.1:52554_solr    ] o.a.s.c.c.ZkStateReader ZooKeeper watch triggered, but Solr cannot talk to ZK: [KeeperErrorCode = Session expired for /live_nodes]
   [junit4]   2> 779359 INFO  (jetty-closer-692-thread-6) [    ] o.e.j.s.h.ContextHandler Stopped o.e.j.s.ServletContextHandler@178536{/solr,null,UNAVAILABLE}
   [junit4]   2> 779359 INFO  (jetty-closer-692-thread-3) [    ] o.e.j.s.h.ContextHandler Stopped o.e.j.s.ServletContextHandler@11c0556{/solr,null,UNAVAILABLE}
   [junit4]   2> 779364 ERROR (SUITE-TriggerIntegrationTest-seed#[1512AC03D11329CE]-worker) [    ] o.a.z.s.ZooKeeperServer ZKShutdownHandler is not registered, so ZooKeeper server won't take any action on ERROR or SHUTDOWN server state changes
   [junit4]   2> 779366 INFO  (SUITE-TriggerIntegrationTest-seed#[1512AC03D11329CE]-worker) [    ] o.a.s.c.ZkTestServer connecting to 127.0.0.1:52088 52088
   [junit4]   2> 779368 INFO  (Thread-1361) [    ] o.a.s.c.ZkTestServer connecting to 127.0.0.1:52088 52088
   [junit4]   2> 779369 WARN  (Thread-1361) [    ] o.a.s.c.ZkTestServer Watch limit violations: 
   [junit4]   2> Maximum concurrent create/delete watches above limit:
   [junit4]   2> 
   [junit4]   2> 	33	/solr/aliases.json
   [junit4]   2> 	33	/solr/clusterprops.json
   [junit4]   2> 	14	/solr/security.json
   [junit4]   2> 
   [junit4]   2> Maximum concurrent data watches above limit:
   [junit4]   2> 
   [junit4]   2> 	33	/solr/clusterstate.json
   [junit4]   2> 	6	/solr/autoscaling.json
   [junit4]   2> 	3	/solr/overseer_elect/election/98869438847647762-127.0.0.1:52206_solr-n_0000000003
   [junit4]   2> 
   [junit4]   2> Maximum concurrent children watches above limit:
   [junit4]   2> 
   [junit4]   2> 	33	/solr/collections
   [junit4]   2> 	32	/solr/live_nodes
   [junit4]   2> 	6	/solr/autoscaling/events/.auto_add_replicas
   [junit4]   2> 	6	/solr/overseer/queue
   [junit4]   2> 	6	/solr/overseer/collection-queue-work
   [junit4]   2> 	6	/solr/overseer/queue-work
   [junit4]   2> 	3	/solr/autoscaling/events/node_added_trigger
   [junit4]   2> 	2	/solr/autoscaling/events/node_lost_trigger
   [junit4]   2> 
   [junit4]   2> NOTE: leaving temporary files on disk at: C:\Users\jenkins\workspace\Lucene-Solr-master-Windows\solr\build\solr-core\test\J1\temp\solr.cloud.autoscaling.TriggerIntegrationTest_1512AC03D11329CE-001
   [junit4]   2> Oct 21, 2017 11:20:24 PM com.carrotsearch.randomizedtesting.ThreadLeakControl checkThreadLeaks
   [junit4]   2> WARNING: Will linger awaiting termination of 1 leaked thread(s).
   [junit4]   2> NOTE: test params are: codec=Asserting(Lucene70): {}, docValues:{}, maxPointsInLeafNode=1828, maxMBSortInHeap=5.680437951611047, sim=RandomSimilarity(queryNorm=false): {}, locale=ga-IE, timezone=Asia/Hong_Kong
   [junit4]   2> NOTE: Windows 10 10.0 x86/Oracle Corporation 1.8.0_144 (32-bit)/cpus=3,threads=1,free=74839576,total=223096832
   [junit4]   2> NOTE: All tests run in this JVM: [SolrCoreTest, TestSchemaVersionResource, TestSimpleTrackingShardHandler, TestLeaderInitiatedRecoveryThread, FieldMutatingUpdateProcessorTest, SoftAutoCommitTest, CdcrReplicationDistributedZkTest, MoreLikeThisHandlerTest, SolrGangliaReporterTest, SolrMetricReporterTest, TestGroupingSearch, CollectionsAPIAsyncDistributedZkTest, DistributedExpandComponentTest, SolrPluginUtilsTest, TestManagedSchemaThreadSafety, DocValuesMultiTest, TestUniqueKeyFieldResource, CustomCollectionTest, TestRawResponseWriter, StatelessScriptUpdateProcessorFactoryTest, TestExtendedDismaxParser, SpatialHeatmapFacetsTest, TestReloadDeadlock, DistributedFacetPivotWhiteBoxTest, BitVectorTest, SortSpecParsingTest, TestValueSourceCache, SmileWriterTest, CollectionsAPIDistributedZkTest, SimplePostToolTest, DistributedQueueTest, TestLRUCache, ChaosMonkeyNothingIsSafeWithPullReplicasTest, SchemaVersionSpecificBehaviorTest, UninvertDocValuesMergePolicyTest, TermsComponentTest, TestManagedResource, HdfsSyncSliceTest, BadCopyFieldTest, TestMinMaxOnMultiValuedField, TestInfoStreamLogging, TestReload, TestConfigOverlay, TestCustomDocTransformer, SpellingQueryConverterTest, TestQueryTypes, V2StandaloneTest, LeaderFailureAfterFreshStartTest, SOLR749Test, TestDocSet, MoveReplicaHDFSTest, TestBM25SimilarityFactory, DistributedQueryComponentOptimizationTest, CursorMarkTest, CloneFieldUpdateProcessorFactoryTest, TestFieldCacheSortRandom, HdfsWriteToMultipleCollectionsTest, FileUtilsTest, RestartWhileUpdatingTest, TestSuggestSpellingConverter, PreAnalyzedFieldManagedSchemaCloudTest, BasicAuthStandaloneTest, MetricsHandlerTest, DistributedFacetPivotLargeTest, BaseCdcrDistributedZkTest, TestCrossCoreJoin, TestJavabinTupleStreamParser, SolrCoreCheckLockOnStartupTest, TestCollectionAPIs, TestConfigSetProperties, TestDFISimilarityFactory, BasicZkTest, IndexSchemaRuntimeFieldTest, TestExactSharedStatsCache, TestInPlaceUpdatesDistrib, SampleTest, TestPerFieldSimilarity, OpenCloseCoreStressTest, QueryElevationComponentTest, TestDocumentBuilder, TestCloudInspectUtil, SimpleMLTQParserTest, UtilsToolTest, TriggerIntegrationTest]
   [junit4] Completed [164/745 (2!)] on J1 in 113.10s, 10 tests, 1 failure <<< FAILURES!

[...truncated 44898 lines...]

Mime
View raw message