lucene-dev mailing list archives

Site index · List index
Message view « Date » · « Thread »
Top « Date » · « Thread »
From Policeman Jenkins Server <jenk...@thetaphi.de>
Subject [JENKINS] Lucene-Solr-7.1-Linux (32bit/jdk1.8.0_144) - Build # 6 - Still Unstable!
Date Sun, 15 Oct 2017 07:39:34 GMT
Build: https://jenkins.thetaphi.de/job/Lucene-Solr-7.1-Linux/6/
Java: 32bit/jdk1.8.0_144 -client -XX:+UseSerialGC

1 tests failed.
FAILED:  junit.framework.TestSuite.org.apache.solr.security.hadoop.TestImpersonationWithHadoopAuth

Error Message:
2 threads leaked from SUITE scope at org.apache.solr.security.hadoop.TestImpersonationWithHadoopAuth:     1) Thread[id=1029, name=jetty-launcher-141-thread-2-EventThread, state=TIMED_WAITING, group=TGRP-TestImpersonationWithHadoopAuth]         at sun.misc.Unsafe.park(Native Method)         at java.util.concurrent.locks.LockSupport.parkNanos(LockSupport.java:215)         at java.util.concurrent.locks.AbstractQueuedSynchronizer.doAcquireSharedNanos(AbstractQueuedSynchronizer.java:1037)         at java.util.concurrent.locks.AbstractQueuedSynchronizer.tryAcquireSharedNanos(AbstractQueuedSynchronizer.java:1328)         at java.util.concurrent.CountDownLatch.await(CountDownLatch.java:277)         at org.apache.curator.CuratorZookeeperClient.internalBlockUntilConnectedOrTimedOut(CuratorZookeeperClient.java:323)         at org.apache.curator.RetryLoop.callWithRetry(RetryLoop.java:105)         at org.apache.curator.framework.imps.GetDataBuilderImpl.pathInForeground(GetDataBuilderImpl.java:288)         at org.apache.curator.framework.imps.GetDataBuilderImpl.forPath(GetDataBuilderImpl.java:279)         at org.apache.curator.framework.imps.GetDataBuilderImpl.forPath(GetDataBuilderImpl.java:41)         at org.apache.curator.framework.recipes.shared.SharedValue.readValue(SharedValue.java:244)         at org.apache.curator.framework.recipes.shared.SharedValue.access$100(SharedValue.java:44)         at org.apache.curator.framework.recipes.shared.SharedValue$1.process(SharedValue.java:61)         at org.apache.curator.framework.imps.NamespaceWatcher.process(NamespaceWatcher.java:67)         at org.apache.zookeeper.ClientCnxn$EventThread.processEvent(ClientCnxn.java:530)         at org.apache.zookeeper.ClientCnxn$EventThread.run(ClientCnxn.java:505)    2) Thread[id=1023, name=jetty-launcher-141-thread-1-EventThread, state=TIMED_WAITING, group=TGRP-TestImpersonationWithHadoopAuth]         at sun.misc.Unsafe.park(Native Method)         at java.util.concurrent.locks.LockSupport.parkNanos(LockSupport.java:215)         at java.util.concurrent.locks.AbstractQueuedSynchronizer.doAcquireSharedNanos(AbstractQueuedSynchronizer.java:1037)         at java.util.concurrent.locks.AbstractQueuedSynchronizer.tryAcquireSharedNanos(AbstractQueuedSynchronizer.java:1328)         at java.util.concurrent.CountDownLatch.await(CountDownLatch.java:277)         at org.apache.curator.CuratorZookeeperClient.internalBlockUntilConnectedOrTimedOut(CuratorZookeeperClient.java:323)         at org.apache.curator.RetryLoop.callWithRetry(RetryLoop.java:105)         at org.apache.curator.framework.imps.GetDataBuilderImpl.pathInForeground(GetDataBuilderImpl.java:288)         at org.apache.curator.framework.imps.GetDataBuilderImpl.forPath(GetDataBuilderImpl.java:279)         at org.apache.curator.framework.imps.GetDataBuilderImpl.forPath(GetDataBuilderImpl.java:41)         at org.apache.curator.framework.recipes.shared.SharedValue.readValue(SharedValue.java:244)         at org.apache.curator.framework.recipes.shared.SharedValue.access$100(SharedValue.java:44)         at org.apache.curator.framework.recipes.shared.SharedValue$1.process(SharedValue.java:61)         at org.apache.curator.framework.imps.NamespaceWatcher.process(NamespaceWatcher.java:67)         at org.apache.zookeeper.ClientCnxn$EventThread.processEvent(ClientCnxn.java:530)         at org.apache.zookeeper.ClientCnxn$EventThread.run(ClientCnxn.java:505)

Stack Trace:
com.carrotsearch.randomizedtesting.ThreadLeakError: 2 threads leaked from SUITE scope at org.apache.solr.security.hadoop.TestImpersonationWithHadoopAuth: 
   1) Thread[id=1029, name=jetty-launcher-141-thread-2-EventThread, state=TIMED_WAITING, group=TGRP-TestImpersonationWithHadoopAuth]
        at sun.misc.Unsafe.park(Native Method)
        at java.util.concurrent.locks.LockSupport.parkNanos(LockSupport.java:215)
        at java.util.concurrent.locks.AbstractQueuedSynchronizer.doAcquireSharedNanos(AbstractQueuedSynchronizer.java:1037)
        at java.util.concurrent.locks.AbstractQueuedSynchronizer.tryAcquireSharedNanos(AbstractQueuedSynchronizer.java:1328)
        at java.util.concurrent.CountDownLatch.await(CountDownLatch.java:277)
        at org.apache.curator.CuratorZookeeperClient.internalBlockUntilConnectedOrTimedOut(CuratorZookeeperClient.java:323)
        at org.apache.curator.RetryLoop.callWithRetry(RetryLoop.java:105)
        at org.apache.curator.framework.imps.GetDataBuilderImpl.pathInForeground(GetDataBuilderImpl.java:288)
        at org.apache.curator.framework.imps.GetDataBuilderImpl.forPath(GetDataBuilderImpl.java:279)
        at org.apache.curator.framework.imps.GetDataBuilderImpl.forPath(GetDataBuilderImpl.java:41)
        at org.apache.curator.framework.recipes.shared.SharedValue.readValue(SharedValue.java:244)
        at org.apache.curator.framework.recipes.shared.SharedValue.access$100(SharedValue.java:44)
        at org.apache.curator.framework.recipes.shared.SharedValue$1.process(SharedValue.java:61)
        at org.apache.curator.framework.imps.NamespaceWatcher.process(NamespaceWatcher.java:67)
        at org.apache.zookeeper.ClientCnxn$EventThread.processEvent(ClientCnxn.java:530)
        at org.apache.zookeeper.ClientCnxn$EventThread.run(ClientCnxn.java:505)
   2) Thread[id=1023, name=jetty-launcher-141-thread-1-EventThread, state=TIMED_WAITING, group=TGRP-TestImpersonationWithHadoopAuth]
        at sun.misc.Unsafe.park(Native Method)
        at java.util.concurrent.locks.LockSupport.parkNanos(LockSupport.java:215)
        at java.util.concurrent.locks.AbstractQueuedSynchronizer.doAcquireSharedNanos(AbstractQueuedSynchronizer.java:1037)
        at java.util.concurrent.locks.AbstractQueuedSynchronizer.tryAcquireSharedNanos(AbstractQueuedSynchronizer.java:1328)
        at java.util.concurrent.CountDownLatch.await(CountDownLatch.java:277)
        at org.apache.curator.CuratorZookeeperClient.internalBlockUntilConnectedOrTimedOut(CuratorZookeeperClient.java:323)
        at org.apache.curator.RetryLoop.callWithRetry(RetryLoop.java:105)
        at org.apache.curator.framework.imps.GetDataBuilderImpl.pathInForeground(GetDataBuilderImpl.java:288)
        at org.apache.curator.framework.imps.GetDataBuilderImpl.forPath(GetDataBuilderImpl.java:279)
        at org.apache.curator.framework.imps.GetDataBuilderImpl.forPath(GetDataBuilderImpl.java:41)
        at org.apache.curator.framework.recipes.shared.SharedValue.readValue(SharedValue.java:244)
        at org.apache.curator.framework.recipes.shared.SharedValue.access$100(SharedValue.java:44)
        at org.apache.curator.framework.recipes.shared.SharedValue$1.process(SharedValue.java:61)
        at org.apache.curator.framework.imps.NamespaceWatcher.process(NamespaceWatcher.java:67)
        at org.apache.zookeeper.ClientCnxn$EventThread.processEvent(ClientCnxn.java:530)
        at org.apache.zookeeper.ClientCnxn$EventThread.run(ClientCnxn.java:505)
	at __randomizedtesting.SeedInfo.seed([46F599DA17D38BBD]:0)




Build Log:
[...truncated 11751 lines...]
   [junit4] Suite: org.apache.solr.security.hadoop.TestImpersonationWithHadoopAuth
   [junit4]   2> 198662 INFO  (SUITE-TestImpersonationWithHadoopAuth-seed#[46F599DA17D38BBD]-worker) [    ] o.a.s.SolrTestCaseJ4 SecureRandom sanity checks: test.solr.allowed.securerandom=null & java.security.egd=file:/dev/./urandom
   [junit4]   2> Creating dataDir: /home/jenkins/workspace/Lucene-Solr-7.1-Linux/solr/build/solr-core/test/J0/temp/solr.security.hadoop.TestImpersonationWithHadoopAuth_46F599DA17D38BBD-001/init-core-data-001
   [junit4]   2> 198662 WARN  (SUITE-TestImpersonationWithHadoopAuth-seed#[46F599DA17D38BBD]-worker) [    ] o.a.s.SolrTestCaseJ4 startTrackingSearchers: numOpens=1 numCloses=1
   [junit4]   2> 198663 INFO  (SUITE-TestImpersonationWithHadoopAuth-seed#[46F599DA17D38BBD]-worker) [    ] o.a.s.SolrTestCaseJ4 Using PointFields (NUMERIC_POINTS_SYSPROP=true) w/NUMERIC_DOCVALUES_SYSPROP=true
   [junit4]   2> 198664 INFO  (SUITE-TestImpersonationWithHadoopAuth-seed#[46F599DA17D38BBD]-worker) [    ] o.a.s.SolrTestCaseJ4 Randomized ssl (true) and clientAuth (false) via: @org.apache.solr.util.RandomizeSSL(reason=, ssl=NaN, value=NaN, clientAuth=NaN)
   [junit4]   2> 198682 INFO  (SUITE-TestImpersonationWithHadoopAuth-seed#[46F599DA17D38BBD]-worker) [    ] o.a.s.c.MiniSolrCloudCluster Starting cluster of 2 servers in /home/jenkins/workspace/Lucene-Solr-7.1-Linux/solr/build/solr-core/test/J0/temp/solr.security.hadoop.TestImpersonationWithHadoopAuth_46F599DA17D38BBD-001/tempDir-001
   [junit4]   2> 198682 INFO  (SUITE-TestImpersonationWithHadoopAuth-seed#[46F599DA17D38BBD]-worker) [    ] o.a.s.c.ZkTestServer STARTING ZK TEST SERVER
   [junit4]   2> 198682 INFO  (Thread-218) [    ] o.a.s.c.ZkTestServer client port:0.0.0.0/0.0.0.0:0
   [junit4]   2> 198682 INFO  (Thread-218) [    ] o.a.s.c.ZkTestServer Starting server
   [junit4]   2> 198684 ERROR (Thread-218) [    ] o.a.z.s.ZooKeeperServer ZKShutdownHandler is not registered, so ZooKeeper server won't take any action on ERROR or SHUTDOWN server state changes
   [junit4]   2> 198782 INFO  (SUITE-TestImpersonationWithHadoopAuth-seed#[46F599DA17D38BBD]-worker) [    ] o.a.s.c.ZkTestServer start zk server on port:39875
   [junit4]   2> 198806 INFO  (jetty-launcher-141-thread-1) [    ] o.e.j.s.Server jetty-9.3.20.v20170531
   [junit4]   2> 198806 INFO  (jetty-launcher-141-thread-2) [    ] o.e.j.s.Server jetty-9.3.20.v20170531
   [junit4]   2> 198808 INFO  (jetty-launcher-141-thread-2) [    ] o.e.j.s.h.ContextHandler Started o.e.j.s.ServletContextHandler@67360d{/solr,null,AVAILABLE}
   [junit4]   2> 198808 INFO  (jetty-launcher-141-thread-1) [    ] o.e.j.s.h.ContextHandler Started o.e.j.s.ServletContextHandler@d6f1d9{/solr,null,AVAILABLE}
   [junit4]   2> 198809 INFO  (jetty-launcher-141-thread-1) [    ] o.e.j.s.AbstractConnector Started ServerConnector@fe2eb7{SSL,[ssl, http/1.1]}{127.0.0.1:38665}
   [junit4]   2> 198809 INFO  (jetty-launcher-141-thread-2) [    ] o.e.j.s.AbstractConnector Started ServerConnector@2a4a12{SSL,[ssl, http/1.1]}{127.0.0.1:41537}
   [junit4]   2> 198810 INFO  (jetty-launcher-141-thread-1) [    ] o.e.j.s.Server Started @199946ms
   [junit4]   2> 198810 INFO  (jetty-launcher-141-thread-2) [    ] o.e.j.s.Server Started @199946ms
   [junit4]   2> 198810 INFO  (jetty-launcher-141-thread-1) [    ] o.a.s.c.s.e.JettySolrRunner Jetty properties: {hostContext=/solr, hostPort=38665}
   [junit4]   2> 198810 INFO  (jetty-launcher-141-thread-2) [    ] o.a.s.c.s.e.JettySolrRunner Jetty properties: {hostContext=/solr, hostPort=41537}
   [junit4]   2> 198810 ERROR (jetty-launcher-141-thread-2) [    ] o.a.s.u.StartupLoggingUtils Missing Java Option solr.log.dir. Logging may be missing or incomplete.
   [junit4]   2> 198810 ERROR (jetty-launcher-141-thread-1) [    ] o.a.s.u.StartupLoggingUtils Missing Java Option solr.log.dir. Logging may be missing or incomplete.
   [junit4]   2> 198810 INFO  (jetty-launcher-141-thread-2) [    ] o.a.s.s.SolrDispatchFilter  ___      _       Welcome to Apache Solr™ version 7.1.0
   [junit4]   2> 198810 INFO  (jetty-launcher-141-thread-1) [    ] o.a.s.s.SolrDispatchFilter  ___      _       Welcome to Apache Solr™ version 7.1.0
   [junit4]   2> 198810 INFO  (jetty-launcher-141-thread-2) [    ] o.a.s.s.SolrDispatchFilter / __| ___| |_ _   Starting in cloud mode on port null
   [junit4]   2> 198810 INFO  (jetty-launcher-141-thread-1) [    ] o.a.s.s.SolrDispatchFilter / __| ___| |_ _   Starting in cloud mode on port null
   [junit4]   2> 198810 INFO  (jetty-launcher-141-thread-2) [    ] o.a.s.s.SolrDispatchFilter \__ \/ _ \ | '_|  Install dir: null, Default config dir: null
   [junit4]   2> 198810 INFO  (jetty-launcher-141-thread-1) [    ] o.a.s.s.SolrDispatchFilter \__ \/ _ \ | '_|  Install dir: null, Default config dir: null
   [junit4]   2> 198810 INFO  (jetty-launcher-141-thread-2) [    ] o.a.s.s.SolrDispatchFilter |___/\___/_|_|    Start time: 2017-10-15T06:39:22.656Z
   [junit4]   2> 198810 INFO  (jetty-launcher-141-thread-1) [    ] o.a.s.s.SolrDispatchFilter |___/\___/_|_|    Start time: 2017-10-15T06:39:22.656Z
   [junit4]   2> 198817 INFO  (jetty-launcher-141-thread-2) [    ] o.a.s.s.SolrDispatchFilter solr.xml found in ZooKeeper. Loading...
   [junit4]   2> 198820 INFO  (jetty-launcher-141-thread-1) [    ] o.a.s.s.SolrDispatchFilter solr.xml found in ZooKeeper. Loading...
   [junit4]   2> 198833 INFO  (jetty-launcher-141-thread-2) [    ] o.a.s.c.ZkContainer Zookeeper client=127.0.0.1:39875/solr
   [junit4]   2> 198833 INFO  (jetty-launcher-141-thread-1) [    ] o.a.s.c.ZkContainer Zookeeper client=127.0.0.1:39875/solr
   [junit4]   2> 198838 WARN  (NIOServerCxn.Factory:0.0.0.0/0.0.0.0:0) [    ] o.a.z.s.NIOServerCnxn caught end of stream exception
   [junit4]   2> EndOfStreamException: Unable to read additional data from client sessionid 0x15f1ec22ba10004, likely client has closed socket
   [junit4]   2> 	at org.apache.zookeeper.server.NIOServerCnxn.doIO(NIOServerCnxn.java:239)
   [junit4]   2> 	at org.apache.zookeeper.server.NIOServerCnxnFactory.run(NIOServerCnxnFactory.java:203)
   [junit4]   2> 	at java.lang.Thread.run(Thread.java:748)
   [junit4]   2> 198898 INFO  (jetty-launcher-141-thread-1) [n:127.0.0.1:38665_solr    ] o.a.s.c.Overseer Overseer (id=null) closing
   [junit4]   2> 198898 INFO  (jetty-launcher-141-thread-1) [n:127.0.0.1:38665_solr    ] o.a.s.c.OverseerElectionContext I am going to be the leader 127.0.0.1:38665_solr
   [junit4]   2> 198898 INFO  (jetty-launcher-141-thread-1) [n:127.0.0.1:38665_solr    ] o.a.s.c.Overseer Overseer (id=98831536129900549-127.0.0.1:38665_solr-n_0000000000) starting
   [junit4]   2> 198899 INFO  (jetty-launcher-141-thread-2) [n:127.0.0.1:41537_solr    ] o.a.s.c.Overseer Overseer (id=null) closing
   [junit4]   2> 198900 INFO  (jetty-launcher-141-thread-2) [n:127.0.0.1:41537_solr    ] o.a.s.c.ZkController Register node as live in ZooKeeper:/live_nodes/127.0.0.1:41537_solr
   [junit4]   2> 198901 INFO  (zkCallback-152-thread-1-processing-n:127.0.0.1:38665_solr) [n:127.0.0.1:38665_solr    ] o.a.s.c.c.ZkStateReader Updated live nodes from ZooKeeper... (0) -> (1)
   [junit4]   2> 198901 INFO  (zkCallback-153-thread-1-processing-n:127.0.0.1:41537_solr) [n:127.0.0.1:41537_solr    ] o.a.s.c.c.ZkStateReader Updated live nodes from ZooKeeper... (0) -> (1)
   [junit4]   2> 198908 INFO  (jetty-launcher-141-thread-1) [n:127.0.0.1:38665_solr    ] o.a.s.c.ZkController Register node as live in ZooKeeper:/live_nodes/127.0.0.1:38665_solr
   [junit4]   2> 198909 INFO  (zkCallback-153-thread-1-processing-n:127.0.0.1:41537_solr) [n:127.0.0.1:41537_solr    ] o.a.s.c.c.ZkStateReader Updated live nodes from ZooKeeper... (1) -> (2)
   [junit4]   2> 198909 INFO  (zkCallback-152-thread-1-processing-n:127.0.0.1:38665_solr) [n:127.0.0.1:38665_solr    ] o.a.s.c.c.ZkStateReader Updated live nodes from ZooKeeper... (1) -> (2)
   [junit4]   2> 199050 INFO  (jetty-launcher-141-thread-1) [n:127.0.0.1:38665_solr    ] o.a.s.c.CoreContainer Initializing authentication plugin: org.apache.solr.security.HadoopAuthPlugin
   [junit4]   2> 199052 INFO  (jetty-launcher-141-thread-1) [n:127.0.0.1:38665_solr    ] o.a.s.s.HadoopAuthPlugin Params: {proxyuser.anyHostUsersGroup.hosts=*, proxyuser.wrongHost.hosts=1.1.1.1.1.1, proxyuser.bogusGroup.groups=__some_bogus_group, proxyuser.localHostAnyGroup.groups=*, cookie.domain=127.0.0.1, proxyuser.wrongHost.groups=*, type=simple, proxyuser.noHosts.groups=*, proxyuser.anyHostUsersGroup.groups=jenkins, proxyuser.noGroups.hosts=*, proxyuser.anyHostAnyUser.groups=*, delegation-token.token-kind=solr-dt, proxyuser.bogusGroup.hosts=*, zk-dt-secret-manager.znodeWorkingPath=solr/security/zkdtsm, signer.secret.provider.zookeeper.path=/token, zk-dt-secret-manager.enable=true, proxyuser.localHostAnyGroup.hosts=localhost.localdomain,localhost,127.0.0.1, proxyuser.anyHostAnyUser.hosts=*, signer.secret.provider=zookeeper}
   [junit4]   2> 199055 INFO  (jetty-launcher-141-thread-1) [n:127.0.0.1:38665_solr    ] o.a.c.f.i.CuratorFrameworkImpl Starting
   [junit4]   2> 199062 INFO  (jetty-launcher-141-thread-1-EventThread) [n:127.0.0.1:38665_solr    ] o.a.c.f.s.ConnectionStateManager State change: CONNECTED
   [junit4]   2> 199067 INFO  (jetty-launcher-141-thread-2) [n:127.0.0.1:41537_solr    ] o.a.s.c.CoreContainer Initializing authentication plugin: org.apache.solr.security.HadoopAuthPlugin
   [junit4]   2> 199067 INFO  (jetty-launcher-141-thread-2) [n:127.0.0.1:41537_solr    ] o.a.s.s.HadoopAuthPlugin Params: {proxyuser.anyHostUsersGroup.hosts=*, proxyuser.wrongHost.hosts=1.1.1.1.1.1, proxyuser.bogusGroup.groups=__some_bogus_group, proxyuser.localHostAnyGroup.groups=*, cookie.domain=127.0.0.1, proxyuser.wrongHost.groups=*, type=simple, proxyuser.noHosts.groups=*, proxyuser.anyHostUsersGroup.groups=jenkins, proxyuser.noGroups.hosts=*, proxyuser.anyHostAnyUser.groups=*, delegation-token.token-kind=solr-dt, proxyuser.bogusGroup.hosts=*, zk-dt-secret-manager.znodeWorkingPath=solr/security/zkdtsm, signer.secret.provider.zookeeper.path=/token, zk-dt-secret-manager.enable=true, proxyuser.localHostAnyGroup.hosts=localhost.localdomain,localhost,127.0.0.1, proxyuser.anyHostAnyUser.hosts=*, signer.secret.provider=zookeeper}
   [junit4]   2> 199069 INFO  (jetty-launcher-141-thread-2) [n:127.0.0.1:41537_solr    ] o.a.c.f.i.CuratorFrameworkImpl Starting
   [junit4]   2> 199079 INFO  (jetty-launcher-141-thread-2-EventThread) [n:127.0.0.1:41537_solr    ] o.a.c.f.s.ConnectionStateManager State change: CONNECTED
   [junit4]   2> 199082 INFO  (jetty-launcher-141-thread-1) [n:127.0.0.1:38665_solr    ] o.a.s.c.CoreContainer PKIAuthenticationPlugin is managing internode requests
   [junit4]   2> 199122 INFO  (jetty-launcher-141-thread-1) [n:127.0.0.1:38665_solr    ] o.a.s.m.r.SolrJmxReporter JMX monitoring for 'solr_38665.solr.node' (registry 'solr.node') enabled at server: com.sun.jmx.mbeanserver.JmxMBeanServer@ed9630
   [junit4]   2> 199132 INFO  (jetty-launcher-141-thread-1) [n:127.0.0.1:38665_solr    ] o.a.s.m.r.SolrJmxReporter JMX monitoring for 'solr_38665.solr.jvm' (registry 'solr.jvm') enabled at server: com.sun.jmx.mbeanserver.JmxMBeanServer@ed9630
   [junit4]   2> 199132 INFO  (jetty-launcher-141-thread-1) [n:127.0.0.1:38665_solr    ] o.a.s.m.r.SolrJmxReporter JMX monitoring for 'solr_38665.solr.jetty' (registry 'solr.jetty') enabled at server: com.sun.jmx.mbeanserver.JmxMBeanServer@ed9630
   [junit4]   2> 199138 INFO  (jetty-launcher-141-thread-1) [n:127.0.0.1:38665_solr    ] o.a.s.c.CorePropertiesLocator Found 0 core definitions underneath /home/jenkins/workspace/Lucene-Solr-7.1-Linux/solr/build/solr-core/test/J0/temp/solr.security.hadoop.TestImpersonationWithHadoopAuth_46F599DA17D38BBD-001/tempDir-001/node1/.
   [junit4]   2> 200092 INFO  (jetty-launcher-141-thread-2) [n:127.0.0.1:41537_solr    ] o.a.s.c.CoreContainer PKIAuthenticationPlugin is managing internode requests
   [junit4]   2> 200139 INFO  (jetty-launcher-141-thread-2) [n:127.0.0.1:41537_solr    ] o.a.s.m.r.SolrJmxReporter JMX monitoring for 'solr_41537.solr.node' (registry 'solr.node') enabled at server: com.sun.jmx.mbeanserver.JmxMBeanServer@ed9630
   [junit4]   2> 200160 INFO  (jetty-launcher-141-thread-2) [n:127.0.0.1:41537_solr    ] o.a.s.m.r.SolrJmxReporter JMX monitoring for 'solr_41537.solr.jvm' (registry 'solr.jvm') enabled at server: com.sun.jmx.mbeanserver.JmxMBeanServer@ed9630
   [junit4]   2> 200161 INFO  (jetty-launcher-141-thread-2) [n:127.0.0.1:41537_solr    ] o.a.s.m.r.SolrJmxReporter JMX monitoring for 'solr_41537.solr.jetty' (registry 'solr.jetty') enabled at server: com.sun.jmx.mbeanserver.JmxMBeanServer@ed9630
   [junit4]   2> 200162 INFO  (jetty-launcher-141-thread-2) [n:127.0.0.1:41537_solr    ] o.a.s.c.CorePropertiesLocator Found 0 core definitions underneath /home/jenkins/workspace/Lucene-Solr-7.1-Linux/solr/build/solr-core/test/J0/temp/solr.security.hadoop.TestImpersonationWithHadoopAuth_46F599DA17D38BBD-001/tempDir-001/node2/.
   [junit4]   2> 200204 INFO  (SUITE-TestImpersonationWithHadoopAuth-seed#[46F599DA17D38BBD]-worker) [    ] o.a.s.c.c.ZkStateReader Updated live nodes from ZooKeeper... (0) -> (2)
   [junit4]   2> 200205 INFO  (SUITE-TestImpersonationWithHadoopAuth-seed#[46F599DA17D38BBD]-worker) [    ] o.a.s.c.s.i.ZkClientClusterStateProvider Cluster at 127.0.0.1:39875/solr ready
   [junit4] IGNOR/A 0.00s J0 | TestImpersonationWithHadoopAuth.testForwarding
   [junit4]    > Assumption #1: 'awaitsfix' test group is disabled (@AwaitsFix(bugUrl=https://issues.apache.org/jira/browse/HADOOP-9893))
   [junit4]   2> 200222 INFO  (TEST-TestImpersonationWithHadoopAuth.testProxyNoConfigHosts-seed#[46F599DA17D38BBD]) [    ] o.a.s.SolrTestCaseJ4 ###Starting testProxyNoConfigHosts
   [junit4]   2> 200300 WARN  (TEST-TestImpersonationWithHadoopAuth.testProxyNoConfigHosts-seed#[46F599DA17D38BBD]) [    ] o.a.h.c.p.ResponseProcessCookies Invalid cookie header: "Set-Cookie: hadoop.auth="u=noHosts&p=noHosts&t=simple-dt&e=1508085564142&s=ntp0VFajJWO1mk/knXs2vYE/rvk="; Domain=127.0.0.1; Expires=Dom, 15-out-2017 16:39:24 GMT; Secure; HttpOnly". Invalid 'expires' attribute: Dom, 15-out-2017 16:39:24 GMT
   [junit4]   2> 200302 INFO  (TEST-TestImpersonationWithHadoopAuth.testProxyNoConfigHosts-seed#[46F599DA17D38BBD]) [    ] o.a.s.SolrTestCaseJ4 ###Ending testProxyNoConfigHosts
   [junit4]   2> 200315 INFO  (TEST-TestImpersonationWithHadoopAuth.testProxyValidateGroup-seed#[46F599DA17D38BBD]) [    ] o.a.s.SolrTestCaseJ4 ###Starting testProxyValidateGroup
   [junit4]   2> 200327 INFO  (qtp14571554-983) [n:127.0.0.1:38665_solr    ] o.a.s.h.a.CollectionsHandler Invoked Collection Action :list with params doAs=jenkins&action=LIST&user.name=anyHostUsersGroup&wt=javabin&version=2 and sendToOCPQueue=true
   [junit4]   2> 200327 INFO  (qtp14571554-983) [n:127.0.0.1:38665_solr    ] o.a.s.s.HttpSolrCall [admin] webapp=null path=/admin/collections params={doAs=jenkins&action=LIST&user.name=anyHostUsersGroup&wt=javabin&version=2} status=0 QTime=0
   [junit4]   2> 200329 WARN  (TEST-TestImpersonationWithHadoopAuth.testProxyValidateGroup-seed#[46F599DA17D38BBD]) [    ] o.a.h.c.p.ResponseProcessCookies Invalid cookie header: "Set-Cookie: hadoop.auth="u=anyHostUsersGroup&p=anyHostUsersGroup&t=simple-dt&e=1508085564172&s=LDAW4gzMIbicyyPOSQL4rXLD+4E="; Domain=127.0.0.1; Expires=Dom, 15-out-2017 16:39:24 GMT; Secure; HttpOnly". Invalid 'expires' attribute: Dom, 15-out-2017 16:39:24 GMT
   [junit4]   2> 200330 INFO  (TEST-TestImpersonationWithHadoopAuth.testProxyValidateGroup-seed#[46F599DA17D38BBD]) [    ] o.a.s.SolrTestCaseJ4 ###Ending testProxyValidateGroup
   [junit4]   2> 200344 INFO  (TEST-TestImpersonationWithHadoopAuth.testProxyWrongHost-seed#[46F599DA17D38BBD]) [    ] o.a.s.SolrTestCaseJ4 ###Starting testProxyWrongHost
   [junit4]   2> 213582 WARN  (jetty-launcher-141-thread-2-SendThread(127.0.0.1:39875)) [n:127.0.0.1:41537_solr    ] o.a.z.ClientCnxn Client session timed out, have not heard from server in 13418ms for sessionid 0x15f1ec22ba10006
   [junit4]   2> 213582 WARN  (jetty-launcher-141-thread-2-SendThread(127.0.0.1:39875)) [n:127.0.0.1:41537_solr    ] o.a.z.ClientCnxn Client session timed out, have not heard from server in 13485ms for sessionid 0x15f1ec22ba10008
   [junit4]   2> 213582 WARN  (NIOServerCxn.Factory:0.0.0.0/0.0.0.0:0) [    ] o.a.z.s.NIOServerCnxn caught end of stream exception
   [junit4]   2> EndOfStreamException: Unable to read additional data from client sessionid 0x15f1ec22ba10006, likely client has closed socket
   [junit4]   2> 	at org.apache.zookeeper.server.NIOServerCnxn.doIO(NIOServerCnxn.java:239)
   [junit4]   2> 	at org.apache.zookeeper.server.NIOServerCnxnFactory.run(NIOServerCnxnFactory.java:203)
   [junit4]   2> 	at java.lang.Thread.run(Thread.java:748)
   [junit4]   2> 213582 WARN  (NIOServerCxn.Factory:0.0.0.0/0.0.0.0:0) [    ] o.a.z.s.NIOServerCnxn caught end of stream exception
   [junit4]   2> EndOfStreamException: Unable to read additional data from client sessionid 0x15f1ec22ba10008, likely client has closed socket
   [junit4]   2> 	at org.apache.zookeeper.server.NIOServerCnxn.doIO(NIOServerCnxn.java:239)
   [junit4]   2> 	at org.apache.zookeeper.server.NIOServerCnxnFactory.run(NIOServerCnxnFactory.java:203)
   [junit4]   2> 	at java.lang.Thread.run(Thread.java:748)
   [junit4]   2> 213582 WARN  (jetty-launcher-141-thread-1-SendThread(127.0.0.1:39875)) [n:127.0.0.1:38665_solr    ] o.a.z.ClientCnxn Client session timed out, have not heard from server in 13488ms for sessionid 0x15f1ec22ba10007
   [junit4]   2> 213583 WARN  (NIOServerCxn.Factory:0.0.0.0/0.0.0.0:0) [    ] o.a.z.s.NIOServerCnxn caught end of stream exception
   [junit4]   2> EndOfStreamException: Unable to read additional data from client sessionid 0x15f1ec22ba10007, likely client has closed socket
   [junit4]   2> 	at org.apache.zookeeper.server.NIOServerCnxn.doIO(NIOServerCnxn.java:239)
   [junit4]   2> 	at org.apache.zookeeper.server.NIOServerCnxnFactory.run(NIOServerCnxnFactory.java:203)
   [junit4]   2> 	at java.lang.Thread.run(Thread.java:748)
   [junit4]   2> 213582 WARN  (jetty-launcher-141-thread-1-SendThread(127.0.0.1:39875)) [n:127.0.0.1:38665_solr    ] o.a.z.ClientCnxn Client session timed out, have not heard from server in 14443ms for sessionid 0x15f1ec22ba10005
   [junit4]   2> 213583 WARN  (NIOServerCxn.Factory:0.0.0.0/0.0.0.0:0) [    ] o.a.z.s.NIOServerCnxn caught end of stream exception
   [junit4]   2> EndOfStreamException: Unable to read additional data from client sessionid 0x15f1ec22ba10005, likely client has closed socket
   [junit4]   2> 	at org.apache.zookeeper.server.NIOServerCnxn.doIO(NIOServerCnxn.java:239)
   [junit4]   2> 	at org.apache.zookeeper.server.NIOServerCnxnFactory.run(NIOServerCnxnFactory.java:203)
   [junit4]   2> 	at java.lang.Thread.run(Thread.java:748)
   [junit4]   2> 213584 WARN  (TEST-TestImpersonationWithHadoopAuth.testProxyWrongHost-seed#[46F599DA17D38BBD]) [    ] o.a.h.c.p.ResponseProcessCookies Invalid cookie header: "Set-Cookie: hadoop.auth="u=wrongHost&p=wrongHost&t=simple-dt&e=1508085564202&s=8J2309QE9h20Q8El3jgkwDl977A="; Domain=127.0.0.1; Expires=Dom, 15-out-2017 16:39:24 GMT; Secure; HttpOnly". Invalid 'expires' attribute: Dom, 15-out-2017 16:39:24 GMT
   [junit4]   2> 213585 INFO  (TEST-TestImpersonationWithHadoopAuth.testProxyWrongHost-seed#[46F599DA17D38BBD]) [    ] o.a.s.SolrTestCaseJ4 ###Ending testProxyWrongHost
   [junit4]   2> 213598 INFO  (TEST-TestImpersonationWithHadoopAuth.testProxyNoConfigGroups-seed#[46F599DA17D38BBD]) [    ] o.a.s.SolrTestCaseJ4 ###Starting testProxyNoConfigGroups
   [junit4]   2> 213608 WARN  (TEST-TestImpersonationWithHadoopAuth.testProxyNoConfigGroups-seed#[46F599DA17D38BBD]) [    ] o.a.h.c.p.ResponseProcessCookies Invalid cookie header: "Set-Cookie: hadoop.auth="u=noGroups&p=noGroups&t=simple-dt&e=1508085577451&s=q4VuEi0UdgWlXOSu/L/dlEFgPfM="; Domain=127.0.0.1; Expires=Dom, 15-out-2017 16:39:37 GMT; Secure; HttpOnly". Invalid 'expires' attribute: Dom, 15-out-2017 16:39:37 GMT
   [junit4]   2> 213609 INFO  (TEST-TestImpersonationWithHadoopAuth.testProxyNoConfigGroups-seed#[46F599DA17D38BBD]) [    ] o.a.s.SolrTestCaseJ4 ###Ending testProxyNoConfigGroups
   [junit4]   2> 213622 INFO  (TEST-TestImpersonationWithHadoopAuth.testProxyInvalidGroup-seed#[46F599DA17D38BBD]) [    ] o.a.s.SolrTestCaseJ4 ###Starting testProxyInvalidGroup
   [junit4]   2> 213637 WARN  (qtp14571554-987) [    ] o.a.h.s.ShellBasedUnixGroupsMapping got exception trying to get groups for user bar: id: ‘bar’: no such user
   [junit4]   2> id: ‘bar’: no such user
   [junit4]   2> 
   [junit4]   2> 213640 WARN  (TEST-TestImpersonationWithHadoopAuth.testProxyInvalidGroup-seed#[46F599DA17D38BBD]) [    ] o.a.h.c.p.ResponseProcessCookies Invalid cookie header: "Set-Cookie: hadoop.auth="u=bogusGroup&p=bogusGroup&t=simple-dt&e=1508085577476&s=gmceasL0exYjfg73V0TOtk3Dq0Q="; Domain=127.0.0.1; Expires=Dom, 15-out-2017 16:39:37 GMT; Secure; HttpOnly". Invalid 'expires' attribute: Dom, 15-out-2017 16:39:37 GMT
   [junit4]   2> 213641 INFO  (TEST-TestImpersonationWithHadoopAuth.testProxyInvalidGroup-seed#[46F599DA17D38BBD]) [    ] o.a.s.SolrTestCaseJ4 ###Ending testProxyInvalidGroup
   [junit4]   2> 213651 INFO  (TEST-TestImpersonationWithHadoopAuth.testProxyValidateHost-seed#[46F599DA17D38BBD]) [    ] o.a.s.SolrTestCaseJ4 ###Starting testProxyValidateHost
   [junit4]   2> 213656 INFO  (qtp14571554-975) [n:127.0.0.1:38665_solr    ] o.a.s.h.a.CollectionsHandler Invoked Collection Action :list with params doAs=bar&action=LIST&user.name=localHostAnyGroup&wt=javabin&version=2 and sendToOCPQueue=true
   [junit4]   2> 213656 INFO  (qtp14571554-975) [n:127.0.0.1:38665_solr    ] o.a.s.s.HttpSolrCall [admin] webapp=null path=/admin/collections params={doAs=bar&action=LIST&user.name=localHostAnyGroup&wt=javabin&version=2} status=0 QTime=0
   [junit4]   2> 213657 WARN  (TEST-TestImpersonationWithHadoopAuth.testProxyValidateHost-seed#[46F599DA17D38BBD]) [    ] o.a.h.c.p.ResponseProcessCookies Invalid cookie header: "Set-Cookie: hadoop.auth="u=localHostAnyGroup&p=localHostAnyGroup&t=simple-dt&e=1508085577501&s=tmWIj4/eX5Z+SeQweUArWLc/jnQ="; Domain=127.0.0.1; Expires=Dom, 15-out-2017 16:39:37 GMT; Secure; HttpOnly". Invalid 'expires' attribute: Dom, 15-out-2017 16:39:37 GMT
   [junit4]   2> 213657 INFO  (TEST-TestImpersonationWithHadoopAuth.testProxyValidateHost-seed#[46F599DA17D38BBD]) [    ] o.a.s.SolrTestCaseJ4 ###Ending testProxyValidateHost
   [junit4]   2> 213667 INFO  (TEST-TestImpersonationWithHadoopAuth.testProxyInvalidProxyUser-seed#[46F599DA17D38BBD]) [    ] o.a.s.SolrTestCaseJ4 ###Starting testProxyInvalidProxyUser
   [junit4]   2> 213679 WARN  (TEST-TestImpersonationWithHadoopAuth.testProxyInvalidProxyUser-seed#[46F599DA17D38BBD]) [    ] o.a.h.c.p.ResponseProcessCookies Invalid cookie header: "Set-Cookie: hadoop.auth="u=bar&p=bar&t=simple-dt&e=1508085577523&s=PRTtnFNRuhS4RtJ81uR2HbZxpJo="; Domain=127.0.0.1; Expires=Dom, 15-out-2017 16:39:37 GMT; Secure; HttpOnly". Invalid 'expires' attribute: Dom, 15-out-2017 16:39:37 GMT
   [junit4]   2> 213679 INFO  (TEST-TestImpersonationWithHadoopAuth.testProxyInvalidProxyUser-seed#[46F599DA17D38BBD]) [    ] o.a.s.SolrTestCaseJ4 ###Ending testProxyInvalidProxyUser
   [junit4]   2> 213682 INFO  (jetty-launcher-141-thread-2-EventThread) [n:127.0.0.1:41537_solr    ] o.a.c.f.s.ConnectionStateManager State change: SUSPENDED
   [junit4]   2> 213682 WARN  (zkCallback-159-thread-1) [    ] o.a.s.c.c.ConnectionManager Watcher org.apache.solr.common.cloud.ConnectionManager@1c03b33 name: ZooKeeperConnection Watcher:127.0.0.1:39875/solr got event WatchedEvent state:Disconnected type:None path:null path: null type: None
   [junit4]   2> 213682 WARN  (zkCallback-159-thread-1) [    ] o.a.s.c.c.ConnectionManager zkClient has disconnected
   [junit4]   2> 213682 WARN  (zkCallback-153-thread-1-processing-n:127.0.0.1:41537_solr) [n:127.0.0.1:41537_solr    ] o.a.s.c.c.ConnectionManager Watcher org.apache.solr.common.cloud.ConnectionManager@35114 name: ZooKeeperConnection Watcher:127.0.0.1:39875/solr got event WatchedEvent state:Disconnected type:None path:null path: null type: None
   [junit4]   2> 213683 WARN  (zkCallback-153-thread-1-processing-n:127.0.0.1:41537_solr) [n:127.0.0.1:41537_solr    ] o.a.s.c.c.ConnectionManager zkClient has disconnected
   [junit4]   2> 213688 WARN  (zkCallback-152-thread-2-processing-n:127.0.0.1:38665_solr) [n:127.0.0.1:38665_solr    ] o.a.s.c.c.ConnectionManager Watcher org.apache.solr.common.cloud.ConnectionManager@620c5 name: ZooKeeperConnection Watcher:127.0.0.1:39875/solr got event WatchedEvent state:Disconnected type:None path:null path: null type: None
   [junit4]   2> 213688 WARN  (zkCallback-152-thread-2-processing-n:127.0.0.1:38665_solr) [n:127.0.0.1:38665_solr    ] o.a.s.c.c.ConnectionManager zkClient has disconnected
   [junit4]   2> 213703 INFO  (TEST-TestImpersonationWithHadoopAuth.testProxyValidateAnyHostAnyUser-seed#[46F599DA17D38BBD]) [    ] o.a.s.SolrTestCaseJ4 ###Starting testProxyValidateAnyHostAnyUser
   [junit4]   2> 213711 INFO  (qtp14571554-987) [n:127.0.0.1:38665_solr    ] o.a.s.h.a.CollectionsHandler Invoked Collection Action :list with params doAs=bar&action=LIST&user.name=anyHostAnyUser&wt=javabin&version=2 and sendToOCPQueue=true
   [junit4]   2> 213711 INFO  (qtp14571554-987) [n:127.0.0.1:38665_solr    ] o.a.s.s.HttpSolrCall [admin] webapp=null path=/admin/collections params={doAs=bar&action=LIST&user.name=anyHostAnyUser&wt=javabin&version=2} status=0 QTime=0
   [junit4]   2> 213712 WARN  (TEST-TestImpersonationWithHadoopAuth.testProxyValidateAnyHostAnyUser-seed#[46F599DA17D38BBD]) [    ] o.a.h.c.p.ResponseProcessCookies Invalid cookie header: "Set-Cookie: hadoop.auth="u=anyHostAnyUser&p=anyHostAnyUser&t=simple-dt&e=1508085577557&s=hISyGQ2p9r1qGzogAgvuAHcXHzQ="; Domain=127.0.0.1; Expires=Dom, 15-out-2017 16:39:37 GMT; Secure; HttpOnly". Invalid 'expires' attribute: Dom, 15-out-2017 16:39:37 GMT
   [junit4]   2> 213712 INFO  (TEST-TestImpersonationWithHadoopAuth.testProxyValidateAnyHostAnyUser-seed#[46F599DA17D38BBD]) [    ] o.a.s.SolrTestCaseJ4 ###Ending testProxyValidateAnyHostAnyUser
   [junit4]   2> 213724 INFO  (TEST-TestImpersonationWithHadoopAuth.testProxyNullProxyUser-seed#[46F599DA17D38BBD]) [    ] o.a.s.SolrTestCaseJ4 ###Starting testProxyNullProxyUser
   [junit4]   2> 213729 INFO  (qtp14571554-979) [    ] o.a.s.s.SolrDispatchFilter Error authenticating
   [junit4]   2> java.lang.IllegalArgumentException: userName is NULL, empty or contains a '&'
   [junit4]   2> 	at org.apache.hadoop.security.authentication.util.AuthToken.checkForIllegalArgument(AuthToken.java:87)
   [junit4]   2> 	at org.apache.hadoop.security.authentication.util.AuthToken.<init>(AuthToken.java:70)
   [junit4]   2> 	at org.apache.hadoop.security.authentication.server.AuthenticationToken.<init>(AuthenticationToken.java:58)
   [junit4]   2> 	at org.apache.hadoop.security.authentication.server.PseudoAuthenticationHandler.authenticate(PseudoAuthenticationHandler.java:195)
   [junit4]   2> 	at org.apache.hadoop.security.token.delegation.web.DelegationTokenAuthenticationHandler.authenticate(DelegationTokenAuthenticationHandler.java:348)
   [junit4]   2> 	at org.apache.solr.security.RequestContinuesRecorderAuthenticationHandler.authenticate(RequestContinuesRecorderAuthenticationHandler.java:69)
   [junit4]   2> 	at org.apache.hadoop.security.authentication.server.AuthenticationFilter.doFilter(AuthenticationFilter.java:518)
   [junit4]   2> 	at org.apache.solr.security.HadoopAuthFilter.doFilter(HadoopAuthFilter.java:110)
   [junit4]   2> 	at org.apache.solr.security.HadoopAuthPlugin.doAuthenticate(HadoopAuthPlugin.java:245)
   [junit4]   2> 	at org.apache.solr.servlet.SolrDispatchFilter.authenticateRequest(SolrDispatchFilter.java:451)
   [junit4]   2> 	at org.apache.solr.servlet.SolrDispatchFilter.doFilter(SolrDispatchFilter.java:347)
   [junit4]   2> 	at org.apache.solr.servlet.SolrDispatchFilter.doFilter(SolrDispatchFilter.java:326)
   [junit4]   2> 	at org.eclipse.jetty.servlet.ServletHandler$CachedChain.doFilter(ServletHandler.java:1759)
   [junit4]   2> 	at org.apache.solr.client.solrj.embedded.JettySolrRunner$DebugFilter.doFilter(JettySolrRunner.java:139)
   [junit4]   2> 	at org.eclipse.jetty.servlet.ServletHandler$CachedChain.doFilter(ServletHandler.java:1759)
   [junit4]   2> 	at org.eclipse.jetty.servlet.ServletHandler.doHandle(ServletHandler.java:582)
   [junit4]   2> 	at org.eclipse.jetty.server.session.SessionHandler.doHandle(SessionHandler.java:224)
   [junit4]   2> 	at org.eclipse.jetty.server.handler.ContextHandler.doHandle(ContextHandler.java:1180)
   [junit4]   2> 	at org.eclipse.jetty.servlet.ServletHandler.doScope(ServletHandler.java:512)
   [junit4]   2> 	at org.eclipse.jetty.server.session.SessionHandler.doScope(SessionHandler.java:185)
   [junit4]   2> 	at org.eclipse.jetty.server.handler.ContextHandler.doScope(ContextHandler.java:1112)
   [junit4]   2> 	at org.eclipse.jetty.server.handler.ScopedHandler.handle(ScopedHandler.java:141)
   [junit4]   2> 	at org.eclipse.jetty.server.handler.gzip.GzipHandler.handle(GzipHandler.java:493)
   [junit4]   2> 	at org.eclipse.jetty.server.handler.HandlerWrapper.handle(HandlerWrapper.java:134)
   [junit4]   2> 	at org.eclipse.jetty.server.Server.handle(Server.java:534)
   [junit4]   2> 	at org.eclipse.jetty.server.HttpChannel.handle(HttpChannel.java:320)
   [junit4]   2> 	at org.eclipse.jetty.server.HttpConnection.onFillable(HttpConnection.java:251)
   [junit4]   2> 	at org.eclipse.jetty.io.AbstractConnection$ReadCallback.succeeded(AbstractConnection.java:283)
   [junit4]   2> 	at org.eclipse.jetty.io.FillInterest.fillable(FillInterest.java:108)
   [junit4]   2> 	at org.eclipse.jetty.io.ssl.SslConnection.onFillable(SslConnection.java:251)
   [junit4]   2> 	at org.eclipse.jetty.io.AbstractConnection$ReadCallback.succeeded(AbstractConnection.java:283)
   [junit4]   2> 	at org.eclipse.jetty.io.FillInterest.fillable(FillInterest.java:108)
   [junit4]   2> 	at org.eclipse.jetty.io.SelectChannelEndPoint$2.run(SelectChannelEndPoint.java:93)
   [junit4]   2> 	at org.eclipse.jetty.util.thread.strategy.ExecuteProduceConsume.executeProduceConsume(ExecuteProduceConsume.java:303)
   [junit4]   2> 	at org.eclipse.jetty.util.thread.strategy.ExecuteProduceConsume.produceConsume(ExecuteProduceConsume.java:148)
   [junit4]   2> 	at org.eclipse.jetty.util.thread.strategy.ExecuteProduceConsume.run(ExecuteProduceConsume.java:136)
   [junit4]   2> 	at org.eclipse.jetty.util.thread.QueuedThreadPool.runJob(QueuedThreadPool.java:671)
   [junit4]   2> 	at org.eclipse.jetty.util.thread.QueuedThreadPool$2.run(QueuedThreadPool.java:589)
   [junit4]   2> 	at java.lang.Thread.run(Thread.java:748)
   [junit4]   2> 213730 WARN  (qtp14571554-979) [    ] o.e.j.s.ServletHandler /solr/admin/collections
   [junit4]   2> org.apache.solr.common.SolrException: Error during request authentication, 
   [junit4]   2> 	at org.apache.solr.servlet.SolrDispatchFilter.authenticateRequest(SolrDispatchFilter.java:457)
   [junit4]   2> 	at org.apache.solr.servlet.SolrDispatchFilter.doFilter(SolrDispatchFilter.java:347)
   [junit4]   2> 	at org.apache.solr.servlet.SolrDispatchFilter.doFilter(SolrDispatchFilter.java:326)
   [junit4]   2> 	at org.eclipse.jetty.servlet.ServletHandler$CachedChain.doFilter(ServletHandler.java:1759)
   [junit4]   2> 	at org.apache.solr.client.solrj.embedded.JettySolrRunner$DebugFilter.doFilter(JettySolrRunner.java:139)
   [junit4]   2> 	at org.eclipse.jetty.servlet.ServletHandler$CachedChain.doFilter(ServletHandler.java:1759)
   [junit4]   2> 	at org.eclipse.jetty.servlet.ServletHandler.doHandle(ServletHandler.java:582)
   [junit4]   2> 	at org.eclipse.jetty.server.session.SessionHandler.doHandle(SessionHandler.java:224)
   [junit4]   2> 	at org.eclipse.jetty.server.handler.ContextHandler.doHandle(ContextHandler.java:1180)
   [junit4]   2> 	at org.eclipse.jetty.servlet.ServletHandler.doScope(ServletHandler.java:512)
   [junit4]   2> 	at org.eclipse.jetty.server.session.SessionHandler.doScope(SessionHandler.java:185)
   [junit4]   2> 	at org.eclipse.jetty.server.handler.ContextHandler.doScope(ContextHandler.java:1112)
   [junit4]   2> 	at org.eclipse.jetty.server.handler.ScopedHandler.handle(ScopedHandler.java:141)
   [junit4]   2> 	at org.eclipse.jetty.server.handler.gzip.GzipHandler.handle(GzipHandler.java:493)
   [junit4]   2> 	at org.eclipse.jetty.server.handler.HandlerWrapper.handle(HandlerWrapper.java:134)
   [junit4]   2> 	at org.eclipse.jetty.server.Server.handle(Server.java:534)
   [junit4]   2> 	at org.eclipse.jetty.server.HttpChannel.handle(HttpChannel.java:320)
   [junit4]   2> 	at org.eclipse.jetty.server.HttpConnection.onFillable(HttpConnection.java:251)
   [junit4]   2> 	at org.eclipse.jetty.io.AbstractConnection$ReadCallback.succeeded(AbstractConnection.java:283)
   [junit4]   2> 	at org.eclipse.jetty.io.FillInterest.fillable(FillInterest.java:108)
   [junit4]   2> 	at org.eclipse.jetty.io.ssl.SslConnection.onFillable(SslConnection.java:251)
   [junit4]   2> 	at org.eclipse.jetty.io.AbstractConnection$ReadCallback.succeeded(AbstractConnection.java:283)
   [junit4]   2> 	at org.eclipse.jetty.io.FillInterest.fillable(FillInterest.java:108)
   [junit4]   2> 	at org.eclipse.jetty.io.SelectChannelEndPoint$2.run(SelectChannelEndPoint.java:93)
   [junit4]   2> 	at org.eclipse.jetty.util.thread.strategy.ExecuteProduceConsume.executeProduceConsume(ExecuteProduceConsume.java:303)
   [junit4]   2> 	at org.eclipse.jetty.util.thread.strategy.ExecuteProduceConsume.produceConsume(ExecuteProduceConsume.java:148)
   [junit4]   2> 	at org.eclipse.jetty.util.thread.strategy.ExecuteProduceConsume.run(ExecuteProduceConsume.java:136)
   [junit4]   2> 	at org.eclipse.jetty.util.thread.QueuedThreadPool.runJob(QueuedThreadPool.java:671)
   [junit4]   2> 	at org.eclipse.jetty.util.thread.QueuedThreadPool$2.run(QueuedThreadPool.java:589)
   [junit4]   2> 	at java.lang.Thread.run(Thread.java:748)
   [junit4]   2> Caused by: java.lang.IllegalArgumentException: userName is NULL, empty or contains a '&'
   [junit4]   2> 	at org.apache.hadoop.security.authentication.util.AuthToken.checkForIllegalArgument(AuthToken.java:87)
   [junit4]   2> 	at org.apache.hadoop.security.authentication.util.AuthToken.<init>(AuthToken.java:70)
   [junit4]   2> 	at org.apache.hadoop.security.authentication.server.AuthenticationToken.<init>(AuthenticationToken.java:58)
   [junit4]   2> 	at org.apache.hadoop.security.authentication.server.PseudoAuthenticationHandler.authenticate(PseudoAuthenticationHandler.java:195)
   [junit4]   2> 	at org.apache.hadoop.security.token.delegation.web.DelegationTokenAuthenticationHandler.authenticate(DelegationTokenAuthenticationHandler.java:348)
   [junit4]   2> 	at org.apache.solr.security.RequestContinuesRecorderAuthenticationHandler.authenticate(RequestContinuesRecorderAuthenticationHandler.java:69)
   [junit4]   2> 	at org.apache.hadoop.security.authentication.server.AuthenticationFilter.doFilter(AuthenticationFilter.java:518)
   [junit4]   2> 	at org.apache.solr.security.HadoopAuthFilter.doFilter(HadoopAuthFilter.java:110)
   [junit4]   2> 	at org.apache.solr.security.HadoopAuthPlugin.doAuthenticate(HadoopAuthPlugin.java:245)
   [junit4]   2> 	at org.apache.solr.servlet.SolrDispatchFilter.authenticateRequest(SolrDispatchFilter.java:451)
   [junit4]   2> 	... 29 more
   [junit4]   2> 213731 INFO  (TEST-TestImpersonationWithHadoopAuth.testProxyNullProxyUser-seed#[46F599DA17D38BBD]) [    ] o.a.s.SolrTestCaseJ4 ###Ending testProxyNullProxyUser
   [junit4]   2> 214502 INFO  (jetty-closer-142-thread-2) [    ] o.e.j.s.AbstractConnector Stopped ServerConnector@2a4a12{SSL,[ssl, http/1.1]}{127.0.0.1:0}
   [junit4]   2> 214510 INFO  (jetty-closer-142-thread-2) [    ] o.a.s.c.CoreContainer Shutting down CoreContainer instance=29865217
   [junit4]   2> 214511 INFO  (jetty-closer-142-thread-2) [    ] o.a.s.m.SolrMetricManager Closing metric reporters for registry=solr.node, tag=null
   [junit4]   2> 214511 INFO  (jetty-closer-142-thread-2) [    ] o.a.s.m.r.SolrJmxReporter Closing reporter [org.apache.solr.metrics.reporters.SolrJmxReporter@717a25: rootName = solr_41537, domain = solr.node, service url = null, agent id = null] for registry solr.node / com.codahale.metrics.MetricRegistry@1753e7c
   [junit4]   2> 214512 INFO  (jetty-closer-142-thread-1) [    ] o.e.j.s.AbstractConnector Stopped ServerConnector@fe2eb7{SSL,[ssl, http/1.1]}{127.0.0.1:0}
   [junit4]   2> 214513 INFO  (jetty-closer-142-thread-1) [    ] o.a.s.c.CoreContainer Shutting down CoreContainer instance=14515808
   [junit4]   2> 214513 INFO  (jetty-closer-142-thread-1) [    ] o.a.s.m.SolrMetricManager Closing metric reporters for registry=solr.node, tag=null
   [junit4]   2> 214513 INFO  (jetty-closer-142-thread-1) [    ] o.a.s.m.r.SolrJmxReporter Closing reporter [org.apache.solr.metrics.reporters.SolrJmxReporter@566439: rootName = solr_38665, domain = solr.node, service url = null, agent id = null] for registry solr.node / com.codahale.metrics.MetricRegistry@a5b9e2
   [junit4]   2> 214523 INFO  (jetty-closer-142-thread-1) [    ] o.a.s.m.SolrMetricManager Closing metric reporters for registry=solr.jvm, tag=null
   [junit4]   2> 214523 INFO  (jetty-closer-142-thread-1) [    ] o.a.s.m.r.SolrJmxReporter Closing reporter [org.apache.solr.metrics.reporters.SolrJmxReporter@234c95: rootName = solr_38665, domain = solr.jvm, service url = null, agent id = null] for registry solr.jvm / com.codahale.metrics.MetricRegistry@1424002
   [junit4]   2> 214531 INFO  (jetty-closer-142-thread-2) [    ] o.a.s.m.SolrMetricManager Closing metric reporters for registry=solr.jvm, tag=null
   [junit4]   2> 214531 INFO  (jetty-closer-142-thread-2) [    ] o.a.s.m.r.SolrJmxReporter Closing reporter [org.apache.solr.metrics.reporters.SolrJmxReporter@1a8a027: rootName = solr_41537, domain = solr.jvm, service url = null, agent id = null] for registry solr.jvm / com.codahale.metrics.MetricRegistry@1424002
   [junit4]   2> 214531 INFO  (jetty-closer-142-thread-1) [    ] o.a.s.m.SolrMetricManager Closing metric reporters for registry=solr.jetty, tag=null
   [junit4]   2> 214531 INFO  (jetty-closer-142-thread-1) [    ] o.a.s.m.r.SolrJmxReporter Closing reporter [org.apache.solr.metrics.reporters.SolrJmxReporter@1095004: rootName = solr_38665, domain = solr.jetty, service url = null, agent id = null] for registry solr.jetty / com.codahale.metrics.MetricRegistry@17dc072
   [junit4]   2> 214538 INFO  (jetty-closer-142-thread-2) [    ] o.a.s.m.SolrMetricManager Closing metric reporters for registry=solr.jetty, tag=null
   [junit4]   2> 214538 INFO  (jetty-closer-142-thread-2) [    ] o.a.s.m.r.SolrJmxReporter Closing reporter [org.apache.solr.metrics.reporters.SolrJmxReporter@1985732: rootName = solr_41537, domain = solr.jetty, service url = null, agent id = null] for registry solr.jetty / com.codahale.metrics.MetricRegistry@17dc072
   [junit4]   2> 214812 INFO  (jetty-launcher-141-thread-1-EventThread) [n:127.0.0.1:38665_solr    ] o.a.c.f.s.ConnectionStateManager State change: SUSPENDED
   [junit4]   2> 215153 INFO  (jetty-closer-142-thread-1) [    ] o.a.s.m.SolrMetricManager Closing metric reporters for registry=solr.cluster, tag=null
   [junit4]   2> 215154 INFO  (jetty-closer-142-thread-1) [    ] o.a.s.c.TransientSolrCoreCacheDefault Allocating transient cache for 2147483647 transient cores
   [junit4]   2> 215154 INFO  (jetty-closer-142-thread-1) [    ] o.a.s.c.Overseer Overseer (id=98831536129900549-127.0.0.1:38665_solr-n_0000000000) closing
   [junit4]   2> 215155 INFO  (OverseerStateUpdate-98831536129900549-127.0.0.1:38665_solr-n_0000000000) [n:127.0.0.1:38665_solr    ] o.a.s.c.Overseer Overseer Loop exiting : 127.0.0.1:38665_solr
   [junit4]   2> 215155 WARN  (OverseerAutoScalingTriggerThread-98831536129900549-127.0.0.1:38665_solr-n_0000000000) [n:127.0.0.1:38665_solr    ] o.a.s.c.a.OverseerTriggerThread OverseerTriggerThread woken up but we are closed, exiting.
   [junit4]   2> 215155 INFO  (OverseerCollectionConfigSetProcessor-98831536129900549-127.0.0.1:38665_solr-n_0000000000) [n:127.0.0.1:38665_solr    ] o.a.s.c.OverseerTaskProcessor According to ZK I (id=98831536129900549-127.0.0.1:38665_solr-n_0000000000) am no longer a leader.
   [junit4]   2> 215156 WARN  (zkCallback-152-thread-5-processing-n:127.0.0.1:38665_solr) [n:127.0.0.1:38665_solr    ] o.a.s.c.c.ZkStateReader ZooKeeper watch triggered, but Solr cannot talk to ZK: [KeeperErrorCode = Session expired for /live_nodes]
   [junit4]   2> 215156 ERROR (Thread[Thread-235,5,TGRP-TestImpersonationWithHadoopAuth]) [n:127.0.0.1:38665_solr    ] o.a.h.s.t.d.AbstractDelegationTokenSecretManager ExpiredTokenRemover received java.lang.InterruptedException: sleep interrupted
   [junit4]   2> 215157 INFO  (jetty-closer-142-thread-1) [    ] o.e.j.s.h.ContextHandler Stopped o.e.j.s.ServletContextHandler@d6f1d9{/solr,null,UNAVAILABLE}
   [junit4]   2> 215338 INFO  (zkCallback-153-thread-5-processing-n:127.0.0.1:41537_solr) [n:127.0.0.1:41537_solr    ] o.a.s.c.OverseerElectionContext I am going to be the leader 127.0.0.1:41537_solr
   [junit4]   2> 215338 INFO  (zkCallback-153-thread-4-processing-n:127.0.0.1:41537_solr) [n:127.0.0.1:41537_solr    ] o.a.s.c.c.ZkStateReader Updated live nodes from ZooKeeper... (2) -> (1)
   [junit4]   2> 215338 INFO  (jetty-closer-142-thread-2) [    ] o.a.s.m.SolrMetricManager Closing metric reporters for registry=solr.cluster, tag=null
   [junit4]   2> 215338 INFO  (jetty-closer-142-thread-2) [    ] o.a.s.c.TransientSolrCoreCacheDefault Allocating transient cache for 2147483647 transient cores
   [junit4]   2> 215341 WARN  (zkCallback-153-thread-4-processing-n:127.0.0.1:41537_solr) [n:127.0.0.1:41537_solr    ] o.a.s.c.c.ZkStateReader ZooKeeper watch triggered, but Solr cannot talk to ZK: [KeeperErrorCode = Session expired for /live_nodes]
   [junit4]   2> 216840 ERROR (Thread[Thread-238,5,TGRP-TestImpersonationWithHadoopAuth]) [n:127.0.0.1:41537_solr    ] o.a.h.s.t.d.AbstractDelegationTokenSecretManager ExpiredTokenRemover received java.lang.InterruptedException: sleep interrupted
   [junit4]   2> 216842 INFO  (jetty-closer-142-thread-2) [    ] o.e.j.s.h.ContextHandler Stopped o.e.j.s.ServletContextHandler@67360d{/solr,null,UNAVAILABLE}
   [junit4]   2> 216842 ERROR (SUITE-TestImpersonationWithHadoopAuth-seed#[46F599DA17D38BBD]-worker) [    ] o.a.z.s.ZooKeeperServer ZKShutdownHandler is not registered, so ZooKeeper server won't take any action on ERROR or SHUTDOWN server state changes
   [junit4]   2> 216842 INFO  (SUITE-TestImpersonationWithHadoopAuth-seed#[46F599DA17D38BBD]-worker) [    ] o.a.s.c.ZkTestServer connecting to 127.0.0.1:39875 39875
   [junit4]   2> 219236 INFO  (Thread-218) [    ] o.a.s.c.ZkTestServer connecting to 127.0.0.1:39875 39875
   [junit4]   2> 219236 WARN  (Thread-218) [    ] o.a.s.c.ZkTestServer Watch limit violations: 
   [junit4]   2> Maximum concurrent create/delete watches above limit:
   [junit4]   2> 
   [junit4]   2> 	3	/solr/aliases.json
   [junit4]   2> 	2	/solr/security.json
   [junit4]   2> 
   [junit4]   2> Maximum concurrent data watches above limit:
   [junit4]   2> 
   [junit4]   2> 	3	/solr/security/zkdtsm/ZKDTSMRoot/ZKDTSMKeyIdRoot
   [junit4]   2> 	3	/solr/clusterstate.json
   [junit4]   2> 	3	/solr/security/zkdtsm/ZKDTSMRoot/ZKDTSMSeqNumRoot
   [junit4]   2> 	3	/solr/clusterprops.json
   [junit4]   2> 	2	/solr/security/zkdtsm/ZKDTSMRoot/ZKDTSMMasterKeyRoot/DK_1
   [junit4]   2> 	2	/solr/security/zkdtsm/ZKDTSMRoot/ZKDTSMMasterKeyRoot/DK_3
   [junit4]   2> 	2	/solr/security/zkdtsm/ZKDTSMRoot/ZKDTSMMasterKeyRoot/DK_2
   [junit4]   2> 	2	/solr/security/zkdtsm/ZKDTSMRoot/ZKDTSMMasterKeyRoot/DK_4
   [junit4]   2> 
   [junit4]   2> Maximum concurrent children watches above limit:
   [junit4]   2> 
   [junit4]   2> 	3	/solr/live_nodes
   [junit4]   2> 	3	/solr/collections
   [junit4]   2> 	3	/solr/security/zkdtsm/ZKDTSMRoot/ZKDTSMMasterKeyRoot
   [junit4]   2> 	3	/solr/security/zkdtsm/ZKDTSMRoot/ZKDTSMTokensRoot
   [junit4]   2> 
   [junit4]   2> 219236 INFO  (SUITE-TestImpersonationWithHadoopAuth-seed#[46F599DA17D38BBD]-worker) [    ] o.a.s.SolrTestCaseJ4 ------------------------------------------------------- Done waiting for tracked resources to be released
   [junit4]   2> Oct 15, 2017 6:39:43 AM com.carrotsearch.randomizedtesting.ThreadLeakControl checkThreadLeaks
   [junit4]   2> WARNING: Will linger awaiting termination of 2 leaked thread(s).
   [junit4]   2> Oct 15, 2017 6:40:03 AM com.carrotsearch.randomizedtesting.ThreadLeakControl checkThreadLeaks
   [junit4]   2> SEVERE: 2 threads leaked from SUITE scope at org.apache.solr.security.hadoop.TestImpersonationWithHadoopAuth: 
   [junit4]   2>    1) Thread[id=1029, name=jetty-launcher-141-thread-2-EventThread, state=TIMED_WAITING, group=TGRP-TestImpersonationWithHadoopAuth]
   [junit4]   2>         at sun.misc.Unsafe.park(Native Method)
   [junit4]   2>         at java.util.concurrent.locks.LockSupport.parkNanos(LockSupport.java:215)
   [junit4]   2>         at java.util.concurrent.locks.AbstractQueuedSynchronizer.doAcquireSharedNanos(AbstractQueuedSynchronizer.java:1037)
   [junit4]   2>         at java.util.concurrent.locks.AbstractQueuedSynchronizer.tryAcquireSharedNanos(AbstractQueuedSynchronizer.java:1328)
   [junit4]   2>         at java.util.concurrent.CountDownLatch.await(CountDownLatch.java:277)
   [junit4]   2>         at org.apache.curator.CuratorZookeeperClient.internalBlockUntilConnectedOrTimedOut(CuratorZookeeperClient.java:323)
   [junit4]   2>         at org.apache.curator.RetryLoop.callWithRetry(RetryLoop.java:105)
   [junit4]   2>         at org.apache.curator.framework.imps.GetDataBuilderImpl.pathInForeground(GetDataBuilderImpl.java:288)
   [junit4]   2>         at org.apache.curator.framework.imps.GetDataBuilderImpl.forPath(GetDataBuilderImpl.java:279)
   [junit4]   2>         at org.apache.curator.framework.imps.GetDataBuilderImpl.forPath(GetDataBuilderImpl.java:41)
   [junit4]   2>         at org.apache.curator.framework.recipes.shared.SharedValue.readValue(SharedValue.java:244)
   [junit4]   2>         at org.apache.curator.framework.recipes.shared.SharedValue.access$100(SharedValue.java:44)
   [junit4]   2>         at org.apache.curator.framework.recipes.shared.SharedValue$1.process(SharedValue.java:61)
   [junit4]   2>         at org.apache.curator.framework.imps.NamespaceWatcher.process(NamespaceWatcher.java:67)
   [junit4]   2>         at org.apache.zookeeper.ClientCnxn$EventThread.processEvent(ClientCnxn.java:530)
   [junit4]   2>         at org.apache.zookeeper.ClientCnxn$EventThread.run(ClientCnxn.java:505)
   [junit4]   2>    2) Thread[id=1023, name=jetty-launcher-141-thread-1-EventThread, state=TIMED_WAITING, group=TGRP-TestImpersonationWithHadoopAuth]
   [junit4]   2>         at sun.misc.Unsafe.park(Native Method)
   [junit4]   2>         at java.util.concurrent.locks.LockSupport.parkNanos(LockSupport.java:215)
   [junit4]   2>         at java.util.concurrent.locks.AbstractQueuedSynchronizer.doAcquireSharedNanos(AbstractQueuedSynchronizer.java:1037)
   [junit4]   2>         at java.util.concurrent.locks.AbstractQueuedSynchronizer.tryAcquireSharedNanos(AbstractQueuedSynchronizer.java:1328)
   [junit4]   2>         at java.util.concurrent.CountDownLatch.await(CountDownLatch.java:277)
   [junit4]   2>         at org.apache.curator.CuratorZookeeperClient.internalBlockUntilConnectedOrTimedOut(CuratorZookeeperClient.java:323)
   [junit4]   2>         at org.apache.curator.RetryLoop.callWithRetry(RetryLoop.java:105)
   [junit4]   2>         at org.apache.curator.framework.imps.GetDataBuilderImpl.pathInForeground(GetDataBuilderImpl.java:288)
   [junit4]   2>         at org.apache.curator.framework.imps.GetDataBuilderImpl.forPath(GetDataBuilderImpl.java:279)
   [junit4]   2>         at org.apache.curator.framework.imps.GetDataBuilderImpl.forPath(GetDataBuilderImpl.java:41)
   [junit4]   2>         at org.apache.curator.framework.recipes.shared.SharedValue.readValue(SharedValue.java:244)
   [junit4]   2>         at org.apache.curator.framework.recipes.shared.SharedValue.access$100(SharedValue.java:44)
   [junit4]   2>         at org.apache.curator.framework.recipes.shared.SharedValue$1.process(SharedValue.java:61)
   [junit4]   2>         at org.apache.curator.framework.imps.NamespaceWatcher.process(NamespaceWatcher.java:67)
   [junit4]   2>         at org.apache.zookeeper.ClientCnxn$EventThread.processEvent(ClientCnxn.java:530)
   [junit4]   2>         at org.apache.zookeeper.ClientCnxn$EventThread.run(ClientCnxn.java:505)
   [junit4]   2> Oct 15, 2017 6:40:03 AM com.carrotsearch.randomizedtesting.ThreadLeakControl tryToInterruptAll
   [junit4]   2> INFO: Starting to interrupt leaked threads:
   [junit4]   2>    1) Thread[id=1029, name=jetty-launcher-141-thread-2-EventThread, state=TIMED_WAITING, group=TGRP-TestImpersonationWithHadoopAuth]
   [junit4]   2>    2) Thread[id=1023, name=jetty-launcher-141-thread-1-EventThread, state=TIMED_WAITING, group=TGRP-TestImpersonationWithHadoopAuth]
   [junit4]   2> 239303 ERROR (jetty-launcher-141-thread-1-EventThread) [n:127.0.0.1:38665_solr    ] o.a.c.f.i.CuratorFrameworkImpl Watcher exception
   [junit4]   2> java.lang.InterruptedException
   [junit4]   2> 	at java.util.concurrent.locks.AbstractQueuedSynchronizer.doAcquireSharedNanos(AbstractQueuedSynchronizer.java:1039)
   [junit4]   2> 	at java.util.concurrent.locks.AbstractQueuedSynchronizer.tryAcquireSharedNanos(AbstractQueuedSynchronizer.java:1328)
   [junit4]   2> 	at java.util.concurrent.CountDownLatch.await(CountDownLatch.java:277)
   [junit4]   2> 	at org.apache.curator.CuratorZookeeperClient.internalBlockUntilConnectedOrTimedOut(CuratorZookeeperClient.java:323)
   [junit4]   2> 	at org.apache.curator.RetryLoop.callWithRetry(RetryLoop.java:105)
   [junit4]   2> 	at org.apache.curator.framework.imps.GetDataBuilderImpl.pathInForeground(GetDataBuilderImpl.java:288)
   [junit4]   2> 	at org.apache.curator.framework.imps.GetDataBuilderImpl.forPath(GetDataBuilderImpl.java:279)
   [junit4]   2> 	at org.apache.curator.framework.imps.GetDataBuilderImpl.forPath(GetDataBuilderImpl.java:41)
   [junit4]   2> 	at org.apache.curator.framework.recipes.shared.SharedValue.readValue(SharedValue.java:244)
   [junit4]   2> 	at org.apache.curator.framework.recipes.shared.SharedValue.access$100(SharedValue.java:44)
   [junit4]   2> 	at org.apache.curator.framework.recipes.shared.SharedValue$1.process(SharedValue.java:61)
   [junit4]   2> 	at org.apache.curator.framework.imps.NamespaceWatcher.process(NamespaceWatcher.java:67)
   [junit4]   2> 	at org.apache.zookeeper.ClientCnxn$EventThread.processEvent(ClientCnxn.java:530)
   [junit4]   2> 	at org.apache.zookeeper.ClientCnxn$EventThread.run(ClientCnxn.java:505)
   [junit4]   2> 239303 ERROR (jetty-launcher-141-thread-2-EventThread) [n:127.0.0.1:41537_solr    ] o.a.c.f.i.CuratorFrameworkImpl Watcher exception
   [junit4]   2> java.lang.InterruptedException
   [junit4]   2> 	at java.util.concurrent.locks.AbstractQueuedSynchronizer.doAcquireSharedNanos(AbstractQueuedSynchronizer.java:1039)
   [junit4]   2> 	at java.util.concurrent.locks.AbstractQueuedSynchronizer.tryAcquireSharedNanos(AbstractQueuedSynchronizer.java:1328)
   [junit4]   2> 	at java.util.concurrent.CountDownLatch.await(CountDownLatch.java:277)
   [junit4]   2> 	at org.apache.curator.CuratorZookeeperClient.internalBlockUntilConnectedOrTimedOut(CuratorZookeeperClient.java:323)
   [junit4]   2> 	at org.apache.curator.RetryLoop.callWithRetry(RetryLoop.java:105)
   [junit4]   2> 	at org.apache.curator.framework.imps.GetDataBuilderImpl.pathInForeground(GetDataBuilderImpl.java:288)
   [junit4]   2> 	at org.apache.curator.framework.imps.GetDataBuilderImpl.forPath(GetDataBuilderImpl.java:279)
   [junit4]   2> 	at org.apache.curator.framework.imps.GetDataBuilderImpl.forPath(GetDataBuilderImpl.java:41)
   [junit4]   2> 	at org.apache.curator.framework.recipes.shared.SharedValue.readValue(SharedValue.java:244)
   [junit4]   2> 	at org.apache.curator.framework.recipes.shared.SharedValue.access$100(SharedValue.java:44)
   [junit4]   2> 	at org.apache.curator.framework.recipes.shared.SharedValue$1.process(SharedValue.java:61)
   [junit4]   2> 	at org.apache.curator.framework.imps.NamespaceWatcher.process(NamespaceWatcher.java:67)
   [junit4]   2> 	at org.apache.zookeeper.ClientCnxn$EventThread.processEvent(ClientCnxn.java:530)
   [junit4]   2> 	at org.apache.zookeeper.ClientCnxn$EventThread.run(ClientCnxn.java:505)
   [junit4]   2> Oct 15, 2017 6:40:03 AM com.carrotsearch.randomizedtesting.ThreadLeakControl tryToInterruptAll
   [junit4]   2> INFO: All leaked threads terminated.
   [junit4]   2> NOTE: test params are: codec=Lucene70, sim=RandomSimilarity(queryNorm=false): {}, locale=pt, timezone=Asia/Ust-Nera
   [junit4]   2> NOTE: Linux 4.10.0-33-generic i386/Oracle Corporation 1.8.0_144 (32-bit)/cpus=8,threads=1,free=20733536,total=114831360
   [junit4]   2> NOTE: All tests run in this JVM: [TestIndexingPerformance, DistributedVersionInfoTest, TestEmbeddedSolrServerSchemaAPI, CdcrUpdateLogTest, SpellingQueryConverterTest, TestRemoteStreaming, TestHighlightDedupGrouping, TestConfigSetsAPIZkFailure, DistribDocExpirationUpdateProcessorTest, TestUseDocValuesAsStored2, TestInitParams, UpdateLogTest, TestSolrCloudWithSecureImpersonation, ChaosMonkeyNothingIsSafeTest, PropertiesRequestHandlerTest, TestImpersonationWithHadoopAuth]
   [junit4]   2> NOTE: reproduce with: ant test  -Dtestcase=TestImpersonationWithHadoopAuth -Dtests.seed=46F599DA17D38BBD -Dtests.multiplier=3 -Dtests.slow=true -Dtests.locale=pt -Dtests.timezone=Asia/Ust-Nera -Dtests.asserts=true -Dtests.file.encoding=UTF-8
   [junit4] ERROR   0.00s J0 | TestImpersonationWithHadoopAuth (suite) <<<
   [junit4]    > Throwable #1: com.carrotsearch.randomizedtesting.ThreadLeakError: 2 threads leaked from SUITE scope at org.apache.solr.security.hadoop.TestImpersonationWithHadoopAuth: 
   [junit4]    >    1) Thread[id=1029, name=jetty-launcher-141-thread-2-EventThread, state=TIMED_WAITING, group=TGRP-TestImpersonationWithHadoopAuth]
   [junit4]    >         at sun.misc.Unsafe.park(Native Method)
   [junit4]    >         at java.util.concurrent.locks.LockSupport.parkNanos(LockSupport.java:215)
   [junit4]    >         at java.util.concurrent.locks.AbstractQueuedSynchronizer.doAcquireSharedNanos(AbstractQueuedSynchronizer.java:1037)
   [junit4]    >         at java.util.concurrent.locks.AbstractQueuedSynchronizer.tryAcquireSharedNanos(AbstractQueuedSynchronizer.java:1328)
   [junit4]    >         at java.util.concurrent.CountDownLatch.await(CountDownLatch.java:277)
   [junit4]    >         at org.apache.curator.CuratorZookeeperClient.internalBlockUntilConnectedOrTimedOut(CuratorZookeeperClient.java:323)
   [junit4]    >         at org.apache.curator.RetryLoop.callWithRetry(RetryLoop.java:105)
   [junit4]    >         at org.apache.curator.framework.imps.GetDataBuilderImpl.pathInForeground(GetDataBuilderImpl.java:288)
   [junit4]    >         at org.apache.curator.framework.imps.GetDataBuilderImpl.forPath(GetDataBuilderImpl.java:279)
   [junit4]    >         at org.apache.curator.framework.imps.GetDataBuilderImpl.forPath(GetDataBuilderImpl.java:41)
   [junit4]    >         at org.apache.curator.framework.recipes.shared.SharedValue.readValue(SharedValue.java:244)
   [junit4]    >         at org.apache.curator.framework.recipes.shared.SharedValue.access$100(SharedValue.java:44)
   [junit4]    >         at org.apache.curator.framework.recipes.shared.SharedValue$1.process(SharedValue.java:61)
   [junit4]    >         at org.apache.curator.framework.imps.NamespaceWatcher.process(NamespaceWatcher.java:67)
   [junit4]    >         at org.apache.zookeeper.ClientCnxn$EventThread.processEvent(ClientCnxn.java:530)
   [junit4]    >         at org.apache.zookeeper.ClientCnxn$EventThread.run(ClientCnxn.java:505)
   [junit4]    >    2) Thread[id=1023, name=jetty-launcher-141-thread-1-EventThread, state=TIMED_WAITING, group=TGRP-TestImpersonationWithHadoopAuth]
   [junit4]    >         at sun.misc.Unsafe.park(Native Method)
   [junit4]    >         at java.util.concurrent.locks.LockSupport.parkNanos(LockSupport.java:215)
   [junit4]    >         at java.util.concurrent.locks.AbstractQueuedSynchronizer.doAcquireSharedNanos(AbstractQueuedSynchronizer.java:1037)
   [junit4]    >         at java.util.concurrent.locks.AbstractQueuedSynchronizer.tryAcquireSharedNanos(AbstractQueuedSynchronizer.java:1328)
   [junit4]    >         at java.util.concurrent.CountDownLatch.await(CountDownLatch.java:277)
   [junit4]    >         at org.apache.curator.CuratorZookeeperClient.internalBlockUntilConnectedOrTimedOut(CuratorZookeeperClient.java:323)
   [junit4]    >         at org.apache.curator.RetryLoop.callWithRetry(RetryLoop.java:105)
   [junit4]    >         at org.apache.curator.framework.imps.GetDataBuilderImpl.pathInForeground(GetDataBuilderImpl.java:288)
   [junit4]    >         at org.apache.curator.framework.imps.GetDataBuilderImpl.forPath(GetDataBuilderImpl.java:279)
   [junit4]    >         at org.apache.curator.framework.imps.GetDataBuilderImpl.forPath(GetDataBuilderImpl.java:41)
   [junit4]    >         at org.apache.curator.framework.recipes.shared.SharedValue.readValue(SharedValue.java:244)
   [junit4]    >         at org.apache.curator.framework.recipes.shared.SharedValue.access$100(SharedValue.java:44)
   [junit4]    >         at org.apache.curator.framework.recipes.shared.SharedValue$1.process(SharedValue.java:61)
   [junit4]    >         at org.apache.curator.framework.imps.NamespaceWatcher.process(NamespaceWatcher.java:67)
   [junit4]    >         at org.apache.zookeeper.ClientCnxn$EventThread.processEvent(ClientCnxn.java:530)
   [junit4]    >         at org.apache.zookeeper.ClientCnxn$EventThread.run(ClientCnxn.java:505)
   [junit4]    > 	at __randomizedtesting.SeedInfo.seed([46F599DA17D38BBD]:0)
   [junit4] Completed [65/744 (1!)] on J0 in 40.67s, 10 tests, 1 error, 1 skipped <<< FAILURES!

[...truncated 45048 lines...]

Mime
View raw message