lucene-dev mailing list archives

Site index · List index
Message view « Date » · « Thread »
Top « Date » · « Thread »
From Policeman Jenkins Server <jenk...@thetaphi.de>
Subject [JENKINS] Lucene-Solr-7.x-Linux (64bit/jdk-9) - Build # 706 - Still Unstable!
Date Mon, 30 Oct 2017 22:36:15 GMT
Build: https://jenkins.thetaphi.de/job/Lucene-Solr-7.x-Linux/706/
Java: 64bit/jdk-9 -XX:-UseCompressedOops -XX:+UseG1GC --illegal-access=deny

14 tests failed.
FAILED:  junit.framework.TestSuite.org.apache.solr.analytics.facet.PivotFacetTest

Error Message:
org.apache.solr.common.SolrException: http://127.0.0.1:36005/solr/collection1_shard2_replica_n2/

Stack Trace:
java.lang.RuntimeException: org.apache.solr.common.SolrException: http://127.0.0.1:36005/solr/collection1_shard2_replica_n2/
	at __randomizedtesting.SeedInfo.seed([FACB4F65958E77DC]:0)
	at org.apache.solr.analytics.SolrAnalyticsTestCase.commitDocs(SolrAnalyticsTestCase.java:91)
	at org.apache.solr.analytics.facet.PivotFacetTest.populate(PivotFacetTest.java:78)
	at java.base/jdk.internal.reflect.NativeMethodAccessorImpl.invoke0(Native Method)
	at java.base/jdk.internal.reflect.NativeMethodAccessorImpl.invoke(NativeMethodAccessorImpl.java:62)
	at java.base/jdk.internal.reflect.DelegatingMethodAccessorImpl.invoke(DelegatingMethodAccessorImpl.java:43)
	at java.base/java.lang.reflect.Method.invoke(Method.java:564)
	at com.carrotsearch.randomizedtesting.RandomizedRunner.invoke(RandomizedRunner.java:1737)
	at com.carrotsearch.randomizedtesting.RandomizedRunner$6.evaluate(RandomizedRunner.java:874)
	at com.carrotsearch.randomizedtesting.RandomizedRunner$7.evaluate(RandomizedRunner.java:890)
	at com.carrotsearch.randomizedtesting.rules.StatementAdapter.evaluate(StatementAdapter.java:36)
	at com.carrotsearch.randomizedtesting.rules.SystemPropertiesRestoreRule$1.evaluate(SystemPropertiesRestoreRule.java:57)
	at org.apache.lucene.util.AbstractBeforeAfterRule$1.evaluate(AbstractBeforeAfterRule.java:45)
	at com.carrotsearch.randomizedtesting.rules.StatementAdapter.evaluate(StatementAdapter.java:36)
	at org.apache.lucene.util.TestRuleStoreClassName$1.evaluate(TestRuleStoreClassName.java:41)
	at com.carrotsearch.randomizedtesting.rules.NoShadowingOrOverridesOnMethodsRule$1.evaluate(NoShadowingOrOverridesOnMethodsRule.java:40)
	at com.carrotsearch.randomizedtesting.rules.NoShadowingOrOverridesOnMethodsRule$1.evaluate(NoShadowingOrOverridesOnMethodsRule.java:40)
	at com.carrotsearch.randomizedtesting.rules.StatementAdapter.evaluate(StatementAdapter.java:36)
	at com.carrotsearch.randomizedtesting.rules.StatementAdapter.evaluate(StatementAdapter.java:36)
	at org.apache.lucene.util.TestRuleAssertionsRequired$1.evaluate(TestRuleAssertionsRequired.java:53)
	at org.apache.lucene.util.TestRuleMarkFailure$1.evaluate(TestRuleMarkFailure.java:47)
	at org.apache.lucene.util.TestRuleIgnoreAfterMaxFailures$1.evaluate(TestRuleIgnoreAfterMaxFailures.java:64)
	at org.apache.lucene.util.TestRuleIgnoreTestSuites$1.evaluate(TestRuleIgnoreTestSuites.java:54)
	at com.carrotsearch.randomizedtesting.rules.StatementAdapter.evaluate(StatementAdapter.java:36)
	at com.carrotsearch.randomizedtesting.ThreadLeakControl$StatementRunner.run(ThreadLeakControl.java:368)
	at java.base/java.lang.Thread.run(Thread.java:844)
Caused by: org.apache.solr.common.SolrException: http://127.0.0.1:36005/solr/collection1_shard2_replica_n2/
	at org.apache.solr.client.solrj.impl.CloudSolrClient.directUpdate(CloudSolrClient.java:589)
	at org.apache.solr.client.solrj.impl.CloudSolrClient.sendRequest(CloudSolrClient.java:1008)
	at org.apache.solr.client.solrj.impl.CloudSolrClient.requestWithRetryOnStaleState(CloudSolrClient.java:875)
	at org.apache.solr.client.solrj.impl.CloudSolrClient.request(CloudSolrClient.java:808)
	at org.apache.solr.client.solrj.SolrRequest.process(SolrRequest.java:178)
	at org.apache.solr.client.solrj.request.UpdateRequest.commit(UpdateRequest.java:233)
	at org.apache.solr.analytics.SolrAnalyticsTestCase.commitDocs(SolrAnalyticsTestCase.java:89)
	... 24 more
Caused by: org.apache.solr.client.solrj.impl.HttpSolrClient$RemoteSolrException: Error from server at http://127.0.0.1:36005/solr/collection1_shard2_replica_n2: Expected mime type application/octet-stream but got application/json. {
  "error":{
    "metadata":[
      "error-class","org.apache.solr.common.SolrException",
      "root-error-class","org.apache.solr.common.SolrException"],
    "msg":"URLDecoder: Invalid digit (i) in escape (%) pattern",
    "code":400}}

	at org.apache.solr.client.solrj.impl.HttpSolrClient.executeMethod(HttpSolrClient.java:590)
	at org.apache.solr.client.solrj.impl.HttpSolrClient.request(HttpSolrClient.java:253)
	at org.apache.solr.client.solrj.impl.HttpSolrClient.request(HttpSolrClient.java:242)
	at org.apache.solr.client.solrj.impl.LBHttpSolrClient.doRequest(LBHttpSolrClient.java:483)
	at org.apache.solr.client.solrj.impl.LBHttpSolrClient.request(LBHttpSolrClient.java:413)
	at org.apache.solr.client.solrj.impl.CloudSolrClient.directUpdate(CloudSolrClient.java:586)
	... 30 more


FAILED:  junit.framework.TestSuite.org.apache.solr.client.solrj.io.stream.StreamExpressionTest

Error Message:
9 threads leaked from SUITE scope at org.apache.solr.client.solrj.io.stream.StreamExpressionTest:     1) Thread[id=754, name=TEST-StreamExpressionTest.testParallelExecutorStream-seed#[CEDD741A46C18E4E]-EventThread, state=WAITING, group=TGRP-StreamExpressionTest]         at java.base@9/jdk.internal.misc.Unsafe.park(Native Method)         at java.base@9/java.util.concurrent.locks.LockSupport.park(LockSupport.java:194)         at java.base@9/java.util.concurrent.locks.AbstractQueuedSynchronizer$ConditionObject.await(AbstractQueuedSynchronizer.java:2062)         at java.base@9/java.util.concurrent.LinkedBlockingQueue.take(LinkedBlockingQueue.java:435)         at app//org.apache.zookeeper.ClientCnxn$EventThread.run(ClientCnxn.java:501)    2) Thread[id=2457, name=zkCallback-261-thread-6, state=TIMED_WAITING, group=TGRP-StreamExpressionTest]         at java.base@9/jdk.internal.misc.Unsafe.park(Native Method)         at java.base@9/java.util.concurrent.locks.LockSupport.parkNanos(LockSupport.java:234)         at java.base@9/java.util.concurrent.SynchronousQueue$TransferStack.awaitFulfill(SynchronousQueue.java:462)         at java.base@9/java.util.concurrent.SynchronousQueue$TransferStack.transfer(SynchronousQueue.java:361)         at java.base@9/java.util.concurrent.SynchronousQueue.poll(SynchronousQueue.java:937)         at java.base@9/java.util.concurrent.ThreadPoolExecutor.getTask(ThreadPoolExecutor.java:1091)         at java.base@9/java.util.concurrent.ThreadPoolExecutor.runWorker(ThreadPoolExecutor.java:1152)         at java.base@9/java.util.concurrent.ThreadPoolExecutor$Worker.run(ThreadPoolExecutor.java:641)         at java.base@9/java.lang.Thread.run(Thread.java:844)    3) Thread[id=753, name=TEST-StreamExpressionTest.testParallelExecutorStream-seed#[CEDD741A46C18E4E]-SendThread(127.0.0.1:36549), state=TIMED_WAITING, group=TGRP-StreamExpressionTest]         at java.base@9/java.lang.Thread.sleep(Native Method)         at app//org.apache.zookeeper.ClientCnxn$SendThread.run(ClientCnxn.java:1051)    4) Thread[id=752, name=Connection evictor, state=TIMED_WAITING, group=TGRP-StreamExpressionTest]         at java.base@9/java.lang.Thread.sleep(Native Method)         at app//org.apache.http.impl.client.IdleConnectionEvictor$1.run(IdleConnectionEvictor.java:66)         at java.base@9/java.lang.Thread.run(Thread.java:844)    5) Thread[id=2438, name=zkCallback-261-thread-4, state=TIMED_WAITING, group=TGRP-StreamExpressionTest]         at java.base@9/jdk.internal.misc.Unsafe.park(Native Method)         at java.base@9/java.util.concurrent.locks.LockSupport.parkNanos(LockSupport.java:234)         at java.base@9/java.util.concurrent.SynchronousQueue$TransferStack.awaitFulfill(SynchronousQueue.java:462)         at java.base@9/java.util.concurrent.SynchronousQueue$TransferStack.transfer(SynchronousQueue.java:361)         at java.base@9/java.util.concurrent.SynchronousQueue.poll(SynchronousQueue.java:937)         at java.base@9/java.util.concurrent.ThreadPoolExecutor.getTask(ThreadPoolExecutor.java:1091)         at java.base@9/java.util.concurrent.ThreadPoolExecutor.runWorker(ThreadPoolExecutor.java:1152)         at java.base@9/java.util.concurrent.ThreadPoolExecutor$Worker.run(ThreadPoolExecutor.java:641)         at java.base@9/java.lang.Thread.run(Thread.java:844)    6) Thread[id=759, name=Connection evictor, state=TIMED_WAITING, group=TGRP-StreamExpressionTest]         at java.base@9/java.lang.Thread.sleep(Native Method)         at app//org.apache.http.impl.client.IdleConnectionEvictor$1.run(IdleConnectionEvictor.java:66)         at java.base@9/java.lang.Thread.run(Thread.java:844)    7) Thread[id=758, name=Connection evictor, state=TIMED_WAITING, group=TGRP-StreamExpressionTest]         at java.base@9/java.lang.Thread.sleep(Native Method)         at app//org.apache.http.impl.client.IdleConnectionEvictor$1.run(IdleConnectionEvictor.java:66)         at java.base@9/java.lang.Thread.run(Thread.java:844)    8) Thread[id=2458, name=zkCallback-261-thread-7, state=TIMED_WAITING, group=TGRP-StreamExpressionTest]         at java.base@9/jdk.internal.misc.Unsafe.park(Native Method)         at java.base@9/java.util.concurrent.locks.LockSupport.parkNanos(LockSupport.java:234)         at java.base@9/java.util.concurrent.SynchronousQueue$TransferStack.awaitFulfill(SynchronousQueue.java:462)         at java.base@9/java.util.concurrent.SynchronousQueue$TransferStack.transfer(SynchronousQueue.java:361)         at java.base@9/java.util.concurrent.SynchronousQueue.poll(SynchronousQueue.java:937)         at java.base@9/java.util.concurrent.ThreadPoolExecutor.getTask(ThreadPoolExecutor.java:1091)         at java.base@9/java.util.concurrent.ThreadPoolExecutor.runWorker(ThreadPoolExecutor.java:1152)         at java.base@9/java.util.concurrent.ThreadPoolExecutor$Worker.run(ThreadPoolExecutor.java:641)         at java.base@9/java.lang.Thread.run(Thread.java:844)    9) Thread[id=2456, name=zkCallback-261-thread-5, state=TIMED_WAITING, group=TGRP-StreamExpressionTest]         at java.base@9/jdk.internal.misc.Unsafe.park(Native Method)         at java.base@9/java.util.concurrent.locks.LockSupport.parkNanos(LockSupport.java:234)         at java.base@9/java.util.concurrent.SynchronousQueue$TransferStack.awaitFulfill(SynchronousQueue.java:462)         at java.base@9/java.util.concurrent.SynchronousQueue$TransferStack.transfer(SynchronousQueue.java:361)         at java.base@9/java.util.concurrent.SynchronousQueue.poll(SynchronousQueue.java:937)         at java.base@9/java.util.concurrent.ThreadPoolExecutor.getTask(ThreadPoolExecutor.java:1091)         at java.base@9/java.util.concurrent.ThreadPoolExecutor.runWorker(ThreadPoolExecutor.java:1152)         at java.base@9/java.util.concurrent.ThreadPoolExecutor$Worker.run(ThreadPoolExecutor.java:641)         at java.base@9/java.lang.Thread.run(Thread.java:844)

Stack Trace:
com.carrotsearch.randomizedtesting.ThreadLeakError: 9 threads leaked from SUITE scope at org.apache.solr.client.solrj.io.stream.StreamExpressionTest: 
   1) Thread[id=754, name=TEST-StreamExpressionTest.testParallelExecutorStream-seed#[CEDD741A46C18E4E]-EventThread, state=WAITING, group=TGRP-StreamExpressionTest]
        at java.base@9/jdk.internal.misc.Unsafe.park(Native Method)
        at java.base@9/java.util.concurrent.locks.LockSupport.park(LockSupport.java:194)
        at java.base@9/java.util.concurrent.locks.AbstractQueuedSynchronizer$ConditionObject.await(AbstractQueuedSynchronizer.java:2062)
        at java.base@9/java.util.concurrent.LinkedBlockingQueue.take(LinkedBlockingQueue.java:435)
        at app//org.apache.zookeeper.ClientCnxn$EventThread.run(ClientCnxn.java:501)
   2) Thread[id=2457, name=zkCallback-261-thread-6, state=TIMED_WAITING, group=TGRP-StreamExpressionTest]
        at java.base@9/jdk.internal.misc.Unsafe.park(Native Method)
        at java.base@9/java.util.concurrent.locks.LockSupport.parkNanos(LockSupport.java:234)
        at java.base@9/java.util.concurrent.SynchronousQueue$TransferStack.awaitFulfill(SynchronousQueue.java:462)
        at java.base@9/java.util.concurrent.SynchronousQueue$TransferStack.transfer(SynchronousQueue.java:361)
        at java.base@9/java.util.concurrent.SynchronousQueue.poll(SynchronousQueue.java:937)
        at java.base@9/java.util.concurrent.ThreadPoolExecutor.getTask(ThreadPoolExecutor.java:1091)
        at java.base@9/java.util.concurrent.ThreadPoolExecutor.runWorker(ThreadPoolExecutor.java:1152)
        at java.base@9/java.util.concurrent.ThreadPoolExecutor$Worker.run(ThreadPoolExecutor.java:641)
        at java.base@9/java.lang.Thread.run(Thread.java:844)
   3) Thread[id=753, name=TEST-StreamExpressionTest.testParallelExecutorStream-seed#[CEDD741A46C18E4E]-SendThread(127.0.0.1:36549), state=TIMED_WAITING, group=TGRP-StreamExpressionTest]
        at java.base@9/java.lang.Thread.sleep(Native Method)
        at app//org.apache.zookeeper.ClientCnxn$SendThread.run(ClientCnxn.java:1051)
   4) Thread[id=752, name=Connection evictor, state=TIMED_WAITING, group=TGRP-StreamExpressionTest]
        at java.base@9/java.lang.Thread.sleep(Native Method)
        at app//org.apache.http.impl.client.IdleConnectionEvictor$1.run(IdleConnectionEvictor.java:66)
        at java.base@9/java.lang.Thread.run(Thread.java:844)
   5) Thread[id=2438, name=zkCallback-261-thread-4, state=TIMED_WAITING, group=TGRP-StreamExpressionTest]
        at java.base@9/jdk.internal.misc.Unsafe.park(Native Method)
        at java.base@9/java.util.concurrent.locks.LockSupport.parkNanos(LockSupport.java:234)
        at java.base@9/java.util.concurrent.SynchronousQueue$TransferStack.awaitFulfill(SynchronousQueue.java:462)
        at java.base@9/java.util.concurrent.SynchronousQueue$TransferStack.transfer(SynchronousQueue.java:361)
        at java.base@9/java.util.concurrent.SynchronousQueue.poll(SynchronousQueue.java:937)
        at java.base@9/java.util.concurrent.ThreadPoolExecutor.getTask(ThreadPoolExecutor.java:1091)
        at java.base@9/java.util.concurrent.ThreadPoolExecutor.runWorker(ThreadPoolExecutor.java:1152)
        at java.base@9/java.util.concurrent.ThreadPoolExecutor$Worker.run(ThreadPoolExecutor.java:641)
        at java.base@9/java.lang.Thread.run(Thread.java:844)
   6) Thread[id=759, name=Connection evictor, state=TIMED_WAITING, group=TGRP-StreamExpressionTest]
        at java.base@9/java.lang.Thread.sleep(Native Method)
        at app//org.apache.http.impl.client.IdleConnectionEvictor$1.run(IdleConnectionEvictor.java:66)
        at java.base@9/java.lang.Thread.run(Thread.java:844)
   7) Thread[id=758, name=Connection evictor, state=TIMED_WAITING, group=TGRP-StreamExpressionTest]
        at java.base@9/java.lang.Thread.sleep(Native Method)
        at app//org.apache.http.impl.client.IdleConnectionEvictor$1.run(IdleConnectionEvictor.java:66)
        at java.base@9/java.lang.Thread.run(Thread.java:844)
   8) Thread[id=2458, name=zkCallback-261-thread-7, state=TIMED_WAITING, group=TGRP-StreamExpressionTest]
        at java.base@9/jdk.internal.misc.Unsafe.park(Native Method)
        at java.base@9/java.util.concurrent.locks.LockSupport.parkNanos(LockSupport.java:234)
        at java.base@9/java.util.concurrent.SynchronousQueue$TransferStack.awaitFulfill(SynchronousQueue.java:462)
        at java.base@9/java.util.concurrent.SynchronousQueue$TransferStack.transfer(SynchronousQueue.java:361)
        at java.base@9/java.util.concurrent.SynchronousQueue.poll(SynchronousQueue.java:937)
        at java.base@9/java.util.concurrent.ThreadPoolExecutor.getTask(ThreadPoolExecutor.java:1091)
        at java.base@9/java.util.concurrent.ThreadPoolExecutor.runWorker(ThreadPoolExecutor.java:1152)
        at java.base@9/java.util.concurrent.ThreadPoolExecutor$Worker.run(ThreadPoolExecutor.java:641)
        at java.base@9/java.lang.Thread.run(Thread.java:844)
   9) Thread[id=2456, name=zkCallback-261-thread-5, state=TIMED_WAITING, group=TGRP-StreamExpressionTest]
        at java.base@9/jdk.internal.misc.Unsafe.park(Native Method)
        at java.base@9/java.util.concurrent.locks.LockSupport.parkNanos(LockSupport.java:234)
        at java.base@9/java.util.concurrent.SynchronousQueue$TransferStack.awaitFulfill(SynchronousQueue.java:462)
        at java.base@9/java.util.concurrent.SynchronousQueue$TransferStack.transfer(SynchronousQueue.java:361)
        at java.base@9/java.util.concurrent.SynchronousQueue.poll(SynchronousQueue.java:937)
        at java.base@9/java.util.concurrent.ThreadPoolExecutor.getTask(ThreadPoolExecutor.java:1091)
        at java.base@9/java.util.concurrent.ThreadPoolExecutor.runWorker(ThreadPoolExecutor.java:1152)
        at java.base@9/java.util.concurrent.ThreadPoolExecutor$Worker.run(ThreadPoolExecutor.java:641)
        at java.base@9/java.lang.Thread.run(Thread.java:844)
	at __randomizedtesting.SeedInfo.seed([CEDD741A46C18E4E]:0)


FAILED:  junit.framework.TestSuite.org.apache.solr.client.solrj.io.stream.StreamExpressionTest

Error Message:
There are still zombie threads that couldn't be terminated:    1) Thread[id=2457, name=zkCallback-261-thread-6, state=TIMED_WAITING, group=TGRP-StreamExpressionTest]         at java.base@9/jdk.internal.misc.Unsafe.park(Native Method)         at java.base@9/java.util.concurrent.locks.LockSupport.parkNanos(LockSupport.java:234)         at java.base@9/java.util.concurrent.SynchronousQueue$TransferStack.awaitFulfill(SynchronousQueue.java:462)         at java.base@9/java.util.concurrent.SynchronousQueue$TransferStack.transfer(SynchronousQueue.java:361)         at java.base@9/java.util.concurrent.SynchronousQueue.poll(SynchronousQueue.java:937)         at java.base@9/java.util.concurrent.ThreadPoolExecutor.getTask(ThreadPoolExecutor.java:1091)         at java.base@9/java.util.concurrent.ThreadPoolExecutor.runWorker(ThreadPoolExecutor.java:1152)         at java.base@9/java.util.concurrent.ThreadPoolExecutor$Worker.run(ThreadPoolExecutor.java:641)         at java.base@9/java.lang.Thread.run(Thread.java:844)    2) Thread[id=753, name=TEST-StreamExpressionTest.testParallelExecutorStream-seed#[CEDD741A46C18E4E]-SendThread(127.0.0.1:36549), state=TIMED_WAITING, group=TGRP-StreamExpressionTest]         at java.base@9/java.lang.Thread.sleep(Native Method)         at app//org.apache.zookeeper.ClientCnxn$SendThread.run(ClientCnxn.java:1051)    3) Thread[id=2438, name=zkCallback-261-thread-4, state=TIMED_WAITING, group=TGRP-StreamExpressionTest]         at java.base@9/jdk.internal.misc.Unsafe.park(Native Method)         at java.base@9/java.util.concurrent.locks.LockSupport.parkNanos(LockSupport.java:234)         at java.base@9/java.util.concurrent.SynchronousQueue$TransferStack.awaitFulfill(SynchronousQueue.java:462)         at java.base@9/java.util.concurrent.SynchronousQueue$TransferStack.transfer(SynchronousQueue.java:361)         at java.base@9/java.util.concurrent.SynchronousQueue.poll(SynchronousQueue.java:937)         at java.base@9/java.util.concurrent.ThreadPoolExecutor.getTask(ThreadPoolExecutor.java:1091)         at java.base@9/java.util.concurrent.ThreadPoolExecutor.runWorker(ThreadPoolExecutor.java:1152)         at java.base@9/java.util.concurrent.ThreadPoolExecutor$Worker.run(ThreadPoolExecutor.java:641)         at java.base@9/java.lang.Thread.run(Thread.java:844)    4) Thread[id=2458, name=zkCallback-261-thread-7, state=TIMED_WAITING, group=TGRP-StreamExpressionTest]         at java.base@9/jdk.internal.misc.Unsafe.park(Native Method)         at java.base@9/java.util.concurrent.locks.LockSupport.parkNanos(LockSupport.java:234)         at java.base@9/java.util.concurrent.SynchronousQueue$TransferStack.awaitFulfill(SynchronousQueue.java:462)         at java.base@9/java.util.concurrent.SynchronousQueue$TransferStack.transfer(SynchronousQueue.java:361)         at java.base@9/java.util.concurrent.SynchronousQueue.poll(SynchronousQueue.java:937)         at java.base@9/java.util.concurrent.ThreadPoolExecutor.getTask(ThreadPoolExecutor.java:1091)         at java.base@9/java.util.concurrent.ThreadPoolExecutor.runWorker(ThreadPoolExecutor.java:1152)         at java.base@9/java.util.concurrent.ThreadPoolExecutor$Worker.run(ThreadPoolExecutor.java:641)         at java.base@9/java.lang.Thread.run(Thread.java:844)    5) Thread[id=2456, name=zkCallback-261-thread-5, state=TIMED_WAITING, group=TGRP-StreamExpressionTest]         at java.base@9/jdk.internal.misc.Unsafe.park(Native Method)         at java.base@9/java.util.concurrent.locks.LockSupport.parkNanos(LockSupport.java:234)         at java.base@9/java.util.concurrent.SynchronousQueue$TransferStack.awaitFulfill(SynchronousQueue.java:462)         at java.base@9/java.util.concurrent.SynchronousQueue$TransferStack.transfer(SynchronousQueue.java:361)         at java.base@9/java.util.concurrent.SynchronousQueue.poll(SynchronousQueue.java:937)         at java.base@9/java.util.concurrent.ThreadPoolExecutor.getTask(ThreadPoolExecutor.java:1091)         at java.base@9/java.util.concurrent.ThreadPoolExecutor.runWorker(ThreadPoolExecutor.java:1152)         at java.base@9/java.util.concurrent.ThreadPoolExecutor$Worker.run(ThreadPoolExecutor.java:641)         at java.base@9/java.lang.Thread.run(Thread.java:844)

Stack Trace:
com.carrotsearch.randomizedtesting.ThreadLeakError: There are still zombie threads that couldn't be terminated:
   1) Thread[id=2457, name=zkCallback-261-thread-6, state=TIMED_WAITING, group=TGRP-StreamExpressionTest]
        at java.base@9/jdk.internal.misc.Unsafe.park(Native Method)
        at java.base@9/java.util.concurrent.locks.LockSupport.parkNanos(LockSupport.java:234)
        at java.base@9/java.util.concurrent.SynchronousQueue$TransferStack.awaitFulfill(SynchronousQueue.java:462)
        at java.base@9/java.util.concurrent.SynchronousQueue$TransferStack.transfer(SynchronousQueue.java:361)
        at java.base@9/java.util.concurrent.SynchronousQueue.poll(SynchronousQueue.java:937)
        at java.base@9/java.util.concurrent.ThreadPoolExecutor.getTask(ThreadPoolExecutor.java:1091)
        at java.base@9/java.util.concurrent.ThreadPoolExecutor.runWorker(ThreadPoolExecutor.java:1152)
        at java.base@9/java.util.concurrent.ThreadPoolExecutor$Worker.run(ThreadPoolExecutor.java:641)
        at java.base@9/java.lang.Thread.run(Thread.java:844)
   2) Thread[id=753, name=TEST-StreamExpressionTest.testParallelExecutorStream-seed#[CEDD741A46C18E4E]-SendThread(127.0.0.1:36549), state=TIMED_WAITING, group=TGRP-StreamExpressionTest]
        at java.base@9/java.lang.Thread.sleep(Native Method)
        at app//org.apache.zookeeper.ClientCnxn$SendThread.run(ClientCnxn.java:1051)
   3) Thread[id=2438, name=zkCallback-261-thread-4, state=TIMED_WAITING, group=TGRP-StreamExpressionTest]
        at java.base@9/jdk.internal.misc.Unsafe.park(Native Method)
        at java.base@9/java.util.concurrent.locks.LockSupport.parkNanos(LockSupport.java:234)
        at java.base@9/java.util.concurrent.SynchronousQueue$TransferStack.awaitFulfill(SynchronousQueue.java:462)
        at java.base@9/java.util.concurrent.SynchronousQueue$TransferStack.transfer(SynchronousQueue.java:361)
        at java.base@9/java.util.concurrent.SynchronousQueue.poll(SynchronousQueue.java:937)
        at java.base@9/java.util.concurrent.ThreadPoolExecutor.getTask(ThreadPoolExecutor.java:1091)
        at java.base@9/java.util.concurrent.ThreadPoolExecutor.runWorker(ThreadPoolExecutor.java:1152)
        at java.base@9/java.util.concurrent.ThreadPoolExecutor$Worker.run(ThreadPoolExecutor.java:641)
        at java.base@9/java.lang.Thread.run(Thread.java:844)
   4) Thread[id=2458, name=zkCallback-261-thread-7, state=TIMED_WAITING, group=TGRP-StreamExpressionTest]
        at java.base@9/jdk.internal.misc.Unsafe.park(Native Method)
        at java.base@9/java.util.concurrent.locks.LockSupport.parkNanos(LockSupport.java:234)
        at java.base@9/java.util.concurrent.SynchronousQueue$TransferStack.awaitFulfill(SynchronousQueue.java:462)
        at java.base@9/java.util.concurrent.SynchronousQueue$TransferStack.transfer(SynchronousQueue.java:361)
        at java.base@9/java.util.concurrent.SynchronousQueue.poll(SynchronousQueue.java:937)
        at java.base@9/java.util.concurrent.ThreadPoolExecutor.getTask(ThreadPoolExecutor.java:1091)
        at java.base@9/java.util.concurrent.ThreadPoolExecutor.runWorker(ThreadPoolExecutor.java:1152)
        at java.base@9/java.util.concurrent.ThreadPoolExecutor$Worker.run(ThreadPoolExecutor.java:641)
        at java.base@9/java.lang.Thread.run(Thread.java:844)
   5) Thread[id=2456, name=zkCallback-261-thread-5, state=TIMED_WAITING, group=TGRP-StreamExpressionTest]
        at java.base@9/jdk.internal.misc.Unsafe.park(Native Method)
        at java.base@9/java.util.concurrent.locks.LockSupport.parkNanos(LockSupport.java:234)
        at java.base@9/java.util.concurrent.SynchronousQueue$TransferStack.awaitFulfill(SynchronousQueue.java:462)
        at java.base@9/java.util.concurrent.SynchronousQueue$TransferStack.transfer(SynchronousQueue.java:361)
        at java.base@9/java.util.concurrent.SynchronousQueue.poll(SynchronousQueue.java:937)
        at java.base@9/java.util.concurrent.ThreadPoolExecutor.getTask(ThreadPoolExecutor.java:1091)
        at java.base@9/java.util.concurrent.ThreadPoolExecutor.runWorker(ThreadPoolExecutor.java:1152)
        at java.base@9/java.util.concurrent.ThreadPoolExecutor$Worker.run(ThreadPoolExecutor.java:641)
        at java.base@9/java.lang.Thread.run(Thread.java:844)
	at __randomizedtesting.SeedInfo.seed([CEDD741A46C18E4E]:0)


FAILED:  org.apache.solr.client.solrj.io.stream.StreamExpressionTest.testParallelExecutorStream

Error Message:
Could not find a healthy node to handle the request.

Stack Trace:
org.apache.solr.common.SolrException: Could not find a healthy node to handle the request.
	at __randomizedtesting.SeedInfo.seed([CEDD741A46C18E4E:73CA01037FEDB313]:0)
	at org.apache.solr.client.solrj.impl.CloudSolrClient.sendRequest(CloudSolrClient.java:1090)
	at org.apache.solr.client.solrj.impl.CloudSolrClient.requestWithRetryOnStaleState(CloudSolrClient.java:875)
	at org.apache.solr.client.solrj.impl.CloudSolrClient.requestWithRetryOnStaleState(CloudSolrClient.java:982)
	at org.apache.solr.client.solrj.impl.CloudSolrClient.requestWithRetryOnStaleState(CloudSolrClient.java:982)
	at org.apache.solr.client.solrj.impl.CloudSolrClient.requestWithRetryOnStaleState(CloudSolrClient.java:982)
	at org.apache.solr.client.solrj.impl.CloudSolrClient.requestWithRetryOnStaleState(CloudSolrClient.java:982)
	at org.apache.solr.client.solrj.impl.CloudSolrClient.requestWithRetryOnStaleState(CloudSolrClient.java:982)
	at org.apache.solr.client.solrj.impl.CloudSolrClient.request(CloudSolrClient.java:808)
	at org.apache.solr.client.solrj.SolrRequest.process(SolrRequest.java:178)
	at org.apache.solr.client.solrj.SolrClient.commit(SolrClient.java:484)
	at org.apache.solr.client.solrj.SolrClient.commit(SolrClient.java:448)
	at org.apache.solr.client.solrj.io.stream.StreamExpressionTest.testParallelExecutorStream(StreamExpressionTest.java:7767)
	at java.base/jdk.internal.reflect.NativeMethodAccessorImpl.invoke0(Native Method)
	at java.base/jdk.internal.reflect.NativeMethodAccessorImpl.invoke(NativeMethodAccessorImpl.java:62)
	at java.base/jdk.internal.reflect.DelegatingMethodAccessorImpl.invoke(DelegatingMethodAccessorImpl.java:43)
	at java.base/java.lang.reflect.Method.invoke(Method.java:564)
	at com.carrotsearch.randomizedtesting.RandomizedRunner.invoke(RandomizedRunner.java:1737)
	at com.carrotsearch.randomizedtesting.RandomizedRunner$8.evaluate(RandomizedRunner.java:934)
	at com.carrotsearch.randomizedtesting.RandomizedRunner$9.evaluate(RandomizedRunner.java:970)
	at com.carrotsearch.randomizedtesting.RandomizedRunner$10.evaluate(RandomizedRunner.java:984)
	at com.carrotsearch.randomizedtesting.rules.SystemPropertiesRestoreRule$1.evaluate(SystemPropertiesRestoreRule.java:57)
	at org.apache.lucene.util.TestRuleSetupTeardownChained$1.evaluate(TestRuleSetupTeardownChained.java:49)
	at org.apache.lucene.util.AbstractBeforeAfterRule$1.evaluate(AbstractBeforeAfterRule.java:45)
	at org.apache.lucene.util.TestRuleThreadAndTestName$1.evaluate(TestRuleThreadAndTestName.java:48)
	at org.apache.lucene.util.TestRuleIgnoreAfterMaxFailures$1.evaluate(TestRuleIgnoreAfterMaxFailures.java:64)
	at org.apache.lucene.util.TestRuleMarkFailure$1.evaluate(TestRuleMarkFailure.java:47)
	at com.carrotsearch.randomizedtesting.rules.StatementAdapter.evaluate(StatementAdapter.java:36)
	at com.carrotsearch.randomizedtesting.ThreadLeakControl$StatementRunner.run(ThreadLeakControl.java:368)
	at com.carrotsearch.randomizedtesting.ThreadLeakControl.forkTimeoutingTask(ThreadLeakControl.java:817)
	at com.carrotsearch.randomizedtesting.ThreadLeakControl$3.evaluate(ThreadLeakControl.java:468)
	at com.carrotsearch.randomizedtesting.RandomizedRunner.runSingleTest(RandomizedRunner.java:943)
	at com.carrotsearch.randomizedtesting.RandomizedRunner$5.evaluate(RandomizedRunner.java:829)
	at com.carrotsearch.randomizedtesting.RandomizedRunner$6.evaluate(RandomizedRunner.java:879)
	at com.carrotsearch.randomizedtesting.RandomizedRunner$7.evaluate(RandomizedRunner.java:890)
	at com.carrotsearch.randomizedtesting.rules.StatementAdapter.evaluate(StatementAdapter.java:36)
	at com.carrotsearch.randomizedtesting.rules.SystemPropertiesRestoreRule$1.evaluate(SystemPropertiesRestoreRule.java:57)
	at org.apache.lucene.util.AbstractBeforeAfterRule$1.evaluate(AbstractBeforeAfterRule.java:45)
	at com.carrotsearch.randomizedtesting.rules.StatementAdapter.evaluate(StatementAdapter.java:36)
	at org.apache.lucene.util.TestRuleStoreClassName$1.evaluate(TestRuleStoreClassName.java:41)
	at com.carrotsearch.randomizedtesting.rules.NoShadowingOrOverridesOnMethodsRule$1.evaluate(NoShadowingOrOverridesOnMethodsRule.java:40)
	at com.carrotsearch.randomizedtesting.rules.NoShadowingOrOverridesOnMethodsRule$1.evaluate(NoShadowingOrOverridesOnMethodsRule.java:40)
	at com.carrotsearch.randomizedtesting.rules.StatementAdapter.evaluate(StatementAdapter.java:36)
	at com.carrotsearch.randomizedtesting.rules.StatementAdapter.evaluate(StatementAdapter.java:36)
	at org.apache.lucene.util.TestRuleAssertionsRequired$1.evaluate(TestRuleAssertionsRequired.java:53)
	at org.apache.lucene.util.TestRuleMarkFailure$1.evaluate(TestRuleMarkFailure.java:47)
	at org.apache.lucene.util.TestRuleIgnoreAfterMaxFailures$1.evaluate(TestRuleIgnoreAfterMaxFailures.java:64)
	at org.apache.lucene.util.TestRuleIgnoreTestSuites$1.evaluate(TestRuleIgnoreTestSuites.java:54)
	at com.carrotsearch.randomizedtesting.rules.StatementAdapter.evaluate(StatementAdapter.java:36)
	at com.carrotsearch.randomizedtesting.ThreadLeakControl$StatementRunner.run(ThreadLeakControl.java:368)
	at java.base/java.lang.Thread.run(Thread.java:844)


FAILED:  org.apache.solr.client.solrj.io.stream.StreamExpressionTest.testExecutorStream

Error Message:
Could not find collection:workQueue

Stack Trace:
java.lang.AssertionError: Could not find collection:workQueue
	at __randomizedtesting.SeedInfo.seed([CEDD741A46C18E4E:EC1DF5E165ABA45E]:0)
	at org.junit.Assert.fail(Assert.java:93)
	at org.junit.Assert.assertTrue(Assert.java:43)
	at org.junit.Assert.assertNotNull(Assert.java:526)
	at org.apache.solr.cloud.AbstractDistribZkTestBase.waitForRecoveriesToFinish(AbstractDistribZkTestBase.java:155)
	at org.apache.solr.client.solrj.io.stream.StreamExpressionTest.testExecutorStream(StreamExpressionTest.java:7655)
	at java.base/jdk.internal.reflect.NativeMethodAccessorImpl.invoke0(Native Method)
	at java.base/jdk.internal.reflect.NativeMethodAccessorImpl.invoke(NativeMethodAccessorImpl.java:62)
	at java.base/jdk.internal.reflect.DelegatingMethodAccessorImpl.invoke(DelegatingMethodAccessorImpl.java:43)
	at java.base/java.lang.reflect.Method.invoke(Method.java:564)
	at com.carrotsearch.randomizedtesting.RandomizedRunner.invoke(RandomizedRunner.java:1737)
	at com.carrotsearch.randomizedtesting.RandomizedRunner$8.evaluate(RandomizedRunner.java:934)
	at com.carrotsearch.randomizedtesting.RandomizedRunner$9.evaluate(RandomizedRunner.java:970)
	at com.carrotsearch.randomizedtesting.RandomizedRunner$10.evaluate(RandomizedRunner.java:984)
	at com.carrotsearch.randomizedtesting.rules.SystemPropertiesRestoreRule$1.evaluate(SystemPropertiesRestoreRule.java:57)
	at org.apache.lucene.util.TestRuleSetupTeardownChained$1.evaluate(TestRuleSetupTeardownChained.java:49)
	at org.apache.lucene.util.AbstractBeforeAfterRule$1.evaluate(AbstractBeforeAfterRule.java:45)
	at org.apache.lucene.util.TestRuleThreadAndTestName$1.evaluate(TestRuleThreadAndTestName.java:48)
	at org.apache.lucene.util.TestRuleIgnoreAfterMaxFailures$1.evaluate(TestRuleIgnoreAfterMaxFailures.java:64)
	at org.apache.lucene.util.TestRuleMarkFailure$1.evaluate(TestRuleMarkFailure.java:47)
	at com.carrotsearch.randomizedtesting.rules.StatementAdapter.evaluate(StatementAdapter.java:36)
	at com.carrotsearch.randomizedtesting.ThreadLeakControl$StatementRunner.run(ThreadLeakControl.java:368)
	at com.carrotsearch.randomizedtesting.ThreadLeakControl.forkTimeoutingTask(ThreadLeakControl.java:817)
	at com.carrotsearch.randomizedtesting.ThreadLeakControl$3.evaluate(ThreadLeakControl.java:468)
	at com.carrotsearch.randomizedtesting.RandomizedRunner.runSingleTest(RandomizedRunner.java:943)
	at com.carrotsearch.randomizedtesting.RandomizedRunner$5.evaluate(RandomizedRunner.java:829)
	at com.carrotsearch.randomizedtesting.RandomizedRunner$6.evaluate(RandomizedRunner.java:879)
	at com.carrotsearch.randomizedtesting.RandomizedRunner$7.evaluate(RandomizedRunner.java:890)
	at com.carrotsearch.randomizedtesting.rules.StatementAdapter.evaluate(StatementAdapter.java:36)
	at com.carrotsearch.randomizedtesting.rules.SystemPropertiesRestoreRule$1.evaluate(SystemPropertiesRestoreRule.java:57)
	at org.apache.lucene.util.AbstractBeforeAfterRule$1.evaluate(AbstractBeforeAfterRule.java:45)
	at com.carrotsearch.randomizedtesting.rules.StatementAdapter.evaluate(StatementAdapter.java:36)
	at org.apache.lucene.util.TestRuleStoreClassName$1.evaluate(TestRuleStoreClassName.java:41)
	at com.carrotsearch.randomizedtesting.rules.NoShadowingOrOverridesOnMethodsRule$1.evaluate(NoShadowingOrOverridesOnMethodsRule.java:40)
	at com.carrotsearch.randomizedtesting.rules.NoShadowingOrOverridesOnMethodsRule$1.evaluate(NoShadowingOrOverridesOnMethodsRule.java:40)
	at com.carrotsearch.randomizedtesting.rules.StatementAdapter.evaluate(StatementAdapter.java:36)
	at com.carrotsearch.randomizedtesting.rules.StatementAdapter.evaluate(StatementAdapter.java:36)
	at org.apache.lucene.util.TestRuleAssertionsRequired$1.evaluate(TestRuleAssertionsRequired.java:53)
	at org.apache.lucene.util.TestRuleMarkFailure$1.evaluate(TestRuleMarkFailure.java:47)
	at org.apache.lucene.util.TestRuleIgnoreAfterMaxFailures$1.evaluate(TestRuleIgnoreAfterMaxFailures.java:64)
	at org.apache.lucene.util.TestRuleIgnoreTestSuites$1.evaluate(TestRuleIgnoreTestSuites.java:54)
	at com.carrotsearch.randomizedtesting.rules.StatementAdapter.evaluate(StatementAdapter.java:36)
	at com.carrotsearch.randomizedtesting.ThreadLeakControl$StatementRunner.run(ThreadLeakControl.java:368)
	at java.base/java.lang.Thread.run(Thread.java:844)


FAILED:  org.apache.solr.client.solrj.io.stream.StreamExpressionTest.testParallelDaemonUpdateStream

Error Message:
Error from server at https://127.0.0.1:37655/solr: Could not fully create collection: parallelDestinationCollection1

Stack Trace:
org.apache.solr.client.solrj.impl.HttpSolrClient$RemoteSolrException: Error from server at https://127.0.0.1:37655/solr: Could not fully create collection: parallelDestinationCollection1
	at __randomizedtesting.SeedInfo.seed([CEDD741A46C18E4E:BE62553AAE2CF7F3]:0)
	at org.apache.solr.client.solrj.impl.HttpSolrClient.executeMethod(HttpSolrClient.java:626)
	at org.apache.solr.client.solrj.impl.HttpSolrClient.request(HttpSolrClient.java:253)
	at org.apache.solr.client.solrj.impl.HttpSolrClient.request(HttpSolrClient.java:242)
	at org.apache.solr.client.solrj.impl.LBHttpSolrClient.doRequest(LBHttpSolrClient.java:483)
	at org.apache.solr.client.solrj.impl.LBHttpSolrClient.request(LBHttpSolrClient.java:413)
	at org.apache.solr.client.solrj.impl.CloudSolrClient.sendRequest(CloudSolrClient.java:1096)
	at org.apache.solr.client.solrj.impl.CloudSolrClient.requestWithRetryOnStaleState(CloudSolrClient.java:875)
	at org.apache.solr.client.solrj.impl.CloudSolrClient.request(CloudSolrClient.java:808)
	at org.apache.solr.client.solrj.SolrRequest.process(SolrRequest.java:178)
	at org.apache.solr.client.solrj.SolrRequest.process(SolrRequest.java:195)
	at org.apache.solr.client.solrj.io.stream.StreamExpressionTest.testParallelDaemonUpdateStream(StreamExpressionTest.java:4151)
	at java.base/jdk.internal.reflect.NativeMethodAccessorImpl.invoke0(Native Method)
	at java.base/jdk.internal.reflect.NativeMethodAccessorImpl.invoke(NativeMethodAccessorImpl.java:62)
	at java.base/jdk.internal.reflect.DelegatingMethodAccessorImpl.invoke(DelegatingMethodAccessorImpl.java:43)
	at java.base/java.lang.reflect.Method.invoke(Method.java:564)
	at com.carrotsearch.randomizedtesting.RandomizedRunner.invoke(RandomizedRunner.java:1737)
	at com.carrotsearch.randomizedtesting.RandomizedRunner$8.evaluate(RandomizedRunner.java:934)
	at com.carrotsearch.randomizedtesting.RandomizedRunner$9.evaluate(RandomizedRunner.java:970)
	at com.carrotsearch.randomizedtesting.RandomizedRunner$10.evaluate(RandomizedRunner.java:984)
	at com.carrotsearch.randomizedtesting.rules.SystemPropertiesRestoreRule$1.evaluate(SystemPropertiesRestoreRule.java:57)
	at org.apache.lucene.util.TestRuleSetupTeardownChained$1.evaluate(TestRuleSetupTeardownChained.java:49)
	at org.apache.lucene.util.AbstractBeforeAfterRule$1.evaluate(AbstractBeforeAfterRule.java:45)
	at org.apache.lucene.util.TestRuleThreadAndTestName$1.evaluate(TestRuleThreadAndTestName.java:48)
	at org.apache.lucene.util.TestRuleIgnoreAfterMaxFailures$1.evaluate(TestRuleIgnoreAfterMaxFailures.java:64)
	at org.apache.lucene.util.TestRuleMarkFailure$1.evaluate(TestRuleMarkFailure.java:47)
	at com.carrotsearch.randomizedtesting.rules.StatementAdapter.evaluate(StatementAdapter.java:36)
	at com.carrotsearch.randomizedtesting.ThreadLeakControl$StatementRunner.run(ThreadLeakControl.java:368)
	at com.carrotsearch.randomizedtesting.ThreadLeakControl.forkTimeoutingTask(ThreadLeakControl.java:817)
	at com.carrotsearch.randomizedtesting.ThreadLeakControl$3.evaluate(ThreadLeakControl.java:468)
	at com.carrotsearch.randomizedtesting.RandomizedRunner.runSingleTest(RandomizedRunner.java:943)
	at com.carrotsearch.randomizedtesting.RandomizedRunner$5.evaluate(RandomizedRunner.java:829)
	at com.carrotsearch.randomizedtesting.RandomizedRunner$6.evaluate(RandomizedRunner.java:879)
	at com.carrotsearch.randomizedtesting.RandomizedRunner$7.evaluate(RandomizedRunner.java:890)
	at com.carrotsearch.randomizedtesting.rules.StatementAdapter.evaluate(StatementAdapter.java:36)
	at com.carrotsearch.randomizedtesting.rules.SystemPropertiesRestoreRule$1.evaluate(SystemPropertiesRestoreRule.java:57)
	at org.apache.lucene.util.AbstractBeforeAfterRule$1.evaluate(AbstractBeforeAfterRule.java:45)
	at com.carrotsearch.randomizedtesting.rules.StatementAdapter.evaluate(StatementAdapter.java:36)
	at org.apache.lucene.util.TestRuleStoreClassName$1.evaluate(TestRuleStoreClassName.java:41)
	at com.carrotsearch.randomizedtesting.rules.NoShadowingOrOverridesOnMethodsRule$1.evaluate(NoShadowingOrOverridesOnMethodsRule.java:40)
	at com.carrotsearch.randomizedtesting.rules.NoShadowingOrOverridesOnMethodsRule$1.evaluate(NoShadowingOrOverridesOnMethodsRule.java:40)
	at com.carrotsearch.randomizedtesting.rules.StatementAdapter.evaluate(StatementAdapter.java:36)
	at com.carrotsearch.randomizedtesting.rules.StatementAdapter.evaluate(StatementAdapter.java:36)
	at org.apache.lucene.util.TestRuleAssertionsRequired$1.evaluate(TestRuleAssertionsRequired.java:53)
	at org.apache.lucene.util.TestRuleMarkFailure$1.evaluate(TestRuleMarkFailure.java:47)
	at org.apache.lucene.util.TestRuleIgnoreAfterMaxFailures$1.evaluate(TestRuleIgnoreAfterMaxFailures.java:64)
	at org.apache.lucene.util.TestRuleIgnoreTestSuites$1.evaluate(TestRuleIgnoreTestSuites.java:54)
	at com.carrotsearch.randomizedtesting.rules.StatementAdapter.evaluate(StatementAdapter.java:36)
	at com.carrotsearch.randomizedtesting.ThreadLeakControl$StatementRunner.run(ThreadLeakControl.java:368)
	at java.base/java.lang.Thread.run(Thread.java:844)


FAILED:  org.apache.solr.client.solrj.io.stream.StreamExpressionTest.testParallelDaemonCommitStream

Error Message:
Error from server at https://127.0.0.1:37655/solr: Could not fully create collection: parallelDestinationCollection1

Stack Trace:
org.apache.solr.client.solrj.impl.HttpSolrClient$RemoteSolrException: Error from server at https://127.0.0.1:37655/solr: Could not fully create collection: parallelDestinationCollection1
	at __randomizedtesting.SeedInfo.seed([CEDD741A46C18E4E:6E2B259F83B040D0]:0)
	at org.apache.solr.client.solrj.impl.HttpSolrClient.executeMethod(HttpSolrClient.java:626)
	at org.apache.solr.client.solrj.impl.HttpSolrClient.request(HttpSolrClient.java:253)
	at org.apache.solr.client.solrj.impl.HttpSolrClient.request(HttpSolrClient.java:242)
	at org.apache.solr.client.solrj.impl.LBHttpSolrClient.doRequest(LBHttpSolrClient.java:483)
	at org.apache.solr.client.solrj.impl.LBHttpSolrClient.request(LBHttpSolrClient.java:413)
	at org.apache.solr.client.solrj.impl.CloudSolrClient.sendRequest(CloudSolrClient.java:1096)
	at org.apache.solr.client.solrj.impl.CloudSolrClient.requestWithRetryOnStaleState(CloudSolrClient.java:875)
	at org.apache.solr.client.solrj.impl.CloudSolrClient.request(CloudSolrClient.java:808)
	at org.apache.solr.client.solrj.SolrRequest.process(SolrRequest.java:178)
	at org.apache.solr.client.solrj.SolrRequest.process(SolrRequest.java:195)
	at org.apache.solr.client.solrj.io.stream.StreamExpressionTest.testParallelDaemonCommitStream(StreamExpressionTest.java:4644)
	at java.base/jdk.internal.reflect.NativeMethodAccessorImpl.invoke0(Native Method)
	at java.base/jdk.internal.reflect.NativeMethodAccessorImpl.invoke(NativeMethodAccessorImpl.java:62)
	at java.base/jdk.internal.reflect.DelegatingMethodAccessorImpl.invoke(DelegatingMethodAccessorImpl.java:43)
	at java.base/java.lang.reflect.Method.invoke(Method.java:564)
	at com.carrotsearch.randomizedtesting.RandomizedRunner.invoke(RandomizedRunner.java:1737)
	at com.carrotsearch.randomizedtesting.RandomizedRunner$8.evaluate(RandomizedRunner.java:934)
	at com.carrotsearch.randomizedtesting.RandomizedRunner$9.evaluate(RandomizedRunner.java:970)
	at com.carrotsearch.randomizedtesting.RandomizedRunner$10.evaluate(RandomizedRunner.java:984)
	at com.carrotsearch.randomizedtesting.rules.SystemPropertiesRestoreRule$1.evaluate(SystemPropertiesRestoreRule.java:57)
	at org.apache.lucene.util.TestRuleSetupTeardownChained$1.evaluate(TestRuleSetupTeardownChained.java:49)
	at org.apache.lucene.util.AbstractBeforeAfterRule$1.evaluate(AbstractBeforeAfterRule.java:45)
	at org.apache.lucene.util.TestRuleThreadAndTestName$1.evaluate(TestRuleThreadAndTestName.java:48)
	at org.apache.lucene.util.TestRuleIgnoreAfterMaxFailures$1.evaluate(TestRuleIgnoreAfterMaxFailures.java:64)
	at org.apache.lucene.util.TestRuleMarkFailure$1.evaluate(TestRuleMarkFailure.java:47)
	at com.carrotsearch.randomizedtesting.rules.StatementAdapter.evaluate(StatementAdapter.java:36)
	at com.carrotsearch.randomizedtesting.ThreadLeakControl$StatementRunner.run(ThreadLeakControl.java:368)
	at com.carrotsearch.randomizedtesting.ThreadLeakControl.forkTimeoutingTask(ThreadLeakControl.java:817)
	at com.carrotsearch.randomizedtesting.ThreadLeakControl$3.evaluate(ThreadLeakControl.java:468)
	at com.carrotsearch.randomizedtesting.RandomizedRunner.runSingleTest(RandomizedRunner.java:943)
	at com.carrotsearch.randomizedtesting.RandomizedRunner$5.evaluate(RandomizedRunner.java:829)
	at com.carrotsearch.randomizedtesting.RandomizedRunner$6.evaluate(RandomizedRunner.java:879)
	at com.carrotsearch.randomizedtesting.RandomizedRunner$7.evaluate(RandomizedRunner.java:890)
	at com.carrotsearch.randomizedtesting.rules.StatementAdapter.evaluate(StatementAdapter.java:36)
	at com.carrotsearch.randomizedtesting.rules.SystemPropertiesRestoreRule$1.evaluate(SystemPropertiesRestoreRule.java:57)
	at org.apache.lucene.util.AbstractBeforeAfterRule$1.evaluate(AbstractBeforeAfterRule.java:45)
	at com.carrotsearch.randomizedtesting.rules.StatementAdapter.evaluate(StatementAdapter.java:36)
	at org.apache.lucene.util.TestRuleStoreClassName$1.evaluate(TestRuleStoreClassName.java:41)
	at com.carrotsearch.randomizedtesting.rules.NoShadowingOrOverridesOnMethodsRule$1.evaluate(NoShadowingOrOverridesOnMethodsRule.java:40)
	at com.carrotsearch.randomizedtesting.rules.NoShadowingOrOverridesOnMethodsRule$1.evaluate(NoShadowingOrOverridesOnMethodsRule.java:40)
	at com.carrotsearch.randomizedtesting.rules.StatementAdapter.evaluate(StatementAdapter.java:36)
	at com.carrotsearch.randomizedtesting.rules.StatementAdapter.evaluate(StatementAdapter.java:36)
	at org.apache.lucene.util.TestRuleAssertionsRequired$1.evaluate(TestRuleAssertionsRequired.java:53)
	at org.apache.lucene.util.TestRuleMarkFailure$1.evaluate(TestRuleMarkFailure.java:47)
	at org.apache.lucene.util.TestRuleIgnoreAfterMaxFailures$1.evaluate(TestRuleIgnoreAfterMaxFailures.java:64)
	at org.apache.lucene.util.TestRuleIgnoreTestSuites$1.evaluate(TestRuleIgnoreTestSuites.java:54)
	at com.carrotsearch.randomizedtesting.rules.StatementAdapter.evaluate(StatementAdapter.java:36)
	at com.carrotsearch.randomizedtesting.ThreadLeakControl$StatementRunner.run(ThreadLeakControl.java:368)
	at java.base/java.lang.Thread.run(Thread.java:844)


FAILED:  org.apache.solr.client.solrj.io.stream.StreamExpressionTest.testUpdateStream

Error Message:
Error from server at https://127.0.0.1:37655/solr: Could not fully create collection: destinationCollection

Stack Trace:
org.apache.solr.client.solrj.impl.HttpSolrClient$RemoteSolrException: Error from server at https://127.0.0.1:37655/solr: Could not fully create collection: destinationCollection
	at __randomizedtesting.SeedInfo.seed([CEDD741A46C18E4E:69AB0604FC9731E]:0)
	at org.apache.solr.client.solrj.impl.HttpSolrClient.executeMethod(HttpSolrClient.java:626)
	at org.apache.solr.client.solrj.impl.HttpSolrClient.request(HttpSolrClient.java:253)
	at org.apache.solr.client.solrj.impl.HttpSolrClient.request(HttpSolrClient.java:242)
	at org.apache.solr.client.solrj.impl.LBHttpSolrClient.doRequest(LBHttpSolrClient.java:483)
	at org.apache.solr.client.solrj.impl.LBHttpSolrClient.request(LBHttpSolrClient.java:413)
	at org.apache.solr.client.solrj.impl.CloudSolrClient.sendRequest(CloudSolrClient.java:1096)
	at org.apache.solr.client.solrj.impl.CloudSolrClient.requestWithRetryOnStaleState(CloudSolrClient.java:875)
	at org.apache.solr.client.solrj.impl.CloudSolrClient.request(CloudSolrClient.java:808)
	at org.apache.solr.client.solrj.SolrRequest.process(SolrRequest.java:178)
	at org.apache.solr.client.solrj.SolrRequest.process(SolrRequest.java:195)
	at org.apache.solr.client.solrj.io.stream.StreamExpressionTest.testUpdateStream(StreamExpressionTest.java:3958)
	at java.base/jdk.internal.reflect.NativeMethodAccessorImpl.invoke0(Native Method)
	at java.base/jdk.internal.reflect.NativeMethodAccessorImpl.invoke(NativeMethodAccessorImpl.java:62)
	at java.base/jdk.internal.reflect.DelegatingMethodAccessorImpl.invoke(DelegatingMethodAccessorImpl.java:43)
	at java.base/java.lang.reflect.Method.invoke(Method.java:564)
	at com.carrotsearch.randomizedtesting.RandomizedRunner.invoke(RandomizedRunner.java:1737)
	at com.carrotsearch.randomizedtesting.RandomizedRunner$8.evaluate(RandomizedRunner.java:934)
	at com.carrotsearch.randomizedtesting.RandomizedRunner$9.evaluate(RandomizedRunner.java:970)
	at com.carrotsearch.randomizedtesting.RandomizedRunner$10.evaluate(RandomizedRunner.java:984)
	at com.carrotsearch.randomizedtesting.rules.SystemPropertiesRestoreRule$1.evaluate(SystemPropertiesRestoreRule.java:57)
	at org.apache.lucene.util.TestRuleSetupTeardownChained$1.evaluate(TestRuleSetupTeardownChained.java:49)
	at org.apache.lucene.util.AbstractBeforeAfterRule$1.evaluate(AbstractBeforeAfterRule.java:45)
	at org.apache.lucene.util.TestRuleThreadAndTestName$1.evaluate(TestRuleThreadAndTestName.java:48)
	at org.apache.lucene.util.TestRuleIgnoreAfterMaxFailures$1.evaluate(TestRuleIgnoreAfterMaxFailures.java:64)
	at org.apache.lucene.util.TestRuleMarkFailure$1.evaluate(TestRuleMarkFailure.java:47)
	at com.carrotsearch.randomizedtesting.rules.StatementAdapter.evaluate(StatementAdapter.java:36)
	at com.carrotsearch.randomizedtesting.ThreadLeakControl$StatementRunner.run(ThreadLeakControl.java:368)
	at com.carrotsearch.randomizedtesting.ThreadLeakControl.forkTimeoutingTask(ThreadLeakControl.java:817)
	at com.carrotsearch.randomizedtesting.ThreadLeakControl$3.evaluate(ThreadLeakControl.java:468)
	at com.carrotsearch.randomizedtesting.RandomizedRunner.runSingleTest(RandomizedRunner.java:943)
	at com.carrotsearch.randomizedtesting.RandomizedRunner$5.evaluate(RandomizedRunner.java:829)
	at com.carrotsearch.randomizedtesting.RandomizedRunner$6.evaluate(RandomizedRunner.java:879)
	at com.carrotsearch.randomizedtesting.RandomizedRunner$7.evaluate(RandomizedRunner.java:890)
	at com.carrotsearch.randomizedtesting.rules.StatementAdapter.evaluate(StatementAdapter.java:36)
	at com.carrotsearch.randomizedtesting.rules.SystemPropertiesRestoreRule$1.evaluate(SystemPropertiesRestoreRule.java:57)
	at org.apache.lucene.util.AbstractBeforeAfterRule$1.evaluate(AbstractBeforeAfterRule.java:45)
	at com.carrotsearch.randomizedtesting.rules.StatementAdapter.evaluate(StatementAdapter.java:36)
	at org.apache.lucene.util.TestRuleStoreClassName$1.evaluate(TestRuleStoreClassName.java:41)
	at com.carrotsearch.randomizedtesting.rules.NoShadowingOrOverridesOnMethodsRule$1.evaluate(NoShadowingOrOverridesOnMethodsRule.java:40)
	at com.carrotsearch.randomizedtesting.rules.NoShadowingOrOverridesOnMethodsRule$1.evaluate(NoShadowingOrOverridesOnMethodsRule.java:40)
	at com.carrotsearch.randomizedtesting.rules.StatementAdapter.evaluate(StatementAdapter.java:36)
	at com.carrotsearch.randomizedtesting.rules.StatementAdapter.evaluate(StatementAdapter.java:36)
	at org.apache.lucene.util.TestRuleAssertionsRequired$1.evaluate(TestRuleAssertionsRequired.java:53)
	at org.apache.lucene.util.TestRuleMarkFailure$1.evaluate(TestRuleMarkFailure.java:47)
	at org.apache.lucene.util.TestRuleIgnoreAfterMaxFailures$1.evaluate(TestRuleIgnoreAfterMaxFailures.java:64)
	at org.apache.lucene.util.TestRuleIgnoreTestSuites$1.evaluate(TestRuleIgnoreTestSuites.java:54)
	at com.carrotsearch.randomizedtesting.rules.StatementAdapter.evaluate(StatementAdapter.java:36)
	at com.carrotsearch.randomizedtesting.ThreadLeakControl$StatementRunner.run(ThreadLeakControl.java:368)
	at java.base/java.lang.Thread.run(Thread.java:844)


FAILED:  org.apache.solr.cloud.TestCloudPivotFacet.test

Error Message:
Timeout occured while waiting response from server at: http://127.0.0.1:33071/kt_/n

Stack Trace:
org.apache.solr.client.solrj.SolrServerException: Timeout occured while waiting response from server at: http://127.0.0.1:33071/kt_/n
	at __randomizedtesting.SeedInfo.seed([60CA92FFEB0778F3:E89EAD2545FB150B]:0)
	at org.apache.solr.client.solrj.impl.HttpSolrClient.executeMethod(HttpSolrClient.java:637)
	at org.apache.solr.client.solrj.impl.HttpSolrClient.request(HttpSolrClient.java:253)
	at org.apache.solr.client.solrj.impl.HttpSolrClient.request(HttpSolrClient.java:242)
	at org.apache.solr.client.solrj.impl.LBHttpSolrClient.doRequest(LBHttpSolrClient.java:483)
	at org.apache.solr.client.solrj.impl.LBHttpSolrClient.request(LBHttpSolrClient.java:413)
	at org.apache.solr.client.solrj.impl.CloudSolrClient.sendRequest(CloudSolrClient.java:1096)
	at org.apache.solr.client.solrj.impl.CloudSolrClient.requestWithRetryOnStaleState(CloudSolrClient.java:875)
	at org.apache.solr.client.solrj.impl.CloudSolrClient.request(CloudSolrClient.java:808)
	at org.apache.solr.client.solrj.SolrRequest.process(SolrRequest.java:178)
	at org.apache.solr.client.solrj.SolrRequest.process(SolrRequest.java:195)
	at org.apache.solr.cloud.AbstractFullDistribZkTestBase.createServers(AbstractFullDistribZkTestBase.java:315)
	at org.apache.solr.BaseDistributedSearchTestCase$ShardsRepeatRule$ShardsFixedStatement.callStatement(BaseDistributedSearchTestCase.java:991)
	at org.apache.solr.BaseDistributedSearchTestCase$ShardsRepeatRule$ShardsStatement.evaluate(BaseDistributedSearchTestCase.java:968)
	at com.carrotsearch.randomizedtesting.rules.SystemPropertiesRestoreRule$1.evaluate(SystemPropertiesRestoreRule.java:57)
	at org.apache.lucene.util.TestRuleSetupTeardownChained$1.evaluate(TestRuleSetupTeardownChained.java:49)
	at org.apache.lucene.util.AbstractBeforeAfterRule$1.evaluate(AbstractBeforeAfterRule.java:45)
	at org.apache.lucene.util.TestRuleThreadAndTestName$1.evaluate(TestRuleThreadAndTestName.java:48)
	at org.apache.lucene.util.TestRuleIgnoreAfterMaxFailures$1.evaluate(TestRuleIgnoreAfterMaxFailures.java:64)
	at org.apache.lucene.util.TestRuleMarkFailure$1.evaluate(TestRuleMarkFailure.java:47)
	at com.carrotsearch.randomizedtesting.rules.StatementAdapter.evaluate(StatementAdapter.java:36)
	at com.carrotsearch.randomizedtesting.ThreadLeakControl$StatementRunner.run(ThreadLeakControl.java:368)
	at com.carrotsearch.randomizedtesting.ThreadLeakControl.forkTimeoutingTask(ThreadLeakControl.java:817)
	at com.carrotsearch.randomizedtesting.ThreadLeakControl$3.evaluate(ThreadLeakControl.java:468)
	at com.carrotsearch.randomizedtesting.RandomizedRunner.runSingleTest(RandomizedRunner.java:943)
	at com.carrotsearch.randomizedtesting.RandomizedRunner$5.evaluate(RandomizedRunner.java:829)
	at com.carrotsearch.randomizedtesting.RandomizedRunner$6.evaluate(RandomizedRunner.java:879)
	at com.carrotsearch.randomizedtesting.RandomizedRunner$7.evaluate(RandomizedRunner.java:890)
	at com.carrotsearch.randomizedtesting.rules.StatementAdapter.evaluate(StatementAdapter.java:36)
	at com.carrotsearch.randomizedtesting.rules.SystemPropertiesRestoreRule$1.evaluate(SystemPropertiesRestoreRule.java:57)
	at org.apache.lucene.util.AbstractBeforeAfterRule$1.evaluate(AbstractBeforeAfterRule.java:45)
	at com.carrotsearch.randomizedtesting.rules.StatementAdapter.evaluate(StatementAdapter.java:36)
	at org.apache.lucene.util.TestRuleStoreClassName$1.evaluate(TestRuleStoreClassName.java:41)
	at com.carrotsearch.randomizedtesting.rules.NoShadowingOrOverridesOnMethodsRule$1.evaluate(NoShadowingOrOverridesOnMethodsRule.java:40)
	at com.carrotsearch.randomizedtesting.rules.NoShadowingOrOverridesOnMethodsRule$1.evaluate(NoShadowingOrOverridesOnMethodsRule.java:40)
	at com.carrotsearch.randomizedtesting.rules.StatementAdapter.evaluate(StatementAdapter.java:36)
	at com.carrotsearch.randomizedtesting.rules.StatementAdapter.evaluate(StatementAdapter.java:36)
	at org.apache.lucene.util.TestRuleAssertionsRequired$1.evaluate(TestRuleAssertionsRequired.java:53)
	at org.apache.lucene.util.TestRuleMarkFailure$1.evaluate(TestRuleMarkFailure.java:47)
	at org.apache.lucene.util.TestRuleIgnoreAfterMaxFailures$1.evaluate(TestRuleIgnoreAfterMaxFailures.java:64)
	at org.apache.lucene.util.TestRuleIgnoreTestSuites$1.evaluate(TestRuleIgnoreTestSuites.java:54)
	at com.carrotsearch.randomizedtesting.rules.StatementAdapter.evaluate(StatementAdapter.java:36)
	at com.carrotsearch.randomizedtesting.ThreadLeakControl$StatementRunner.run(ThreadLeakControl.java:368)
	at java.base/java.lang.Thread.run(Thread.java:844)
Caused by: java.net.SocketTimeoutException: Read timed out
	at java.base/java.net.SocketInputStream.socketRead0(Native Method)
	at java.base/java.net.SocketInputStream.socketRead(SocketInputStream.java:116)
	at java.base/java.net.SocketInputStream.read(SocketInputStream.java:171)
	at java.base/java.net.SocketInputStream.read(SocketInputStream.java:141)
	at org.apache.http.impl.io.SessionInputBufferImpl.streamRead(SessionInputBufferImpl.java:137)
	at org.apache.http.impl.io.SessionInputBufferImpl.fillBuffer(SessionInputBufferImpl.java:153)
	at org.apache.http.impl.io.SessionInputBufferImpl.readLine(SessionInputBufferImpl.java:282)
	at org.apache.http.impl.conn.DefaultHttpResponseParser.parseHead(DefaultHttpResponseParser.java:138)
	at org.apache.http.impl.conn.DefaultHttpResponseParser.parseHead(DefaultHttpResponseParser.java:56)
	at org.apache.http.impl.io.AbstractMessageParser.parse(AbstractMessageParser.java:259)
	at org.apache.http.impl.DefaultBHttpClientConnection.receiveResponseHeader(DefaultBHttpClientConnection.java:163)
	at org.apache.http.impl.conn.CPoolProxy.receiveResponseHeader(CPoolProxy.java:165)
	at org.apache.http.protocol.HttpRequestExecutor.doReceiveResponse(HttpRequestExecutor.java:273)
	at org.apache.http.protocol.HttpRequestExecutor.execute(HttpRequestExecutor.java:125)
	at org.apache.http.impl.execchain.MainClientExec.execute(MainClientExec.java:272)
	at org.apache.http.impl.execchain.ProtocolExec.execute(ProtocolExec.java:185)
	at org.apache.http.impl.execchain.RetryExec.execute(RetryExec.java:89)
	at org.apache.http.impl.execchain.RedirectExec.execute(RedirectExec.java:111)
	at org.apache.http.impl.client.InternalHttpClient.doExecute(InternalHttpClient.java:185)
	at org.apache.http.impl.client.CloseableHttpClient.execute(CloseableHttpClient.java:83)
	at org.apache.http.impl.client.CloseableHttpClient.execute(CloseableHttpClient.java:56)
	at org.apache.solr.client.solrj.impl.HttpSolrClient.executeMethod(HttpSolrClient.java:525)
	... 42 more


FAILED:  org.apache.solr.cloud.autoscaling.ExecutePlanActionTest.testIntegration

Error Message:
Timed out waiting for replicas of collection to be 2 again null Live Nodes: [127.0.0.1:35921_solr] Last available state: DocCollection(testIntegration//collections/testIntegration/state.json/6)={   "pullReplicas":"0",   "replicationFactor":"2",   "shards":{"shard1":{       "range":"80000000-7fffffff",       "state":"active",       "replicas":{         "core_node3":{           "core":"testIntegration_shard1_replica_n1",           "base_url":"http://127.0.0.1:46155/solr",           "node_name":"127.0.0.1:46155_solr",           "state":"down",           "type":"NRT"},         "core_node4":{           "core":"testIntegration_shard1_replica_n2",           "base_url":"http://127.0.0.1:35921/solr",           "node_name":"127.0.0.1:35921_solr",           "state":"active",           "type":"NRT",           "leader":"true"}}}},   "router":{"name":"compositeId"},   "maxShardsPerNode":"1",   "autoAddReplicas":"false",   "nrtReplicas":"2",   "tlogReplicas":"0"}

Stack Trace:
java.lang.AssertionError: Timed out waiting for replicas of collection to be 2 again
null
Live Nodes: [127.0.0.1:35921_solr]
Last available state: DocCollection(testIntegration//collections/testIntegration/state.json/6)={
  "pullReplicas":"0",
  "replicationFactor":"2",
  "shards":{"shard1":{
      "range":"80000000-7fffffff",
      "state":"active",
      "replicas":{
        "core_node3":{
          "core":"testIntegration_shard1_replica_n1",
          "base_url":"http://127.0.0.1:46155/solr",
          "node_name":"127.0.0.1:46155_solr",
          "state":"down",
          "type":"NRT"},
        "core_node4":{
          "core":"testIntegration_shard1_replica_n2",
          "base_url":"http://127.0.0.1:35921/solr",
          "node_name":"127.0.0.1:35921_solr",
          "state":"active",
          "type":"NRT",
          "leader":"true"}}}},
  "router":{"name":"compositeId"},
  "maxShardsPerNode":"1",
  "autoAddReplicas":"false",
  "nrtReplicas":"2",
  "tlogReplicas":"0"}
	at __randomizedtesting.SeedInfo.seed([60CA92FFEB0778F3:D0AB9CD3CE38D9D6]:0)
	at org.junit.Assert.fail(Assert.java:93)
	at org.apache.solr.cloud.SolrCloudTestCase.waitForState(SolrCloudTestCase.java:269)
	at org.apache.solr.cloud.autoscaling.ExecutePlanActionTest.testIntegration(ExecutePlanActionTest.java:209)
	at java.base/jdk.internal.reflect.NativeMethodAccessorImpl.invoke0(Native Method)
	at java.base/jdk.internal.reflect.NativeMethodAccessorImpl.invoke(NativeMethodAccessorImpl.java:62)
	at java.base/jdk.internal.reflect.DelegatingMethodAccessorImpl.invoke(DelegatingMethodAccessorImpl.java:43)
	at java.base/java.lang.reflect.Method.invoke(Method.java:564)
	at com.carrotsearch.randomizedtesting.RandomizedRunner.invoke(RandomizedRunner.java:1737)
	at com.carrotsearch.randomizedtesting.RandomizedRunner$8.evaluate(RandomizedRunner.java:934)
	at com.carrotsearch.randomizedtesting.RandomizedRunner$9.evaluate(RandomizedRunner.java:970)
	at com.carrotsearch.randomizedtesting.RandomizedRunner$10.evaluate(RandomizedRunner.java:984)
	at com.carrotsearch.randomizedtesting.rules.SystemPropertiesRestoreRule$1.evaluate(SystemPropertiesRestoreRule.java:57)
	at org.apache.lucene.util.TestRuleSetupTeardownChained$1.evaluate(TestRuleSetupTeardownChained.java:49)
	at org.apache.lucene.util.AbstractBeforeAfterRule$1.evaluate(AbstractBeforeAfterRule.java:45)
	at org.apache.lucene.util.TestRuleThreadAndTestName$1.evaluate(TestRuleThreadAndTestName.java:48)
	at org.apache.lucene.util.TestRuleIgnoreAfterMaxFailures$1.evaluate(TestRuleIgnoreAfterMaxFailures.java:64)
	at org.apache.lucene.util.TestRuleMarkFailure$1.evaluate(TestRuleMarkFailure.java:47)
	at com.carrotsearch.randomizedtesting.rules.StatementAdapter.evaluate(StatementAdapter.java:36)
	at com.carrotsearch.randomizedtesting.ThreadLeakControl$StatementRunner.run(ThreadLeakControl.java:368)
	at com.carrotsearch.randomizedtesting.ThreadLeakControl.forkTimeoutingTask(ThreadLeakControl.java:817)
	at com.carrotsearch.randomizedtesting.ThreadLeakControl$3.evaluate(ThreadLeakControl.java:468)
	at com.carrotsearch.randomizedtesting.RandomizedRunner.runSingleTest(RandomizedRunner.java:943)
	at com.carrotsearch.randomizedtesting.RandomizedRunner$5.evaluate(RandomizedRunner.java:829)
	at com.carrotsearch.randomizedtesting.RandomizedRunner$6.evaluate(RandomizedRunner.java:879)
	at com.carrotsearch.randomizedtesting.RandomizedRunner$7.evaluate(RandomizedRunner.java:890)
	at com.carrotsearch.randomizedtesting.rules.StatementAdapter.evaluate(StatementAdapter.java:36)
	at com.carrotsearch.randomizedtesting.rules.SystemPropertiesRestoreRule$1.evaluate(SystemPropertiesRestoreRule.java:57)
	at org.apache.lucene.util.AbstractBeforeAfterRule$1.evaluate(AbstractBeforeAfterRule.java:45)
	at com.carrotsearch.randomizedtesting.rules.StatementAdapter.evaluate(StatementAdapter.java:36)
	at org.apache.lucene.util.TestRuleStoreClassName$1.evaluate(TestRuleStoreClassName.java:41)
	at com.carrotsearch.randomizedtesting.rules.NoShadowingOrOverridesOnMethodsRule$1.evaluate(NoShadowingOrOverridesOnMethodsRule.java:40)
	at com.carrotsearch.randomizedtesting.rules.NoShadowingOrOverridesOnMethodsRule$1.evaluate(NoShadowingOrOverridesOnMethodsRule.java:40)
	at com.carrotsearch.randomizedtesting.rules.StatementAdapter.evaluate(StatementAdapter.java:36)
	at com.carrotsearch.randomizedtesting.rules.StatementAdapter.evaluate(StatementAdapter.java:36)
	at org.apache.lucene.util.TestRuleAssertionsRequired$1.evaluate(TestRuleAssertionsRequired.java:53)
	at org.apache.lucene.util.TestRuleMarkFailure$1.evaluate(TestRuleMarkFailure.java:47)
	at org.apache.lucene.util.TestRuleIgnoreAfterMaxFailures$1.evaluate(TestRuleIgnoreAfterMaxFailures.java:64)
	at org.apache.lucene.util.TestRuleIgnoreTestSuites$1.evaluate(TestRuleIgnoreTestSuites.java:54)
	at com.carrotsearch.randomizedtesting.rules.StatementAdapter.evaluate(StatementAdapter.java:36)
	at com.carrotsearch.randomizedtesting.ThreadLeakControl$StatementRunner.run(ThreadLeakControl.java:368)
	at java.base/java.lang.Thread.run(Thread.java:844)


FAILED:  org.apache.solr.client.solrj.io.stream.StreamExpressionTest.testBasicTextLogitStream

Error Message:
Error from server at https://127.0.0.1:37655/solr: Could not fully create collection: destinationCollection

Stack Trace:
org.apache.solr.client.solrj.impl.HttpSolrClient$RemoteSolrException: Error from server at https://127.0.0.1:37655/solr: Could not fully create collection: destinationCollection
	at __randomizedtesting.SeedInfo.seed([CEDD741A46C18E4E:794A7265DFB07E66]:0)
	at org.apache.solr.client.solrj.impl.HttpSolrClient.executeMethod(HttpSolrClient.java:626)
	at org.apache.solr.client.solrj.impl.HttpSolrClient.request(HttpSolrClient.java:253)
	at org.apache.solr.client.solrj.impl.HttpSolrClient.request(HttpSolrClient.java:242)
	at org.apache.solr.client.solrj.impl.LBHttpSolrClient.doRequest(LBHttpSolrClient.java:483)
	at org.apache.solr.client.solrj.impl.LBHttpSolrClient.request(LBHttpSolrClient.java:413)
	at org.apache.solr.client.solrj.impl.CloudSolrClient.sendRequest(CloudSolrClient.java:1096)
	at org.apache.solr.client.solrj.impl.CloudSolrClient.requestWithRetryOnStaleState(CloudSolrClient.java:875)
	at org.apache.solr.client.solrj.impl.CloudSolrClient.request(CloudSolrClient.java:808)
	at org.apache.solr.client.solrj.SolrRequest.process(SolrRequest.java:178)
	at org.apache.solr.client.solrj.SolrRequest.process(SolrRequest.java:195)
	at org.apache.solr.client.solrj.io.stream.StreamExpressionTest.testBasicTextLogitStream(StreamExpressionTest.java:7806)
	at java.base/jdk.internal.reflect.NativeMethodAccessorImpl.invoke0(Native Method)
	at java.base/jdk.internal.reflect.NativeMethodAccessorImpl.invoke(NativeMethodAccessorImpl.java:62)
	at java.base/jdk.internal.reflect.DelegatingMethodAccessorImpl.invoke(DelegatingMethodAccessorImpl.java:43)
	at java.base/java.lang.reflect.Method.invoke(Method.java:564)
	at com.carrotsearch.randomizedtesting.RandomizedRunner.invoke(RandomizedRunner.java:1737)
	at com.carrotsearch.randomizedtesting.RandomizedRunner$8.evaluate(RandomizedRunner.java:934)
	at com.carrotsearch.randomizedtesting.RandomizedRunner$9.evaluate(RandomizedRunner.java:970)
	at com.carrotsearch.randomizedtesting.RandomizedRunner$10.evaluate(RandomizedRunner.java:984)
	at com.carrotsearch.randomizedtesting.rules.SystemPropertiesRestoreRule$1.evaluate(SystemPropertiesRestoreRule.java:57)
	at org.apache.lucene.util.TestRuleSetupTeardownChained$1.evaluate(TestRuleSetupTeardownChained.java:49)
	at org.apache.lucene.util.AbstractBeforeAfterRule$1.evaluate(AbstractBeforeAfterRule.java:45)
	at org.apache.lucene.util.TestRuleThreadAndTestName$1.evaluate(TestRuleThreadAndTestName.java:48)
	at org.apache.lucene.util.TestRuleIgnoreAfterMaxFailures$1.evaluate(TestRuleIgnoreAfterMaxFailures.java:64)
	at org.apache.lucene.util.TestRuleMarkFailure$1.evaluate(TestRuleMarkFailure.java:47)
	at com.carrotsearch.randomizedtesting.rules.StatementAdapter.evaluate(StatementAdapter.java:36)
	at com.carrotsearch.randomizedtesting.ThreadLeakControl$StatementRunner.run(ThreadLeakControl.java:368)
	at com.carrotsearch.randomizedtesting.ThreadLeakControl.forkTimeoutingTask(ThreadLeakControl.java:817)
	at com.carrotsearch.randomizedtesting.ThreadLeakControl$3.evaluate(ThreadLeakControl.java:468)
	at com.carrotsearch.randomizedtesting.RandomizedRunner.runSingleTest(RandomizedRunner.java:943)
	at com.carrotsearch.randomizedtesting.RandomizedRunner$5.evaluate(RandomizedRunner.java:829)
	at com.carrotsearch.randomizedtesting.RandomizedRunner$6.evaluate(RandomizedRunner.java:879)
	at com.carrotsearch.randomizedtesting.RandomizedRunner$7.evaluate(RandomizedRunner.java:890)
	at com.carrotsearch.randomizedtesting.rules.StatementAdapter.evaluate(StatementAdapter.java:36)
	at com.carrotsearch.randomizedtesting.rules.SystemPropertiesRestoreRule$1.evaluate(SystemPropertiesRestoreRule.java:57)
	at org.apache.lucene.util.AbstractBeforeAfterRule$1.evaluate(AbstractBeforeAfterRule.java:45)
	at com.carrotsearch.randomizedtesting.rules.StatementAdapter.evaluate(StatementAdapter.java:36)
	at org.apache.lucene.util.TestRuleStoreClassName$1.evaluate(TestRuleStoreClassName.java:41)
	at com.carrotsearch.randomizedtesting.rules.NoShadowingOrOverridesOnMethodsRule$1.evaluate(NoShadowingOrOverridesOnMethodsRule.java:40)
	at com.carrotsearch.randomizedtesting.rules.NoShadowingOrOverridesOnMethodsRule$1.evaluate(NoShadowingOrOverridesOnMethodsRule.java:40)
	at com.carrotsearch.randomizedtesting.rules.StatementAdapter.evaluate(StatementAdapter.java:36)
	at com.carrotsearch.randomizedtesting.rules.StatementAdapter.evaluate(StatementAdapter.java:36)
	at org.apache.lucene.util.TestRuleAssertionsRequired$1.evaluate(TestRuleAssertionsRequired.java:53)
	at org.apache.lucene.util.TestRuleMarkFailure$1.evaluate(TestRuleMarkFailure.java:47)
	at org.apache.lucene.util.TestRuleIgnoreAfterMaxFailures$1.evaluate(TestRuleIgnoreAfterMaxFailures.java:64)
	at org.apache.lucene.util.TestRuleIgnoreTestSuites$1.evaluate(TestRuleIgnoreTestSuites.java:54)
	at com.carrotsearch.randomizedtesting.rules.StatementAdapter.evaluate(StatementAdapter.java:36)
	at com.carrotsearch.randomizedtesting.ThreadLeakControl$StatementRunner.run(ThreadLeakControl.java:368)
	at java.base/java.lang.Thread.run(Thread.java:844)


FAILED:  org.apache.solr.client.solrj.io.stream.StreamExpressionTest.testParallelTerminatingDaemonUpdateStream

Error Message:
Error from server at https://127.0.0.1:37655/solr: Could not fully create collection: parallelDestinationCollection1

Stack Trace:
org.apache.solr.client.solrj.impl.HttpSolrClient$RemoteSolrException: Error from server at https://127.0.0.1:37655/solr: Could not fully create collection: parallelDestinationCollection1
	at __randomizedtesting.SeedInfo.seed([CEDD741A46C18E4E:3FB9AC7212AB4150]:0)
	at org.apache.solr.client.solrj.impl.HttpSolrClient.executeMethod(HttpSolrClient.java:626)
	at org.apache.solr.client.solrj.impl.HttpSolrClient.request(HttpSolrClient.java:253)
	at org.apache.solr.client.solrj.impl.HttpSolrClient.request(HttpSolrClient.java:242)
	at org.apache.solr.client.solrj.impl.LBHttpSolrClient.doRequest(LBHttpSolrClient.java:483)
	at org.apache.solr.client.solrj.impl.LBHttpSolrClient.request(LBHttpSolrClient.java:413)
	at org.apache.solr.client.solrj.impl.CloudSolrClient.sendRequest(CloudSolrClient.java:1096)
	at org.apache.solr.client.solrj.impl.CloudSolrClient.requestWithRetryOnStaleState(CloudSolrClient.java:875)
	at org.apache.solr.client.solrj.impl.CloudSolrClient.request(CloudSolrClient.java:808)
	at org.apache.solr.client.solrj.SolrRequest.process(SolrRequest.java:178)
	at org.apache.solr.client.solrj.SolrRequest.process(SolrRequest.java:195)
	at org.apache.solr.client.solrj.io.stream.StreamExpressionTest.testParallelTerminatingDaemonUpdateStream(StreamExpressionTest.java:4327)
	at java.base/jdk.internal.reflect.NativeMethodAccessorImpl.invoke0(Native Method)
	at java.base/jdk.internal.reflect.NativeMethodAccessorImpl.invoke(NativeMethodAccessorImpl.java:62)
	at java.base/jdk.internal.reflect.DelegatingMethodAccessorImpl.invoke(DelegatingMethodAccessorImpl.java:43)
	at java.base/java.lang.reflect.Method.invoke(Method.java:564)
	at com.carrotsearch.randomizedtesting.RandomizedRunner.invoke(RandomizedRunner.java:1737)
	at com.carrotsearch.randomizedtesting.RandomizedRunner$8.evaluate(RandomizedRunner.java:934)
	at com.carrotsearch.randomizedtesting.RandomizedRunner$9.evaluate(RandomizedRunner.java:970)
	at com.carrotsearch.randomizedtesting.RandomizedRunner$10.evaluate(RandomizedRunner.java:984)
	at com.carrotsearch.randomizedtesting.rules.SystemPropertiesRestoreRule$1.evaluate(SystemPropertiesRestoreRule.java:57)
	at org.apache.lucene.util.TestRuleSetupTeardownChained$1.evaluate(TestRuleSetupTeardownChained.java:49)
	at org.apache.lucene.util.AbstractBeforeAfterRule$1.evaluate(AbstractBeforeAfterRule.java:45)
	at org.apache.lucene.util.TestRuleThreadAndTestName$1.evaluate(TestRuleThreadAndTestName.java:48)
	at org.apache.lucene.util.TestRuleIgnoreAfterMaxFailures$1.evaluate(TestRuleIgnoreAfterMaxFailures.java:64)
	at org.apache.lucene.util.TestRuleMarkFailure$1.evaluate(TestRuleMarkFailure.java:47)
	at com.carrotsearch.randomizedtesting.rules.StatementAdapter.evaluate(StatementAdapter.java:36)
	at com.carrotsearch.randomizedtesting.ThreadLeakControl$StatementRunner.run(ThreadLeakControl.java:368)
	at com.carrotsearch.randomizedtesting.ThreadLeakControl.forkTimeoutingTask(ThreadLeakControl.java:817)
	at com.carrotsearch.randomizedtesting.ThreadLeakControl$3.evaluate(ThreadLeakControl.java:468)
	at com.carrotsearch.randomizedtesting.RandomizedRunner.runSingleTest(RandomizedRunner.java:943)
	at com.carrotsearch.randomizedtesting.RandomizedRunner$5.evaluate(RandomizedRunner.java:829)
	at com.carrotsearch.randomizedtesting.RandomizedRunner$6.evaluate(RandomizedRunner.java:879)
	at com.carrotsearch.randomizedtesting.RandomizedRunner$7.evaluate(RandomizedRunner.java:890)
	at com.carrotsearch.randomizedtesting.rules.StatementAdapter.evaluate(StatementAdapter.java:36)
	at com.carrotsearch.randomizedtesting.rules.SystemPropertiesRestoreRule$1.evaluate(SystemPropertiesRestoreRule.java:57)
	at org.apache.lucene.util.AbstractBeforeAfterRule$1.evaluate(AbstractBeforeAfterRule.java:45)
	at com.carrotsearch.randomizedtesting.rules.StatementAdapter.evaluate(StatementAdapter.java:36)
	at org.apache.lucene.util.TestRuleStoreClassName$1.evaluate(TestRuleStoreClassName.java:41)
	at com.carrotsearch.randomizedtesting.rules.NoShadowingOrOverridesOnMethodsRule$1.evaluate(NoShadowingOrOverridesOnMethodsRule.java:40)
	at com.carrotsearch.randomizedtesting.rules.NoShadowingOrOverridesOnMethodsRule$1.evaluate(NoShadowingOrOverridesOnMethodsRule.java:40)
	at com.carrotsearch.randomizedtesting.rules.StatementAdapter.evaluate(StatementAdapter.java:36)
	at com.carrotsearch.randomizedtesting.rules.StatementAdapter.evaluate(StatementAdapter.java:36)
	at org.apache.lucene.util.TestRuleAssertionsRequired$1.evaluate(TestRuleAssertionsRequired.java:53)
	at org.apache.lucene.util.TestRuleMarkFailure$1.evaluate(TestRuleMarkFailure.java:47)
	at org.apache.lucene.util.TestRuleIgnoreAfterMaxFailures$1.evaluate(TestRuleIgnoreAfterMaxFailures.java:64)
	at org.apache.lucene.util.TestRuleIgnoreTestSuites$1.evaluate(TestRuleIgnoreTestSuites.java:54)
	at com.carrotsearch.randomizedtesting.rules.StatementAdapter.evaluate(StatementAdapter.java:36)
	at com.carrotsearch.randomizedtesting.ThreadLeakControl$StatementRunner.run(ThreadLeakControl.java:368)
	at java.base/java.lang.Thread.run(Thread.java:844)


FAILED:  org.apache.solr.client.solrj.io.stream.StreamExpressionTest.testClassifyStream

Error Message:
Error from server at https://127.0.0.1:37655/solr: Could not fully create collection: modelCollection

Stack Trace:
org.apache.solr.client.solrj.impl.HttpSolrClient$RemoteSolrException: Error from server at https://127.0.0.1:37655/solr: Could not fully create collection: modelCollection
	at __randomizedtesting.SeedInfo.seed([CEDD741A46C18E4E:6B95EE227F9997DA]:0)
	at org.apache.solr.client.solrj.impl.HttpSolrClient.executeMethod(HttpSolrClient.java:626)
	at org.apache.solr.client.solrj.impl.HttpSolrClient.request(HttpSolrClient.java:253)
	at org.apache.solr.client.solrj.impl.HttpSolrClient.request(HttpSolrClient.java:242)
	at org.apache.solr.client.solrj.impl.LBHttpSolrClient.doRequest(LBHttpSolrClient.java:483)
	at org.apache.solr.client.solrj.impl.LBHttpSolrClient.request(LBHttpSolrClient.java:413)
	at org.apache.solr.client.solrj.impl.CloudSolrClient.sendRequest(CloudSolrClient.java:1096)
	at org.apache.solr.client.solrj.impl.CloudSolrClient.requestWithRetryOnStaleState(CloudSolrClient.java:875)
	at org.apache.solr.client.solrj.impl.CloudSolrClient.request(CloudSolrClient.java:808)
	at org.apache.solr.client.solrj.SolrRequest.process(SolrRequest.java:178)
	at org.apache.solr.client.solrj.SolrRequest.process(SolrRequest.java:195)
	at org.apache.solr.client.solrj.io.stream.StreamExpressionTest.testClassifyStream(StreamExpressionTest.java:4863)
	at java.base/jdk.internal.reflect.NativeMethodAccessorImpl.invoke0(Native Method)
	at java.base/jdk.internal.reflect.NativeMethodAccessorImpl.invoke(NativeMethodAccessorImpl.java:62)
	at java.base/jdk.internal.reflect.DelegatingMethodAccessorImpl.invoke(DelegatingMethodAccessorImpl.java:43)
	at java.base/java.lang.reflect.Method.invoke(Method.java:564)
	at com.carrotsearch.randomizedtesting.RandomizedRunner.invoke(RandomizedRunner.java:1737)
	at com.carrotsearch.randomizedtesting.RandomizedRunner$8.evaluate(RandomizedRunner.java:934)
	at com.carrotsearch.randomizedtesting.RandomizedRunner$9.evaluate(RandomizedRunner.java:970)
	at com.carrotsearch.randomizedtesting.RandomizedRunner$10.evaluate(RandomizedRunner.java:984)
	at com.carrotsearch.randomizedtesting.rules.SystemPropertiesRestoreRule$1.evaluate(SystemPropertiesRestoreRule.java:57)
	at org.apache.lucene.util.TestRuleSetupTeardownChained$1.evaluate(TestRuleSetupTeardownChained.java:49)
	at org.apache.lucene.util.AbstractBeforeAfterRule$1.evaluate(AbstractBeforeAfterRule.java:45)
	at org.apache.lucene.util.TestRuleThreadAndTestName$1.evaluate(TestRuleThreadAndTestName.java:48)
	at org.apache.lucene.util.TestRuleIgnoreAfterMaxFailures$1.evaluate(TestRuleIgnoreAfterMaxFailures.java:64)
	at org.apache.lucene.util.TestRuleMarkFailure$1.evaluate(TestRuleMarkFailure.java:47)
	at com.carrotsearch.randomizedtesting.rules.StatementAdapter.evaluate(StatementAdapter.java:36)
	at com.carrotsearch.randomizedtesting.ThreadLeakControl$StatementRunner.run(ThreadLeakControl.java:368)
	at com.carrotsearch.randomizedtesting.ThreadLeakControl.forkTimeoutingTask(ThreadLeakControl.java:817)
	at com.carrotsearch.randomizedtesting.ThreadLeakControl$3.evaluate(ThreadLeakControl.java:468)
	at com.carrotsearch.randomizedtesting.RandomizedRunner.runSingleTest(RandomizedRunner.java:943)
	at com.carrotsearch.randomizedtesting.RandomizedRunner$5.evaluate(RandomizedRunner.java:829)
	at com.carrotsearch.randomizedtesting.RandomizedRunner$6.evaluate(RandomizedRunner.java:879)
	at com.carrotsearch.randomizedtesting.RandomizedRunner$7.evaluate(RandomizedRunner.java:890)
	at com.carrotsearch.randomizedtesting.rules.StatementAdapter.evaluate(StatementAdapter.java:36)
	at com.carrotsearch.randomizedtesting.rules.SystemPropertiesRestoreRule$1.evaluate(SystemPropertiesRestoreRule.java:57)
	at org.apache.lucene.util.AbstractBeforeAfterRule$1.evaluate(AbstractBeforeAfterRule.java:45)
	at com.carrotsearch.randomizedtesting.rules.StatementAdapter.evaluate(StatementAdapter.java:36)
	at org.apache.lucene.util.TestRuleStoreClassName$1.evaluate(TestRuleStoreClassName.java:41)
	at com.carrotsearch.randomizedtesting.rules.NoShadowingOrOverridesOnMethodsRule$1.evaluate(NoShadowingOrOverridesOnMethodsRule.java:40)
	at com.carrotsearch.randomizedtesting.rules.NoShadowingOrOverridesOnMethodsRule$1.evaluate(NoShadowingOrOverridesOnMethodsRule.java:40)
	at com.carrotsearch.randomizedtesting.rules.StatementAdapter.evaluate(StatementAdapter.java:36)
	at com.carrotsearch.randomizedtesting.rules.StatementAdapter.evaluate(StatementAdapter.java:36)
	at org.apache.lucene.util.TestRuleAssertionsRequired$1.evaluate(TestRuleAssertionsRequired.java:53)
	at org.apache.lucene.util.TestRuleMarkFailure$1.evaluate(TestRuleMarkFailure.java:47)
	at org.apache.lucene.util.TestRuleIgnoreAfterMaxFailures$1.evaluate(TestRuleIgnoreAfterMaxFailures.java:64)
	at org.apache.lucene.util.TestRuleIgnoreTestSuites$1.evaluate(TestRuleIgnoreTestSuites.java:54)
	at com.carrotsearch.randomizedtesting.rules.StatementAdapter.evaluate(StatementAdapter.java:36)
	at com.carrotsearch.randomizedtesting.ThreadLeakControl$StatementRunner.run(ThreadLeakControl.java:368)
	at java.base/java.lang.Thread.run(Thread.java:844)


FAILED:  org.apache.solr.client.solrj.io.stream.StreamExpressionTest.testFeaturesSelectionStream

Error Message:
Error from server at https://127.0.0.1:37655/solr: Could not fully create collection: destinationCollection

Stack Trace:
org.apache.solr.client.solrj.impl.HttpSolrClient$RemoteSolrException: Error from server at https://127.0.0.1:37655/solr: Could not fully create collection: destinationCollection
	at __randomizedtesting.SeedInfo.seed([CEDD741A46C18E4E:A55FF80D26A7FE28]:0)
	at org.apache.solr.client.solrj.impl.HttpSolrClient.executeMethod(HttpSolrClient.java:626)
	at org.apache.solr.client.solrj.impl.HttpSolrClient.request(HttpSolrClient.java:253)
	at org.apache.solr.client.solrj.impl.HttpSolrClient.request(HttpSolrClient.java:242)
	at org.apache.solr.client.solrj.impl.LBHttpSolrClient.doRequest(LBHttpSolrClient.java:483)
	at org.apache.solr.client.solrj.impl.LBHttpSolrClient.request(LBHttpSolrClient.java:413)
	at org.apache.solr.client.solrj.impl.CloudSolrClient.sendRequest(CloudSolrClient.java:1096)
	at org.apache.solr.client.solrj.impl.CloudSolrClient.requestWithRetryOnStaleState(CloudSolrClient.java:875)
	at org.apache.solr.client.solrj.impl.CloudSolrClient.request(CloudSolrClient.java:808)
	at org.apache.solr.client.solrj.SolrRequest.process(SolrRequest.java:178)
	at org.apache.solr.client.solrj.SolrRequest.process(SolrRequest.java:195)
	at org.apache.solr.client.solrj.io.stream.StreamExpressionTest.testFeaturesSelectionStream(StreamExpressionTest.java:7978)
	at java.base/jdk.internal.reflect.NativeMethodAccessorImpl.invoke0(Native Method)
	at java.base/jdk.internal.reflect.NativeMethodAccessorImpl.invoke(NativeMethodAccessorImpl.java:62)
	at java.base/jdk.internal.reflect.DelegatingMethodAccessorImpl.invoke(DelegatingMethodAccessorImpl.java:43)
	at java.base/java.lang.reflect.Method.invoke(Method.java:564)
	at com.carrotsearch.randomizedtesting.RandomizedRunner.invoke(RandomizedRunner.java:1737)
	at com.carrotsearch.randomizedtesting.RandomizedRunner$8.evaluate(RandomizedRunner.java:934)
	at com.carrotsearch.randomizedtesting.RandomizedRunner$9.evaluate(RandomizedRunner.java:970)
	at com.carrotsearch.randomizedtesting.RandomizedRunner$10.evaluate(RandomizedRunner.java:984)
	at com.carrotsearch.randomizedtesting.rules.SystemPropertiesRestoreRule$1.evaluate(SystemPropertiesRestoreRule.java:57)
	at org.apache.lucene.util.TestRuleSetupTeardownChained$1.evaluate(TestRuleSetupTeardownChained.java:49)
	at org.apache.lucene.util.AbstractBeforeAfterRule$1.evaluate(AbstractBeforeAfterRule.java:45)
	at org.apache.lucene.util.TestRuleThreadAndTestName$1.evaluate(TestRuleThreadAndTestName.java:48)
	at org.apache.lucene.util.TestRuleIgnoreAfterMaxFailures$1.evaluate(TestRuleIgnoreAfterMaxFailures.java:64)
	at org.apache.lucene.util.TestRuleMarkFailure$1.evaluate(TestRuleMarkFailure.java:47)
	at com.carrotsearch.randomizedtesting.rules.StatementAdapter.evaluate(StatementAdapter.java:36)
	at com.carrotsearch.randomizedtesting.ThreadLeakControl$StatementRunner.run(ThreadLeakControl.java:368)
	at com.carrotsearch.randomizedtesting.ThreadLeakControl.forkTimeoutingTask(ThreadLeakControl.java:817)
	at com.carrotsearch.randomizedtesting.ThreadLeakControl$3.evaluate(ThreadLeakControl.java:468)
	at com.carrotsearch.randomizedtesting.RandomizedRunner.runSingleTest(RandomizedRunner.java:943)
	at com.carrotsearch.randomizedtesting.RandomizedRunner$5.evaluate(RandomizedRunner.java:829)
	at com.carrotsearch.randomizedtesting.RandomizedRunner$6.evaluate(RandomizedRunner.java:879)
	at com.carrotsearch.randomizedtesting.RandomizedRunner$7.evaluate(RandomizedRunner.java:890)
	at com.carrotsearch.randomizedtesting.rules.StatementAdapter.evaluate(StatementAdapter.java:36)
	at com.carrotsearch.randomizedtesting.rules.SystemPropertiesRestoreRule$1.evaluate(SystemPropertiesRestoreRule.java:57)
	at org.apache.lucene.util.AbstractBeforeAfterRule$1.evaluate(AbstractBeforeAfterRule.java:45)
	at com.carrotsearch.randomizedtesting.rules.StatementAdapter.evaluate(StatementAdapter.java:36)
	at org.apache.lucene.util.TestRuleStoreClassName$1.evaluate(TestRuleStoreClassName.java:41)
	at com.carrotsearch.randomizedtesting.rules.NoShadowingOrOverridesOnMethodsRule$1.evaluate(NoShadowingOrOverridesOnMethodsRule.java:40)
	at com.carrotsearch.randomizedtesting.rules.NoShadowingOrOverridesOnMethodsRule$1.evaluate(NoShadowingOrOverridesOnMethodsRule.java:40)
	at com.carrotsearch.randomizedtesting.rules.StatementAdapter.evaluate(StatementAdapter.java:36)
	at com.carrotsearch.randomizedtesting.rules.StatementAdapter.evaluate(StatementAdapter.java:36)
	at org.apache.lucene.util.TestRuleAssertionsRequired$1.evaluate(TestRuleAssertionsRequired.java:53)
	at org.apache.lucene.util.TestRuleMarkFailure$1.evaluate(TestRuleMarkFailure.java:47)
	at org.apache.lucene.util.TestRuleIgnoreAfterMaxFailures$1.evaluate(TestRuleIgnoreAfterMaxFailures.java:64)
	at org.apache.lucene.util.TestRuleIgnoreTestSuites$1.evaluate(TestRuleIgnoreTestSuites.java:54)
	at com.carrotsearch.randomizedtesting.rules.StatementAdapter.evaluate(StatementAdapter.java:36)
	at com.carrotsearch.randomizedtesting.ThreadLeakControl$StatementRunner.run(ThreadLeakControl.java:368)
	at java.base/java.lang.Thread.run(Thread.java:844)




Build Log:
[...truncated 12708 lines...]
   [junit4] Suite: org.apache.solr.cloud.TestCloudPivotFacet
   [junit4]   2> Creating dataDir: /home/jenkins/workspace/Lucene-Solr-7.x-Linux/solr/build/solr-core/test/J1/temp/solr.cloud.TestCloudPivotFacet_60CA92FFEB0778F3-001/init-core-data-001
   [junit4]   2> 886676 WARN  (SUITE-TestCloudPivotFacet-seed#[60CA92FFEB0778F3]-worker) [    ] o.a.s.SolrTestCaseJ4 startTrackingSearchers: numOpens=68 numCloses=68
   [junit4]   2> 886676 INFO  (SUITE-TestCloudPivotFacet-seed#[60CA92FFEB0778F3]-worker) [    ] o.a.s.SolrTestCaseJ4 Using PointFields (NUMERIC_POINTS_SYSPROP=true) w/NUMERIC_DOCVALUES_SYSPROP=false
   [junit4]   2> 886677 INFO  (SUITE-TestCloudPivotFacet-seed#[60CA92FFEB0778F3]-worker) [    ] o.a.s.SolrTestCaseJ4 Randomized ssl (false) and clientAuth (false) via: @org.apache.solr.SolrTestCaseJ4$SuppressSSL(bugUrl="None")
   [junit4]   2> 886677 INFO  (SUITE-TestCloudPivotFacet-seed#[60CA92FFEB0778F3]-worker) [    ] o.a.s.SolrTestCaseJ4 SecureRandom sanity checks: test.solr.allowed.securerandom=null & java.security.egd=file:/dev/./urandom
   [junit4]   2> 886677 INFO  (SUITE-TestCloudPivotFacet-seed#[60CA92FFEB0778F3]-worker) [    ] o.a.s.BaseDistributedSearchTestCase Setting hostContext system property: /kt_/n
   [junit4]   2> 886677 INFO  (SUITE-TestCloudPivotFacet-seed#[60CA92FFEB0778F3]-worker) [    ] o.a.s.c.TestCloudPivotFacet init'ing useFieldRandomizedFactor = 2
   [junit4]   2> 886679 INFO  (TEST-TestCloudPivotFacet.test-seed#[60CA92FFEB0778F3]) [    ] o.a.s.c.ZkTestServer STARTING ZK TEST SERVER
   [junit4]   2> 886682 INFO  (Thread-2062) [    ] o.a.s.c.ZkTestServer client port:0.0.0.0/0.0.0.0:0
   [junit4]   2> 886682 INFO  (Thread-2062) [    ] o.a.s.c.ZkTestServer Starting server
   [junit4]   2> 886690 ERROR (Thread-2062) [    ] o.a.z.s.ZooKeeperServer ZKShutdownHandler is not registered, so ZooKeeper server won't take any action on ERROR or SHUTDOWN server state changes
   [junit4]   2> 886782 INFO  (TEST-TestCloudPivotFacet.test-seed#[60CA92FFEB0778F3]) [    ] o.a.s.c.ZkTestServer start zk server on port:37745
   [junit4]   2> 886785 WARN  (NIOServerCxn.Factory:0.0.0.0/0.0.0.0:0) [    ] o.a.z.s.NIOServerCnxn caught end of stream exception
   [junit4]   2> EndOfStreamException: Unable to read additional data from client sessionid 0x15f6f3e634b0000, likely client has closed socket
   [junit4]   2> 	at org.apache.zookeeper.server.NIOServerCnxn.doIO(NIOServerCnxn.java:239)
   [junit4]   2> 	at org.apache.zookeeper.server.NIOServerCnxnFactory.run(NIOServerCnxnFactory.java:203)
   [junit4]   2> 	at java.base/java.lang.Thread.run(Thread.java:844)
   [junit4]   2> 886789 INFO  (TEST-TestCloudPivotFacet.test-seed#[60CA92FFEB0778F3]) [    ] o.a.s.c.AbstractZkTestCase put /home/jenkins/workspace/Lucene-Solr-7.x-Linux/solr/core/src/test-files/solr/collection1/conf/solrconfig-tlog.xml to /configs/conf1/solrconfig.xml
   [junit4]   2> 886790 INFO  (TEST-TestCloudPivotFacet.test-seed#[60CA92FFEB0778F3]) [    ] o.a.s.c.AbstractZkTestCase put /home/jenkins/workspace/Lucene-Solr-7.x-Linux/solr/core/src/test-files/solr/collection1/conf/schema.xml to /configs/conf1/schema.xml
   [junit4]   2> 886791 INFO  (TEST-TestCloudPivotFacet.test-seed#[60CA92FFEB0778F3]) [    ] o.a.s.c.AbstractZkTestCase put /home/jenkins/workspace/Lucene-Solr-7.x-Linux/solr/core/src/test-files/solr/collection1/conf/solrconfig.snippet.randomindexconfig.xml to /configs/conf1/solrconfig.snippet.randomindexconfig.xml
   [junit4]   2> 886791 INFO  (TEST-TestCloudPivotFacet.test-seed#[60CA92FFEB0778F3]) [    ] o.a.s.c.AbstractZkTestCase put /home/jenkins/workspace/Lucene-Solr-7.x-Linux/solr/core/src/test-files/solr/collection1/conf/stopwords.txt to /configs/conf1/stopwords.txt
   [junit4]   2> 886792 INFO  (TEST-TestCloudPivotFacet.test-seed#[60CA92FFEB0778F3]) [    ] o.a.s.c.AbstractZkTestCase put /home/jenkins/workspace/Lucene-Solr-7.x-Linux/solr/core/src/test-files/solr/collection1/conf/protwords.txt to /configs/conf1/protwords.txt
   [junit4]   2> 886792 INFO  (TEST-TestCloudPivotFacet.test-seed#[60CA92FFEB0778F3]) [    ] o.a.s.c.AbstractZkTestCase put /home/jenkins/workspace/Lucene-Solr-7.x-Linux/solr/core/src/test-files/solr/collection1/conf/currency.xml to /configs/conf1/currency.xml
   [junit4]   2> 886793 INFO  (TEST-TestCloudPivotFacet.test-seed#[60CA92FFEB0778F3]) [    ] o.a.s.c.AbstractZkTestCase put /home/jenkins/workspace/Lucene-Solr-7.x-Linux/solr/core/src/test-files/solr/collection1/conf/enumsConfig.xml to /configs/conf1/enumsConfig.xml
   [junit4]   2> 886793 INFO  (TEST-TestCloudPivotFacet.test-seed#[60CA92FFEB0778F3]) [    ] o.a.s.c.AbstractZkTestCase put /home/jenkins/workspace/Lucene-Solr-7.x-Linux/solr/core/src/test-files/solr/collection1/conf/open-exchange-rates.json to /configs/conf1/open-exchange-rates.json
   [junit4]   2> 886794 INFO  (TEST-TestCloudPivotFacet.test-seed#[60CA92FFEB0778F3]) [    ] o.a.s.c.AbstractZkTestCase put /home/jenkins/workspace/Lucene-Solr-7.x-Linux/solr/core/src/test-files/solr/collection1/conf/mapping-ISOLatin1Accent.txt to /configs/conf1/mapping-ISOLatin1Accent.txt
   [junit4]   2> 886795 INFO  (TEST-TestCloudPivotFacet.test-seed#[60CA92FFEB0778F3]) [    ] o.a.s.c.AbstractZkTestCase put /home/jenkins/workspace/Lucene-Solr-7.x-Linux/solr/core/src/test-files/solr/collection1/conf/o

[...truncated too long message...]

9/java.util.concurrent.ThreadPoolExecutor.runWorker(ThreadPoolExecutor.java:1152)
   [junit4]    >         at java.base@9/java.util.concurrent.ThreadPoolExecutor$Worker.run(ThreadPoolExecutor.java:641)
   [junit4]    >         at java.base@9/java.lang.Thread.run(Thread.java:844)
   [junit4]    > 	at __randomizedtesting.SeedInfo.seed([CEDD741A46C18E4E]:0)Throwable #2: com.carrotsearch.randomizedtesting.ThreadLeakError: There are still zombie threads that couldn't be terminated:
   [junit4]    >    1) Thread[id=2457, name=zkCallback-261-thread-6, state=TIMED_WAITING, group=TGRP-StreamExpressionTest]
   [junit4]    >         at java.base@9/jdk.internal.misc.Unsafe.park(Native Method)
   [junit4]    >         at java.base@9/java.util.concurrent.locks.LockSupport.parkNanos(LockSupport.java:234)
   [junit4]    >         at java.base@9/java.util.concurrent.SynchronousQueue$TransferStack.awaitFulfill(SynchronousQueue.java:462)
   [junit4]    >         at java.base@9/java.util.concurrent.SynchronousQueue$TransferStack.transfer(SynchronousQueue.java:361)
   [junit4]    >         at java.base@9/java.util.concurrent.SynchronousQueue.poll(SynchronousQueue.java:937)
   [junit4]    >         at java.base@9/java.util.concurrent.ThreadPoolExecutor.getTask(ThreadPoolExecutor.java:1091)
   [junit4]    >         at java.base@9/java.util.concurrent.ThreadPoolExecutor.runWorker(ThreadPoolExecutor.java:1152)
   [junit4]    >         at java.base@9/java.util.concurrent.ThreadPoolExecutor$Worker.run(ThreadPoolExecutor.java:641)
   [junit4]    >         at java.base@9/java.lang.Thread.run(Thread.java:844)
   [junit4]    >    2) Thread[id=753, name=TEST-StreamExpressionTest.testParallelExecutorStream-seed#[CEDD741A46C18E4E]-SendThread(127.0.0.1:36549), state=TIMED_WAITING, group=TGRP-StreamExpressionTest]
   [junit4]    >         at java.base@9/java.lang.Thread.sleep(Native Method)
   [junit4]    >         at app//org.apache.zookeeper.ClientCnxn$SendThread.run(ClientCnxn.java:1051)
   [junit4]    >    3) Thread[id=2438, name=zkCallback-261-thread-4, state=TIMED_WAITING, group=TGRP-StreamExpressionTest]
   [junit4]    >         at java.base@9/jdk.internal.misc.Unsafe.park(Native Method)
   [junit4]    >         at java.base@9/java.util.concurrent.locks.LockSupport.parkNanos(LockSupport.java:234)
   [junit4]    >         at java.base@9/java.util.concurrent.SynchronousQueue$TransferStack.awaitFulfill(SynchronousQueue.java:462)
   [junit4]    >         at java.base@9/java.util.concurrent.SynchronousQueue$TransferStack.transfer(SynchronousQueue.java:361)
   [junit4]    >         at java.base@9/java.util.concurrent.SynchronousQueue.poll(SynchronousQueue.java:937)
   [junit4]    >         at java.base@9/java.util.concurrent.ThreadPoolExecutor.getTask(ThreadPoolExecutor.java:1091)
   [junit4]    >         at java.base@9/java.util.concurrent.ThreadPoolExecutor.runWorker(ThreadPoolExecutor.java:1152)
   [junit4]    >         at java.base@9/java.util.concurrent.ThreadPoolExecutor$Worker.run(ThreadPoolExecutor.java:641)
   [junit4]    >         at java.base@9/java.lang.Thread.run(Thread.java:844)
   [junit4]    >    4) Thread[id=2458, name=zkCallback-261-thread-7, state=TIMED_WAITING, group=TGRP-StreamExpressionTest]
   [junit4]    >         at java.base@9/jdk.internal.misc.Unsafe.park(Native Method)
   [junit4]    >         at java.base@9/java.util.concurrent.locks.LockSupport.parkNanos(LockSupport.java:234)
   [junit4]    >         at java.base@9/java.util.concurrent.SynchronousQueue$TransferStack.awaitFulfill(SynchronousQueue.java:462)
   [junit4]    >         at java.base@9/java.util.concurrent.SynchronousQueue$TransferStack.transfer(SynchronousQueue.java:361)
   [junit4]    >         at java.base@9/java.util.concurrent.SynchronousQueue.poll(SynchronousQueue.java:937)
   [junit4]    >         at java.base@9/java.util.concurrent.ThreadPoolExecutor.getTask(ThreadPoolExecutor.java:1091)
   [junit4]    >         at java.base@9/java.util.concurrent.ThreadPoolExecutor.runWorker(ThreadPoolExecutor.java:1152)
   [junit4]    >         at java.base@9/java.util.concurrent.ThreadPoolExecutor$Worker.run(ThreadPoolExecutor.java:641)
   [junit4]    >         at java.base@9/java.lang.Thread.run(Thread.java:844)
   [junit4]    >    5) Thread[id=2456, name=zkCallback-261-thread-5, state=TIMED_WAITING, group=TGRP-StreamExpressionTest]
   [junit4]    >         at java.base@9/jdk.internal.misc.Unsafe.park(Native Method)
   [junit4]    >         at java.base@9/java.util.concurrent.locks.LockSupport.parkNanos(LockSupport.java:234)
   [junit4]    >         at java.base@9/java.util.concurrent.SynchronousQueue$TransferStack.awaitFulfill(SynchronousQueue.java:462)
   [junit4]    >         at java.base@9/java.util.concurrent.SynchronousQueue$TransferStack.transfer(SynchronousQueue.java:361)
   [junit4]    >         at java.base@9/java.util.concurrent.SynchronousQueue.poll(SynchronousQueue.java:937)
   [junit4]    >         at java.base@9/java.util.concurrent.ThreadPoolExecutor.getTask(ThreadPoolExecutor.java:1091)
   [junit4]    >         at java.base@9/java.util.concurrent.ThreadPoolExecutor.runWorker(ThreadPoolExecutor.java:1152)
   [junit4]    >         at java.base@9/java.util.concurrent.ThreadPoolExecutor$Worker.run(ThreadPoolExecutor.java:641)
   [junit4]    >         at java.base@9/java.lang.Thread.run(Thread.java:844)
   [junit4]    > 	at __randomizedtesting.SeedInfo.seed([CEDD741A46C18E4E]:0)
   [junit4] Completed [128/146 (1!)] on J0 in 355.50s, 124 tests, 1 failure, 10 errors <<< FAILURES!

[...truncated 2220 lines...]
   [junit4] Suite: org.apache.solr.analytics.facet.PivotFacetTest
   [junit4]   2> Creating dataDir: /home/jenkins/workspace/Lucene-Solr-7.x-Linux/solr/build/contrib/solr-analytics/test/J2/temp/solr.analytics.facet.PivotFacetTest_FACB4F65958E77DC-001/init-core-data-001
   [junit4]   2> NOTE: test params are: codec=CheapBastard, sim=RandomSimilarity(queryNorm=true): {}, locale=en-NG, timezone=Africa/Lagos
   [junit4]   2> NOTE: Linux 4.10.0-37-generic amd64/Oracle Corporation 9 (64-bit)/cpus=8,threads=1,free=122031440,total=536870912
   [junit4]   2> NOTE: All tests run in this JVM: [CastingDateValueStreamTest, CastingAnalyticsValueTest, StringFieldsTest, AndFunctionTest, RoundFunctionTest, ConcatFunctionTest, FloatFieldsTest, MultFunctionTest, LTEFunctionTest, DivideFunctionTest, TopFunctionTest, ConstantValueTest, LegacyQueryFacetTest, ExpressionFactoryTest, NoFacetTest, PivotFacetTest]
   [junit4]   2> NOTE: reproduce with: ant test  -Dtestcase=PivotFacetTest -Dtests.seed=FACB4F65958E77DC -Dtests.multiplier=3 -Dtests.slow=true -Dtests.locale=en-NG -Dtests.timezone=Africa/Lagos -Dtests.asserts=true -Dtests.file.encoding=UTF-8
   [junit4] ERROR   0.00s J2 | PivotFacetTest (suite) <<<
   [junit4]    > Throwable #1: java.lang.RuntimeException: org.apache.solr.common.SolrException: http://127.0.0.1:36005/solr/collection1_shard2_replica_n2/
   [junit4]    > 	at __randomizedtesting.SeedInfo.seed([FACB4F65958E77DC]:0)
   [junit4]    > 	at org.apache.solr.analytics.SolrAnalyticsTestCase.commitDocs(SolrAnalyticsTestCase.java:91)
   [junit4]    > 	at org.apache.solr.analytics.facet.PivotFacetTest.populate(PivotFacetTest.java:78)
   [junit4]    > 	at java.base/jdk.internal.reflect.NativeMethodAccessorImpl.invoke0(Native Method)
   [junit4]    > 	at java.base/jdk.internal.reflect.NativeMethodAccessorImpl.invoke(NativeMethodAccessorImpl.java:62)
   [junit4]    > 	at java.base/jdk.internal.reflect.DelegatingMethodAccessorImpl.invoke(DelegatingMethodAccessorImpl.java:43)
   [junit4]    > 	at java.base/java.lang.reflect.Method.invoke(Method.java:564)
   [junit4]    > 	at java.base/java.lang.Thread.run(Thread.java:844)
   [junit4]    > Caused by: org.apache.solr.common.SolrException: http://127.0.0.1:36005/solr/collection1_shard2_replica_n2/
   [junit4]    > 	at org.apache.solr.client.solrj.impl.CloudSolrClient.directUpdate(CloudSolrClient.java:589)
   [junit4]    > 	at org.apache.solr.client.solrj.impl.CloudSolrClient.sendRequest(CloudSolrClient.java:1008)
   [junit4]    > 	at org.apache.solr.client.solrj.impl.CloudSolrClient.requestWithRetryOnStaleState(CloudSolrClient.java:875)
   [junit4]    > 	at org.apache.solr.client.solrj.impl.CloudSolrClient.request(CloudSolrClient.java:808)
   [junit4]    > 	at org.apache.solr.client.solrj.SolrRequest.process(SolrRequest.java:178)
   [junit4]    > 	at org.apache.solr.client.solrj.request.UpdateRequest.commit(UpdateRequest.java:233)
   [junit4]    > 	at org.apache.solr.analytics.SolrAnalyticsTestCase.commitDocs(SolrAnalyticsTestCase.java:89)
   [junit4]    > 	... 24 more
   [junit4]    > Caused by: org.apache.solr.client.solrj.impl.HttpSolrClient$RemoteSolrException: Error from server at http://127.0.0.1:36005/solr/collection1_shard2_replica_n2: Expected mime type application/octet-stream but got application/json. {
   [junit4]    >   "error":{
   [junit4]    >     "metadata":[
   [junit4]    >       "error-class","org.apache.solr.common.SolrException",
   [junit4]    >       "root-error-class","org.apache.solr.common.SolrException"],
   [junit4]    >     "msg":"URLDecoder: Invalid digit (i) in escape (%) pattern",
   [junit4]    >     "code":400}}
   [junit4]    > 	at org.apache.solr.client.solrj.impl.HttpSolrClient.executeMethod(HttpSolrClient.java:590)
   [junit4]    > 	at org.apache.solr.client.solrj.impl.HttpSolrClient.request(HttpSolrClient.java:253)
   [junit4]    > 	at org.apache.solr.client.solrj.impl.HttpSolrClient.request(HttpSolrClient.java:242)
   [junit4]    > 	at org.apache.solr.client.solrj.impl.LBHttpSolrClient.doRequest(LBHttpSolrClient.java:483)
   [junit4]    > 	at org.apache.solr.client.solrj.impl.LBHttpSolrClient.request(LBHttpSolrClient.java:413)
   [junit4]    > 	at org.apache.solr.client.solrj.impl.CloudSolrClient.directUpdate(CloudSolrClient.java:586)
   [junit4]    > 	... 30 more
   [junit4] Completed [78/78 (1!)] on J2 in 129.19s, 0 tests, 1 error <<< FAILURES!

[...truncated 37050 lines...]

Mime
View raw message