lucene-dev mailing list archives

Site index · List index
Message view « Date » · « Thread »
Top « Date » · « Thread »
From Policeman Jenkins Server <jenk...@thetaphi.de>
Subject [JENKINS] Lucene-Solr-5.5-Windows (32bit/jdk1.8.0_144) - Build # 146 - Unstable!
Date Thu, 19 Oct 2017 22:09:19 GMT
Build: https://jenkins.thetaphi.de/job/Lucene-Solr-5.5-Windows/146/
Java: 32bit/jdk1.8.0_144 -client -XX:+UseSerialGC

2 tests failed.
FAILED:  junit.framework.TestSuite.org.apache.solr.schema.TestManagedSchemaAPI

Error Message:
ObjectTracker found 8 object(s) that were not released!!! [MockDirectoryWrapper, MDCAwareThreadPoolExecutor, MockDirectoryWrapper, TransactionLog, MockDirectoryWrapper, MDCAwareThreadPoolExecutor, TransactionLog, MockDirectoryWrapper]

Stack Trace:
java.lang.AssertionError: ObjectTracker found 8 object(s) that were not released!!! [MockDirectoryWrapper, MDCAwareThreadPoolExecutor, MockDirectoryWrapper, TransactionLog, MockDirectoryWrapper, MDCAwareThreadPoolExecutor, TransactionLog, MockDirectoryWrapper]
	at __randomizedtesting.SeedInfo.seed([C9178EAC76EBE3B1]:0)
	at org.junit.Assert.fail(Assert.java:93)
	at org.junit.Assert.assertTrue(Assert.java:43)
	at org.junit.Assert.assertNull(Assert.java:551)
	at org.apache.solr.SolrTestCaseJ4.afterClass(SolrTestCaseJ4.java:238)
	at sun.reflect.GeneratedMethodAccessor37.invoke(Unknown Source)
	at sun.reflect.DelegatingMethodAccessorImpl.invoke(DelegatingMethodAccessorImpl.java:43)
	at java.lang.reflect.Method.invoke(Method.java:498)
	at com.carrotsearch.randomizedtesting.RandomizedRunner.invoke(RandomizedRunner.java:1764)
	at com.carrotsearch.randomizedtesting.RandomizedRunner$7.evaluate(RandomizedRunner.java:834)
	at com.carrotsearch.randomizedtesting.rules.StatementAdapter.evaluate(StatementAdapter.java:36)
	at com.carrotsearch.randomizedtesting.rules.SystemPropertiesRestoreRule$1.evaluate(SystemPropertiesRestoreRule.java:57)
	at org.apache.lucene.util.AbstractBeforeAfterRule$1.evaluate(AbstractBeforeAfterRule.java:45)
	at com.carrotsearch.randomizedtesting.rules.StatementAdapter.evaluate(StatementAdapter.java:36)
	at org.apache.lucene.util.TestRuleStoreClassName$1.evaluate(TestRuleStoreClassName.java:41)
	at com.carrotsearch.randomizedtesting.rules.NoShadowingOrOverridesOnMethodsRule$1.evaluate(NoShadowingOrOverridesOnMethodsRule.java:40)
	at com.carrotsearch.randomizedtesting.rules.NoShadowingOrOverridesOnMethodsRule$1.evaluate(NoShadowingOrOverridesOnMethodsRule.java:40)
	at com.carrotsearch.randomizedtesting.rules.StatementAdapter.evaluate(StatementAdapter.java:36)
	at com.carrotsearch.randomizedtesting.rules.StatementAdapter.evaluate(StatementAdapter.java:36)
	at com.carrotsearch.randomizedtesting.rules.StatementAdapter.evaluate(StatementAdapter.java:36)
	at org.apache.lucene.util.TestRuleAssertionsRequired$1.evaluate(TestRuleAssertionsRequired.java:53)
	at org.apache.lucene.util.TestRuleMarkFailure$1.evaluate(TestRuleMarkFailure.java:47)
	at org.apache.lucene.util.TestRuleIgnoreAfterMaxFailures$1.evaluate(TestRuleIgnoreAfterMaxFailures.java:64)
	at org.apache.lucene.util.TestRuleIgnoreTestSuites$1.evaluate(TestRuleIgnoreTestSuites.java:54)
	at com.carrotsearch.randomizedtesting.rules.StatementAdapter.evaluate(StatementAdapter.java:36)
	at com.carrotsearch.randomizedtesting.ThreadLeakControl$StatementRunner.run(ThreadLeakControl.java:367)
	at java.lang.Thread.run(Thread.java:748)


FAILED:  junit.framework.TestSuite.org.apache.solr.schema.TestManagedSchemaAPI

Error Message:
Could not remove the following files (in the order of attempts):    C:\Users\jenkins\workspace\Lucene-Solr-5.5-Windows\solr\build\solr-core\test\J1\temp\solr.schema.TestManagedSchemaAPI_C9178EAC76EBE3B1-001\tempDir-001\node1\testschemaapi_shard1_replica1\data\tlog\tlog.0000000000000000000: java.nio.file.FileSystemException: C:\Users\jenkins\workspace\Lucene-Solr-5.5-Windows\solr\build\solr-core\test\J1\temp\solr.schema.TestManagedSchemaAPI_C9178EAC76EBE3B1-001\tempDir-001\node1\testschemaapi_shard1_replica1\data\tlog\tlog.0000000000000000000: The process cannot access the file because it is being used by another process.     C:\Users\jenkins\workspace\Lucene-Solr-5.5-Windows\solr\build\solr-core\test\J1\temp\solr.schema.TestManagedSchemaAPI_C9178EAC76EBE3B1-001\tempDir-001\node1\testschemaapi_shard1_replica1\data\tlog: java.nio.file.DirectoryNotEmptyException: C:\Users\jenkins\workspace\Lucene-Solr-5.5-Windows\solr\build\solr-core\test\J1\temp\solr.schema.TestManagedSchemaAPI_C9178EAC76EBE3B1-001\tempDir-001\node1\testschemaapi_shard1_replica1\data\tlog    C:\Users\jenkins\workspace\Lucene-Solr-5.5-Windows\solr\build\solr-core\test\J1\temp\solr.schema.TestManagedSchemaAPI_C9178EAC76EBE3B1-001\tempDir-001\node1\testschemaapi_shard1_replica1\data: java.nio.file.DirectoryNotEmptyException: C:\Users\jenkins\workspace\Lucene-Solr-5.5-Windows\solr\build\solr-core\test\J1\temp\solr.schema.TestManagedSchemaAPI_C9178EAC76EBE3B1-001\tempDir-001\node1\testschemaapi_shard1_replica1\data    C:\Users\jenkins\workspace\Lucene-Solr-5.5-Windows\solr\build\solr-core\test\J1\temp\solr.schema.TestManagedSchemaAPI_C9178EAC76EBE3B1-001\tempDir-001\node1\testschemaapi_shard1_replica1: java.nio.file.DirectoryNotEmptyException: C:\Users\jenkins\workspace\Lucene-Solr-5.5-Windows\solr\build\solr-core\test\J1\temp\solr.schema.TestManagedSchemaAPI_C9178EAC76EBE3B1-001\tempDir-001\node1\testschemaapi_shard1_replica1    C:\Users\jenkins\workspace\Lucene-Solr-5.5-Windows\solr\build\solr-core\test\J1\temp\solr.schema.TestManagedSchemaAPI_C9178EAC76EBE3B1-001\tempDir-001\node1: java.nio.file.DirectoryNotEmptyException: C:\Users\jenkins\workspace\Lucene-Solr-5.5-Windows\solr\build\solr-core\test\J1\temp\solr.schema.TestManagedSchemaAPI_C9178EAC76EBE3B1-001\tempDir-001\node1    C:\Users\jenkins\workspace\Lucene-Solr-5.5-Windows\solr\build\solr-core\test\J1\temp\solr.schema.TestManagedSchemaAPI_C9178EAC76EBE3B1-001\tempDir-001\node2\testschemaapi_shard1_replica2\data\tlog\tlog.0000000000000000001: java.nio.file.FileSystemException: C:\Users\jenkins\workspace\Lucene-Solr-5.5-Windows\solr\build\solr-core\test\J1\temp\solr.schema.TestManagedSchemaAPI_C9178EAC76EBE3B1-001\tempDir-001\node2\testschemaapi_shard1_replica2\data\tlog\tlog.0000000000000000001: The process cannot access the file because it is being used by another process.     C:\Users\jenkins\workspace\Lucene-Solr-5.5-Windows\solr\build\solr-core\test\J1\temp\solr.schema.TestManagedSchemaAPI_C9178EAC76EBE3B1-001\tempDir-001\node2\testschemaapi_shard1_replica2\data\tlog: java.nio.file.DirectoryNotEmptyException: C:\Users\jenkins\workspace\Lucene-Solr-5.5-Windows\solr\build\solr-core\test\J1\temp\solr.schema.TestManagedSchemaAPI_C9178EAC76EBE3B1-001\tempDir-001\node2\testschemaapi_shard1_replica2\data\tlog    C:\Users\jenkins\workspace\Lucene-Solr-5.5-Windows\solr\build\solr-core\test\J1\temp\solr.schema.TestManagedSchemaAPI_C9178EAC76EBE3B1-001\tempDir-001\node2\testschemaapi_shard1_replica2\data: java.nio.file.DirectoryNotEmptyException: C:\Users\jenkins\workspace\Lucene-Solr-5.5-Windows\solr\build\solr-core\test\J1\temp\solr.schema.TestManagedSchemaAPI_C9178EAC76EBE3B1-001\tempDir-001\node2\testschemaapi_shard1_replica2\data    C:\Users\jenkins\workspace\Lucene-Solr-5.5-Windows\solr\build\solr-core\test\J1\temp\solr.schema.TestManagedSchemaAPI_C9178EAC76EBE3B1-001\tempDir-001\node2\testschemaapi_shard1_replica2: java.nio.file.DirectoryNotEmptyException: C:\Users\jenkins\workspace\Lucene-Solr-5.5-Windows\solr\build\solr-core\test\J1\temp\solr.schema.TestManagedSchemaAPI_C9178EAC76EBE3B1-001\tempDir-001\node2\testschemaapi_shard1_replica2    C:\Users\jenkins\workspace\Lucene-Solr-5.5-Windows\solr\build\solr-core\test\J1\temp\solr.schema.TestManagedSchemaAPI_C9178EAC76EBE3B1-001\tempDir-001\node2: java.nio.file.DirectoryNotEmptyException: C:\Users\jenkins\workspace\Lucene-Solr-5.5-Windows\solr\build\solr-core\test\J1\temp\solr.schema.TestManagedSchemaAPI_C9178EAC76EBE3B1-001\tempDir-001\node2    C:\Users\jenkins\workspace\Lucene-Solr-5.5-Windows\solr\build\solr-core\test\J1\temp\solr.schema.TestManagedSchemaAPI_C9178EAC76EBE3B1-001\tempDir-001: java.nio.file.DirectoryNotEmptyException: C:\Users\jenkins\workspace\Lucene-Solr-5.5-Windows\solr\build\solr-core\test\J1\temp\solr.schema.TestManagedSchemaAPI_C9178EAC76EBE3B1-001\tempDir-001    C:\Users\jenkins\workspace\Lucene-Solr-5.5-Windows\solr\build\solr-core\test\J1\temp\solr.schema.TestManagedSchemaAPI_C9178EAC76EBE3B1-001: java.nio.file.DirectoryNotEmptyException: C:\Users\jenkins\workspace\Lucene-Solr-5.5-Windows\solr\build\solr-core\test\J1\temp\solr.schema.TestManagedSchemaAPI_C9178EAC76EBE3B1-001 

Stack Trace:
java.io.IOException: Could not remove the following files (in the order of attempts):
   C:\Users\jenkins\workspace\Lucene-Solr-5.5-Windows\solr\build\solr-core\test\J1\temp\solr.schema.TestManagedSchemaAPI_C9178EAC76EBE3B1-001\tempDir-001\node1\testschemaapi_shard1_replica1\data\tlog\tlog.0000000000000000000: java.nio.file.FileSystemException: C:\Users\jenkins\workspace\Lucene-Solr-5.5-Windows\solr\build\solr-core\test\J1\temp\solr.schema.TestManagedSchemaAPI_C9178EAC76EBE3B1-001\tempDir-001\node1\testschemaapi_shard1_replica1\data\tlog\tlog.0000000000000000000: The process cannot access the file because it is being used by another process.

   C:\Users\jenkins\workspace\Lucene-Solr-5.5-Windows\solr\build\solr-core\test\J1\temp\solr.schema.TestManagedSchemaAPI_C9178EAC76EBE3B1-001\tempDir-001\node1\testschemaapi_shard1_replica1\data\tlog: java.nio.file.DirectoryNotEmptyException: C:\Users\jenkins\workspace\Lucene-Solr-5.5-Windows\solr\build\solr-core\test\J1\temp\solr.schema.TestManagedSchemaAPI_C9178EAC76EBE3B1-001\tempDir-001\node1\testschemaapi_shard1_replica1\data\tlog
   C:\Users\jenkins\workspace\Lucene-Solr-5.5-Windows\solr\build\solr-core\test\J1\temp\solr.schema.TestManagedSchemaAPI_C9178EAC76EBE3B1-001\tempDir-001\node1\testschemaapi_shard1_replica1\data: java.nio.file.DirectoryNotEmptyException: C:\Users\jenkins\workspace\Lucene-Solr-5.5-Windows\solr\build\solr-core\test\J1\temp\solr.schema.TestManagedSchemaAPI_C9178EAC76EBE3B1-001\tempDir-001\node1\testschemaapi_shard1_replica1\data
   C:\Users\jenkins\workspace\Lucene-Solr-5.5-Windows\solr\build\solr-core\test\J1\temp\solr.schema.TestManagedSchemaAPI_C9178EAC76EBE3B1-001\tempDir-001\node1\testschemaapi_shard1_replica1: java.nio.file.DirectoryNotEmptyException: C:\Users\jenkins\workspace\Lucene-Solr-5.5-Windows\solr\build\solr-core\test\J1\temp\solr.schema.TestManagedSchemaAPI_C9178EAC76EBE3B1-001\tempDir-001\node1\testschemaapi_shard1_replica1
   C:\Users\jenkins\workspace\Lucene-Solr-5.5-Windows\solr\build\solr-core\test\J1\temp\solr.schema.TestManagedSchemaAPI_C9178EAC76EBE3B1-001\tempDir-001\node1: java.nio.file.DirectoryNotEmptyException: C:\Users\jenkins\workspace\Lucene-Solr-5.5-Windows\solr\build\solr-core\test\J1\temp\solr.schema.TestManagedSchemaAPI_C9178EAC76EBE3B1-001\tempDir-001\node1
   C:\Users\jenkins\workspace\Lucene-Solr-5.5-Windows\solr\build\solr-core\test\J1\temp\solr.schema.TestManagedSchemaAPI_C9178EAC76EBE3B1-001\tempDir-001\node2\testschemaapi_shard1_replica2\data\tlog\tlog.0000000000000000001: java.nio.file.FileSystemException: C:\Users\jenkins\workspace\Lucene-Solr-5.5-Windows\solr\build\solr-core\test\J1\temp\solr.schema.TestManagedSchemaAPI_C9178EAC76EBE3B1-001\tempDir-001\node2\testschemaapi_shard1_replica2\data\tlog\tlog.0000000000000000001: The process cannot access the file because it is being used by another process.

   C:\Users\jenkins\workspace\Lucene-Solr-5.5-Windows\solr\build\solr-core\test\J1\temp\solr.schema.TestManagedSchemaAPI_C9178EAC76EBE3B1-001\tempDir-001\node2\testschemaapi_shard1_replica2\data\tlog: java.nio.file.DirectoryNotEmptyException: C:\Users\jenkins\workspace\Lucene-Solr-5.5-Windows\solr\build\solr-core\test\J1\temp\solr.schema.TestManagedSchemaAPI_C9178EAC76EBE3B1-001\tempDir-001\node2\testschemaapi_shard1_replica2\data\tlog
   C:\Users\jenkins\workspace\Lucene-Solr-5.5-Windows\solr\build\solr-core\test\J1\temp\solr.schema.TestManagedSchemaAPI_C9178EAC76EBE3B1-001\tempDir-001\node2\testschemaapi_shard1_replica2\data: java.nio.file.DirectoryNotEmptyException: C:\Users\jenkins\workspace\Lucene-Solr-5.5-Windows\solr\build\solr-core\test\J1\temp\solr.schema.TestManagedSchemaAPI_C9178EAC76EBE3B1-001\tempDir-001\node2\testschemaapi_shard1_replica2\data
   C:\Users\jenkins\workspace\Lucene-Solr-5.5-Windows\solr\build\solr-core\test\J1\temp\solr.schema.TestManagedSchemaAPI_C9178EAC76EBE3B1-001\tempDir-001\node2\testschemaapi_shard1_replica2: java.nio.file.DirectoryNotEmptyException: C:\Users\jenkins\workspace\Lucene-Solr-5.5-Windows\solr\build\solr-core\test\J1\temp\solr.schema.TestManagedSchemaAPI_C9178EAC76EBE3B1-001\tempDir-001\node2\testschemaapi_shard1_replica2
   C:\Users\jenkins\workspace\Lucene-Solr-5.5-Windows\solr\build\solr-core\test\J1\temp\solr.schema.TestManagedSchemaAPI_C9178EAC76EBE3B1-001\tempDir-001\node2: java.nio.file.DirectoryNotEmptyException: C:\Users\jenkins\workspace\Lucene-Solr-5.5-Windows\solr\build\solr-core\test\J1\temp\solr.schema.TestManagedSchemaAPI_C9178EAC76EBE3B1-001\tempDir-001\node2
   C:\Users\jenkins\workspace\Lucene-Solr-5.5-Windows\solr\build\solr-core\test\J1\temp\solr.schema.TestManagedSchemaAPI_C9178EAC76EBE3B1-001\tempDir-001: java.nio.file.DirectoryNotEmptyException: C:\Users\jenkins\workspace\Lucene-Solr-5.5-Windows\solr\build\solr-core\test\J1\temp\solr.schema.TestManagedSchemaAPI_C9178EAC76EBE3B1-001\tempDir-001
   C:\Users\jenkins\workspace\Lucene-Solr-5.5-Windows\solr\build\solr-core\test\J1\temp\solr.schema.TestManagedSchemaAPI_C9178EAC76EBE3B1-001: java.nio.file.DirectoryNotEmptyException: C:\Users\jenkins\workspace\Lucene-Solr-5.5-Windows\solr\build\solr-core\test\J1\temp\solr.schema.TestManagedSchemaAPI_C9178EAC76EBE3B1-001

	at org.apache.lucene.util.IOUtils.rm(IOUtils.java:295)
	at org.apache.lucene.util.TestRuleTemporaryFilesCleanup.afterAlways(TestRuleTemporaryFilesCleanup.java:217)
	at com.carrotsearch.randomizedtesting.rules.TestRuleAdapter$1.afterAlways(TestRuleAdapter.java:31)
	at com.carrotsearch.randomizedtesting.rules.StatementAdapter.evaluate(StatementAdapter.java:43)
	at com.carrotsearch.randomizedtesting.rules.StatementAdapter.evaluate(StatementAdapter.java:36)
	at org.apache.lucene.util.TestRuleAssertionsRequired$1.evaluate(TestRuleAssertionsRequired.java:53)
	at org.apache.lucene.util.TestRuleMarkFailure$1.evaluate(TestRuleMarkFailure.java:47)
	at org.apache.lucene.util.TestRuleIgnoreAfterMaxFailures$1.evaluate(TestRuleIgnoreAfterMaxFailures.java:64)
	at org.apache.lucene.util.TestRuleIgnoreTestSuites$1.evaluate(TestRuleIgnoreTestSuites.java:54)
	at com.carrotsearch.randomizedtesting.rules.StatementAdapter.evaluate(StatementAdapter.java:36)
	at com.carrotsearch.randomizedtesting.ThreadLeakControl$StatementRunner.run(ThreadLeakControl.java:367)
	at java.lang.Thread.run(Thread.java:748)




Build Log:
[...truncated 12280 lines...]
   [junit4] Suite: org.apache.solr.schema.TestManagedSchemaAPI
   [junit4]   2> Creating dataDir: C:\Users\jenkins\workspace\Lucene-Solr-5.5-Windows\solr\build\solr-core\test\J1\temp\solr.schema.TestManagedSchemaAPI_C9178EAC76EBE3B1-001\init-core-data-001
   [junit4]   2> 2702072 INFO  (SUITE-TestManagedSchemaAPI-seed#[C9178EAC76EBE3B1]-worker) [    ] o.a.s.SolrTestCaseJ4 Randomized ssl (false) and clientAuth (true)
   [junit4]   2> 2702073 INFO  (TEST-TestManagedSchemaAPI.test-seed#[C9178EAC76EBE3B1]) [    ] o.a.s.SolrTestCaseJ4 ###Starting test
   [junit4]   2> 2702074 INFO  (TEST-TestManagedSchemaAPI.test-seed#[C9178EAC76EBE3B1]) [    ] o.a.s.c.ZkTestServer STARTING ZK TEST SERVER
   [junit4]   2> 2702075 INFO  (Thread-6797) [    ] o.a.s.c.ZkTestServer client port:0.0.0.0/0.0.0.0:0
   [junit4]   2> 2702075 INFO  (Thread-6797) [    ] o.a.s.c.ZkTestServer Starting server
   [junit4]   2> 2702175 INFO  (TEST-TestManagedSchemaAPI.test-seed#[C9178EAC76EBE3B1]) [    ] o.a.s.c.ZkTestServer start zk server on port:49699
   [junit4]   2> 2702175 INFO  (TEST-TestManagedSchemaAPI.test-seed#[C9178EAC76EBE3B1]) [    ] o.a.s.c.c.SolrZkClient Using default ZkCredentialsProvider
   [junit4]   2> 2702176 INFO  (TEST-TestManagedSchemaAPI.test-seed#[C9178EAC76EBE3B1]) [    ] o.a.s.c.c.ConnectionManager Waiting for client to connect to ZooKeeper
   [junit4]   2> 2702180 INFO  (zkCallback-10183-thread-1) [    ] o.a.s.c.c.ConnectionManager Watcher org.apache.solr.common.cloud.ConnectionManager@15c590b name:ZooKeeperConnection Watcher:127.0.0.1:49699 got event WatchedEvent state:SyncConnected type:None path:null path:null type:None
   [junit4]   2> 2702181 INFO  (TEST-TestManagedSchemaAPI.test-seed#[C9178EAC76EBE3B1]) [    ] o.a.s.c.c.ConnectionManager Client is connected to ZooKeeper
   [junit4]   2> 2702181 INFO  (TEST-TestManagedSchemaAPI.test-seed#[C9178EAC76EBE3B1]) [    ] o.a.s.c.c.SolrZkClient Using default ZkACLProvider
   [junit4]   2> 2702181 INFO  (TEST-TestManagedSchemaAPI.test-seed#[C9178EAC76EBE3B1]) [    ] o.a.s.c.c.SolrZkClient makePath: /solr/solr.xml
   [junit4]   2> 2702188 INFO  (jetty-launcher-10182-thread-2) [    ] o.e.j.s.Server jetty-9.2.13.v20150730
   [junit4]   2> 2702189 INFO  (jetty-launcher-10182-thread-1) [    ] o.e.j.s.Server jetty-9.2.13.v20150730
   [junit4]   2> 2702189 INFO  (jetty-launcher-10182-thread-2) [    ] o.e.j.s.h.ContextHandler Started o.e.j.s.ServletContextHandler@1aa41f3{/solr,null,AVAILABLE}
   [junit4]   2> 2702191 INFO  (jetty-launcher-10182-thread-1) [    ] o.e.j.s.h.ContextHandler Started o.e.j.s.ServletContextHandler@128ade0{/solr,null,AVAILABLE}
   [junit4]   2> 2702191 INFO  (jetty-launcher-10182-thread-2) [    ] o.e.j.s.ServerConnector Started ServerConnector@6a8c86{HTTP/1.1}{127.0.0.1:49703}
   [junit4]   2> 2702191 INFO  (jetty-launcher-10182-thread-2) [    ] o.e.j.s.Server Started @2704621ms
   [junit4]   2> 2702191 INFO  (jetty-launcher-10182-thread-2) [    ] o.a.s.c.s.e.JettySolrRunner Jetty properties: {hostContext=/solr, hostPort=49703}
   [junit4]   2> 2702191 INFO  (jetty-launcher-10182-thread-2) [    ] o.a.s.s.SolrDispatchFilter SolrDispatchFilter.init(): sun.misc.Launcher$AppClassLoader@1d16e93
   [junit4]   2> 2702191 INFO  (jetty-launcher-10182-thread-2) [    ] o.a.s.c.SolrResourceLoader new SolrResourceLoader for directory: 'C:\Users\jenkins\workspace\Lucene-Solr-5.5-Windows\solr\build\solr-core\test\J1\temp\solr.schema.TestManagedSchemaAPI_C9178EAC76EBE3B1-001\tempDir-001\node2'
   [junit4]   2> 2702191 INFO  (jetty-launcher-10182-thread-2) [    ] o.a.s.c.SolrResourceLoader JNDI not configured for solr (NoInitialContextEx)
   [junit4]   2> 2702191 INFO  (jetty-launcher-10182-thread-2) [    ] o.a.s.c.SolrResourceLoader solr home defaulted to 'solr/' (could not find system property or JNDI)
   [junit4]   2> 2702191 INFO  (jetty-launcher-10182-thread-1) [    ] o.e.j.s.ServerConnector Started ServerConnector@1320f64{HTTP/1.1}{127.0.0.1:49706}
   [junit4]   2> 2702191 INFO  (jetty-launcher-10182-thread-1) [    ] o.e.j.s.Server Started @2704622ms
   [junit4]   2> 2702191 INFO  (jetty-launcher-10182-thread-1) [    ] o.a.s.c.s.e.JettySolrRunner Jetty properties: {hostContext=/solr, hostPort=49706}
   [junit4]   2> 2702192 INFO  (jetty-launcher-10182-thread-2) [    ] o.a.s.c.c.SolrZkClient Using default ZkCredentialsProvider
   [junit4]   2> 2702192 INFO  (jetty-launcher-10182-thread-1) [    ] o.a.s.s.SolrDispatchFilter SolrDispatchFilter.init(): sun.misc.Launcher$AppClassLoader@1d16e93
   [junit4]   2> 2702192 INFO  (jetty-launcher-10182-thread-1) [    ] o.a.s.c.SolrResourceLoader new SolrResourceLoader for directory: 'C:\Users\jenkins\workspace\Lucene-Solr-5.5-Windows\solr\build\solr-core\test\J1\temp\solr.schema.TestManagedSchemaAPI_C9178EAC76EBE3B1-001\tempDir-001\node1'
   [junit4]   2> 2702192 INFO  (jetty-launcher-10182-thread-1) [    ] o.a.s.c.SolrResourceLoader JNDI not configured for solr (NoInitialContextEx)
   [junit4]   2> 2702192 INFO  (jetty-launcher-10182-thread-1) [    ] o.a.s.c.SolrResourceLoader solr home defaulted to 'solr/' (could not find system property or JNDI)
   [junit4]   2> 2702192 INFO  (jetty-launcher-10182-thread-2) [    ] o.a.s.c.c.ConnectionManager Waiting for client to connect to ZooKeeper
   [junit4]   2> 2702193 INFO  (jetty-launcher-10182-thread-1) [    ] o.a.s.c.c.SolrZkClient Using default ZkCredentialsProvider
   [junit4]   2> 2702194 INFO  (jetty-launcher-10182-thread-1) [    ] o.a.s.c.c.ConnectionManager Waiting for client to connect to ZooKeeper
   [junit4]   2> 2702198 INFO  (zkCallback-10184-thread-1) [    ] o.a.s.c.c.ConnectionManager Watcher org.apache.solr.common.cloud.ConnectionManager@1d1c4a5 name:ZooKeeperConnection Watcher:127.0.0.1:49699/solr got event WatchedEvent state:SyncConnected type:None path:null path:null type:None
   [junit4]   2> 2702198 INFO  (zkCallback-10185-thread-1) [    ] o.a.s.c.c.ConnectionManager Watcher org.apache.solr.common.cloud.ConnectionManager@4bb9f name:ZooKeeperConnection Watcher:127.0.0.1:49699/solr got event WatchedEvent state:SyncConnected type:None path:null path:null type:None
   [junit4]   2> 2702198 INFO  (jetty-launcher-10182-thread-2) [    ] o.a.s.c.c.ConnectionManager Client is connected to ZooKeeper
   [junit4]   2> 2702199 INFO  (jetty-launcher-10182-thread-1) [    ] o.a.s.c.c.ConnectionManager Client is connected to ZooKeeper
   [junit4]   2> 2702199 INFO  (jetty-launcher-10182-thread-2) [    ] o.a.s.c.c.SolrZkClient Using default ZkACLProvider
   [junit4]   2> 2702199 INFO  (jetty-launcher-10182-thread-1) [    ] o.a.s.c.c.SolrZkClient Using default ZkACLProvider
   [junit4]   2> 2702199 INFO  (jetty-launcher-10182-thread-1) [    ] o.a.s.s.SolrDispatchFilter solr.xml found in ZooKeeper. Loading...
   [junit4]   2> 2702200 INFO  (jetty-launcher-10182-thread-2) [    ] o.a.s.s.SolrDispatchFilter solr.xml found in ZooKeeper. Loading...
   [junit4]   2> 2702213 WARN  (NIOServerCxn.Factory:0.0.0.0/0.0.0.0:0) [    ] o.a.z.s.NIOServerCnxn caught end of stream exception
   [junit4]   2> EndOfStreamException: Unable to read additional data from client sessionid 0x15f369beb500002, likely client has closed socket
   [junit4]   2> 	at org.apache.zookeeper.server.NIOServerCnxn.doIO(NIOServerCnxn.java:228)
   [junit4]   2> 	at org.apache.zookeeper.server.NIOServerCnxnFactory.run(NIOServerCnxnFactory.java:208)
   [junit4]   2> 	at java.lang.Thread.run(Thread.java:748)
   [junit4]   2> 2702213 INFO  (jetty-launcher-10182-thread-2) [    ] o.a.s.c.CorePropertiesLocator Config-defined core root directory: C:\Users\jenkins\workspace\Lucene-Solr-5.5-Windows\solr\build\solr-core\test\J1\temp\solr.schema.TestManagedSchemaAPI_C9178EAC76EBE3B1-001\tempDir-001\node2\.
   [junit4]   2> 2702213 INFO  (jetty-launcher-10182-thread-1) [    ] o.a.s.c.CorePropertiesLocator Config-defined core root directory: C:\Users\jenkins\workspace\Lucene-Solr-5.5-Windows\solr\build\solr-core\test\J1\temp\solr.schema.TestManagedSchemaAPI_C9178EAC76EBE3B1-001\tempDir-001\node1\.
   [junit4]   2> 2702213 INFO  (jetty-launcher-10182-thread-2) [    ] o.a.s.c.CoreContainer New CoreContainer 33348659
   [junit4]   2> 2702213 INFO  (jetty-launcher-10182-thread-1) [    ] o.a.s.c.CoreContainer New CoreContainer 25954760
   [junit4]   2> 2702213 INFO  (jetty-launcher-10182-thread-2) [    ] o.a.s.c.CoreContainer Loading cores into CoreContainer [instanceDir=C:\Users\jenkins\workspace\Lucene-Solr-5.5-Windows\solr\build\solr-core\test\J1\temp\solr.schema.TestManagedSchemaAPI_C9178EAC76EBE3B1-001\tempDir-001\node2]
   [junit4]   2> 2702214 INFO  (jetty-launcher-10182-thread-1) [    ] o.a.s.c.CoreContainer Loading cores into CoreContainer [instanceDir=C:\Users\jenkins\workspace\Lucene-Solr-5.5-Windows\solr\build\solr-core\test\J1\temp\solr.schema.TestManagedSchemaAPI_C9178EAC76EBE3B1-001\tempDir-001\node1]
   [junit4]   2> 2702214 WARN  (jetty-launcher-10182-thread-2) [    ] o.a.s.c.CoreContainer Couldn't add files from C:\Users\jenkins\workspace\Lucene-Solr-5.5-Windows\solr\build\solr-core\test\J1\temp\solr.schema.TestManagedSchemaAPI_C9178EAC76EBE3B1-001\tempDir-001\node2\lib to classpath: C:\Users\jenkins\workspace\Lucene-Solr-5.5-Windows\solr\build\solr-core\test\J1\temp\solr.schema.TestManagedSchemaAPI_C9178EAC76EBE3B1-001\tempDir-001\node2\lib
   [junit4]   2> 2702214 WARN  (jetty-launcher-10182-thread-1) [    ] o.a.s.c.CoreContainer Couldn't add files from C:\Users\jenkins\workspace\Lucene-Solr-5.5-Windows\solr\build\solr-core\test\J1\temp\solr.schema.TestManagedSchemaAPI_C9178EAC76EBE3B1-001\tempDir-001\node1\lib to classpath: C:\Users\jenkins\workspace\Lucene-Solr-5.5-Windows\solr\build\solr-core\test\J1\temp\solr.schema.TestManagedSchemaAPI_C9178EAC76EBE3B1-001\tempDir-001\node1\lib
   [junit4]   2> 2702214 INFO  (jetty-launcher-10182-thread-2) [    ] o.a.s.h.c.HttpShardHandlerFactory created with socketTimeout : 90000,urlScheme : ,connTimeout : 15000,maxConnectionsPerHost : 20,maxConnections : 10000,corePoolSize : 0,maximumPoolSize : 2147483647,maxThreadIdleTime : 5,sizeOfQueue : -1,fairnessPolicy : false,useRetries : false,connectionsEvictorSleepDelay : 5000,maxConnectionIdleTime : 40000,
   [junit4]   2> 2702214 INFO  (jetty-launcher-10182-thread-1) [    ] o.a.s.h.c.HttpShardHandlerFactory created with socketTimeout : 90000,urlScheme : ,connTimeout : 15000,maxConnectionsPerHost : 20,maxConnections : 10000,corePoolSize : 0,maximumPoolSize : 2147483647,maxThreadIdleTime : 5,sizeOfQueue : -1,fairnessPolicy : false,useRetries : false,connectionsEvictorSleepDelay : 5000,maxConnectionIdleTime : 40000,
   [junit4]   2> 2702218 INFO  (jetty-launcher-10182-thread-1) [    ] o.a.s.u.UpdateShardHandler Creating UpdateShardHandler HTTP client with params: socketTimeout=340000&connTimeout=45000&retry=true
   [junit4]   2> 2702218 INFO  (jetty-launcher-10182-thread-2) [    ] o.a.s.u.UpdateShardHandler Creating UpdateShardHandler HTTP client with params: socketTimeout=340000&connTimeout=45000&retry=true
   [junit4]   2> 2702218 INFO  (jetty-launcher-10182-thread-1) [    ] o.a.s.l.LogWatcher SLF4J impl is org.slf4j.impl.Log4jLoggerFactory
   [junit4]   2> 2702218 INFO  (jetty-launcher-10182-thread-1) [    ] o.a.s.l.LogWatcher Registering Log Listener [Log4j (org.slf4j.impl.Log4jLoggerFactory)]
   [junit4]   2> 2702219 INFO  (jetty-launcher-10182-thread-1) [    ] o.a.s.c.ZkContainer Zookeeper client=127.0.0.1:49699/solr
   [junit4]   2> 2702219 INFO  (jetty-launcher-10182-thread-1) [    ] o.a.s.c.ZkController zkHost includes chroot
   [junit4]   2> 2702219 INFO  (jetty-launcher-10182-thread-2) [    ] o.a.s.l.LogWatcher SLF4J impl is org.slf4j.impl.Log4jLoggerFactory
   [junit4]   2> 2702219 INFO  (jetty-launcher-10182-thread-1) [    ] o.a.s.c.c.SolrZkClient Using default ZkCredentialsProvider
   [junit4]   2> 2702219 INFO  (jetty-launcher-10182-thread-2) [    ] o.a.s.l.LogWatcher Registering Log Listener [Log4j (org.slf4j.impl.Log4jLoggerFactory)]
   [junit4]   2> 2702219 INFO  (jetty-launcher-10182-thread-2) [    ] o.a.s.c.ZkContainer Zookeeper client=127.0.0.1:49699/solr
   [junit4]   2> 2702219 INFO  (jetty-launcher-10182-thread-2) [    ] o.a.s.c.ZkController zkHost includes chroot
   [junit4]   2> 2702219 INFO  (jetty-launcher-10182-thread-2) [    ] o.a.s.c.c.SolrZkClient Using default ZkCredentialsProvider
   [junit4]   2> 2702219 INFO  (jetty-launcher-10182-thread-1) [    ] o.a.s.c.c.ConnectionManager Waiting for client to connect to ZooKeeper
   [junit4]   2> 2702219 INFO  (jetty-launcher-10182-thread-2) [    ] o.a.s.c.c.ConnectionManager Waiting for client to connect to ZooKeeper
   [junit4]   2> 2702222 INFO  (zkCallback-10190-thread-1) [    ] o.a.s.c.c.ConnectionManager Watcher org.apache.solr.common.cloud.ConnectionManager@100c2f8 name:ZooKeeperConnection Watcher:127.0.0.1:49699 got event WatchedEvent state:SyncConnected type:None path:null path:null type:None
   [junit4]   2> 2702222 INFO  (jetty-launcher-10182-thread-1) [    ] o.a.s.c.c.ConnectionManager Client is connected to ZooKeeper
   [junit4]   2> 2702222 INFO  (zkCallback-10191-thread-1) [    ] o.a.s.c.c.ConnectionManager Watcher org.apache.solr.common.cloud.ConnectionManager@4a4bc name:ZooKeeperConnection Watcher:127.0.0.1:49699 got event WatchedEvent state:SyncConnected type:None path:null path:null type:None
   [junit4]   2> 2702222 INFO  (jetty-launcher-10182-thread-2) [    ] o.a.s.c.c.ConnectionManager Client is connected to ZooKeeper
   [junit4]   2> 2702222 INFO  (jetty-launcher-10182-thread-1) [    ] o.a.s.c.c.SolrZkClient Using default ZkACLProvider
   [junit4]   2> 2702222 INFO  (jetty-launcher-10182-thread-2) [    ] o.a.s.c.c.SolrZkClient Using default ZkACLProvider
   [junit4]   2> 2702224 INFO  (jetty-launcher-10182-thread-2) [n:127.0.0.1:49703_solr    ] o.a.s.c.ZkController Added new OnReconnect listener org.apache.solr.cloud.ZkController$6@e84ec5
   [junit4]   2> 2702224 INFO  (jetty-launcher-10182-thread-1) [n:127.0.0.1:49706_solr    ] o.a.s.c.ZkController Added new OnReconnect listener org.apache.solr.cloud.ZkController$6@18061e6
   [junit4]   2> 2702226 INFO  (jetty-launcher-10182-thread-1) [n:127.0.0.1:49706_solr    ] o.a.s.c.c.ConnectionManager Waiting for client to connect to ZooKeeper
   [junit4]   2> 2702226 INFO  (jetty-launcher-10182-thread-2) [n:127.0.0.1:49703_solr    ] o.a.s.c.c.ConnectionManager Waiting for client to connect to ZooKeeper
   [junit4]   2> 2702228 INFO  (zkCallback-10193-thread-1-processing-n:127.0.0.1:49706_solr) [n:127.0.0.1:49706_solr    ] o.a.s.c.c.ConnectionManager Watcher org.apache.solr.common.cloud.ConnectionManager@eb0531 name:ZooKeeperConnection Watcher:127.0.0.1:49699/solr got event WatchedEvent state:SyncConnected type:None path:null path:null type:None
   [junit4]   2> 2702228 INFO  (zkCallback-10192-thread-1-processing-n:127.0.0.1:49703_solr) [n:127.0.0.1:49703_solr    ] o.a.s.c.c.ConnectionManager Watcher org.apache.solr.common.cloud.ConnectionManager@1821463 name:ZooKeeperConnection Watcher:127.0.0.1:49699/solr got event WatchedEvent state:SyncConnected type:None path:null path:null type:None
   [junit4]   2> 2702228 INFO  (jetty-launcher-10182-thread-1) [n:127.0.0.1:49706_solr    ] o.a.s.c.c.ConnectionManager Client is connected to ZooKeeper
   [junit4]   2> 2702228 INFO  (jetty-launcher-10182-thread-2) [n:127.0.0.1:49703_solr    ] o.a.s.c.c.ConnectionManager Client is connected to ZooKeeper
   [junit4]   2> 2702229 INFO  (jetty-launcher-10182-thread-2) [n:127.0.0.1:49703_solr    ] o.a.s.c.c.SolrZkClient makePath: /overseer/queue
   [junit4]   2> 2702231 INFO  (jetty-launcher-10182-thread-1) [n:127.0.0.1:49706_solr    ] o.a.s.c.c.SolrZkClient makePath: /overseer/queue
   [junit4]   2> 2702233 INFO  (jetty-launcher-10182-thread-1) [n:127.0.0.1:49706_solr    ] o.a.s.c.c.SolrZkClient makePath: /overseer/collection-queue-work
   [junit4]   2> 2702234 INFO  (jetty-launcher-10182-thread-2) [n:127.0.0.1:49703_solr    ] o.a.s.c.c.SolrZkClient makePath: /overseer/collection-queue-work
   [junit4]   2> 2702239 INFO  (jetty-launcher-10182-thread-2) [n:127.0.0.1:49703_solr    ] o.a.s.c.c.SolrZkClient makePath: /overseer/collection-map-running
   [junit4]   2> 2702239 INFO  (jetty-launcher-10182-thread-1) [n:127.0.0.1:49706_solr    ] o.a.s.c.c.SolrZkClient makePath: /overseer/collection-map-running
   [junit4]   2> 2702242 INFO  (jetty-launcher-10182-thread-1) [n:127.0.0.1:49706_solr    ] o.a.s.c.c.SolrZkClient makePath: /overseer/collection-map-completed
   [junit4]   2> 2702243 INFO  (jetty-launcher-10182-thread-2) [n:127.0.0.1:49703_solr    ] o.a.s.c.c.SolrZkClient makePath: /overseer/collection-map-completed
   [junit4]   2> 2702245 INFO  (jetty-launcher-10182-thread-1) [n:127.0.0.1:49706_solr    ] o.a.s.c.c.SolrZkClient makePath: /overseer/collection-map-failure
   [junit4]   2> 2702245 INFO  (jetty-launcher-10182-thread-2) [n:127.0.0.1:49703_solr    ] o.a.s.c.c.SolrZkClient makePath: /overseer/collection-map-failure
   [junit4]   2> 2702249 INFO  (jetty-launcher-10182-thread-1) [n:127.0.0.1:49706_solr    ] o.a.s.c.c.SolrZkClient makePath: /live_nodes
   [junit4]   2> 2702249 INFO  (jetty-launcher-10182-thread-2) [n:127.0.0.1:49703_solr    ] o.a.s.c.c.SolrZkClient makePath: /live_nodes
   [junit4]   2> 2702250 INFO  (jetty-launcher-10182-thread-2) [n:127.0.0.1:49703_solr    ] o.a.s.c.c.SolrZkClient makePath: /collections
   [junit4]   2> 2702250 INFO  (jetty-launcher-10182-thread-1) [n:127.0.0.1:49706_solr    ] o.a.s.c.c.SolrZkClient makePath: /collections
   [junit4]   2> 2702253 INFO  (jetty-launcher-10182-thread-1) [n:127.0.0.1:49706_solr    ] o.a.s.c.c.SolrZkClient makePath: /aliases.json
   [junit4]   2> 2702253 INFO  (jetty-launcher-10182-thread-2) [n:127.0.0.1:49703_solr    ] o.a.s.c.c.SolrZkClient makePath: /aliases.json
   [junit4]   2> 2702255 INFO  (jetty-launcher-10182-thread-2) [n:127.0.0.1:49703_solr    ] o.a.s.c.c.SolrZkClient makePath: /clusterstate.json
   [junit4]   2> 2702255 INFO  (jetty-launcher-10182-thread-1) [n:127.0.0.1:49706_solr    ] o.a.s.c.c.SolrZkClient makePath: /clusterstate.json
   [junit4]   2> 2702256 INFO  (jetty-launcher-10182-thread-1) [n:127.0.0.1:49706_solr    ] o.a.s.c.c.SolrZkClient makePath: /security.json
   [junit4]   2> 2702256 INFO  (jetty-launcher-10182-thread-2) [n:127.0.0.1:49703_solr    ] o.a.s.c.c.SolrZkClient makePath: /security.json
   [junit4]   2> 2702258 INFO  (jetty-launcher-10182-thread-2) [n:127.0.0.1:49703_solr    ] o.a.s.c.ZkController Register node as live in ZooKeeper:/live_nodes/127.0.0.1:49703_solr
   [junit4]   2> 2702258 INFO  (jetty-launcher-10182-thread-1) [n:127.0.0.1:49706_solr    ] o.a.s.c.ZkController Register node as live in ZooKeeper:/live_nodes/127.0.0.1:49706_solr
   [junit4]   2> 2702258 INFO  (jetty-launcher-10182-thread-2) [n:127.0.0.1:49703_solr    ] o.a.s.c.c.SolrZkClient makePath: /live_nodes/127.0.0.1:49703_solr
   [junit4]   2> 2702258 INFO  (jetty-launcher-10182-thread-1) [n:127.0.0.1:49706_solr    ] o.a.s.c.c.SolrZkClient makePath: /live_nodes/127.0.0.1:49706_solr
   [junit4]   2> 2702260 INFO  (jetty-launcher-10182-thread-2) [n:127.0.0.1:49703_solr    ] o.a.s.c.c.SolrZkClient makePath: /overseer_elect
   [junit4]   2> 2702260 INFO  (jetty-launcher-10182-thread-1) [n:127.0.0.1:49706_solr    ] o.a.s.c.c.SolrZkClient makePath: /overseer_elect
   [junit4]   2> 2702262 INFO  (jetty-launcher-10182-thread-1) [n:127.0.0.1:49706_solr    ] o.a.s.c.c.SolrZkClient makePath: /overseer_elect/election
   [junit4]   2> 2702262 INFO  (jetty-launcher-10182-thread-2) [n:127.0.0.1:49703_solr    ] o.a.s.c.c.SolrZkClient makePath: /overseer_elect/election
   [junit4]   2> 2702263 INFO  (jetty-launcher-10182-thread-2) [n:127.0.0.1:49703_solr    ] o.a.s.c.Overseer Overseer (id=null) closing
   [junit4]   2> 2702263 INFO  (jetty-launcher-10182-thread-1) [n:127.0.0.1:49706_solr    ] o.a.s.c.Overseer Overseer (id=null) closing
   [junit4]   2> 2702265 INFO  (jetty-launcher-10182-thread-1) [n:127.0.0.1:49706_solr    ] o.a.s.c.LeaderElector Joined leadership election with path: /overseer_elect/election/98857760121159685-127.0.0.1:49706_solr-n_0000000001
   [junit4]   2> 2702265 INFO  (jetty-launcher-10182-thread-2) [n:127.0.0.1:49703_solr    ] o.a.s.c.LeaderElector Joined leadership election with path: /overseer_elect/election/98857760121159686-127.0.0.1:49703_solr-n_0000000000
   [junit4]   2> 2702266 INFO  (jetty-launcher-10182-thread-2) [n:127.0.0.1:49703_solr    ] o.a.s.c.OverseerElectionContext I am going to be the leader 127.0.0.1:49703_solr
   [junit4]   2> 2702266 INFO  (jetty-launcher-10182-thread-2) [n:127.0.0.1:49703_solr    ] o.a.s.c.c.SolrZkClient makePath: /overseer_elect/leader
   [junit4]   2> 2702266 INFO  (jetty-launcher-10182-thread-1) [n:127.0.0.1:49706_solr    ] o.a.s.c.LeaderElector Watching path /overseer_elect/election/98857760121159686-127.0.0.1:49703_solr-n_0000000000 to know if I could be the leader
   [junit4]   2> 2702266 INFO  (jetty-launcher-10182-thread-1) [n:127.0.0.1:49706_solr    ] o.a.s.c.c.ZkStateReader Updating cluster state from ZooKeeper... 
   [junit4]   2> 2702267 INFO  (jetty-launcher-10182-thread-2) [n:127.0.0.1:49703_solr    ] o.a.s.c.Overseer Overseer (id=98857760121159686-127.0.0.1:49703_solr-n_0000000000) starting
   [junit4]   2> 2702271 INFO  (jetty-launcher-10182-thread-2) [n:127.0.0.1:49703_solr    ] o.a.s.c.c.SolrZkClient makePath: /overseer/queue-work
   [junit4]   2> 2702279 INFO  (jetty-launcher-10182-thread-2) [n:127.0.0.1:49703_solr    ] o.a.s.c.OverseerAutoReplicaFailoverThread Starting OverseerAutoReplicaFailoverThread autoReplicaFailoverWorkLoopDelay=10000 autoReplicaFailoverWaitAfterExpiration=30000 autoReplicaFailoverBadNodeExpiration=60000
   [junit4]   2> 2702279 INFO  (jetty-launcher-10182-thread-2) [n:127.0.0.1:49703_solr    ] o.a.s.c.c.ZkStateReader Updating cluster state from ZooKeeper... 
   [junit4]   2> 2702287 INFO  (OverseerStateUpdate-98857760121159686-127.0.0.1:49703_solr-n_0000000000) [n:127.0.0.1:49703_solr    ] o.a.s.c.Overseer Starting to work on the main queue
   [junit4]   2> 2702289 INFO  (OverseerCollectionConfigSetProcessor-98857760121159686-127.0.0.1:49703_solr-n_0000000000) [n:127.0.0.1:49703_solr    ] o.a.s.c.OverseerTaskProcessor Process current queue of overseer operations
   [junit4]   2> 2702305 INFO  (jetty-launcher-10182-thread-1) [n:127.0.0.1:49706_solr    ] o.a.s.c.CoreContainer Security conf doesn't exist. Skipping setup for authorization module.
   [junit4]   2> 2702305 INFO  (jetty-launcher-10182-thread-1) [n:127.0.0.1:49706_solr    ] o.a.s.c.CoreContainer No authentication plugin used.
   [junit4]   2> 2702306 INFO  (jetty-launcher-10182-thread-1) [n:127.0.0.1:49706_solr    ] o.a.s.c.CorePropertiesLocator Looking for core definitions underneath C:\Users\jenkins\workspace\Lucene-Solr-5.5-Windows\solr\build\solr-core\test\J1\temp\solr.schema.TestManagedSchemaAPI_C9178EAC76EBE3B1-001\tempDir-001\node1\.
   [junit4]   2> 2702306 INFO  (jetty-launcher-10182-thread-1) [n:127.0.0.1:49706_solr    ] o.a.s.c.CorePropertiesLocator Found 0 core definitions
   [junit4]   2> 2702307 INFO  (jetty-launcher-10182-thread-1) [n:127.0.0.1:49706_solr    ] o.a.s.s.SolrDispatchFilter user.dir=C:\Users\jenkins\workspace\Lucene-Solr-5.5-Windows\solr\build\solr-core\test\J1
   [junit4]   2> 2702307 INFO  (jetty-launcher-10182-thread-1) [n:127.0.0.1:49706_solr    ] o.a.s.s.SolrDispatchFilter SolrDispatchFilter.init() done
   [junit4]   2> 2702314 INFO  (jetty-launcher-10182-thread-2) [n:127.0.0.1:49703_solr    ] o.a.s.c.CoreContainer Security conf doesn't exist. Skipping setup for authorization module.
   [junit4]   2> 2702314 INFO  (jetty-launcher-10182-thread-2) [n:127.0.0.1:49703_solr    ] o.a.s.c.CoreContainer No authentication plugin used.
   [junit4]   2> 2702316 INFO  (jetty-launcher-10182-thread-2) [n:127.0.0.1:49703_solr    ] o.a.s.c.CorePropertiesLocator Looking for core definitions underneath C:\Users\jenkins\workspace\Lucene-Solr-5.5-Windows\solr\build\solr-core\test\J1\temp\solr.schema.TestManagedSchemaAPI_C9178EAC76EBE3B1-001\tempDir-001\node2\.
   [junit4]   2> 2702316 INFO  (jetty-launcher-10182-thread-2) [n:127.0.0.1:49703_solr    ] o.a.s.c.CorePropertiesLocator Found 0 core definitions
   [junit4]   2> 2702317 INFO  (jetty-launcher-10182-thread-2) [n:127.0.0.1:49703_solr    ] o.a.s.s.SolrDispatchFilter user.dir=C:\Users\jenkins\workspace\Lucene-Solr-5.5-Windows\solr\build\solr-core\test\J1
   [junit4]   2> 2702317 INFO  (jetty-launcher-10182-thread-2) [n:127.0.0.1:49703_solr    ] o.a.s.s.SolrDispatchFilter SolrDispatchFilter.init() done
   [junit4]   2> 2702318 INFO  (TEST-TestManagedSchemaAPI.test-seed#[C9178EAC76EBE3B1]) [    ] o.a.s.c.c.SolrZkClient Using default ZkCredentialsProvider
   [junit4]   2> 2702318 INFO  (TEST-TestManagedSchemaAPI.test-seed#[C9178EAC76EBE3B1]) [    ] o.a.s.c.c.ConnectionManager Waiting for client to connect to ZooKeeper
   [junit4]   2> 2702320 INFO  (zkCallback-10194-thread-1) [    ] o.a.s.c.c.ConnectionManager Watcher org.apache.solr.common.cloud.ConnectionManager@946f0b name:ZooKeeperConnection Watcher:127.0.0.1:49699 got event WatchedEvent state:SyncConnected type:None path:null path:null type:None
   [junit4]   2> 2702320 INFO  (TEST-TestManagedSchemaAPI.test-seed#[C9178EAC76EBE3B1]) [    ] o.a.s.c.c.ConnectionManager Client is connected to ZooKeeper
   [junit4]   2> 2702321 INFO  (TEST-TestManagedSchemaAPI.test-seed#[C9178EAC76EBE3B1]) [    ] o.a.s.c.c.SolrZkClient Using default ZkACLProvider
   [junit4]   2> 2702325 INFO  (TEST-TestManagedSchemaAPI.test-seed#[C9178EAC76EBE3B1]) [    ] o.a.s.c.c.SolrZkClient Using default ZkCredentialsProvider
   [junit4]   2> 2702326 INFO  (TEST-TestManagedSchemaAPI.test-seed#[C9178EAC76EBE3B1]) [    ] o.a.s.c.c.ConnectionManager Waiting for client to connect to ZooKeeper
   [junit4]   2> 2702329 INFO  (zkCallback-10196-thread-1) [    ] o.a.s.c.c.ConnectionManager Watcher org.apache.solr.common.cloud.ConnectionManager@1a864aa name:ZooKeeperConnection Watcher:127.0.0.1:49699/solr got event WatchedEvent state:SyncConnected type:None path:null path:null type:None
   [junit4]   2> 2702329 INFO  (TEST-TestManagedSchemaAPI.test-seed#[C9178EAC76EBE3B1]) [    ] o.a.s.c.c.ConnectionManager Client is connected to ZooKeeper
   [junit4]   2> 2702329 INFO  (TEST-TestManagedSchemaAPI.test-seed#[C9178EAC76EBE3B1]) [    ] o.a.s.c.c.SolrZkClient Using default ZkACLProvider
   [junit4]   2> 2702330 INFO  (TEST-TestManagedSchemaAPI.test-seed#[C9178EAC76EBE3B1]) [    ] o.a.s.c.c.SolrZkClient makePath: /configs/conf1/managed-schema
   [junit4]   2> 2702335 INFO  (TEST-TestManagedSchemaAPI.test-seed#[C9178EAC76EBE3B1]) [    ] o.a.s.c.c.SolrZkClient makePath: /configs/conf1/solrconfig.xml
   [junit4]   2> 2702338 INFO  (TEST-TestManagedSchemaAPI.test-seed#[C9178EAC76EBE3B1]) [    ] o.a.s.c.c.SolrZkClient Using default ZkCredentialsProvider
   [junit4]   2> 2702339 INFO  (TEST-TestManagedSchemaAPI.test-seed#[C9178EAC76EBE3B1]) [    ] o.a.s.c.c.ConnectionManager Waiting for client to connect to ZooKeeper
   [junit4]   2> 2702340 INFO  (zkCallback-10197-thread-1) [    ] o.a.s.c.c.ConnectionManager Watcher org.apache.solr.common.cloud.ConnectionManager@19d0016 name:ZooKeeperConnection Watcher:127.0.0.1:49699/solr got event WatchedEvent state:SyncConnected type:None path:null path:null type:None
   [junit4]   2> 2702341 INFO  (TEST-TestManagedSchemaAPI.test-seed#[C9178EAC76EBE3B1]) [    ] o.a.s.c.c.ConnectionManager Client is connected to ZooKeeper
   [junit4]   2> 2702341 INFO  (TEST-TestManagedSchemaAPI.test-seed#[C9178EAC76EBE3B1]) [    ] o.a.s.c.c.SolrZkClient Using default ZkACLProvider
   [junit4]   2> 2702341 INFO  (TEST-TestManagedSchemaAPI.test-seed#[C9178EAC76EBE3B1]) [    ] o.a.s.c.c.ZkStateReader Updating cluster state from ZooKeeper... 
   [junit4]   2> 2702348 INFO  (qtp15880046-44891) [n:127.0.0.1:49706_solr    ] o.a.s.h.a.CollectionsHandler Invoked Collection Action :create with params replicationFactor=2&collection.configName=conf1&name=testschemaapi&action=CREATE&numShards=1&wt=javabin&version=2 and sendToOCPQueue=true
   [junit4]   2> 2702351 INFO  (OverseerCollectionConfigSetProcessor-98857760121159686-127.0.0.1:49703_solr-n_0000000000) [n:127.0.0.1:49703_solr    ] o.a.s.c.OverseerTaskProcessor Overseer Collection Message Handler: Get the message id:/overseer/collection-queue-work/qn-0000000000 message:{
   [junit4]   2>   "name":"testschemaapi",
   [junit4]   2>   "fromApi":"true",
   [junit4]   2>   "replicationFactor":"2",
   [junit4]   2>   "collection.configName":"conf1",
   [junit4]   2>   "numShards":"1",
   [junit4]   2>   "stateFormat":"2",
   [junit4]   2>   "operation":"create"}
   [junit4]   2> 2702351 INFO  (OverseerThreadFactory-10683-thread-1-processing-n:127.0.0.1:49703_solr) [n:127.0.0.1:49703_solr    ] o.a.s.c.OverseerCollectionMessageHandler OverseerCollectionMessageHandler.processMessage : create , {
   [junit4]   2>   "name":"testschemaapi",
   [junit4]   2>   "fromApi":"true",
   [junit4]   2>   "replicationFactor":"2",
   [junit4]   2>   "collection.configName":"conf1",
   [junit4]   2>   "numShards":"1",
   [junit4]   2>   "stateFormat":"2",
   [junit4]   2>   "operation":"create"}
   [junit4]   2> 2702353 INFO  (OverseerThreadFactory-10683-thread-1-processing-n:127.0.0.1:49703_solr) [n:127.0.0.1:49703_solr    ] o.a.s.c.OverseerCollectionMessageHandler Create collection testschemaapi
   [junit4]   2> 2702354 INFO  (OverseerThreadFactory-10683-thread-1-processing-n:127.0.0.1:49703_solr) [n:127.0.0.1:49703_solr    ] o.a.s.c.OverseerCollectionMessageHandler creating collections conf node /collections/testschemaapi 
   [junit4]   2> 2702354 INFO  (OverseerThreadFactory-10683-thread-1-processing-n:127.0.0.1:49703_solr) [n:127.0.0.1:49703_solr    ] o.a.s.c.c.SolrZkClient makePath: /collections/testschemaapi
   [junit4]   2> 2702356 INFO  (zkCallback-10193-thread-1-processing-n:127.0.0.1:49706_solr) [n:127.0.0.1:49706_solr    ] o.a.s.c.c.ZkStateReader A collections change: [WatchedEvent state:SyncConnected type:NodeChildrenChanged path:/collections], has occurred - updating...
   [junit4]   2> 2702356 INFO  (zkCallback-10192-thread-1-processing-n:127.0.0.1:49703_solr) [n:127.0.0.1:49703_solr    ] o.a.s.c.c.ZkStateReader A collections change: [WatchedEvent state:SyncConnected type:NodeChildrenChanged path:/collections], has occurred - updating...
   [junit4]   2> 2702356 INFO  (zkCallback-10197-thread-1) [    ] o.a.s.c.c.ZkStateReader A collections change: [WatchedEvent state:SyncConnected type:NodeChildrenChanged path:/collections], has occurred - updating...
   [junit4]   2> 2702361 INFO  (OverseerStateUpdate-98857760121159686-127.0.0.1:49703_solr-n_0000000000) [n:127.0.0.1:49703_solr    ] o.a.s.c.Overseer processMessage: queueSize: 1, message = {
   [junit4]   2>   "name":"testschemaapi",
   [junit4]   2>   "fromApi":"true",
   [junit4]   2>   "replicationFactor":"2",
   [junit4]   2>   "collection.configName":"conf1",
   [junit4]   2>   "numShards":"1",
   [junit4]   2>   "stateFormat":"2",
   [junit4]   2>   "operation":"create"} current state version: 0
   [junit4]   2> 2702361 INFO  (OverseerStateUpdate-98857760121159686-127.0.0.1:49703_solr-n_0000000000) [n:127.0.0.1:49703_solr    ] o.a.s.c.o.ClusterStateMutator building a new cName: testschemaapi
   [junit4]   2> 2702363 INFO  (OverseerStateUpdate-98857760121159686-127.0.0.1:49703_solr-n_0000000000) [n:127.0.0.1:49703_solr    ] o.a.s.c.o.ZkStateWriter going to create_collection /collections/testschemaapi/state.json
   [junit4]   2> 2702460 INFO  (OverseerThreadFactory-10683-thread-1-processing-n:127.0.0.1:49703_solr) [n:127.0.0.1:49703_solr    ] o.a.s.c.OverseerCollectionMessageHandler Creating SolrCores for new collection testschemaapi, shardNames [shard1] , replicationFactor : 2
   [junit4]   2> 2702461 INFO  (OverseerThreadFactory-10683-thread-1-processing-n:127.0.0.1:49703_solr) [n:127.0.0.1:49703_solr    ] o.a.s.c.OverseerCollectionMessageHandler Creating core testschemaapi_shard1_replica1 as part of shard shard1 of collection testschemaapi on 127.0.0.1:49706_solr
   [junit4]   2> 2702462 INFO  (OverseerThreadFactory-10683-thread-1-processing-n:127.0.0.1:49703_solr) [n:127.0.0.1:49703_solr    ] o.a.s.c.OverseerCollectionMessageHandler Creating core testschemaapi_shard1_replica2 as part of shard shard1 of collection testschemaapi on 127.0.0.1:49703_solr
   [junit4]   2> 2702467 INFO  (qtp9448847-44881) [n:127.0.0.1:49703_solr    ] o.a.s.h.a.CoreAdminOperation core create command qt=/admin/cores&collection.configName=conf1&name=testschemaapi_shard1_replica2&action=CREATE&numShards=1&collection=testschemaapi&shard=shard1&wt=javabin&version=2
   [junit4]   2> 2702468 INFO  (qtp15880046-44894) [n:127.0.0.1:49706_solr    ] o.a.s.h.a.CoreAdminOperation core create command qt=/admin/cores&collection.configName=conf1&name=testschemaapi_shard1_replica1&action=CREATE&numShards=1&collection=testschemaapi&shard=shard1&wt=javabin&version=2
   [junit4]   2> 2702469 INFO  (qtp15880046-44894) [n:127.0.0.1:49706_solr    ] o.a.s.c.CoreDescriptor Created CoreDescriptor: {name=testschemaapi_shard1_replica1, collection.configName=conf1, config=solrconfig.xml, transient=false, schema=schema.xml, loadOnStartup=true, configSetProperties=configsetprops.json, collection=testschemaapi, numShards=1, dataDir=data\, shard=shard1}
   [junit4]   2> 2702469 INFO  (qtp9448847-44881) [n:127.0.0.1:49703_solr    ] o.a.s.c.CoreDescriptor Created CoreDescriptor: {name=testschemaapi_shard1_replica2, collection.configName=conf1, config=solrconfig.xml, transient=false, schema=schema.xml, loadOnStartup=true, configSetProperties=configsetprops.json, collection=testschemaapi, numShards=1, dataDir=data\, shard=shard1}
   [junit4]   2> 2702472 INFO  (qtp15880046-44894) [n:127.0.0.1:49706_solr c:testschemaapi s:shard1  x:testschemaapi_shard1_replica1] o.a.s.c.ZkController publishing state=down
   [junit4]   2> 2702472 INFO  (qtp9448847-44881) [n:127.0.0.1:49703_solr c:testschemaapi s:shard1  x:testschemaapi_shard1_replica2] o.a.s.c.ZkController publishing state=down
   [junit4]   2> 2702475 INFO  (qtp15880046-44894) [n:127.0.0.1:49706_solr c:testschemaapi s:shard1  x:testschemaapi_shard1_replica1] o.a.s.c.ZkController Registering watch for collection testschemaapi
   [junit4]   2> 2702475 INFO  (qtp15880046-44894) [n:127.0.0.1:49706_solr c:testschemaapi s:shard1  x:testschemaapi_shard1_replica1] o.a.s.c.c.ZkStateReader addZkWatch [testschemaapi]
   [junit4]   2> 2702475 INFO  (qtp9448847-44881) [n:127.0.0.1:49703_solr c:testschemaapi s:shard1  x:testschemaapi_shard1_replica2] o.a.s.c.ZkController Registering watch for collection testschemaapi
   [junit4]   2> 2702475 INFO  (qtp9448847-44881) [n:127.0.0.1:49703_solr c:testschemaapi s:shard1  x:testschemaapi_shard1_replica2] o.a.s.c.c.ZkStateReader addZkWatch [testschemaapi]
   [junit4]   2> 2702475 INFO  (OverseerStateUpdate-98857760121159686-127.0.0.1:49703_solr-n_0000000000) [n:127.0.0.1:49703_solr    ] o.a.s.c.Overseer processMessage: queueSize: 2, message = {
   [junit4]   2>   "core":"testschemaapi_shard1_replica1",
   [junit4]   2>   "roles":null,
   [junit4]   2>   "base_url":"http://127.0.0.1:49706/solr",
   [junit4]   2>   "node_name":"127.0.0.1:49706_solr",
   [junit4]   2>   "numShards":"1",
   [junit4]   2>   "state":"down",
   [junit4]   2>   "shard":"shard1",
   [junit4]   2>   "collection":"testschemaapi",
   [junit4]   2>   "operation":"state"} current state version: 0
   [junit4]   2> 2702476 INFO  (qtp15880046-44894) [n:127.0.0.1:49706_solr c:testschemaapi s:shard1  x:testschemaapi_shard1_replica1] o.a.s.c.c.ZkStateReader Add data for [testschemaapi] ver [0]
   [junit4]   2> 2702476 INFO  (OverseerStateUpdate-98857760121159686-127.0.0.1:49703_solr-n_0000000000) [n:127.0.0.1:49703_solr    ] o.a.s.c.o.ReplicaMutator Update state numShards=1 message={
   [junit4]   2>   "core":"testschemaapi_shard1_replica1",
   [junit4]   2>   "roles":null,
   [junit4]   2>   "base_url":"http://127.0.0.1:49706/solr",
   [junit4]   2>   "node_name":"127.0.0.1:49706_solr",
   [junit4]   2>   "numShards":"1",
   [junit4]   2>   "state":"down",
   [junit4]   2>   "shard":"shard1",
   [junit4]   2>   "collection":"testschemaapi",
   [junit4]   2>   "operation":"state"}
   [junit4]   2> 2702476 INFO  (qtp15880046-44894) [n:127.0.0.1:49706_solr c:testschemaapi s:shard1  x:testschemaapi_shard1_replica1] o.a.s.c.ZkController look for our core node name
   [junit4]   2> 2702476 INFO  (qtp9448847-44881) [n:127.0.0.1:49703_solr c:testschemaapi s:shard1  x:testschemaapi_shard1_replica2] o.a.s.c.c.ZkStateReader Add data for [testschemaapi] ver [0]
   [junit4]   2> 2702476 INFO  (qtp9448847-44881) [n:127.0.0.1:49703_solr c:testschemaapi s:shard1  x:testschemaapi_shard1_replica2] o.a.s.c.ZkController look for our core node name
   [junit4]   2> 2702479 INFO  (OverseerStateUpdate-98857760121159686-127.0.0.1:49703_solr-n_0000000000) [n:127.0.0.1:49703_solr    ] o.a.s.c.Overseer processMessage: queueSize: 1, message = {
   [junit4]   2>   "core":"testschemaapi_shard1_replica2",
   [junit4]   2>   "roles":null,
   [junit4]   2>   "base_url":"http://127.0.0.1:49703/solr",
   [junit4]   2>   "node_name":"127.0.0.1:49703_solr",
   [junit4]   2>   "numShards":"1",
   [junit4]   2>   "state":"down",
   [junit4]   2>   "shard":"shard1",
   [junit4]   2>   "collection":"testschemaapi",
   [junit4]   2>   "operation":"state"} current state version: 0
   [junit4]   2> 2702480 INFO  (OverseerStateUpdate-98857760121159686-127.0.0.1:49703_solr-n_0000000000) [n:127.0.0.1:49703_solr    ] o.a.s.c.o.ReplicaMutator Update state numShards=1 message={
   [junit4]   2>   "core":"testschemaapi_shard1_replica2",
   [junit4]   2>   "roles":null,
   [junit4]   2>   "base_url":"http://127.0.0.1:49703/solr",
   [junit4]   2>   "node_name":"127.0.0.1:49703_solr",
   [junit4]   2>   "numShards":"1",
   [junit4]   2>   "state":"down",
   [junit4]   2>   "shard":"shard1",
   [junit4]   2>   "collection":"testschemaapi",
   [junit4]   2>   "operation":"state"}
   [junit4]   2> 2702585 INFO  (OverseerStateUpdate-98857760121159686-127.0.0.1:49703_solr-n_0000000000) [n:127.0.0.1:49703_solr    ] o.a.s.c.o.ZkStateWriter going to update_collection /collections/testschemaapi/state.json version: 0
   [junit4]   2> 2702587 INFO  (zkCallback-10192-thread-1-processing-n:127.0.0.1:49703_solr) [n:127.0.0.1:49703_solr    ] o.a.s.c.c.ZkStateReader A cluster state change: [WatchedEvent state:SyncConnected type:NodeDataChanged path:/collections/testschemaapi/state.json] for collection [testschemaapi] has occurred - updating... (live nodes size: [2])
   [junit4]   2> 2702587 INFO  (zkCallback-10193-thread-1-processing-n:127.0.0.1:49706_solr) [n:127.0.0.1:49706_solr    ] o.a.s.c.c.ZkStateReader A cluster state change: [WatchedEvent state:SyncConnected type:NodeDataChanged path:/collections/testschemaapi/state.json] for collection [testschemaapi] has occurred - updating... (live nodes size: [2])
   [junit4]   2> 2702588 INFO  (zkCallback-10192-thread-1-processing-n:127.0.0.1:49703_solr) [n:127.0.0.1:49703_solr    ] o.a.s.c.c.ZkStateReader Updating data for [testschemaapi] from [0] to [1]
   [junit4]   2> 2702588 INFO  (zkCallback-10193-thread-1-processing-n:127.0.0.1:49706_solr) [n:127.0.0.1:49706_solr    ] o.a.s.c.c.ZkStateReader Updating data for [testschemaapi] from [0] to [1]
   [junit4]   2> 2703482 INFO  (qtp9448847-44881) [n:127.0.0.1:49703_solr c:testschemaapi s:shard1  x:testschemaapi_shard1_replica2] o.a.s.c.ZkController waiting to find shard id in clusterstate for testschemaapi_shard1_replica2
   [junit4]   2> 2703482 INFO  (qtp9448847-44881) [n:127.0.0.1:49703_solr c:testschemaapi s:shard1  x:testschemaapi_shard1_replica2] o.a.s.c.ZkController Check for collection zkNode:testschemaapi
   [junit4]   2> 2703482 INFO  (qtp15880046-44894) [n:127.0.0.1:49706_solr c:testschemaapi s:shard1  x:testschemaapi_shard1_replica1] o.a.s.c.ZkController waiting to find shard id in clusterstate for testschemaapi_shard1_replica1
   [junit4]   2> 2703483 INFO  (qtp15880046-44894) [n:127.0.0.1:49706_solr c:testschemaapi s:shard1  x:testschemaapi_shard1_replica1] o.a.s.c.ZkController Check for collection zkNode:testschemaapi
   [junit4]   2> 2703483 INFO  (qtp9448847-44881) [n:127.0.0.1:49703_solr c:testschemaapi s:shard1  x:testschemaapi_shard1_replica2] o.a.s.c.ZkController Collection zkNode exists
   [junit4]   2> 2703483 INFO  (qtp15880046-44894) [n:127.0.0.1:49706_solr c:testschemaapi s:shard1  x:testschemaapi_shard1_replica1] o.a.s.c.ZkController Collection zkNode exists
   [junit4]   2> 2703483 INFO  (qtp9448847-44881) [n:127.0.0.1:49703_solr c:testschemaapi s:shard1  x:testschemaapi_shard1_replica2] o.a.s.c.c.ZkStateReader Load collection config from: [/collections/testschemaapi]
   [junit4]   2> 2703483 INFO  (qtp15880046-44894) [n:127.0.0.1:49706_solr c:testschemaapi s:shard1  x:testschemaapi_shard1_replica1] o.a.s.c.c.ZkStateReader Load collection config from: [/collections/testschemaapi]
   [junit4]   2> 2703485 INFO  (qtp9448847-44881) [n:127.0.0.1:49703_solr c:testschemaapi s:shard1  x:testschemaapi_shard1_replica2] o.a.s.c.c.ZkStateReader path=[/collections/testschemaapi] [configName]=[conf1] specified config exists in ZooKeeper
   [junit4]   2> 2703485 INFO  (qtp15880046-44894) [n:127.0.0.1:49706_solr c:testschemaapi s:shard1  x:testschemaapi_shard1_replica1] o.a.s.c.c.ZkStateReader path=[/collections/testschemaapi] [configName]=[conf1] specified config exists in ZooKeeper
   [junit4]   2> 2703485 INFO  (qtp9448847-44881) [n:127.0.0.1:49703_solr c:testschemaapi s:shard1  x:testschemaapi_shard1_replica2] o.a.s.c.SolrResourceLoader new SolrResourceLoader for directory: 'C:\Users\jenkins\workspace\Lucene-Solr-5.5-Windows\solr\build\solr-core\test\J1\temp\solr.schema.TestManagedSchemaAPI_C9178EAC76EBE3B1-001\tempDir-001\node2\testschemaapi_shard1_replica2'
   [junit4]   2> 2703485 INFO  (qtp15880046-44894) [n:127.0.0.1:49706_solr c:testschemaapi s:shard1  x:testschemaapi_shard1_replica1] o.a.s.c.SolrResourceLoader new SolrResourceLoader for directory: 'C:\Users\jenkins\workspace\Lucene-Solr-5.5-Windows\solr\build\solr-core\test\J1\temp\solr.schema.TestManagedSchemaAPI_C9178EAC76EBE3B1-001\tempDir-001\node1\testschemaapi_shard1_replica1'
   [junit4]   2> 2703485 INFO  (qtp9448847-44881) [n:127.0.0.1:49703_solr c:testschemaapi s:shard1  x:testschemaapi_shard1_replica2] o.a.s.c.SolrResourceLoader JNDI not configured for solr (NoInitialContextEx)
   [junit4]   2> 2703485 INFO  (qtp9448847-44881) [n:127.0.0.1:49703_solr c:testschemaapi s:shard1  x:testschemaapi_shard1_replica2] o.a.s.c.SolrResourceLoader solr home defaulted to 'solr/' (could not find system property or JNDI)
   [junit4]   2> 2703485 INFO  (qtp15880046-44894) [n:127.0.0.1:49706_solr c:testschemaapi s:shard1  x:testschemaapi_shard1_replica1] o.a.s.c.SolrResourceLoader JNDI not configured for solr (NoInitialContextEx)
   [junit4]   2> 2703486 INFO  (qtp15880046-44894) [n:127.0.0.1:49706_solr c:testschemaapi s:shard1  x:testschemaapi_shard1_replica1] o.a.s.c.SolrResourceLoader solr home defaulted to 'solr/' (could not find system property or JNDI)
   [junit4]   2> 2703489 INFO  (qtp15880046-44894) [n:127.0.0.1:49706_solr c:testschemaapi s:shard1  x:testschemaapi_shard1_replica1] o.a.s.c.Config loaded config solrconfig.xml with version 0 
   [junit4]   2> 2703489 INFO  (qtp9448847-44881) [n:127.0.0.1:49703_solr c:testschemaapi s:shard1  x:testschemaapi_shard1_replica2] o.a.s.c.Config loaded config solrconfig.xml with version 0 
   [junit4]   2> 2703497 INFO  (qtp9448847-44881) [n:127.0.0.1:49703_solr c:testschemaapi s:shard1  x:testschemaapi_shard1_replica2] o.a.s.c.SolrConfig current version of requestparams : -1
   [junit4]   2> 2703497 INFO  (qtp15880046-44894) [n:127.0.0.1:49706_solr c:testschemaapi s:shard1  x:testschemaapi_shard1_replica1] o.a.s.c.SolrConfig current version of requestparams : -1
   [junit4]   2> 2703500 INFO  (qtp9448847-44881) [n:127.0.0.1:49703_solr c:testschemaapi s:shard1  x:testschemaapi_shard1_replica2] o.a.s.c.SolrConfig Using Lucene MatchVersion: 5.5.5
   [junit4]   2> 2703500 INFO  (qtp15880046-44894) [n:127.0.0.1:49706_solr c:testschemaapi s:shard1  x:testschemaapi_shard1_replica1] o.a.s.c.SolrConfig Using Lucene MatchVersion: 5.5.5
   [junit4]   2> 2703513 INFO  (qtp9448847-44881) [n:127.0.0.1:49703_solr c:testschemaapi s:shard1  x:testschemaapi_shard1_replica2] o.a.s.c.SolrConfig Loaded SolrConfig: solrconfig.xml
   [junit4]   2> 2703513 INFO  (qtp15880046-44894) [n:127.0.0.1:49706_solr c:testschemaapi s:shard1  x:testschemaapi_shard1_replica1] o.a.s.c.SolrConfig Loaded SolrConfig: solrconfig.xml
   [junit4]   2> 2703518 INFO  (qtp9448847-44881) [n:127.0.0.1:49703_solr c:testschemaapi s:shard1  x:testschemaapi_shard1_replica2] o.a.s.s.IndexSchema [testschemaapi_shard1_replica2] Schema name=minimal
   [junit4]   2> 2703518 INFO  (qtp15880046-44894) [n:127.0.0.1:49706_solr c:testschemaapi s:shard1  x:testschemaapi_shard1_replica1] o.a.s.s.IndexSchema [testschemaapi_shard1_replica1] Schema name=minimal
   [junit4]   2> 2703524 INFO  (qtp9448847-44881) [n:127.0.0.1:49703_solr c:testschemaapi s:shard1  x:testschemaapi_shard1_replica2] o.a.s.s.IndexSchema unique key field: id
   [junit4]   2> 2703524 INFO  (qtp15880046-44894) [n:127.0.0.1:49706_solr c:testschemaapi s:shard1  x:testschemaapi_shard1_replica1] o.a.s.s.IndexSchema unique key field: id
   [junit4]   2> 2703529 INFO  (qtp9448847-44881) [n:127.0.0.1:49703_solr c:testschemaapi s:shard1  x:testschemaapi_shard1_replica2] o.a.s.c.ConfigSetProperties Did not find ConfigSet properties, assuming default properties: Can't find resource 'configsetprops.json' in classpath or '/configs/conf1', cwd=C:\Users\jenkins\workspace\Lucene-Solr-5.5-Windows\solr\build\solr-core\test\J1
   [junit4]   2> 2703529 INFO  (qtp15880046-44894) [n:127.0.0.1:49706_solr c:testschemaapi s:shard1  x:testschemaapi_shard1_replica1] o.a.s.c.ConfigSetProperties Did not find ConfigSet properties, assuming default properties: Can't find resource 'configsetprops.json' in classpath or '/configs/conf1', cwd=C:\Users\jenkins\workspace\Lucene-Solr-5.5-Windows\solr\build\solr-core\test\J1
   [junit4]   2> 2703529 INFO  (qtp9448847-44881) [n:127.0.0.1:49703_solr c:testschemaapi s:shard1  x:testschemaapi_shard1_replica2] o.a.s.c.CoreContainer Creating SolrCore 'testschemaapi_shard1_replica2' using configuration from collection testschemaapi
   [junit4]   2> 2703529 INFO  (qtp15880046-44894) [n:127.0.0.1:49706_solr c:testschemaapi s:shard1  x:testschemaapi_shard1_replica1] o.a.s.c.CoreContainer Creating SolrCore 'testschemaapi_shard1_replica1' using configuration from collection testschemaapi
   [junit4]   2> 2703530 INFO  (qtp15880046-44894) [n:127.0.0.1:49706_solr c:testschemaapi s:shard1 r:core_node1 x:testschemaapi_shard1_replica1] o.a.s.c.SolrCore org.apache.solr.core.MockDirectoryFactory
   [junit4]   2> 2703530 INFO  (qtp9448847-44881) [n:127.0.0.1:49703_solr c:testschemaapi s:shard1 r:core_node2 x:testschemaapi_shard1_replica2] o.a.s.c.SolrCore org.apache.solr.core.MockDirectoryFactory
   [junit4]   2> 2703530 INFO  (qtp15880046-44894) [n:127.0.0.1:49706_solr c:testschemaapi s:shard1 r:core_node1 x:testschemaapi_shard1_replica1] o.a.s.c.SolrCore [[testschemaapi_shard1_replica1] ] Opening new SolrCore at [C:\Users\jenkins\workspace\Lucene-Solr-5.5-Windows\solr\build\solr-core\test\J1\temp\solr.schema.TestManagedSchemaAPI_C9178EAC76EBE3B1-001\tempDir-001\node1\testschemaapi_shard1_replica1], dataDir=[C:\Users\jenkins\workspace\Lucene-Solr-5.5-Windows\solr\build\solr-core\test\J1\temp\solr.schema.TestManagedSchemaAPI_C9178EAC76EBE3B1-001\tempDir-001\node1\.\testschemaapi_shard1_replica1\data\]
   [junit4]   2> 2703530 INFO  (qtp9448847-44881) [n:127.0.0.1:49703_solr c:testschemaapi s:shard1 r:core_node2 x:testschemaapi_shard1_replica2] o.a.s.c.SolrCore [[testschemaapi_shard1_replica2] ] Opening new SolrCore at [C:\Users\jenkins\workspace\Lucene-Solr-5.5-Windows\solr\build\solr-core\test\J1\temp\solr.schema.TestManagedSchemaAPI_C9178EAC76EBE3B1-001\tempDir-001\node2\testschemaapi_shard1_replica2], dataDir=[C:\Users\jenkins\workspace\Lucene-Solr-5.5-Windows\solr\build\solr-core\test\J1\temp\solr.schema.TestManagedSchemaAPI_C9178EAC76EBE3B1-001\tempDir-001\node2\.\testschemaapi_shard1_replica2\data\]
   [junit4]   2> 2703530 INFO  (qtp15880046-44894) [n:127.0.0.1:49706_solr c:testschemaapi s:shard1 r:core_node1 x:testschemaapi_shard1_replica1] o.a.s.c.SolrCore JMX monitoring not detected for core: testschemaapi_shard1_replica1
   [junit4]   2> 2703530 INFO  (qtp9448847-44881) [n:127.0.0.1:49703_solr c:testschemaapi s:shard1 r:core_node2 x:testschemaapi_shard1_replica2] o.a.s.c.SolrCore JMX monitoring not detected for core: testschemaapi_shard1_replica2
   [junit4]   2> 2703530 INFO  (qtp15880046-44894) [n:127.0.0.1:49706_solr c:testschemaapi s:shard1 r:core_node1 x:testschemaapi_shard1_replica1] o.a.s.c.CachingDirectoryFactory return new directory for C:\Users\jenkins\workspace\Lucene-Solr-5.5-Windows\solr\build\solr-core\test\J1\temp\solr.schema.TestManagedSchemaAPI_C9178EAC76EBE3B1-001\tempDir-001\node1\.\testschemaapi_shard1_replica1\data\
   [junit4]   2> 2703530 INFO  (qtp9448847-44881) [n:127.0.0.1:49703_solr c:testschemaapi s:shard1 r:core_node2 x:testschemaapi_shard1_replica2] o.a.s.c.CachingDirectoryFactory return new directory for C:\Users\jenkins\workspace\Lucene-Solr-5.5-Windows\solr\build\solr-core\test\J1\temp\solr.schema.TestManagedSchemaAPI_C9178EAC76EBE3B1-001\tempDir-001\node2\.\testschemaapi_shard1_replica2\data\
   [junit4]   2> 2703530 INFO  (qtp15880046-44894) [n:127.0.0.1:49706_solr c:testschemaapi s:shard1 r:core_node1 x:testschemaapi_shard1_replica1] o.a.s.c.SolrCore New index directory detected: old=null new=C:\Users\jenkins\workspace\Lucene-Solr-5.5-Windows\solr\build\solr-core\test\J1\temp\solr.schema.TestManagedSchemaAPI_C9178EAC76EBE3B1-001\tempDir-001\node1\.\testschemaapi_shard1_replica1\data\index/
   [junit4]   2> 2703530 INFO  (qtp9448847-44881) [n:127.0.0.1:49703_solr c:testschemaapi s:shard1 r:core_node2 x:testschemaapi_shard1_replica2] o.a.s.c.SolrCore New index directory detected: old=null new=C:\Users\jenkins\workspace\Lucene-Solr-5.5-Windows\solr\build\solr-core\test\J1\temp\solr.schema.TestManagedSchemaAPI_C9178EAC76EBE3B1-001\tempDir-001\node2\.\testschemaapi_shard1_replica2\data\index/
   [junit4]   2> 2703530 WARN  (qtp15880046-44894) [n:127.0.0.1:49706_solr c:testschemaapi s:shard1 r:core_node1 x:testschemaapi_shard1_replica1] o.a.s.c.SolrCore [testschemaapi_shard1_replica1] Solr index directory 'C:\Users\jenkins\workspace\Lucene-Solr-5.5-Windows\solr\build\solr-core\test\J1\temp\solr.schema.TestManagedSchemaAPI_C9178EAC76EBE3B1-001\tempDir-001\node1\.\testschemaapi_shard1_replica1\data\index' doesn't exist. Creating new index...
   [junit4]   2> 2703530 WARN  (qtp9448847-44881) [n:127.0.0.1:49703_solr c:testschemaapi s:shard1 r:core_node2 x:testschemaapi_shard1_replica2] o.a.s.c.SolrCore [testschemaapi_shard1_replica2] Solr index directory 'C:\Users\jenkins\workspace\Lucene-Solr-5.5-Windows\solr\build\solr-core\test\J1\temp\solr.schema.TestManagedSchemaAPI_C9178EAC76EBE3B1-001\tempDir-001\node2\.\testschemaapi_shard1_replica2\data\index' doesn't exist. Creating new index...
   [junit4]   2> 2703530 INFO  (qtp15880046-44894) [n:127.0.0.1:49706_solr c:testschemaapi s:shard1 r:core_node1 x:testschemaapi_shard1_replica1] o.a.s.c.CachingDirectoryFactory return new directory for C:\Users\jenkins\workspace\Lucene-Solr-5.5-Windows\solr\build\solr-core\test\J1\temp\solr.schema.TestManagedSchemaAPI_C9178EAC76EBE3B1-001\tempDir-001\node1\.\testschemaapi_shard1_replica1\data\index
   [junit4]   2> 2703530 INFO  (qtp9448847-44881) [n:127.0.0.1:49703_solr c:testschemaapi s:shard1 r:core_node2 x:testschemaapi_shard1_replica2] o.a.s.c.CachingDirectoryFactory return new directory for C:\Users\jenkins\workspace\Lucene-Solr-5.5-Windows\solr\build\solr-core\test\J1\temp\solr.schema.TestManagedSchemaAPI_C9178EAC76EBE3B1-001\tempDir-001\node2\.\testschemaapi_shard1_replica2\data\index
   [junit4]   2> 2703534 INFO  (qtp15880046-44894) [n:127.0.0.1:49706_solr c:testschemaapi s:shard1 r:core_node1 x:testschemaapi_shard1_replica1] o.a.s.c.SolrDeletionPolicy SolrDeletionPolicy.onCommit: commits: num=1
   [junit4]   2> 	commit{dir=MockDirectoryWrapper(RAMDirectory@9da97e lockFactory=org.apache.lucene.store.SingleInstanceLockFactory@23b7d8),segFN=segments_1,generation=1}
   [junit4]   2> 2703534 INFO  (qtp15880046-44894) [n:127.0.0.1:49706_solr c:testschemaapi s:shard1 r:core_node1 x:testschemaapi_shard1_replica1] o.a.s.c.SolrDeletionPolicy newest commit generation = 1
   [junit4]   2> 2703534 INFO  (qtp9448847-44881) [n:127.0.0.1:49703_solr c:testschemaapi s:shard1 r:core_node2 x:testschemaapi_shard1_replica2] o.a.s.c.SolrDeletionPolicy SolrDeletionPolicy.onCommit: commits: num=1
   [junit4]   2> 	commit{dir=MockDirectoryWrapper(RAMDirectory@1854bcf lockFactory=org.apache.lucene.store.SingleInstanceLockFactory@23aed4),segFN=segments_1,generation=1}
   [junit4]   2> 2703534 INFO  (qtp9448847-44881) [n:127.0.0.1:49703_solr c:testschemaapi s:shard1 r:core_node2 x:testschemaapi_shard1_replica2] o.a.s.c.SolrDeletionPolicy newest commit generation = 1
   [junit4]   2> 2703537 INFO  (qtp15880046-44894) [n:127.0.0.1:49706_solr c:testschemaapi s:shard1 r:core_node1 x:testschemaapi_shard1_replica1] o.a.s.c.SolrCore no updateRequestProcessorChain defined as default, creating implicit default
   [junit4]   2> 2703537 INFO  (qtp9448847-44881) [n:127.0.0.1:49703_solr c:testschemaapi s:shard1 r:core_node2 x:testschemaapi_shard1_replica2] o.a.s.c.SolrCore no updateRequestProcessorChain defined as default, creating implicit default
   [junit4]   2> 2703538 INFO  (OldIndexDirectoryCleanupThreadForCore-testschemaapi_shard1_replica2) [n:127.0.0.1:49703_solr c:testschemaapi s:shard1 r:core_node2 x:testschemaapi_shard1_replica2] o.a.s.c.SolrCore Looking for old index directories to cleanup for core testschemaapi_shard1_replica2 in C:\Users\jenkins\workspace\Lucene-Solr-5.5-Windows\solr\build\solr-core\test\J1\temp\solr.schema.TestManagedSchemaAPI_C9178EAC76EBE3B1-001\tempDir-001\node2\.\testschemaapi_shard1_replica2\data\
   [junit4]   2> 2703539 INFO  (OldIndexDirectoryCleanupThreadForCore-testschemaapi_shard1_replica1) [n:127.0.0.1:49706_solr c:testschemaapi s:shard1 r:core_node1 x:testschemaapi_shard1_replica1] o.a.s.c.SolrCore Looking for old index directories to cleanup for core testschemaapi_shard1_replica1 in C:\Users\jenkins\workspace\Lucene-Solr-5.5-Windows\solr\build\solr-core\test\J1\temp\solr.schema.TestManagedSchemaAPI_C9178EAC76EBE3B1-001\tempDir-001\node1\.\testschemaapi_shard1_replica1\data\
   [junit4]   2> 2703540 WARN  (OldIndexDirectoryCleanupThreadForCore-testschemaapi_shard1_replica1) [n:127.0.0.1:49706_solr c:testschemaapi s:shard1 r:core_node1 x:testschemaapi_shard1_replica1] o.a.s.c.DirectoryFactory C:\Users\jenkins\workspace\Lucene-Solr-5.5-Windows\solr\build\solr-core\test\J1\temp\solr.schema.TestManagedSchemaAPI_C9178EAC76EBE3B1-001\tempDir-001\node1\.\testschemaapi_shard1_replica1\data\ does not point to a valid data directory; skipping clean-up of old index directories.
   [junit4]   2> 2703542 WARN  (OldIndexDirectoryCleanupThreadForCore-testschemaapi_shard1_replica2) [n:127.0.0.1:49703_solr c:testschemaapi s:shard1 r:core_node2 x:testschemaapi_shard1_replica2] o.a.s.c.DirectoryFactory C:\Users\jenkins\workspace\Lucene-Solr-5.5-Windows\solr\build\solr-core\test\J1\temp\solr.schema.TestManagedSchemaAPI_C9178EAC76EBE3B1-001\tempDir-001\node2\.\testschemaapi_shard1_replica2\data\ does not point to a valid data directory; skipping clean-up of old index directories.
   [junit4]   2> 2703545 INFO  (qtp9448847-44881) [n:127.0.0.1:49703_solr c:testschemaapi s:shard1 r:core_node2 x:testschemaapi_shard1_replica2] o.a.s.h.l.XMLLoader xsltCacheLifetimeSeconds=60
   [junit4]   2> 2703545 INFO  (qtp15880046-44894) [n:127.0.0.1:49706_solr c:testschemaapi s:shard1 r:core_node1 x:testschemaapi_shard1_replica1] o.a.s.h.l.XMLLoader xsltCacheLifetimeSeconds=60
   [junit4]   2> 2703548 INFO  (qtp9448847-44881) [n:127.0.0.1:49703_solr c:testschemaapi s:shard1 r:core_node2 x:testschemaapi_shard1_replica2] o.a.s.h.l.XMLLoader xsltCacheLifetimeSeconds=60
   [junit4]   2> 2703548 INFO  (qtp15880046-44894) [n:127.0.0.1:49706_solr c:testschemaapi s:shard1 r:core_node1 x:testschemaapi_shard1_replica1] o.a.s.h.l.XMLLoader xsltCacheLifetimeSeconds=60
   [junit4]   2> 2703549 INFO  (qtp9448847-44881) [n:127.0.0.1:49703_solr c:testschemaapi s:shard1 r:core_node2 x:testschemaapi_shard1_replica2] o.a.s.h.l.XMLLoader xsltCacheLifetimeSeconds=60
   [junit4]   2> 2703550 INFO  (qtp15880046-44894) [n:127.0.0.1:49706_solr c:testschemaapi s:shard1 r:core_node1 x:testschemaapi_shard1_replica1] o.a.s.h.l.XMLLoader xsltCacheLifetimeSeconds=60
   [junit4]   2> 2703550 INFO  (qtp9448847-44881) [n:127.0.0.1:49703_solr c:testschemaapi s:shard1 r:core_node2 x:testschemaapi_shard1_replica2] o.a.s.h.l.XMLLoader xsltCacheLifetimeSeconds=60
   [junit4]   2> 2703552 INFO  (qtp15880046-44894) [n:127.0.0.1:49706_solr c:testschemaapi s:shard1 r:core_node1 x:testschemaapi_shard1_replica1] o.a.s.h.l.XMLLoader xsltCacheLifetimeSeconds=60
   [junit4]   2> 2703553 INFO  (qtp9448847-44881) [n:127.0.0.1:49703_solr c:testschemaapi s:shard1 r:core_node2 x:testschemaapi_shard1_replica2] o.a.s.c.RequestHandlers Registered paths: /admin/mbeans,/update/csv,/update/json/docs,/admin/luke,/select,/admin/segments,/get,/admin/system,/replication,/admin/properties,/config,/schema,/admin/plugins,/admin/logging,/update/json,/admin/threads,/admin/ping,/update,/admin/file
   [junit4]   2> 2703553 INFO  (qtp9448847-44881) [n:127.0.0.1:49703_solr c:testschemaapi s:shard1 r:core_node2 x:testschemaapi_shard1_replica2] o.a.s.c.SolrCore Using default statsCache cache: org.apache.solr.search.stats.LocalStatsCache
   [junit4]   2> 2703554 INFO  (qtp15880046-44894) [n:127.0.0.1:49706_solr c:testschemaapi s:shard1 r:core_node1 x:testschemaapi_shard1_replica1] o.a.s.c.RequestHandlers Registered paths: /admin/mbeans,/update/csv,/update/json/docs,/admin/luke,/select,/admin/segments,/get,/admin/system,/replication,/admin/properties,/config,/schema,/admin/plugins,/admin/logging,/update/json,/admin/threads,/admin/ping,/update,/admin/file
   [junit4]   2> 2703555 INFO  (qtp15880046-44894) [n:127.0.0.1:49706_solr c:testschemaapi s:shard1 r:core_node1 x:testschemaapi_shard1_replica1] o.a.s.c.SolrCore Using default statsCache cache: org.apache.solr.search.stats.LocalStatsCache
   [junit4]   2> 2703555 INFO  (qtp9448847-44881) [n:127.0.0.1:49703_solr c:testschemaapi s:shard1 r:core_node2 x:testschemaapi_shard1_replica2] o.a.s.u.UpdateHandler Using UpdateLog implementation: org.apache.solr.update.UpdateLog
   [junit4]   2> 2703555 INFO  (qtp9448847-44881) [n:127.0.0.1:49703_solr c:testschemaapi s:shard1 r:core_node2 x:testschemaapi_shard1_replica2] o.a.s.u.UpdateLog Initializing UpdateLog: dataDir=null defaultSyncLevel=FLUSH numRecordsToKeep=100 maxNumLogsToKeep=10 numVersionBuckets=65536
   [junit4]   2> 2703556 INFO  (qtp15880046-44894) [n:127.0.0.1:49706_solr c:testschemaapi s:shard1 r:core_node1 x:testschemaapi_shard1_replica1] o.a.s.u.UpdateHandler Using UpdateLog implementation: org.apache.solr.update.UpdateLog
   [junit4]   2> 2703557 INFO  (qtp15880046-44894) [n:127.0.0.1:49706_solr c:testschemaapi s:shard1 r:core_node1 x:testschemaapi_shard1_replica1] o.a.s.u.UpdateLog Initializing UpdateLog: dataDir=null defaultSyncLevel=FLUSH numRecordsToKeep=100 maxNumLogsToKeep=10 numVersionBuckets=65536
   [junit4]   2> 2703561 INFO  (qtp9448847-44881) [n:127.0.0.1:49703_solr c:testschemaapi s:shard1 r:core_node2 x:testschemaapi_shard1_replica2] o.a.s.u.CommitTracker Hard AutoCommit: disabled
   [junit4]   2> 2703561 INFO  (qtp9448847-44881) [n:127.0.0.1:49703_solr c:testschemaapi s:shard1 r:core_node2 x:testschemaapi_shard1_replica2] o.a.s.u.CommitTracker Soft AutoCommit: disabled
   [junit4]   2> 2703563 INFO  (qtp9448847-44881) [n:127.0.0.1:49703_solr c:testschemaapi s:shard1 r:core_node2 x:testschemaapi_shard1_replica2] o.a.s.c.SolrDeletionPolicy SolrDeletionPolicy.onInit: commits: num=1
   [junit4]   2> 	commit{dir=MockDirectoryWrapper(RAMDirectory@1854bcf lockFactory=org.apache.lucene.store.SingleInstanceLockFactory@23aed4),segFN=segments_1,generation=1}
   [junit4]   2> 2703563 INFO  (qtp9448847-44881) [n:127.0.0.1:49703_solr c:testschemaapi s:shard1 r:core_node2 x:testschemaapi_shard1_replica2] o.a.s.c.SolrDeletionPolicy newest commit generation = 1
   [junit4]   2> 2703564 INFO  (qtp15880046-44894) [n:127.0.0.1:49706_solr c:testschemaapi s:shard1 r:core_node1 x:testschemaapi_shard1_replica1] o.a.s.u.CommitTracker Hard AutoCommit: disabled
   [junit4]   2> 2703564 INFO  (qtp9448847-44881) [n:127.0.0.1:49703_solr c:testschemaapi s:shard1 r:core_node2 x:testschemaapi_shard1_replica2] o.a.s.s.SolrIndexSearcher Opening Searcher@817b1c[testschemaapi_shard1_replica2] main
   [junit4]   2> 2703564 INFO  (qtp15880046-44894) [n:127.0.0.1:49706_solr c:testschemaapi s:shard1 r:core_node1 x:testschemaapi_shard1_replica1] o.a.s.u.CommitTracker Soft AutoCommit: disabled
   [junit4]   2> 2703564 INFO  (qtp9448847-44881) [n:127.0.0.1:49703_solr c:testschemaapi s:shard1 r:core_node2 x:testschemaapi_shard1_replica2] o.a.s.c.c.ZkStateReader Load collection config from: [/collections/testschemaapi]
   [junit4]   2> 2703565 INFO  (qtp9448847-44881) [n:127.0.0.1:49703_solr c:testschemaapi s:shard1 r:core_node2 x:testschemaapi_shard1_replica2] o.a.s.c.c.ZkStateReader path=[/collections/testschemaapi] [configName]=[conf1] specified config exists in ZooKeeper
   [junit4]   2> 2703565 INFO  (qtp9448847-44881) [n:127.0.0.1:49703_solr c:testschemaapi s:shard1 r:core_node2 x:testschemaapi_shard1_replica2] o.a.s.r.ManagedResourceStorage Setting up ZooKeeper-based storage for the RestManager with znodeBase: /configs/conf1
   [junit4]   2> 2703566 INFO  (qtp9448847-44881) [n:127.0.0.1:49703_solr c:testschemaapi s:shard1 r:core_node2 x:testschemaapi_shard1_replica2] o.a.s.r.ManagedResourceStorage Configured ZooKeeperStorageIO with znodeBase: /configs/conf1
   [junit4]   2> 2703567 INFO  (qtp9448847-44881) [n:127.0.0.1:49703_solr c:testschemaapi s:shard1 r:core_node2 x:testschemaapi_shard1_replica2] o.a.s.r.RestManager Initializing RestManager with initArgs: {}
   [junit4]   2> 2703567 INFO  (qtp9448847-44881) [n:127.0.0.1:49703_solr c:testschemaapi s:shard1 r:core_node2 x:testschemaapi_shard1_replica2] o.a.s.r.ManagedResourceStorage Reading _rest_managed.json using ZooKeeperStorageIO:path=/configs/conf1
   [junit4]   2> 2703567 INFO  (qtp9448847-44881) [n:127.0.0.1:49703_solr c:testschemaapi s:shard1 r:core_node2 x:testschemaapi_shard1_replica2] o.a.s.r.ManagedResourceStorage No data found for znode /configs/conf1/_rest_managed.json
   [junit4]   2> 2703568 INFO  (qtp9448847-44881) [n:127.0.0.1:49703_solr c:testschemaapi s:shard1 r:core_node2 x:testschemaapi_shard1_replica2] o.a.s.r.ManagedResourceStorage Loaded null at path _rest_managed.json using ZooKeeperStorageIO:path=/configs/conf1
   [junit4]   2> 2703568 INFO  (qtp9448847-44881) [n:127.0.0.1:49703_solr c:testschemaapi s:shard1 r:core_node2 x:testschemaapi_shard1_replica2] o.a.s.r.RestManager Initializing 0 registered ManagedResources
   [junit4]   2> 2703568 INFO  (qtp9448847-44881) [n:127.0.0.1:49703_solr c:testschemaapi s:shard1 r:core_node2 x:testschemaapi_shard1_replica2] o.a.s.s.ZkIndexSchemaReader Creating ZooKeeper watch for the managed schema at /configs/conf1/managed-schema
   [junit4]   2> 2703569 INFO  (qtp9448847-44881) [n:127.0.0.1:49703_solr c:testschemaapi s:shard1 r:core_node2 x:testschemaapi_shard1_replica2] o.a.s.c.ZkController Added new OnReconnect listener ZkIndexSchemaReader: /configs/conf1/managed-schema, uniqueCoreId: testschemaapi_shard1_replica2:2364599085130833
   [junit4]   2> 2703569 INFO  (qtp9448847-44881) [n:127.0.0.1:49703_solr c:testschemaapi s:shard1 r:core_node2 x:testschemaapi_shard1_replica2] o.a.s.h.ReplicationHandler Commits will be reserved for  10000
   [junit4]   2> 2703569 INFO  (qtp9448847-44881) [n:127.0.0.1:49703_solr c:testschemaapi s:shard1 r:core_node2 x:testschemaapi_shard1_replica2] o.a.s.u.UpdateLog Looking up max value of version field to seed version buckets
   [junit4]   2> 2703570 INFO  (qtp9448847-44881) [n:127.0.0.1:49703_solr c:testschemaapi s:shard1 r:core_node2 x:testschemaapi_shard1_replica2] o.a.s.u.VersionInfo Refreshing highest value of _version_ for 65536 version buckets from index
   [junit4]   2> 2703570 INFO  (qtp9448847-44881) [n:127.0.0.1:49703_solr c:testschemaapi s:shard1 r:core_node2 x:testschemaapi_shard1_replica2] o.a.s.u.VersionInfo No terms found for _version_, cannot seed version bucket highest value from index
   [junit4]   2> 2703570 INFO  (qtp9448847-44881) [n:127.0.0.1:49703_solr c:testschemaapi s:shard1 r:core_node2 x:testschemaapi_shard1_replica2] o.a.s.u.UpdateLog Could not find max version in index or recent updates, using new clock 1581724163503030272
   [junit4]   2> 2703570 INFO  (searcherExecutor-10688-thread-1-processing-n:127.0.0.1:49703_solr x:testschemaapi_shard1_replica2 s:shard1 c:testschemaapi r:core_node2) [n:127.0.0.1:49703_solr c:testschemaapi s:shard1 r:core_node2 x:testschemaapi_shard1_replica2] o.a.s.c.SolrCore [testschemaapi_shard1_replica2] Registered new searcher Searcher@817b1c[testschemaapi_shard1_replica2] main{ExitableDirectoryReader(UninvertingDirectoryReader())}
   [junit4]   2> 2703571 INFO  (qtp9448847-44881) [n:127.0.0.1:49703_solr c:testschemaapi s:shard1 r:core_node2 x:testschemaapi_shard1_replica2] o.a.s.u.UpdateLog Took 1.0ms to seed version buckets with highest version 1581724163503030272
   [junit4]   2> 2703571 INFO  (qtp9448847-44881) [n:127.0.0.1:49703_solr c:testschemaapi s:shard1 r:core_node2 x:testschemaapi_shard1_replica2] o.a.s.c.ZkController watch zkdir /configs/conf1
   [junit4]   2> 2703572 INFO  (qtp15880046-44894) [n:127.0.0.1:49706_solr c:testschemaapi s:shard1 r:core_node1 x:testschemaapi_shard1_replica1] o.a.s.c.SolrDeletionPolicy SolrDeletionPolicy.onInit: commits: num=1
   [junit4]   2> 	commit{dir=MockDirectoryWrapper(RAMDirectory@9da97e lockFactory=org.apache.lucene.store.SingleInstanceLockFactory@23b7d8),segFN=segments_1,generation=1}
   [junit4]   2> 2703572 INFO  (qtp9448847-44881) [n:127.0.0.1:49703_solr c:testschemaapi s:shard1 r:core_node2 x:testschemaapi_shard1_replica2] o.a.s.c.CoreContainer registering core: testschemaapi_shard1_replica2
   [junit4]   2> 2703573 INFO  (qtp9448847-44881) [n:127.0.0.1:49703_solr c:testschemaapi s:shard1 r:core_node2 x:testschemaapi_shard1_replica2] o.a.s.c.ZkController Register replica - core:testschemaapi_shard1_replica2 address:http://127.0.0.1:49703/solr collection:testschemaapi shard:shard1
   [junit4]   2> 2703573 INFO  (qtp15880046-44894) [n:127.0.0.1:49706_solr c:testschemaapi s:shard1 r:core_node1 x:testschemaapi_shard1_replica1] o.a.s.c.SolrDeletionPolicy newest commit generation = 1
   [junit4]   2> 2703574 INFO  (qtp9448847-44881) [n:127.0.0.1:49703_solr c:testschemaapi s:shard1 r:core_node2 x:testschemaapi_shard1_replica2] o.a.s.c.c.SolrZkClient makePath: /collections/testschemaapi/leader_elect/shard1/election
   [junit4]   2> 2703574 INFO  (qtp15880046-44894) [n:127.0.0.1:49706_solr c:testschemaapi s:shard1 r:core_node1 x:testschemaapi_shard1_replica1] o.a.s.s.SolrIndexSearcher Opening Searcher@102d8e9[testschemaapi_shard1_replica1] main
   [junit4]   2> 2703574 INFO  (qtp15880046-44894) [n:127.0.0.1:49706_solr c:testschemaapi s:shard1 r:core_node1 x:testschemaapi_shard1_replica1] o.a.s.c.c.ZkStateReader Load collection config from: [/collections/testschemaapi]
   [junit4]   2> 2703578 INFO  (qtp9448847-44881) [n:127.0.0.1:49703_solr c:testschemaapi s:shard1 r:core_node2 x:testschemaapi_shard1_replica2] o.a.s.c.LeaderElector Joined leadership election with path: /collections/testschemaapi/leader_elect/shard1/election/98857760121159686-core_node2-n_0000000000
   [junit4]   2> 2703578 INFO  (qtp15880046-44894) [n:127.0.0.1:49706_solr c:testschemaapi s:shard1 r:core_node1 x:testschemaapi_shard1_replica1] o.a.s.c.c.ZkStateReader path=[/collections/testschemaapi] [configName]=[conf1] specified config exists in ZooKeeper
   [junit4]   2> 2703578 INFO  (qtp15880046-44894) [n:127.0.0.1:49706_solr c:testschemaapi s:shard1 r:core_node1 x:testschemaapi_shard1_replica1] o.a.s.r.ManagedResourceStorage Setting up ZooKeeper-based storage for the RestManager with znodeBase: /configs/conf1
   [junit4]   2> 2703578 INFO  (qtp9448847-44881) [n:127.0.0.1:49703_solr c:testschemaapi s:shard1 r:core_node2 x:testschemaapi_shard1_replica2] o.a.s.c.ShardLeaderElectionContext Running the leader process for shard=shard1 and weAreReplacement=false and leaderVoteWait=10000
   [junit4]   2> 2703578 INFO  (qtp15880046-44894) [n:127.0.0.1:49706_solr c:testschemaapi s:shard1 r:core_node1 x:testschemaapi_shard1_replica1] o.a.s.r.ManagedResourceStorage Configured ZooKeeperStorageIO with znodeBase: /configs/conf1
   [junit4]   2> 2703578 INFO  (qtp15880046-44894) [n:127.0.0.1:49706_solr c:testschemaapi s:shard1 r:core_node1 x:testschemaapi_shard1_replica1] o.a.s.r.RestManager Initializing RestManager with initArgs: {}
   [junit4]   2> 2703578 INFO  (qtp15880046-44894) [n:127.0.0.1:49706_solr c:testschemaapi s:shard1 r:core_node1 x:testschemaapi_shard1_replica1] o.a.s.r.ManagedResourceStorage Reading _rest_managed.json using ZooKeeperStorageIO:path=/configs/conf1
   [junit4]   2> 2703582 INFO  (qtp15880046-44894) [n:127.0.0.1:49706_solr c:testschemaapi s:shard1 r:core_node1 x:testschemaapi_shard1_replica1] o.a.s.r.ManagedResourceStorage No data found for znode /configs/conf1/_rest_managed.json
   [junit4]   2> 2703583 INFO  (qtp15880046-44894) [n:127.0.0.1:49706_solr c:testschemaapi s:shard1 r:core_node1 x:testschemaapi_shard1_replica1] o.a.s.r.ManagedResourceStorage Loaded null at path _rest_managed.json using ZooKeeperStorageIO:path=/configs/conf1
   [junit4]   2> 2703583 INFO  (qtp15880046-44894) [n:127.0.0.1:49706_solr c:testschemaapi s:shard1 r:core_node1 x:testschemaapi_shard1_replica1] o.a.s.r.RestManager Initializing 0 registered ManagedResources
   [junit4]   2> 2703583 INFO  (qtp15880046-44894) [n:127.0.0.1:49706_solr c:testschemaapi s:shard1 r:core_node1 x:testschemaapi_shard1_replica1] o.a.s.s.ZkIndexSchemaReader Creating ZooKeeper watch for the managed schema at /configs/conf1/managed-schema
   [junit4]   2> 2703584 INFO  (qtp15880046-44894) [n:127.0.0.1:49706_solr c:testschemaapi s:shard1 r:core_node1 x:testschemaapi_shard1_replica1] o.a.s.c.ZkController Added new OnReconnect listener ZkIndexSchemaReader: /configs/conf1/managed-schema, uniqueCoreId: testschemaapi_shard1_replica1:2364599085247739
   [junit4]   2> 2703584 INFO  (qtp15880046-44894) [n:127.0.0.1:49706_solr c:testschemaapi s:shard1 r:core_node1 x:testschemaapi_shard1_replica1] o.a.s.h.ReplicationHandler Commits will be reserved for  10000
   [junit4]   2> 2703585 INFO  (qtp15880046-44894) [n:127.0.0.1:49706_solr c:testschemaapi s:shard1 r:core_node1 x:testschemaapi_shard1_replica1] o.a.s.u.UpdateLog Looking up max value of version field to seed version buckets
   [junit4]   2> 2703585 INFO  (qtp15880046-44894) [n:127.0.0.1:49706_solr c:testschemaapi s:shard1 r:core_node1 x:testschemaapi_shard1_replica1] o.a.s.u.VersionInfo Refreshing highest value of _version_ for 65536 version buckets from index
   [junit4]   2> 2703585 INFO  (qtp15880046-44894) [n:127.0.0.1:49706_solr c:testschemaapi s:shard1 r:core_node1 x:testschemaapi_shard1_replica1] o.a.s.u.VersionInfo No terms found for _version_, cannot seed version bucket highest value from index
   [junit4]   2> 2703585 INFO  (qtp15880046-44894) [n:127.0.0.1:49706_solr c:testschemaapi s:shard1 r:core_node1 x:testschemaapi_shard1_replica1] o.a.s.u.UpdateLog Could not find max version in index or recent updates, using new clock 1581724163518758912
   [junit4]   2> 2703586 INFO  (searcherExecutor-10689-thread-1-processing-n:127.0.0.1:49706_solr x:testschemaapi_shard1_replica1 s:shard1 c:testschemaapi r:core_node1) [n:127.0.0.1:49706_solr c:testschemaapi s:shard1 r:core_node1 x:testschemaapi_shard1_replica1] o.a.s.c.SolrCore [testschemaapi_shard1_replica1] Registered new searcher Searcher@102d8e9[testschemaapi_shard1_replica1] main{ExitableDirectoryReader(UninvertingDirectoryReader())}
   [junit4]   2> 2703586 INFO  (qtp15880046-44894) [n:127.0.0.1:49706_solr c:testschemaapi s:shard1 r:core_node1 x:testschemaapi_shard1_replica1] o.a.s.u.UpdateLog Took 1.0ms to seed version buckets with highest version 1581724163518758912
   [junit4]   2> 2703586 INFO  (qtp15880046-44894) [n:127.0.0.1:49706_solr c:testschemaapi s:shard1 r:core_node1 x:testschemaapi_shard1_replica1] o.a.s.c.ZkController watch zkdir /configs/conf1
   [junit4]   2> 2703586 INFO  (qtp9448847-44881) [n:127.0.0.1:49703_solr c:testschemaapi s:shard1 r:core_node2 x:testschemaapi_shard1_replica2] o.a.s.c.ShardLeaderElectionContext Waiting until we see more replicas up for shard shard1: total=2 found=1 timeoutin=9998ms
   [junit4]   2> 2703587 INFO  (OverseerStateUpdate-98857760121159686-127.0.0.1:49703_solr-n_0000000000) [n:127.0.0.1:49703_solr    ] o.a.s.c.Overseer processMessage: queueSize: 1, message = {
   [junit4]   2>   "operation":"leader",
   [junit4]   2>   "shard":"shard1",
   [junit4]   2>   "collection":"testschemaapi"} current state version: 0
   [junit4]   2> 2703587 INFO  (qtp15880046-44894) [n:127.0.0.1:49706_solr c:testschemaapi s:shard1 r:core_node1 x:testschemaapi_shard1_replica1] o.a.s.c.CoreContainer registering core: testschemaapi_shard1_replica1
   [junit4]   2> 2703587 INFO  (qtp15880046-44894) [n:127.0.0.1:49706_solr c:testschemaapi s:shard1 r:core_node1 x:testschemaapi_shard1_replica1] o.a.s.c.ZkController Register replica - core:testschemaapi_shard1_replica1 address:http://127.0.0.1:49706/solr collection:testschemaapi shard:shard1
   [junit4]   2> 2703591 INFO  (qtp15880046-44894) [n:127.0.0.1:49706_solr c:testschemaapi s:shard1 r:core_node1 x:testschemaapi_shard1_replica1] o.a.s.c.LeaderElector Joined leadership election with path: /collections/testschemaapi/leader_elect/shard1/election/98857760121159685-core_node1-n_0000000001
   [junit4]   2> 2703593 INFO  (qtp15880046-44894) [n:127.0.0.1:49706_solr c:testschemaapi s:shard1 r:core_node1 x:testschemaapi_shard1_replica1] o.a.s.c.LeaderElector Watching path /collections/testschemaapi/leader_elect/shard1/election/98857760121159686-core_node2-n_0000000000 to know if I could be the leader
   [junit4]   2> 2703692 INFO  (OverseerStateUpdate-98857760121159686-127.0.0.1:49703_solr-n_0000000000) [n:127.0.0.1:49703_solr    ] o.a.s.c.o.ZkStateWriter goin

[...truncated too long message...]

milarity, HdfsUnloadDistributedZkTest, RequestHandlersTest, CoreMergeIndexesAdminHandlerTest, MigrateRouteKeyTest, TestShardHandlerFactory, TermVectorComponentDistributedTest, FileUtilsTest, BadIndexSchemaTest, TestManagedSchemaFieldTypeResource, TestHighFrequencyDictionaryFactory, TestClassicSimilarityFactory, SolrInfoMBeanTest, RAMDirectoryFactoryTest, SSLMigrationTest, TestFiltering, CSVRequestHandlerTest, SuggesterTSTTest, TestCollectionAPI, NoCacheHeaderTest, TestFieldCollectionResource, SolrCoreCheckLockOnStartupTest, TestOnReconnectListenerSupport, TestBinaryResponseWriter, TestMaxScoreQueryParser, TestBulkSchemaAPI, TestShortCircuitedRequests, TestReversedWildcardFilterFactory, TestSolrConfigHandlerCloud, TestTrie, TestCrossCoreJoin, OpenCloseCoreStressTest, OverseerTest, BasicZkTest, ClusterStateUpdateTest, TestRandomFaceting, TestZkChroot, TestRandomDVFaceting, ShardRoutingCustomTest, TestHashPartitioner, HardAutoCommitTest, TestRangeQuery, TestCoreContainer, TestSolr4Spatial, SolrCmdDistributorTest, TestSort, DirectUpdateHandlerTest, SimplePostToolTest, AnalysisAfterCoreReloadTest, SuggesterFSTTest, SuggesterTest, SchemaVersionSpecificBehaviorTest, TestAtomicUpdateErrorCases, DefaultValueUpdateProcessorTest, LukeRequestHandlerTest, DocumentAnalysisRequestHandlerTest, DocumentBuilderTest, PathHierarchyTokenizerFactoryTest, TestSolrQueryParser, FastVectorHighlighterTest, LoggingHandlerTest, IndexSchemaTest, TestCollationField, UpdateRequestProcessorFactoryTest, QueryParsingTest, BinaryUpdateRequestHandlerTest, PingRequestHandlerTest, SpellingQueryConverterTest, DOMUtilTest, ClusterStateTest, TestLRUCache, TestUtils, TestDocumentBuilder, SystemInfoHandlerTest, CircularListTest, DistributedMLTComponentTest, TestRTGBase, CursorPagingTest, DistributedIntervalFacetingTest, SolrTestCaseJ4Test, TestDistributedMissingSort, ActionThrottleTest, AsyncCallRequestStatusResponseTest, CollectionReloadTest, CollectionTooManyReplicasTest, ConfigSetsAPITest, DeleteInactiveReplicaTest, DeleteShardTest, DistribDocExpirationUpdateProcessorTest, LeaderInitiatedRecoveryOnShardRestartTest, MultiThreadedOCPTest, ReplicationFactorTest, RestartWhileUpdatingTest, SaslZkACLProviderTest, ShardSplitTest, TestDistribDocBasedVersion, TestDownShardTolerantSearch, TestLeaderInitiatedRecoveryThread, TestRandomRequestDistribution, TestStressLiveNodes, VMParamsZkACLAndCredentialsProvidersTest, HdfsBasicDistributedZkTest, HdfsChaosMonkeyNothingIsSafeTest, HdfsCollectionsAPIDistributedZkTest, HdfsRecoverLeaseTest, HdfsRestartWhileUpdatingTest, HdfsSyncSliceTest, HdfsThreadLeakTest, HdfsWriteToMultipleCollectionsTest, StressHdfsTest, ZkStateReaderTest, ZkStateWriterTest, CachingDirectoryFactoryTest, TestConfigSets, TestDynamicLoading, TestSolrConfigHandlerConcurrent, DistributedFacetPivotSmallTest, DistributedQueryComponentCustomSortTest, TestPivotHelperCode, JavabinLoaderTest, HighlighterMaxOffsetTest, WrapperMergePolicyFactoryTest, TestMacros, TestChildDocTransformer, TestManagedResource, TestManagedResourceStorage, TestCopyFieldCollectionResource, TestDefaultSearchFieldResource, TestFieldTypeResource, TestSchemaNameResource, TestSchemaSimilarityResource, TestSchemaVersionResource, TestSerializedLuceneMatchVersion, TestSolrQueryParserDefaultOperatorResource, TestSolrQueryParserResource, TestUniqueKeyFieldResource, TestManagedSynonymFilterFactory, BadCopyFieldTest, ChangedSchemaMergeTest, DateRangeFieldTest, SpatialRPTFieldTypeTest, TestManagedSchema, TestManagedSchemaAPI]
   [junit4]   2> NOTE: reproduce with: ant test  -Dtestcase=TestManagedSchemaAPI -Dtests.seed=C9178EAC76EBE3B1 -Dtests.slow=true -Dtests.locale=ko -Dtests.timezone=America/Fortaleza -Dtests.asserts=true -Dtests.file.encoding=UTF-8
   [junit4] ERROR   0.00s J1 | TestManagedSchemaAPI (suite) <<<
   [junit4]    > Throwable #1: java.lang.AssertionError: ObjectTracker found 8 object(s) that were not released!!! [MockDirectoryWrapper, MDCAwareThreadPoolExecutor, MockDirectoryWrapper, TransactionLog, MockDirectoryWrapper, MDCAwareThreadPoolExecutor, TransactionLog, MockDirectoryWrapper]
   [junit4]    > 	at __randomizedtesting.SeedInfo.seed([C9178EAC76EBE3B1]:0)
   [junit4]    > 	at org.apache.solr.SolrTestCaseJ4.afterClass(SolrTestCaseJ4.java:238)
   [junit4]    > 	at java.lang.Thread.run(Thread.java:748)Throwable #2: java.io.IOException: Could not remove the following files (in the order of attempts):
   [junit4]    >    C:\Users\jenkins\workspace\Lucene-Solr-5.5-Windows\solr\build\solr-core\test\J1\temp\solr.schema.TestManagedSchemaAPI_C9178EAC76EBE3B1-001\tempDir-001\node1\testschemaapi_shard1_replica1\data\tlog\tlog.0000000000000000000: java.nio.file.FileSystemException: C:\Users\jenkins\workspace\Lucene-Solr-5.5-Windows\solr\build\solr-core\test\J1\temp\solr.schema.TestManagedSchemaAPI_C9178EAC76EBE3B1-001\tempDir-001\node1\testschemaapi_shard1_replica1\data\tlog\tlog.0000000000000000000: The process cannot access the file because it is being used by another process.
   [junit4]    >    C:\Users\jenkins\workspace\Lucene-Solr-5.5-Windows\solr\build\solr-core\test\J1\temp\solr.schema.TestManagedSchemaAPI_C9178EAC76EBE3B1-001\tempDir-001\node1\testschemaapi_shard1_replica1\data\tlog: java.nio.file.DirectoryNotEmptyException: C:\Users\jenkins\workspace\Lucene-Solr-5.5-Windows\solr\build\solr-core\test\J1\temp\solr.schema.TestManagedSchemaAPI_C9178EAC76EBE3B1-001\tempDir-001\node1\testschemaapi_shard1_replica1\data\tlog
   [junit4]    >    C:\Users\jenkins\workspace\Lucene-Solr-5.5-Windows\solr\build\solr-core\test\J1\temp\solr.schema.TestManagedSchemaAPI_C9178EAC76EBE3B1-001\tempDir-001\node1\testschemaapi_shard1_replica1\data: java.nio.file.DirectoryNotEmptyException: C:\Users\jenkins\workspace\Lucene-Solr-5.5-Windows\solr\build\solr-core\test\J1\temp\solr.schema.TestManagedSchemaAPI_C9178EAC76EBE3B1-001\tempDir-001\node1\testschemaapi_shard1_replica1\data
   [junit4]    >    C:\Users\jenkins\workspace\Lucene-Solr-5.5-Windows\solr\build\solr-core\test\J1\temp\solr.schema.TestManagedSchemaAPI_C9178EAC76EBE3B1-001\tempDir-001\node1\testschemaapi_shard1_replica1: java.nio.file.DirectoryNotEmptyException: C:\Users\jenkins\workspace\Lucene-Solr-5.5-Windows\solr\build\solr-core\test\J1\temp\solr.schema.TestManagedSchemaAPI_C9178EAC76EBE3B1-001\tempDir-001\node1\testschemaapi_shard1_replica1
   [junit4]    >    C:\Users\jenkins\workspace\Lucene-Solr-5.5-Windows\solr\build\solr-core\test\J1\temp\solr.schema.TestManagedSchemaAPI_C9178EAC76EBE3B1-001\tempDir-001\node1: java.nio.file.DirectoryNotEmptyException: C:\Users\jenkins\workspace\Lucene-Solr-5.5-Windows\solr\build\solr-core\test\J1\temp\solr.schema.TestManagedSchemaAPI_C9178EAC76EBE3B1-001\tempDir-001\node1
   [junit4]    >    C:\Users\jenkins\workspace\Lucene-Solr-5.5-Windows\solr\build\solr-core\test\J1\temp\solr.schema.TestManagedSchemaAPI_C9178EAC76EBE3B1-001\tempDir-001\node2\testschemaapi_shard1_replica2\data\tlog\tlog.0000000000000000001: java.nio.file.FileSystemException: C:\Users\jenkins\workspace\Lucene-Solr-5.5-Windows\solr\build\solr-core\test\J1\temp\solr.schema.TestManagedSchemaAPI_C9178EAC76EBE3B1-001\tempDir-001\node2\testschemaapi_shard1_replica2\data\tlog\tlog.0000000000000000001: The process cannot access the file because it is being used by another process.
   [junit4]    >    C:\Users\jenkins\workspace\Lucene-Solr-5.5-Windows\solr\build\solr-core\test\J1\temp\solr.schema.TestManagedSchemaAPI_C9178EAC76EBE3B1-001\tempDir-001\node2\testschemaapi_shard1_replica2\data\tlog: java.nio.file.DirectoryNotEmptyException: C:\Users\jenkins\workspace\Lucene-Solr-5.5-Windows\solr\build\solr-core\test\J1\temp\solr.schema.TestManagedSchemaAPI_C9178EAC76EBE3B1-001\tempDir-001\node2\testschemaapi_shard1_replica2\data\tlog
   [junit4]    >    C:\Users\jenkins\workspace\Lucene-Solr-5.5-Windows\solr\build\solr-core\test\J1\temp\solr.schema.TestManagedSchemaAPI_C9178EAC76EBE3B1-001\tempDir-001\node2\testschemaapi_shard1_replica2\data: java.nio.file.DirectoryNotEmptyException: C:\Users\jenkins\workspace\Lucene-Solr-5.5-Windows\solr\build\solr-core\test\J1\temp\solr.schema.TestManagedSchemaAPI_C9178EAC76EBE3B1-001\tempDir-001\node2\testschemaapi_shard1_replica2\data
   [junit4]    >    C:\Users\jenkins\workspace\Lucene-Solr-5.5-Windows\solr\build\solr-core\test\J1\temp\solr.schema.TestManagedSchemaAPI_C9178EAC76EBE3B1-001\tempDir-001\node2\testschemaapi_shard1_replica2: java.nio.file.DirectoryNotEmptyException: C:\Users\jenkins\workspace\Lucene-Solr-5.5-Windows\solr\build\solr-core\test\J1\temp\solr.schema.TestManagedSchemaAPI_C9178EAC76EBE3B1-001\tempDir-001\node2\testschemaapi_shard1_replica2
   [junit4]    >    C:\Users\jenkins\workspace\Lucene-Solr-5.5-Windows\solr\build\solr-core\test\J1\temp\solr.schema.TestManagedSchemaAPI_C9178EAC76EBE3B1-001\tempDir-001\node2: java.nio.file.DirectoryNotEmptyException: C:\Users\jenkins\workspace\Lucene-Solr-5.5-Windows\solr\build\solr-core\test\J1\temp\solr.schema.TestManagedSchemaAPI_C9178EAC76EBE3B1-001\tempDir-001\node2
   [junit4]    >    C:\Users\jenkins\workspace\Lucene-Solr-5.5-Windows\solr\build\solr-core\test\J1\temp\solr.schema.TestManagedSchemaAPI_C9178EAC76EBE3B1-001\tempDir-001: java.nio.file.DirectoryNotEmptyException: C:\Users\jenkins\workspace\Lucene-Solr-5.5-Windows\solr\build\solr-core\test\J1\temp\solr.schema.TestManagedSchemaAPI_C9178EAC76EBE3B1-001\tempDir-001
   [junit4]    >    C:\Users\jenkins\workspace\Lucene-Solr-5.5-Windows\solr\build\solr-core\test\J1\temp\solr.schema.TestManagedSchemaAPI_C9178EAC76EBE3B1-001: java.nio.file.DirectoryNotEmptyException: C:\Users\jenkins\workspace\Lucene-Solr-5.5-Windows\solr\build\solr-core\test\J1\temp\solr.schema.TestManagedSchemaAPI_C9178EAC76EBE3B1-001
   [junit4]    > 	at org.apache.lucene.util.IOUtils.rm(IOUtils.java:295)
   [junit4]    > 	at java.lang.Thread.run(Thread.java:748)
   [junit4] Completed [523/575 (1!)] on J1 in 11.16s, 1 test, 1 failure, 1 error <<< FAILURES!

[...truncated 49323 lines...]

Mime
View raw message