lucene-dev mailing list archives

Site index · List index
Message view « Date » · « Thread »
Top « Date » · « Thread »
From Policeman Jenkins Server <jenk...@thetaphi.de>
Subject [JENKINS] Lucene-Solr-master-MacOSX (64bit/jdk1.8.0) - Build # 4240 - Still Unstable!
Date Fri, 20 Oct 2017 13:33:11 GMT
Build: https://jenkins.thetaphi.de/job/Lucene-Solr-master-MacOSX/4240/
Java: 64bit/jdk1.8.0 -XX:-UseCompressedOops -XX:+UseConcMarkSweepGC

1 tests failed.
FAILED:  org.apache.solr.core.TestDynamicLoading.testDynamicLoading

Error Message:
Could not get expected value  'org.apache.solr.core.BlobStoreTestRequestHandler' for path 'overlay/requestHandler/\/test1/class' full output: {   "responseHeader":{     "status":0,     "QTime":0},   "overlay":{     "znodeVersion":0,     "runtimeLib":{"colltest":{         "name":"colltest",         "version":1}}}},  from server:  null

Stack Trace:
java.lang.AssertionError: Could not get expected value  'org.apache.solr.core.BlobStoreTestRequestHandler' for path 'overlay/requestHandler/\/test1/class' full output: {
  "responseHeader":{
    "status":0,
    "QTime":0},
  "overlay":{
    "znodeVersion":0,
    "runtimeLib":{"colltest":{
        "name":"colltest",
        "version":1}}}},  from server:  null
	at __randomizedtesting.SeedInfo.seed([E1A73044852D3954:39EA1D1372F09CF4]:0)
	at org.junit.Assert.fail(Assert.java:93)
	at org.junit.Assert.assertTrue(Assert.java:43)
	at org.apache.solr.core.TestSolrConfigHandler.testForResponseElement(TestSolrConfigHandler.java:557)
	at org.apache.solr.core.TestDynamicLoading.testDynamicLoading(TestDynamicLoading.java:97)
	at sun.reflect.NativeMethodAccessorImpl.invoke0(Native Method)
	at sun.reflect.NativeMethodAccessorImpl.invoke(NativeMethodAccessorImpl.java:62)
	at sun.reflect.DelegatingMethodAccessorImpl.invoke(DelegatingMethodAccessorImpl.java:43)
	at java.lang.reflect.Method.invoke(Method.java:498)
	at com.carrotsearch.randomizedtesting.RandomizedRunner.invoke(RandomizedRunner.java:1737)
	at com.carrotsearch.randomizedtesting.RandomizedRunner$8.evaluate(RandomizedRunner.java:934)
	at com.carrotsearch.randomizedtesting.RandomizedRunner$9.evaluate(RandomizedRunner.java:970)
	at com.carrotsearch.randomizedtesting.RandomizedRunner$10.evaluate(RandomizedRunner.java:984)
	at org.apache.solr.BaseDistributedSearchTestCase$ShardsRepeatRule$ShardsFixedStatement.callStatement(BaseDistributedSearchTestCase.java:993)
	at org.apache.solr.BaseDistributedSearchTestCase$ShardsRepeatRule$ShardsStatement.evaluate(BaseDistributedSearchTestCase.java:968)
	at com.carrotsearch.randomizedtesting.rules.SystemPropertiesRestoreRule$1.evaluate(SystemPropertiesRestoreRule.java:57)
	at org.apache.lucene.util.TestRuleSetupTeardownChained$1.evaluate(TestRuleSetupTeardownChained.java:49)
	at org.apache.lucene.util.AbstractBeforeAfterRule$1.evaluate(AbstractBeforeAfterRule.java:45)
	at org.apache.lucene.util.TestRuleThreadAndTestName$1.evaluate(TestRuleThreadAndTestName.java:48)
	at org.apache.lucene.util.TestRuleIgnoreAfterMaxFailures$1.evaluate(TestRuleIgnoreAfterMaxFailures.java:64)
	at org.apache.lucene.util.TestRuleMarkFailure$1.evaluate(TestRuleMarkFailure.java:47)
	at com.carrotsearch.randomizedtesting.rules.StatementAdapter.evaluate(StatementAdapter.java:36)
	at com.carrotsearch.randomizedtesting.ThreadLeakControl$StatementRunner.run(ThreadLeakControl.java:368)
	at com.carrotsearch.randomizedtesting.ThreadLeakControl.forkTimeoutingTask(ThreadLeakControl.java:817)
	at com.carrotsearch.randomizedtesting.ThreadLeakControl$3.evaluate(ThreadLeakControl.java:468)
	at com.carrotsearch.randomizedtesting.RandomizedRunner.runSingleTest(RandomizedRunner.java:943)
	at com.carrotsearch.randomizedtesting.RandomizedRunner$5.evaluate(RandomizedRunner.java:829)
	at com.carrotsearch.randomizedtesting.RandomizedRunner$6.evaluate(RandomizedRunner.java:879)
	at com.carrotsearch.randomizedtesting.RandomizedRunner$7.evaluate(RandomizedRunner.java:890)
	at com.carrotsearch.randomizedtesting.rules.StatementAdapter.evaluate(StatementAdapter.java:36)
	at com.carrotsearch.randomizedtesting.rules.SystemPropertiesRestoreRule$1.evaluate(SystemPropertiesRestoreRule.java:57)
	at org.apache.lucene.util.AbstractBeforeAfterRule$1.evaluate(AbstractBeforeAfterRule.java:45)
	at com.carrotsearch.randomizedtesting.rules.StatementAdapter.evaluate(StatementAdapter.java:36)
	at org.apache.lucene.util.TestRuleStoreClassName$1.evaluate(TestRuleStoreClassName.java:41)
	at com.carrotsearch.randomizedtesting.rules.NoShadowingOrOverridesOnMethodsRule$1.evaluate(NoShadowingOrOverridesOnMethodsRule.java:40)
	at com.carrotsearch.randomizedtesting.rules.NoShadowingOrOverridesOnMethodsRule$1.evaluate(NoShadowingOrOverridesOnMethodsRule.java:40)
	at com.carrotsearch.randomizedtesting.rules.StatementAdapter.evaluate(StatementAdapter.java:36)
	at com.carrotsearch.randomizedtesting.rules.StatementAdapter.evaluate(StatementAdapter.java:36)
	at com.carrotsearch.randomizedtesting.rules.StatementAdapter.evaluate(StatementAdapter.java:36)
	at org.apache.lucene.util.TestRuleAssertionsRequired$1.evaluate(TestRuleAssertionsRequired.java:53)
	at org.apache.lucene.util.TestRuleMarkFailure$1.evaluate(TestRuleMarkFailure.java:47)
	at org.apache.lucene.util.TestRuleIgnoreAfterMaxFailures$1.evaluate(TestRuleIgnoreAfterMaxFailures.java:64)
	at org.apache.lucene.util.TestRuleIgnoreTestSuites$1.evaluate(TestRuleIgnoreTestSuites.java:54)
	at com.carrotsearch.randomizedtesting.rules.StatementAdapter.evaluate(StatementAdapter.java:36)
	at com.carrotsearch.randomizedtesting.ThreadLeakControl$StatementRunner.run(ThreadLeakControl.java:368)
	at java.lang.Thread.run(Thread.java:748)




Build Log:
[...truncated 11932 lines...]
   [junit4] Suite: org.apache.solr.core.TestDynamicLoading
   [junit4]   2> Creating dataDir: /Users/jenkins/workspace/Lucene-Solr-master-MacOSX/solr/build/solr-core/test/J1/temp/solr.core.TestDynamicLoading_E1A73044852D3954-001/init-core-data-001
   [junit4]   2> 626630 WARN  (SUITE-TestDynamicLoading-seed#[E1A73044852D3954]-worker) [    ] o.a.s.SolrTestCaseJ4 startTrackingSearchers: numOpens=2 numCloses=2
   [junit4]   2> 626630 INFO  (SUITE-TestDynamicLoading-seed#[E1A73044852D3954]-worker) [    ] o.a.s.SolrTestCaseJ4 Using PointFields (NUMERIC_POINTS_SYSPROP=true) w/NUMERIC_DOCVALUES_SYSPROP=false
   [junit4]   2> 626633 INFO  (SUITE-TestDynamicLoading-seed#[E1A73044852D3954]-worker) [    ] o.a.s.SolrTestCaseJ4 Randomized ssl (false) and clientAuth (false) via: @org.apache.solr.util.RandomizeSSL(reason=, value=NaN, ssl=NaN, clientAuth=NaN) w/ MAC_OS_X supressed clientAuth
   [junit4]   2> 626633 INFO  (SUITE-TestDynamicLoading-seed#[E1A73044852D3954]-worker) [    ] o.a.s.SolrTestCaseJ4 SecureRandom sanity checks: test.solr.allowed.securerandom=null & java.security.egd=file:/dev/./urandom
   [junit4]   2> 626633 INFO  (SUITE-TestDynamicLoading-seed#[E1A73044852D3954]-worker) [    ] o.a.s.BaseDistributedSearchTestCase Setting hostContext system property: /_e/q
   [junit4]   2> 626637 INFO  (TEST-TestDynamicLoading.testDynamicLoading-seed#[E1A73044852D3954]) [    ] o.a.s.c.ZkTestServer STARTING ZK TEST SERVER
   [junit4]   2> 626637 INFO  (Thread-1026) [    ] o.a.s.c.ZkTestServer client port:0.0.0.0/0.0.0.0:0
   [junit4]   2> 626637 INFO  (Thread-1026) [    ] o.a.s.c.ZkTestServer Starting server
   [junit4]   2> 626640 ERROR (Thread-1026) [    ] o.a.z.s.ZooKeeperServer ZKShutdownHandler is not registered, so ZooKeeper server won't take any action on ERROR or SHUTDOWN server state changes
   [junit4]   2> 626742 INFO  (TEST-TestDynamicLoading.testDynamicLoading-seed#[E1A73044852D3954]) [    ] o.a.s.c.ZkTestServer start zk server on port:51721
   [junit4]   2> 626771 INFO  (TEST-TestDynamicLoading.testDynamicLoading-seed#[E1A73044852D3954]) [    ] o.a.s.c.AbstractZkTestCase put /Users/jenkins/workspace/Lucene-Solr-master-MacOSX/solr/core/src/test-files/solr/collection1/conf/solrconfig-tlog.xml to /configs/conf1/solrconfig.xml
   [junit4]   2> 626774 INFO  (TEST-TestDynamicLoading.testDynamicLoading-seed#[E1A73044852D3954]) [    ] o.a.s.c.AbstractZkTestCase put /Users/jenkins/workspace/Lucene-Solr-master-MacOSX/solr/core/src/test-files/solr/collection1/conf/schema.xml to /configs/conf1/schema.xml
   [junit4]   2> 626776 INFO  (TEST-TestDynamicLoading.testDynamicLoading-seed#[E1A73044852D3954]) [    ] o.a.s.c.AbstractZkTestCase put /Users/jenkins/workspace/Lucene-Solr-master-MacOSX/solr/core/src/test-files/solr/collection1/conf/solrconfig.snippet.randomindexconfig.xml to /configs/conf1/solrconfig.snippet.randomindexconfig.xml
   [junit4]   2> 626778 INFO  (TEST-TestDynamicLoading.testDynamicLoading-seed#[E1A73044852D3954]) [    ] o.a.s.c.AbstractZkTestCase put /Users/jenkins/workspace/Lucene-Solr-master-MacOSX/solr/core/src/test-files/solr/collection1/conf/stopwords.txt to /configs/conf1/stopwords.txt
   [junit4]   2> 626780 INFO  (TEST-TestDynamicLoading.testDynamicLoading-seed#[E1A73044852D3954]) [    ] o.a.s.c.AbstractZkTestCase put /Users/jenkins/workspace/Lucene-Solr-master-MacOSX/solr/core/src/test-files/solr/collection1/conf/protwords.txt to /configs/conf1/protwords.txt
   [junit4]   2> 626782 INFO  (TEST-TestDynamicLoading.testDynamicLoading-seed#[E1A73044852D3954]) [    ] o.a.s.c.AbstractZkTestCase put /Users/jenkins/workspace/Lucene-Solr-master-MacOSX/solr/core/src/test-files/solr/collection1/conf/currency.xml to /configs/conf1/currency.xml
   [junit4]   2> 626784 INFO  (TEST-TestDynamicLoading.testDynamicLoading-seed#[E1A73044852D3954]) [    ] o.a.s.c.AbstractZkTestCase put /Users/jenkins/workspace/Lucene-Solr-master-MacOSX/solr/core/src/test-files/solr/collection1/conf/enumsConfig.xml to /configs/conf1/enumsConfig.xml
   [junit4]   2> 626786 INFO  (TEST-TestDynamicLoading.testDynamicLoading-seed#[E1A73044852D3954]) [    ] o.a.s.c.AbstractZkTestCase put /Users/jenkins/workspace/Lucene-Solr-master-MacOSX/solr/core/src/test-files/solr/collection1/conf/open-exchange-rates.json to /configs/conf1/open-exchange-rates.json
   [junit4]   2> 626788 INFO  (TEST-TestDynamicLoading.testDynamicLoading-seed#[E1A73044852D3954]) [    ] o.a.s.c.AbstractZkTestCase put /Users/jenkins/workspace/Lucene-Solr-master-MacOSX/solr/core/src/test-files/solr/collection1/conf/mapping-ISOLatin1Accent.txt to /configs/conf1/mapping-ISOLatin1Accent.txt
   [junit4]   2> 626790 INFO  (TEST-TestDynamicLoading.testDynamicLoading-seed#[E1A73044852D3954]) [    ] o.a.s.c.AbstractZkTestCase put /Users/jenkins/workspace/Lucene-Solr-master-MacOSX/solr/core/src/test-files/solr/collection1/conf/old_synonyms.txt to /configs/conf1/old_synonyms.txt
   [junit4]   2> 626792 INFO  (TEST-TestDynamicLoading.testDynamicLoading-seed#[E1A73044852D3954]) [    ] o.a.s.c.AbstractZkTestCase put /Users/jenkins/workspace/Lucene-Solr-master-MacOSX/solr/core/src/test-files/solr/collection1/conf/synonyms.txt to /configs/conf1/synonyms.txt
   [junit4]   2> 626795 INFO  (TEST-TestDynamicLoading.testDynamicLoading-seed#[E1A73044852D3954]) [    ] o.a.s.c.AbstractFullDistribZkTestBase Will use NRT replicas unless explicitly asked otherwise
   [junit4]   2> 627159 INFO  (TEST-TestDynamicLoading.testDynamicLoading-seed#[E1A73044852D3954]) [    ] o.e.j.s.Server jetty-9.3.20.v20170531
   [junit4]   2> 627161 INFO  (TEST-TestDynamicLoading.testDynamicLoading-seed#[E1A73044852D3954]) [    ] o.e.j.s.h.ContextHandler Started o.e.j.s.ServletContextHandler@14b69ebb{/_e/q,null,AVAILABLE}
   [junit4]   2> 627163 INFO  (TEST-TestDynamicLoading.testDynamicLoading-seed#[E1A73044852D3954]) [    ] o.e.j.s.AbstractConnector Started ServerConnector@54c295c1{HTTP/1.1,[http/1.1]}{127.0.0.1:51724}
   [junit4]   2> 627165 INFO  (TEST-TestDynamicLoading.testDynamicLoading-seed#[E1A73044852D3954]) [    ] o.e.j.s.Server Started @630280ms
   [junit4]   2> 627165 INFO  (TEST-TestDynamicLoading.testDynamicLoading-seed#[E1A73044852D3954]) [    ] o.a.s.c.s.e.JettySolrRunner Jetty properties: {solr.data.dir=/Users/jenkins/workspace/Lucene-Solr-master-MacOSX/solr/build/solr-core/test/J1/temp/solr.core.TestDynamicLoading_E1A73044852D3954-001/tempDir-001/control/data, hostContext=/_e/q, hostPort=51724, coreRootDirectory=/Users/jenkins/workspace/Lucene-Solr-master-MacOSX/solr/build/solr-core/test/J1/../../../../../../../../../Users/jenkins/workspace/Lucene-Solr-master-MacOSX/solr/build/solr-core/test/J1/temp/solr.core.TestDynamicLoading_E1A73044852D3954-001/control-001/cores}
   [junit4]   2> 627165 ERROR (TEST-TestDynamicLoading.testDynamicLoading-seed#[E1A73044852D3954]) [    ] o.a.s.u.StartupLoggingUtils Missing Java Option solr.log.dir. Logging may be missing or incomplete.
   [junit4]   2> 627165 INFO  (TEST-TestDynamicLoading.testDynamicLoading-seed#[E1A73044852D3954]) [    ] o.a.s.s.SolrDispatchFilter  ___      _       Welcome to Apache Solr™ version 8.0.0
   [junit4]   2> 627165 INFO  (TEST-TestDynamicLoading.testDynamicLoading-seed#[E1A73044852D3954]) [    ] o.a.s.s.SolrDispatchFilter / __| ___| |_ _   Starting in cloud mode on port null
   [junit4]   2> 627165 INFO  (TEST-TestDynamicLoading.testDynamicLoading-seed#[E1A73044852D3954]) [    ] o.a.s.s.SolrDispatchFilter \__ \/ _ \ | '_|  Install dir: null, Default config dir: null
   [junit4]   2> 627165 INFO  (TEST-TestDynamicLoading.testDynamicLoading-seed#[E1A73044852D3954]) [    ] o.a.s.s.SolrDispatchFilter |___/\___/_|_|    Start time: 2017-10-20T12:29:09.225Z
   [junit4]   2> 627170 INFO  (TEST-TestDynamicLoading.testDynamicLoading-seed#[E1A73044852D3954]) [    ] o.a.s.s.SolrDispatchFilter Loading solr.xml from SolrHome (not found in ZooKeeper)
   [junit4]   2> 627170 INFO  (TEST-TestDynamicLoading.testDynamicLoading-seed#[E1A73044852D3954]) [    ] o.a.s.c.SolrXmlConfig Loading container configuration from /Users/jenkins/workspace/Lucene-Solr-master-MacOSX/solr/build/solr-core/test/J1/temp/solr.core.TestDynamicLoading_E1A73044852D3954-001/control-001/solr.xml
   [junit4]   2> 627182 INFO  (TEST-TestDynamicLoading.testDynamicLoading-seed#[E1A73044852D3954]) [    ] o.a.s.c.SolrXmlConfig Configuration parameter autoReplicaFailoverWorkLoopDelay is ignored
   [junit4]   2> 627182 INFO  (TEST-TestDynamicLoading.testDynamicLoading-seed#[E1A73044852D3954]) [    ] o.a.s.c.SolrXmlConfig Configuration parameter autoReplicaFailoverBadNodeExpiration is ignored
   [junit4]   2> 627183 INFO  (TEST-TestDynamicLoading.testDynamicLoading-seed#[E1A73044852D3954]) [    ] o.a.s.c.SolrXmlConfig MBean server found: com.sun.jmx.mbeanserver.JmxMBeanServer@7c661cc1, but no JMX reporters were configured - adding default JMX reporter.
   [junit4]   2> 627189 INFO  (TEST-TestDynamicLoading.testDynamicLoading-seed#[E1A73044852D3954]) [    ] o.a.s.c.ZkContainer Zookeeper client=127.0.0.1:51721/solr
   [junit4]   2> 627348 INFO  (TEST-TestDynamicLoading.testDynamicLoading-seed#[E1A73044852D3954]) [n:127.0.0.1:51724__e%2Fq    ] o.a.s.c.Overseer Overseer (id=null) closing
   [junit4]   2> 627349 INFO  (TEST-TestDynamicLoading.testDynamicLoading-seed#[E1A73044852D3954]) [n:127.0.0.1:51724__e%2Fq    ] o.a.s.c.OverseerElectionContext I am going to be the leader 127.0.0.1:51724__e%2Fq
   [junit4]   2> 627350 INFO  (TEST-TestDynamicLoading.testDynamicLoading-seed#[E1A73044852D3954]) [n:127.0.0.1:51724__e%2Fq    ] o.a.s.c.Overseer Overseer (id=98861223031537668-127.0.0.1:51724__e%2Fq-n_0000000000) starting
   [junit4]   2> 627363 INFO  (TEST-TestDynamicLoading.testDynamicLoading-seed#[E1A73044852D3954]) [n:127.0.0.1:51724__e%2Fq    ] o.a.s.c.ZkController Register node as live in ZooKeeper:/live_nodes/127.0.0.1:51724__e%2Fq
   [junit4]   2> 627365 INFO  (zkCallback-1577-thread-1-processing-n:127.0.0.1:51724__e%2Fq) [n:127.0.0.1:51724__e%2Fq    ] o.a.s.c.c.ZkStateReader Updated live nodes from ZooKeeper... (0) -> (1)
   [junit4]   2> 627525 INFO  (TEST-TestDynamicLoading.testDynamicLoading-seed#[E1A73044852D3954]) [n:127.0.0.1:51724__e%2Fq    ] o.a.s.m.r.SolrJmxReporter JMX monitoring for 'solr.node' (registry 'solr.node') enabled at server: com.sun.jmx.mbeanserver.JmxMBeanServer@7c661cc1
   [junit4]   2> 627554 INFO  (TEST-TestDynamicLoading.testDynamicLoading-seed#[E1A73044852D3954]) [n:127.0.0.1:51724__e%2Fq    ] o.a.s.m.r.SolrJmxReporter JMX monitoring for 'solr.jvm' (registry 'solr.jvm') enabled at server: com.sun.jmx.mbeanserver.JmxMBeanServer@7c661cc1
   [junit4]   2> 627554 INFO  (TEST-TestDynamicLoading.testDynamicLoading-seed#[E1A73044852D3954]) [n:127.0.0.1:51724__e%2Fq    ] o.a.s.m.r.SolrJmxReporter JMX monitoring for 'solr.jetty' (registry 'solr.jetty') enabled at server: com.sun.jmx.mbeanserver.JmxMBeanServer@7c661cc1
   [junit4]   2> 627555 INFO  (TEST-TestDynamicLoading.testDynamicLoading-seed#[E1A73044852D3954]) [n:127.0.0.1:51724__e%2Fq    ] o.a.s.c.CorePropertiesLocator Found 0 core definitions underneath /Users/jenkins/workspace/Lucene-Solr-master-MacOSX/solr/build/solr-core/test/J1/../../../../../../../../../Users/jenkins/workspace/Lucene-Solr-master-MacOSX/solr/build/solr-core/test/J1/temp/solr.core.TestDynamicLoading_E1A73044852D3954-001/control-001/cores
   [junit4]   2> 627605 INFO  (TEST-TestDynamicLoading.testDynamicLoading-seed#[E1A73044852D3954]) [    ] o.a.s.c.c.ZkStateReader Updated live nodes from ZooKeeper... (0) -> (1)
   [junit4]   2> 627606 INFO  (TEST-TestDynamicLoading.testDynamicLoading-seed#[E1A73044852D3954]) [    ] o.a.s.c.s.i.ZkClientClusterStateProvider Cluster at 127.0.0.1:51721/solr ready
   [junit4]   2> 627609 INFO  (qtp540886988-5898) [n:127.0.0.1:51724__e%2Fq    ] o.a.s.h.a.CollectionsHandler Invoked Collection Action :create with params replicationFactor=1&collection.configName=conf1&name=control_collection&nrtReplicas=1&action=CREATE&numShards=1&createNodeSet=127.0.0.1:51724__e%252Fq&wt=javabin&version=2 and sendToOCPQueue=true
   [junit4]   2> 627613 INFO  (OverseerThreadFactory-2638-thread-1-processing-n:127.0.0.1:51724__e%2Fq) [n:127.0.0.1:51724__e%2Fq    ] o.a.s.c.CreateCollectionCmd Create collection control_collection
   [junit4]   2> 627727 INFO  (qtp540886988-5900) [n:127.0.0.1:51724__e%2Fq    ] o.a.s.h.a.CoreAdminOperation core create command qt=/admin/cores&collection.configName=conf1&newCollection=true&name=control_collection_shard1_replica_n1&action=CREATE&numShards=1&collection=control_collection&shard=shard1&wt=javabin&version=2&replicaType=NRT
   [junit4]   2> 627728 INFO  (qtp540886988-5900) [n:127.0.0.1:51724__e%2Fq    ] o.a.s.c.TransientSolrCoreCacheDefault Allocating transient cache for 4 transient cores
   [junit4]   2> 627841 INFO  (zkCallback-1577-thread-1-processing-n:127.0.0.1:51724__e%2Fq) [n:127.0.0.1:51724__e%2Fq    ] o.a.s.c.c.ZkStateReader A cluster state change: [WatchedEvent state:SyncConnected type:NodeDataChanged path:/collections/control_collection/state.json] for collection [control_collection] has occurred - updating... (live nodes size: [1])
   [junit4]   2> 628761 INFO  (qtp540886988-5900) [n:127.0.0.1:51724__e%2Fq c:control_collection s:shard1  x:control_collection_shard1_replica_n1] o.a.s.c.SolrConfig Using Lucene MatchVersion: 8.0.0
   [junit4]   2> 628784 INFO  (qtp540886988-5900) [n:127.0.0.1:51724__e%2Fq c:control_collection s:shard1  x:control_collection_shard1_replica_n1] o.a.s.s.IndexSchema [control_collection_shard1_replica_n1] Schema name=test
   [junit4]   2> 629008 INFO  (qtp540886988-5900) [n:127.0.0.1:51724__e%2Fq c:control_collection s:shard1  x:control_collection_shard1_replica_n1] o.a.s.s.IndexSchema Loaded schema test/1.0 with uniqueid field id
   [junit4]   2> 629027 INFO  (qtp540886988-5900) [n:127.0.0.1:51724__e%2Fq c:control_collection s:shard1  x:control_collection_shard1_replica_n1] o.a.s.c.CoreContainer Creating SolrCore 'control_collection_shard1_replica_n1' using configuration from collection control_collection, trusted=true
   [junit4]   2> 629028 INFO  (qtp540886988-5900) [n:127.0.0.1:51724__e%2Fq c:control_collection s:shard1  x:control_collection_shard1_replica_n1] o.a.s.m.r.SolrJmxReporter JMX monitoring for 'solr.core.control_collection.shard1.replica_n1' (registry 'solr.core.control_collection.shard1.replica_n1') enabled at server: com.sun.jmx.mbeanserver.JmxMBeanServer@7c661cc1
   [junit4]   2> 629028 INFO  (qtp540886988-5900) [n:127.0.0.1:51724__e%2Fq c:control_collection s:shard1  x:control_collection_shard1_replica_n1] o.a.s.c.SolrCore solr.RecoveryStrategy.Builder
   [junit4]   2> 629028 INFO  (qtp540886988-5900) [n:127.0.0.1:51724__e%2Fq c:control_collection s:shard1  x:control_collection_shard1_replica_n1] o.a.s.c.SolrCore [[control_collection_shard1_replica_n1] ] Opening new SolrCore at [/Users/jenkins/workspace/Lucene-Solr-master-MacOSX/solr/build/solr-core/test/J1/temp/solr.core.TestDynamicLoading_E1A73044852D3954-001/control-001/cores/control_collection_shard1_replica_n1], dataDir=[/Users/jenkins/workspace/Lucene-Solr-master-MacOSX/solr/build/solr-core/test/J1/../../../../../../../../../Users/jenkins/workspace/Lucene-Solr-master-MacOSX/solr/build/solr-core/test/J1/temp/solr.core.TestDynamicLoading_E1A73044852D3954-001/control-001/cores/control_collection_shard1_replica_n1/data/]
   [junit4]   2> 629042 INFO  (qtp540886988-5900) [n:127.0.0.1:51724__e%2Fq c:control_collection s:shard1  x:control_collection_shard1_replica_n1] o.a.s.u.RandomMergePolicy RandomMergePolicy wrapping class org.apache.lucene.index.AlcoholicMergePolicy: [AlcoholicMergePolicy: minMergeSize=0, mergeFactor=10, maxMergeSize=721972694, maxMergeSizeForForcedMerge=9223372036854775807, calibrateSizeByDeletes=true, maxMergeDocs=2147483647, maxCFSSegmentSizeMB=8.796093022207999E12, noCFSRatio=0.1]
   [junit4]   2> 629072 WARN  (qtp540886988-5900) [n:127.0.0.1:51724__e%2Fq c:control_collection s:shard1  x:control_collection_shard1_replica_n1] o.a.s.c.RequestHandlers INVALID paramSet a in requestHandler {type = requestHandler,name = /dump,class = DumpRequestHandler,attributes = {initParams=a, name=/dump, class=DumpRequestHandler},args = {defaults={a=A,b=B}}}
   [junit4]   2> 629135 INFO  (qtp540886988-5900) [n:127.0.0.1:51724__e%2Fq c:control_collection s:shard1  x:control_collection_shard1_replica_n1] o.a.s.u.UpdateHandler Using UpdateLog implementation: org.apache.solr.update.UpdateLog
   [junit4]   2> 629135 INFO  (qtp540886988-5900) [n:127.0.0.1:51724__e%2Fq c:control_collection s:shard1  x:control_collection_shard1_replica_n1] o.a.s.u.UpdateLog Initializing UpdateLog: dataDir= defaultSyncLevel=FLUSH numRecordsToKeep=100 maxNumLogsToKeep=10 numVersionBuckets=65536
   [junit4]   2> 629150 INFO  (qtp540886988-5900) [n:127.0.0.1:51724__e%2Fq c:control_collection s:shard1  x:control_collection_shard1_replica_n1] o.a.s.u.CommitTracker Hard AutoCommit: disabled
   [junit4]   2> 629150 INFO  (qtp540886988-5900) [n:127.0.0.1:51724__e%2Fq c:control_collection s:shard1  x:control_collection_shard1_replica_n1] o.a.s.u.CommitTracker Soft AutoCommit: disabled
   [junit4]   2> 629151 INFO  (qtp540886988-5900) [n:127.0.0.1:51724__e%2Fq c:control_collection s:shard1  x:control_collection_shard1_replica_n1] o.a.s.u.RandomMergePolicy RandomMergePolicy wrapping class org.apache.lucene.index.TieredMergePolicy: [TieredMergePolicy: maxMergeAtOnce=23, maxMergeAtOnceExplicit=29, maxMergedSegmentMB=99.6728515625, floorSegmentMB=1.14453125, forceMergeDeletesPctAllowed=25.267315203646564, segmentsPerTier=25.0, maxCFSSegmentSizeMB=8.796093022207999E12, noCFSRatio=0.4533779829516632
   [junit4]   2> 629151 INFO  (qtp540886988-5900) [n:127.0.0.1:51724__e%2Fq c:control_collection s:shard1  x:control_collection_shard1_replica_n1] o.a.s.s.SolrIndexSearcher Opening [Searcher@49777d76[control_collection_shard1_replica_n1] main]
   [junit4]   2> 629153 INFO  (qtp540886988-5900) [n:127.0.0.1:51724__e%2Fq c:control_collection s:shard1  x:control_collection_shard1_replica_n1] o.a.s.r.ManagedResourceStorage Configured ZooKeeperStorageIO with znodeBase: /configs/conf1
   [junit4]   2> 629153 INFO  (qtp540886988-5900) [n:127.0.0.1:51724__e%2Fq c:control_collection s:shard1  x:control_collection_shard1_replica_n1] o.a.s.r.ManagedResourceStorage Loaded null at path _rest_managed.json using ZooKeeperStorageIO:path=/configs/conf1
   [junit4]   2> 629153 INFO  (qtp540886988-5900) [n:127.0.0.1:51724__e%2Fq c:control_collection s:shard1  x:control_collection_shard1_replica_n1] o.a.s.h.ReplicationHandler Commits will be reserved for 10000ms.
   [junit4]   2> 629154 INFO  (qtp540886988-5900) [n:127.0.0.1:51724__e%2Fq c:control_collection s:shard1  x:control_collection_shard1_replica_n1] o.a.s.u.UpdateLog Could not find max version in index or recent updates, using new clock 1581779571141771264
   [junit4]   2> 629154 INFO  (searcherExecutor-2641-thread-1-processing-n:127.0.0.1:51724__e%2Fq x:control_collection_shard1_replica_n1 s:shard1 c:control_collection) [n:127.0.0.1:51724__e%2Fq c:control_collection s:shard1  x:control_collection_shard1_replica_n1] o.a.s.c.SolrCore [control_collection_shard1_replica_n1] Registered new searcher Searcher@49777d76[control_collection_shard1_replica_n1] main{ExitableDirectoryReader(UninvertingDirectoryReader())}
   [junit4]   2> 629159 INFO  (qtp540886988-5900) [n:127.0.0.1:51724__e%2Fq c:control_collection s:shard1  x:control_collection_shard1_replica_n1] o.a.s.c.ShardLeaderElectionContext Enough replicas found to continue.
   [junit4]   2> 629159 INFO  (qtp540886988-5900) [n:127.0.0.1:51724__e%2Fq c:control_collection s:shard1  x:control_collection_shard1_replica_n1] o.a.s.c.ShardLeaderElectionContext I may be the new leader - try and sync
   [junit4]   2> 629159 INFO  (qtp540886988-5900) [n:127.0.0.1:51724__e%2Fq c:control_collection s:shard1  x:control_collection_shard1_replica_n1] o.a.s.c.SyncStrategy Sync replicas to http://127.0.0.1:51724/_e/q/control_collection_shard1_replica_n1/
   [junit4]   2> 629159 INFO  (qtp540886988-5900) [n:127.0.0.1:51724__e%2Fq c:control_collection s:shard1  x:control_collection_shard1_replica_n1] o.a.s.c.SyncStrategy Sync Success - now sync replicas to me
   [junit4]   2> 629159 INFO  (qtp540886988-5900) [n:127.0.0.1:51724__e%2Fq c:control_collection s:shard1  x:control_collection_shard1_replica_n1] o.a.s.c.SyncStrategy http://127.0.0.1:51724/_e/q/control_collection_shard1_replica_n1/ has no replicas
   [junit4]   2> 629159 INFO  (qtp540886988-5900) [n:127.0.0.1:51724__e%2Fq c:control_collection s:shard1  x:control_collection_shard1_replica_n1] o.a.s.c.ShardLeaderElectionContext Found all replicas participating in election, clear LIR
   [junit4]   2> 629164 INFO  (qtp540886988-5900) [n:127.0.0.1:51724__e%2Fq c:control_collection s:shard1  x:control_collection_shard1_replica_n1] o.a.s.c.ShardLeaderElectionContext I am the new leader: http://127.0.0.1:51724/_e/q/control_collection_shard1_replica_n1/ shard1
   [junit4]   2> 629266 INFO  (zkCallback-1577-thread-1-processing-n:127.0.0.1:51724__e%2Fq) [n:127.0.0.1:51724__e%2Fq    ] o.a.s.c.c.ZkStateReader A cluster state change: [WatchedEvent state:SyncConnected type:NodeDataChanged path:/collections/control_collection/state.json] for collection [control_collection] has occurred - updating... (live nodes size: [1])
   [junit4]   2> 629317 INFO  (qtp540886988-5900) [n:127.0.0.1:51724__e%2Fq c:control_collection s:shard1  x:control_collection_shard1_replica_n1] o.a.s.c.ZkController I am the leader, no recovery necessary
   [junit4]   2> 629319 INFO  (qtp540886988-5900) [n:127.0.0.1:51724__e%2Fq c:control_collection s:shard1  x:control_collection_shard1_replica_n1] o.a.s.s.HttpSolrCall [admin] webapp=null path=/admin/cores params={qt=/admin/cores&collection.configName=conf1&newCollection=true&name=control_collection_shard1_replica_n1&action=CREATE&numShards=1&collection=control_collection&shard=shard1&wt=javabin&version=2&replicaType=NRT} status=0 QTime=1591
   [junit4]   2> 629322 INFO  (qtp540886988-5898) [n:127.0.0.1:51724__e%2Fq    ] o.a.s.h.a.CollectionsHandler Wait for new collection to be active for at most 30 seconds. Check all shard replicas
   [junit4]   2> 629424 INFO  (zkCallback-1577-thread-1-processing-n:127.0.0.1:51724__e%2Fq) [n:127.0.0.1:51724__e%2Fq    ] o.a.s.c.c.ZkStateReader A cluster state change: [WatchedEvent state:SyncConnected type:NodeDataChanged path:/collections/control_collection/state.json] for collection [control_collection] has occurred - updating... (live nodes size: [1])
   [junit4]   2> 629617 INFO  (OverseerCollectionConfigSetProcessor-98861223031537668-127.0.0.1:51724__e%2Fq-n_0000000000) [n:127.0.0.1:51724__e%2Fq    ] o.a.s.c.OverseerTaskQueue Response ZK path: /overseer/collection-queue-work/qnr-0000000000 doesn't exist.  Requestor may have disconnected from ZooKeeper
   [junit4]   2> 630325 INFO  (qtp540886988-5898) [n:127.0.0.1:51724__e%2Fq    ] o.a.s.s.HttpSolrCall [admin] webapp=null path=/admin/collections params={replicationFactor=1&collection.configName=conf1&name=control_collection&nrtReplicas=1&action=CREATE&numShards=1&createNodeSet=127.0.0.1:51724__e%252Fq&wt=javabin&version=2} status=0 QTime=2715
   [junit4]   2> 630332 INFO  (TEST-TestDynamicLoading.testDynamicLoading-seed#[E1A73044852D3954]) [    ] o.a.s.c.c.ZkStateReader Updated live nodes from ZooKeeper... (0) -> (1)
   [junit4]   2> 630334 INFO  (TEST-TestDynamicLoading.testDynamicLoading-seed#[E1A73044852D3954]) [    ] o.a.s.c.s.i.ZkClientClusterStateProvider Cluster at 127.0.0.1:51721/solr ready
   [junit4]   2> 630334 INFO  (TEST-TestDynamicLoading.testDynamicLoading-seed#[E1A73044852D3954]) [    ] o.a.s.c.ChaosMonkey monkey: init - expire sessions:false cause connection loss:false
   [junit4]   2> 630335 INFO  (qtp540886988-5901) [n:127.0.0.1:51724__e%2Fq    ] o.a.s.h.a.CollectionsHandler Invoked Collection Action :create with params replicationFactor=1&collection.configName=conf1&name=collection1&nrtReplicas=1&action=CREATE&numShards=2&createNodeSet=&stateFormat=1&wt=javabin&version=2 and sendToOCPQueue=true
   [junit4]   2> 630339 INFO  (OverseerThreadFactory-2638-thread-2-processing-n:127.0.0.1:51724__e%2Fq) [n:127.0.0.1:51724__e%2Fq    ] o.a.s.c.CreateCollectionCmd Create collection collection1
   [junit4]   2> 630340 WARN  (OverseerThreadFactory-2638-thread-2-processing-n:127.0.0.1:51724__e%2Fq) [n:127.0.0.1:51724__e%2Fq    ] o.a.s.c.CreateCollectionCmd It is unusual to create a collection (collection1) without cores.
   [junit4]   2> 630549 INFO  (qtp540886988-5901) [n:127.0.0.1:51724__e%2Fq    ] o.a.s.h.a.CollectionsHandler Wait for new collection to be active for at most 30 seconds. Check all shard replicas
   [junit4]   2> 630549 INFO  (qtp540886988-5901) [n:127.0.0.1:51724__e%2Fq    ] o.a.s.s.HttpSolrCall [admin] webapp=null path=/admin/collections params={replicationFactor=1&collection.configName=conf1&name=collection1&nrtReplicas=1&action=CREATE&numShards=2&createNodeSet=&stateFormat=1&wt=javabin&version=2} status=0 QTime=213
   [junit4]   2> 630895 INFO  (TEST-TestDynamicLoading.testDynamicLoading-seed#[E1A73044852D3954]) [    ] o.a.s.c.AbstractFullDistribZkTestBase create jetty 1 in directory /Users/jenkins/workspace/Lucene-Solr-master-MacOSX/solr/build/solr-core/test/J1/temp/solr.core.TestDynamicLoading_E1A73044852D3954-001/shard-1-001 of type NRT
   [junit4]   2> 630895 INFO  (TEST-TestDynamicLoading.testDynamicLoading-seed#[E1A73044852D3954]) [    ] o.e.j.s.Server jetty-9.3.20.v20170531
   [junit4]   2> 630896 INFO  (TEST-TestDynamicLoading.testDynamicLoading-seed#[E1A73044852D3954]) [    ] o.e.j.s.h.ContextHandler Started o.e.j.s.ServletContextHandler@7242e423{/_e/q,null,AVAILABLE}
   [junit4]   2> 630904 INFO  (TEST-TestDynamicLoading.testDynamicLoading-seed#[E1A73044852D3954]) [    ] o.e.j.s.AbstractConnector Started ServerConnector@53bb668e{HTTP/1.1,[http/1.1]}{127.0.0.1:51749}
   [junit4]   2> 630904 INFO  (TEST-TestDynamicLoading.testDynamicLoading-seed#[E1A73044852D3954]) [    ] o.e.j.s.Server Started @634019ms
   [junit4]   2> 630904 INFO  (TEST-TestDynamicLoading.testDynamicLoading-seed#[E1A73044852D3954]) [    ] o.a.s.c.s.e.JettySolrRunner Jetty properties: {solr.data.dir=/Users/jenkins/workspace/Lucene-Solr-master-MacOSX/solr/build/solr-core/test/J1/temp/solr.core.TestDynamicLoading_E1A73044852D3954-001/tempDir-001/jetty1, replicaType=NRT, solrconfig=solrconfig.xml, hostContext=/_e/q, hostPort=51749, coreRootDirectory=/Users/jenkins/workspace/Lucene-Solr-master-MacOSX/solr/build/solr-core/test/J1/temp/solr.core.TestDynamicLoading_E1A73044852D3954-001/shard-1-001/cores}
   [junit4]   2> 630904 ERROR (TEST-TestDynamicLoading.testDynamicLoading-seed#[E1A73044852D3954]) [    ] o.a.s.u.StartupLoggingUtils Missing Java Option solr.log.dir. Logging may be missing or incomplete.
   [junit4]   2> 630905 INFO  (TEST-TestDynamicLoading.testDynamicLoading-seed#[E1A73044852D3954]) [    ] o.a.s.s.SolrDispatchFilter  ___      _       Welcome to Apache Solr™ version 8.0.0
   [junit4]   2> 630905 INFO  (TEST-TestDynamicLoading.testDynamicLoading-seed#[E1A73044852D3954]) [    ] o.a.s.s.SolrDispatchFilter / __| ___| |_ _   Starting in cloud mode on port null
   [junit4]   2> 630905 INFO  (TEST-TestDynamicLoading.testDynamicLoading-seed#[E1A73044852D3954]) [    ] o.a.s.s.SolrDispatchFilter \__ \/ _ \ | '_|  Install dir: null, Default config dir: null
   [junit4]   2> 630905 INFO  (TEST-TestDynamicLoading.testDynamicLoading-seed#[E1A73044852D3954]) [    ] o.a.s.s.SolrDispatchFilter |___/\___/_|_|    Start time: 2017-10-20T12:29:12.965Z
   [junit4]   2> 630908 INFO  (TEST-TestDynamicLoading.testDynamicLoading-seed#[E1A73044852D3954]) [    ] o.a.s.s.SolrDispatchFilter Loading solr.xml from SolrHome (not found in ZooKeeper)
   [junit4]   2> 630908 INFO  (TEST-TestDynamicLoading.testDynamicLoading-seed#[E1A73044852D3954]) [    ] o.a.s.c.SolrXmlConfig Loading container configuration from /Users/jenkins/workspace/Lucene-Solr-master-MacOSX/solr/build/solr-core/test/J1/temp/solr.core.TestDynamicLoading_E1A73044852D3954-001/shard-1-001/solr.xml
   [junit4]   2> 630914 INFO  (TEST-TestDynamicLoading.testDynamicLoading-seed#[E1A73044852D3954]) [    ] o.a.s.c.SolrXmlConfig Configuration parameter autoReplicaFailoverWorkLoopDelay is ignored
   [junit4]   2> 630914 INFO  (TEST-TestDynamicLoading.testDynamicLoading-seed#[E1A73044852D3954]) [    ] o.a.s.c.SolrXmlConfig Configuration parameter autoReplicaFailoverBadNodeExpiration is ignored
   [junit4]   2> 630915 INFO  (TEST-TestDynamicLoading.testDynamicLoading-seed#[E1A73044852D3954]) [    ] o.a.s.c.SolrXmlConfig MBean server found: com.sun.jmx.mbeanserver.JmxMBeanServer@7c661cc1, but no JMX reporters were configured - adding default JMX reporter.
   [junit4]   2> 630919 INFO  (TEST-TestDynamicLoading.testDynamicLoading-seed#[E1A73044852D3954]) [    ] o.a.s.c.ZkContainer Zookeeper client=127.0.0.1:51721/solr
   [junit4]   2> 630940 INFO  (TEST-TestDynamicLoading.testDynamicLoading-seed#[E1A73044852D3954]) [n:127.0.0.1:51749__e%2Fq    ] o.a.s.c.c.ZkStateReader Updated live nodes from ZooKeeper... (0) -> (1)
   [junit4]   2> 630946 INFO  (TEST-TestDynamicLoading.testDynamicLoading-seed#[E1A73044852D3954]) [n:127.0.0.1:51749__e%2Fq    ] o.a.s.c.Overseer Overseer (id=null) closing
   [junit4]   2> 630950 INFO  (TEST-TestDynamicLoading.testDynamicLoading-seed#[E1A73044852D3954]) [n:127.0.0.1:51749__e%2Fq    ] o.a.s.c.ZkController Register node as live in ZooKeeper:/live_nodes/127.0.0.1:51749__e%2Fq
   [junit4]   2> 630952 INFO  (zkCallback-1577-thread-1-processing-n:127.0.0.1:51724__e%2Fq) [n:127.0.0.1:51724__e%2Fq    ] o.a.s.c.c.ZkStateReader Updated live nodes from ZooKeeper... (1) -> (2)
   [junit4]   2> 630952 INFO  (zkCallback-1585-thread-1) [    ] o.a.s.c.c.ZkStateReader Updated live nodes from ZooKeeper... (1) -> (2)
   [junit4]   2> 630952 INFO  (zkCallback-1590-thread-1-processing-n:127.0.0.1:51749__e%2Fq) [n:127.0.0.1:51749__e%2Fq    ] o.a.s.c.c.ZkStateReader Updated live nodes from ZooKeeper... (1) -> (2)
   [junit4]   2> 631049 INFO  (TEST-TestDynamicLoading.testDynamicLoading-seed#[E1A73044852D3954]) [n:127.0.0.1:51749__e%2Fq    ] o.a.s.m.r.SolrJmxReporter JMX monitoring for 'solr.node' (registry 'solr.node') enabled at server: com.sun.jmx.mbeanserver.JmxMBeanServer@7c661cc1
   [junit4]   2> 631058 INFO  (TEST-TestDynamicLoading.testDynamicLoading-seed#[E1A73044852D3954]) [n:127.0.0.1:51749__e%2Fq    ] o.a.s.m.r.SolrJmxReporter JMX monitoring for 'solr.jvm' (registry 'solr.jvm') enabled at server: com.sun.jmx.mbeanserver.JmxMBeanServer@7c661cc1
   [junit4]   2> 631059 INFO  (TEST-TestDynamicLoading.testDynamicLoading-seed#[E1A73044852D3954]) [n:127.0.0.1:51749__e%2Fq    ] o.a.s.m.r.SolrJmxReporter JMX monitoring for 'solr.jetty' (registry 'solr.jetty') enabled at server: com.sun.jmx.mbeanserver.JmxMBeanServer@7c661cc1
   [junit4]   2> 631060 INFO  (TEST-TestDynamicLoading.testDynamicLoading-seed#[E1A73044852D3954]) [n:127.0.0.1:51749__e%2Fq    ] o.a.s.c.CorePropertiesLocator Found 0 core definitions underneath /Users/jenkins/workspace/Lucene-Solr-master-MacOSX/solr/build/solr-core/test/J1/temp/solr.core.TestDynamicLoading_E1A73044852D3954-001/shard-1-001/cores
   [junit4]   2> 631105 INFO  (qtp540886988-5903) [n:127.0.0.1:51724__e%2Fq    ] o.a.s.h.a.CollectionsHandler Invoked Collection Action :addreplica with params node=127.0.0.1:51749__e%252Fq&action=ADDREPLICA&collection=collection1&shard=shard2&type=NRT&wt=javabin&version=2 and sendToOCPQueue=true
   [junit4]   2> 631111 INFO  (OverseerCollectionConfigSetProcessor-98861223031537668-127.0.0.1:51724__e%2Fq-n_0000000000) [n:127.0.0.1:51724__e%2Fq    ] o.a.s.c.OverseerTaskQueue Response ZK path: /overseer/collection-queue-work/qnr-0000000002 doesn't exist.  Requestor may have disconnected from ZooKeeper
   [junit4]   2> 631111 INFO  (OverseerThreadFactory-2638-thread-3-processing-n:127.0.0.1:51724__e%2Fq) [n:127.0.0.1:51724__e%2Fq    ] o.a.s.c.AddReplicaCmd Node Identified 127.0.0.1:51749__e%2Fq for creating new replica
   [junit4]   2> 631120 INFO  (qtp2091341040-5945) [n:127.0.0.1:51749__e%2Fq    ] o.a.s.h.a.CoreAdminOperation core create command qt=/admin/cores&collection.configName=conf1&name=collection1_shard2_replica_n41&action=CREATE&collection=collection1&shard=shard2&wt=javabin&version=2&replicaType=NRT
   [junit4]   2> 631121 INFO  (qtp2091341040-5945) [n:127.0.0.1:51749__e%2Fq    ] o.a.s.c.TransientSolrCoreCacheDefault Allocating transient cache for 4 transient cores
   [junit4]   2> 632150 INFO  (qtp2091341040-5945) [n:127.0.0.1:51749__e%2Fq c:collection1 s:shard2  x:collection1_shard2_replica_n41] o.a.s.c.SolrConfig Using Lucene MatchVersion: 8.0.0
   [junit4]   2> 632167 INFO  (qtp2091341040-5945) [n:127.0.0.1:51749__e%2Fq c:collection1 s:shard2  x:collection1_shard2_replica_n41] o.a.s.s.IndexSchema [collection1_shard2_replica_n41] Schema name=test
   [junit4]   2> 632286 INFO  (qtp2091341040-5945) [n:127.0.0.1:51749__e%2Fq c:collection1 s:shard2  x:collection1_shard2_replica_n41] o.a.s.s.IndexSchema Loaded schema test/1.0 with uniqueid field id
   [junit4]   2> 632321 INFO  (qtp2091341040-5945) [n:127.0.0.1:51749__e%2Fq c:collection1 s:shard2  x:collection1_shard2_replica_n41] o.a.s.c.CoreContainer Creating SolrCore 'collection1_shard2_replica_n41' using configuration from collection collection1, trusted=true
   [junit4]   2> 632321 INFO  (qtp2091341040-5945) [n:127.0.0.1:51749__e%2Fq c:collection1 s:shard2  x:collection1_shard2_replica_n41] o.a.s.m.r.SolrJmxReporter JMX monitoring for 'solr.core.collection1.shard2.replica_n41' (registry 'solr.core.collection1.shard2.replica_n41') enabled at server: com.sun.jmx.mbeanserver.JmxMBeanServer@7c661cc1
   [junit4]   2> 632321 INFO  (qtp2091341040-5945) [n:127.0.0.1:51749__e%2Fq c:collection1 s:shard2  x:collection1_shard2_replica_n41] o.a.s.c.SolrCore solr.RecoveryStrategy.Builder
   [junit4]   2> 632321 INFO  (qtp2091341040-5945) [n:127.0.0.1:51749__e%2Fq c:collection1 s:shard2  x:collection1_shard2_replica_n41] o.a.s.c.SolrCore [[collection1_shard2_replica_n41] ] Opening new SolrCore at [/Users/jenkins/workspace/Lucene-Solr-master-MacOSX/solr/build/solr-core/test/J1/temp/solr.core.TestDynamicLoading_E1A73044852D3954-001/shard-1-001/cores/collection1_shard2_replica_n41], dataDir=[/Users/jenkins/workspace/Lucene-Solr-master-MacOSX/solr/build/solr-core/test/J1/temp/solr.core.TestDynamicLoading_E1A73044852D3954-001/shard-1-001/cores/collection1_shard2_replica_n41/data/]
   [junit4]   2> 632329 INFO  (qtp2091341040-5945) [n:127.0.0.1:51749__e%2Fq c:collection1 s:shard2  x:collection1_shard2_replica_n41] o.a.s.u.RandomMergePolicy RandomMergePolicy wrapping class org.apache.lucene.index.AlcoholicMergePolicy: [AlcoholicMergePolicy: minMergeSize=0, mergeFactor=10, maxMergeSize=721972694, maxMergeSizeForForcedMerge=9223372036854775807, calibrateSizeByDeletes=true, maxMergeDocs=2147483647, maxCFSSegmentSizeMB=8.796093022207999E12, noCFSRatio=0.1]
   [junit4]   2> 632333 WARN  (qtp2091341040-5945) [n:127.0.0.1:51749__e%2Fq c:collection1 s:shard2  x:collection1_shard2_replica_n41] o.a.s.c.RequestHandlers INVALID paramSet a in requestHandler {type = requestHandler,name = /dump,class = DumpRequestHandler,attributes = {initParams=a, name=/dump, class=DumpRequestHandler},args = {defaults={a=A,b=B}}}
   [junit4]   2> 632393 INFO  (qtp2091341040-5945) [n:127.0.0.1:51749__e%2Fq c:collection1 s:shard2  x:collection1_shard2_replica_n41] o.a.s.u.UpdateHandler Using UpdateLog implementation: org.apache.solr.update.UpdateLog
   [junit4]   2> 632393 INFO  (qtp2091341040-5945) [n:127.0.0.1:51749__e%2Fq c:collection1 s:shard2  x:collection1_shard2_replica_n41] o.a.s.u.UpdateLog Initializing UpdateLog: dataDir= defaultSyncLevel=FLUSH numRecordsToKeep=100 maxNumLogsToKeep=10 numVersionBuckets=65536
   [junit4]   2> 632394 INFO  (qtp2091341040-5945) [n:127.0.0.1:51749__e%2Fq c:collection1 s:shard2  x:collection1_shard2_replica_n41] o.a.s.u.CommitTracker Hard AutoCommit: disabled
   [junit4]   2> 632394 INFO  (qtp2091341040-5945) [n:127.0.0.1:51749__e%2Fq c:collection1 s:shard2  x:collection1_shard2_replica_n41] o.a.s.u.CommitTracker Soft AutoCommit: disabled
   [junit4]   2> 632396 INFO  (qtp2091341040-5945) [n:127.0.0.1:51749__e%2Fq c:collection1 s:shard2  x:collection1_shard2_replica_n41] o.a.s.u.RandomMergePolicy RandomMergePolicy wrapping class org.apache.lucene.index.TieredMergePolicy: [TieredMergePolicy: maxMergeAtOnce=23, maxMergeAtOnceExplicit=29, maxMergedSegmentMB=99.6728515625, floorSegmentMB=1.14453125, forceMergeDeletesPctAllowed=25.267315203646564, segmentsPerTier=25.0, maxCFSSegmentSizeMB=8.796093022207999E12, noCFSRatio=0.4533779829516632
   [junit4]   2> 632396 INFO  (qtp2091341040-5945) [n:127.0.0.1:51749__e%2Fq c:collection1 s:shard2  x:collection1_shard2_replica_n41] o.a.s.s.SolrIndexSearcher Opening [Searcher@6edcd6dc[collection1_shard2_replica_n41] main]
   [junit4]   2> 632399 INFO  (qtp2091341040-5945) [n:127.0.0.1:51749__e%2Fq c:collection1 s:shard2  x:collection1_shard2_replica_n41] o.a.s.r.ManagedResourceStorage Configured ZooKeeperStorageIO with znodeBase: /configs/conf1
   [junit4]   2> 632400 INFO  (qtp2091341040-5945) [n:127.0.0.1:51749__e%2Fq c:collection1 s:shard2  x:collection1_shard2_replica_n41] o.a.s.r.ManagedResourceStorage Loaded null at path _rest_managed.json using ZooKeeperStorageIO:path=/configs/conf1
   [junit4]   2> 632400 INFO  (qtp2091341040-5945) [n:127.0.0.1:51749__e%2Fq c:collection1 s:shard2  x:collection1_shard2_replica_n41] o.a.s.h.ReplicationHandler Commits will be reserved for 10000ms.
   [junit4]   2> 632400 INFO  (qtp2091341040-5945) [n:127.0.0.1:51749__e%2Fq c:collection1 s:shard2  x:collection1_shard2_replica_n41] o.a.s.u.UpdateLog Could not find max version in index or recent updates, using new clock 1581779574545448960
   [junit4]   2> 632401 INFO  (searcherExecutor-2652-thread-1-processing-n:127.0.0.1:51749__e%2Fq x:collection1_shard2_replica_n41 s:shard2 c:collection1) [n:127.0.0.1:51749__e%2Fq c:collection1 s:shard2  x:collection1_shard2_replica_n41] o.a.s.c.SolrCore [collection1_shard2_replica_n41] Registered new searcher Searcher@6edcd6dc[collection1_shard2_replica_n41] main{ExitableDirectoryReader(UninvertingDirectoryReader())}
   [junit4]   2> 632411 INFO  (qtp2091341040-5945) [n:127.0.0.1:51749__e%2Fq c:collection1 s:shard2  x:collection1_shard2_replica_n41] o.a.s.c.ShardLeaderElectionContext Enough replicas found to continue.
   [junit4]   2> 632411 INFO  (qtp2091341040-5945) [n:127.0.0.1:51749__e%2Fq c:collection1 s:shard2  x:collection1_shard2_replica_n41] o.a.s.c.ShardLeaderElectionContext I may be the new leader - try and sync
   [junit4]   2> 632411 INFO  (qtp2091341040-5945) [n:127.0.0.1:51749__e%2Fq c:collection1 s:shard2  x:collection1_shard2_replica_n41] o.a.s.c.SyncStrategy Sync replicas to http://127.0.0.1:51749/_e/q/collection1_shard2_replica_n41/
   [junit4]   2> 632411 INFO  (qtp2091341040-5945) [n:127.0.0.1:51749__e%2Fq c:collection1 s:shard2  x:collection1_shard2_replica_n41] o.a.s.c.SyncStrategy Sync Success - now sync replicas to me
   [junit4]   2> 632411 INFO  (qtp2091341040-5945) [n:127.0.0.1:51749__e%2Fq c:collection1 s:shard2  x:collection1_shard2_replica_n41] o.a.s.c.SyncStrategy http://127.0.0.1:51749/_e/q/collection1_shard2_replica_n41/ has no replicas
   [junit4]   2> 632411 INFO  (qtp2091341040-5945) [n:127.0.0.1:51749__e%2Fq c:collection1 s:shard2  x:collection1_shard2_replica_n41] o.a.s.c.ShardLeaderElectionContext Found all replicas participating in election, clear LIR
   [junit4]   2> 632417 INFO  (qtp2091341040-5945) [n:127.0.0.1:51749__e%2Fq c:collection1 s:shard2  x:collection1_shard2_replica_n41] o.a.s.c.ShardLeaderElectionContext I am the new leader: http://127.0.0.1:51749/_e/q/collection1_shard2_replica_n41/ shard2
   [junit4]   2> 632525 INFO  (qtp2091341040-5945) [n:127.0.0.1:51749__e%2Fq c:collection1 s:shard2  x:collection1_shard2_replica_n41] o.a.s.c.ZkController I am the leader, no recovery necessary
   [junit4]   2> 632526 INFO  (qtp2091341040-5945) [n:127.0.0.1:51749__e%2Fq c:collection1 s:shard2  x:collection1_shard2_replica_n41] o.a.s.s.HttpSolrCall [admin] webapp=null path=/admin/cores params={qt=/admin/cores&collection.configName=conf1&name=collection1_shard2_replica_n41&action=CREATE&collection=collection1&shard=shard2&wt=javabin&version=2&replicaType=NRT} status=0 QTime=1406
   [junit4]   2> 632529 INFO  (qtp540886988-5903) [n:127.0.0.1:51724__e%2Fq    ] o.a.s.s.HttpSolrCall [admin] webapp=null path=/admin/collections params={node=127.0.0.1:51749__e%252Fq&action=ADDREPLICA&collection=collection1&shard=shard2&type=NRT&wt=javabin&version=2} status=0 QTime=1423
   [junit4]   2> 632835 INFO  (TEST-TestDynamicLoading.testDynamicLoading-seed#[E1A73044852D3954]) [    ] o.a.s.c.AbstractFullDistribZkTestBase create jetty 2 in directory /Users/jenkins/workspace/Lucene-Solr-master-MacOSX/solr/build/solr-core/test/J1/temp/solr.core.TestDynamicLoading_E1A73044852D3954-001/shard-2-001 of type NRT
   [junit4]   2> 632836 INFO  (TEST-TestDynamicLoading.testDynamicLoading-seed#[E1A73044852D3954]) [    ] o.e.j.s.Server jetty-9.3.20.v20170531
   [junit4]   2> 632837 INFO  (TEST-TestDynamicLoading.testDynamicLoading-seed#[E1A73044852D3954]) [    ] o.e.j.s.h.ContextHandler Started o.e.j.s.ServletContextHandler@77c68b14{/_e/q,null,AVAILABLE}
   [junit4]   2> 632837 INFO  (TEST-TestDynamicLoading.testDynamicLoading-seed#[E1A73044852D3954]) [    ] o.e.j.s.AbstractConnector Started ServerConnector@73be63{HTTP/1.1,[http/1.1]}{127.0.0.1:51760}
   [junit4]   2> 632837 INFO  (TEST-TestDynamicLoading.testDynamicLoading-seed#[E1A73044852D3954]) [    ] o.e.j.s.Server Started @635952ms
   [junit4]   2> 632837 INFO  (TEST-TestDynamicLoading.testDynamicLoading-seed#[E1A73044852D3954]) [    ] o.a.s.c.s.e.JettySolrRunner Jetty properties: {solr.data.dir=/Users/jenkins/workspace/Lucene-Solr-master-MacOSX/solr/build/solr-core/test/J1/temp/solr.core.TestDynamicLoading_E1A73044852D3954-001/tempDir-001/jetty2, solrconfig=solrconfig.xml, hostContext=/_e/q, hostPort=51760, coreRootDirectory=/Users/jenkins/workspace/Lucene-Solr-master-MacOSX/solr/build/solr-core/test/J1/temp/solr.core.TestDynamicLoading_E1A73044852D3954-001/shard-2-001/cores}
   [junit4]   2> 632838 ERROR (TEST-TestDynamicLoading.testDynamicLoading-seed#[E1A73044852D3954]) [    ] o.a.s.u.StartupLoggingUtils Missing Java Option solr.log.dir. Logging may be missing or incomplete.
   [junit4]   2> 632838 INFO  (TEST-TestDynamicLoading.testDynamicLoading-seed#[E1A73044852D3954]) [    ] o.a.s.s.SolrDispatchFilter  ___      _       Welcome to Apache Solr™ version 8.0.0
   [junit4]   2> 632838 INFO  (TEST-TestDynamicLoading.testDynamicLoading-seed#[E1A73044852D3954]) [    ] o.a.s.s.SolrDispatchFilter / __| ___| |_ _   Starting in cloud mode on port null
   [junit4]   2> 632838 INFO  (TEST-TestDynamicLoading.testDynamicLoading-seed#[E1A73044852D3954]) [    ] o.a.s.s.SolrDispatchFilter \__ \/ _ \ | '_|  Install dir: null, Default config dir: null
   [junit4]   2> 632838 INFO  (TEST-TestDynamicLoading.testDynamicLoading-seed#[E1A73044852D3954]) [    ] o.a.s.s.SolrDispatchFilter |___/\___/_|_|    Start time: 2017-10-20T12:29:14.898Z
   [junit4]   2> 632841 INFO  (TEST-TestDynamicLoading.testDynamicLoading-seed#[E1A73044852D3954]) [    ] o.a.s.s.SolrDispatchFilter Loading solr.xml from SolrHome (not found in ZooKeeper)
   [junit4]   2> 632841 INFO  (TEST-TestDynamicLoading.testDynamicLoading-seed#[E1A73044852D3954]) [    ] o.a.s.c.SolrXmlConfig Loading container configuration from /Users/jenkins/workspace/Lucene-Solr-master-MacOSX/solr/build/solr-core/test/J1/temp/solr.core.TestDynamicLoading_E1A73044852D3954-001/shard-2-001/solr.xml
   [junit4]   2> 632846 INFO  (TEST-TestDynamicLoading.testDynamicLoading-seed#[E1A73044852D3954]) [    ] o.a.s.c.SolrXmlConfig Configuration parameter autoReplicaFailoverWorkLoopDelay is ignored
   [junit4]   2> 632846 INFO  (TEST-TestDynamicLoading.testDynamicLoading-seed#[E1A73044852D3954]) [    ] o.a.s.c.SolrXmlConfig Configuration parameter autoReplicaFailoverBadNodeExpiration is ignored
   [junit4]   2> 632853 INFO  (TEST-TestDynamicLoading.testDynamicLoading-seed#[E1A73044852D3954]) [    ] o.a.s.c.SolrXmlConfig MBean server found: com.sun.jmx.mbeanserver.JmxMBeanServer@7c661cc1, but no JMX reporters were configured - adding default JMX reporter.
   [junit4]   2> 632856 INFO  (TEST-TestDynamicLoading.testDynamicLoading-seed#[E1A73044852D3954]) [    ] o.a.s.c.ZkContainer Zookeeper client=127.0.0.1:51721/solr
   [junit4]   2> 632869 INFO  (TEST-TestDynamicLoading.testDynamicLoading-seed#[E1A73044852D3954]) [n:127.0.0.1:51760__e%2Fq    ] o.a.s.c.c.ZkStateReader Updated live nodes from ZooKeeper... (0) -> (2)
   [junit4]   2> 632873 INFO  (TEST-TestDynamicLoading.testDynamicLoading-seed#[E1A73044852D3954]) [n:127.0.0.1:51760__e%2Fq    ] o.a.s.c.Overseer Overseer (id=null) closing
   [junit4]   2> 632876 INFO  (TEST-TestDynamicLoading.testDynamicLoading-seed#[E1A73044852D3954]) [n:127.0.0.1:51760__e%2Fq    ] o.a.s.c.ZkController Register node as live in ZooKeeper:/live_nodes/127.0.0.1:51760__e%2Fq
   [junit4]   2> 632878 INFO  (zkCallback-1577-thread-1-processing-n:127.0.0.1:51724__e%2Fq) [n:127.0.0.1:51724__e%2Fq    ] o.a.s.c.c.ZkStateReader Updated live nodes from ZooKeeper... (2) -> (3)
   [junit4]   2> 632878 INFO  (zkCallback-1590-thread-1-processing-n:127.0.0.1:51749__e%2Fq) [n:127.0.0.1:51749__e%2Fq    ] o.a.s.c.c.ZkStateReader Updated live nodes from ZooKeeper... (2) -> (3)
   [junit4]   2> 632878 INFO  (zkCallback-1585-thread-1) [    ] o.a.s.c.c.ZkStateReader Updated live nodes from ZooKeeper... (2) -> (3)
   [junit4]   2> 632878 INFO  (zkCallback-1596-thread-1-processing-n:127.0.0.1:51760__e%2Fq) [n:127.0.0.1:51760__e%2Fq    ] o.a.s.c.c.ZkStateReader Updated live nodes from ZooKeeper... (2) -> (3)
   [junit4]   2> 632962 INFO  (TEST-TestDynamicLoading.testDynamicLoading-seed#[E1A73044852D3954]) [n:127.0.0.1:51760__e%2Fq    ] o.a.s.m.r.SolrJmxReporter JMX monitoring for 'solr.node' (registry 'solr.node') enabled at server: com.sun.jmx.mbeanserver.JmxMBeanServer@7c661cc1
   [junit4]   2> 632972 INFO  (TEST-TestDynamicLoading.testDynamicLoading-seed#[E1A73044852D3954]) [n:127.0.0.1:51760__e%2Fq    ] o.a.s.m.r.SolrJmxReporter JMX monitoring for 'solr.jvm' (registry 'solr.jvm') enabled at server: com.sun.jmx.mbeanserver.JmxMBeanServer@7c661cc1
   [junit4]   2> 632972 INFO  (TEST-TestDynamicLoading.testDynamicLoading-seed#[E1A73044852D3954]) [n:127.0.0.1:51760__e%2Fq    ] o.a.s.m.r.SolrJmxReporter JMX monitoring for 'solr.jetty' (registry 'solr.jetty') enabled at server: com.sun.jmx.mbeanserver.JmxMBeanServer@7c661cc1
   [junit4]   2> 632974 INFO  (TEST-TestDynamicLoading.testDynamicLoading-seed#[E1A73044852D3954]) [n:127.0.0.1:51760__e%2Fq    ] o.a.s.c.CorePropertiesLocator Found 0 core definitions underneath /Users/jenkins/workspace/Lucene-Solr-master-MacOSX/solr/build/solr-core/test/J1/temp/solr.core.TestDynamicLoading_E1A73044852D3954-001/shard-2-001/cores
   [junit4]   2> 633045 INFO  (qtp540886988-5896) [n:127.0.0.1:51724__e%2Fq    ] o.a.s.h.a.CollectionsHandler Invoked Collection Action :addreplica with params node=127.0.0.1:51760__e%252Fq&action=ADDREPLICA&collection=collection1&shard=shard1&type=NRT&wt=javabin&version=2 and sendToOCPQueue=true
   [junit4]   2> 633049 INFO  (OverseerCollectionConfigSetProcessor-98861223031537668-127.0.0.1:51724__e%2Fq-n_0000000000) [n:127.0.0.1:51724__e%2Fq    ] o.a.s.c.OverseerTaskQueue Response ZK path: /overseer/collection-queue-work/qnr-0000000004 doesn't exist.  Requestor may have disconnected from ZooKeeper
   [junit4]   2> 633049 INFO  (OverseerThreadFactory-2638-thread-4-processing-n:127.0.0.1:51724__e%2Fq) [n:127.0.0.1:51724__e%2Fq    ] o.a.s.c.AddReplicaCmd Node Identified 127.0.0.1:51760__e%2Fq for creating new replica
   [junit4]   2> 633053 INFO  (qtp420643146-5974) [n:127.0.0.1:51760__e%2Fq    ] o.a.s.h.a.CoreAdminOperation core create command qt=/admin/cores&collection.configName=conf1&name=collection1_shard1_replica_n43&action=CREATE&collection=collection1&shard=shard1&wt=javabin&version=2&replicaType=NRT
   [junit4]   2> 633053 INFO  (qtp420643146-5974) [n:127.0.0.1:51760__e%2Fq    ] o.a.s.c.TransientSolrCoreCacheDefault Allocating transient cache for 4 transient cores
   [junit4]   2> 634079 INFO  (qtp420643146-5974) [n:127.0.0.1:51760__e%2Fq c:collection1 s:shard1  x:collection1_shard1_replica_n43] o.a.s.c.SolrConfig Using Lucene MatchVersion: 8.0.0
   [junit4]   2> 634097 INFO  (qtp420643146-5974) [n:127.0.0.1:51760__e%2Fq c:collection1 s:shard1  x:collection1_shard1_replica_n43] o.a.s.s.IndexSchema [collection1_shard1_replica_n43] Schema name=test
   [junit4]   2> 634264 INFO  (qtp420643146-5974) [n:127.0.0.1:51760__e%2Fq c:collection1 s:shard1  x:collection1_shard1_replica_n43] o.a.s.s.IndexSchema Loaded schema test/1.0 with uniqueid field id
   [junit4]   2> 634286 INFO  (qtp420643146-5974) [n:127.0.0.1:51760__e%2Fq c:collection1 s:shard1  x:collection1_shard1_replica_n43] o.a.s.c.CoreContainer Creating SolrCore 'collection1_shard1_replica_n43' using configuration from collection collection1, trusted=true
   [junit4]   2> 634288 INFO  (qtp420643146-5974) [n:127.0.0.1:51760__e%2Fq c:collection1 s:shard1  x:collection1_shard1_replica_n43] o.a.s.m.r.SolrJmxReporter JMX monitoring for 'solr.core.collection1.shard1.replica_n43' (registry 'solr.core.collection1.shard1.replica_n43') enabled at server: com.sun.jmx.mbeanserver.JmxMBeanServer@7c661cc1
   [junit4]   2> 634288 INFO  (qtp420643146-5974) [n:127.0.0.1:51760__e%2Fq c:collection1 s:shard1  x:collection1_shard1_replica_n43] o.a.s.c.SolrCore solr.RecoveryStrategy.Builder
   [junit4]   2> 634288 INFO  (qtp420643146-5974) [n:127.0.0.1:51760__e%2Fq c:collection1 s:shard1  x:collection1_shard1_replica_n43] o.a.s.c.SolrCore [[collection1_shard1_replica_n43] ] Opening new SolrCore at [/Users/jenkins/workspace/Lucene-Solr-master-MacOSX/solr/build/solr-core/test/J1/temp/solr.core.TestDynamicLoading_E1A73044852D3954-001/shard-2-001/cores/collection1_shard1_replica_n43], dataDir=[/Users/jenkins/workspace/Lucene-Solr-master-MacOSX/solr/build/solr-core/test/J1/temp/solr.core.TestDynamicLoading_E1A73044852D3954-001/shard-2-001/cores/collection1_shard1_replica_n43/data/]
   [junit4]   2> 634300 INFO  (qtp420643146-5974) [n:127.0.0.1:51760__e%2Fq c:collection1 s:shard1  x:collection1_shard1_replica_n43] o.a.s.u.RandomMergePolicy RandomMergePolicy wrapping class org.apache.lucene.index.AlcoholicMergePolicy: [AlcoholicMergePolicy: minMergeSize=0, mergeFactor=10, maxMergeSize=721972694, maxMergeSizeForForcedMerge=9223372036854775807, calibrateSizeByDeletes=true, maxMergeDocs=2147483647, maxCFSSegmentSizeMB=8.796093022207999E12, noCFSRatio=0.1]
   [junit4]   2> 634323 WARN  (qtp420643146-5974) [n:127.0.0.1:51760__e%2Fq c:collection1 s:shard1  x:collection1_shard1_replica_n43] o.a.s.c.RequestHandlers INVALID paramSet a in requestHandler {type = requestHandler,name = /dump,class = DumpRequestHandler,attributes = {initParams=a, name=/dump, class=DumpRequestHandler},args = {defaults={a=A,b=B}}}
   [junit4]   2> 634404 INFO  (qtp420643146-5974) [n:127.0.0.1:51760__e%2Fq c:collection1 s:shard1  x:collection1_shard1_replica_n43] o.a.s.u.UpdateHandler Using UpdateLog implementation: org.apache.solr.update.UpdateLog
   [junit4]   2> 634404 INFO  (qtp420643146-5974) [n:127.0.0.1:51760__e%2Fq c:collection1 s:shard1  x:collection1_shard1_replica_n43] o.a.s.u.UpdateLog Initializing UpdateLog: dataDir= defaultSyncLevel=FLUSH numRecordsToKeep=100 maxNumLogsToKeep=10 numVersionBuckets=65536
   [junit4]   2> 634406 INFO  (qtp420643146-5974) [n:127.0.0.1:51760__e%2Fq c:collection1 s:shard1  x:collection1_shard1_replica_n43] o.a.s.u.CommitTracker Hard AutoCommit: disabled
   [junit4]   2> 634406 INFO  (qtp420643146-5974) [n:127.0.0.1:51760__e%2Fq c:collection1 s:shard1  x:collection1_shard1_replica_n43] o.a.s.u.CommitTracker Soft AutoCommit: disabled
   [junit4]   2> 634408 INFO  (qtp420643146-5974) [n:127.0.0.1:51760__e%2Fq c:collection1 s:shard1  x:collection1_shard1_replica_n43] o.a.s.u.RandomMergePolicy RandomMergePolicy wrapping class org.apache.lucene.index.TieredMergePolicy: [TieredMergePolicy: maxMergeAtOnce=23, maxMergeAtOnceExplicit=29, maxMergedSegmentMB=99.6728515625, floorSegmentMB=1.14453125, forceMergeDeletesPctAllowed=25.267315203646564, segmentsPerTier=25.0, maxCFSSegmentSizeMB=8.796093022207999E12, noCFSRatio=0.4533779829516632
   [junit4]   2> 634409 INFO  (qtp420643146-5974) [n:127.0.0.1:51760__e%2Fq c:collection1 s:shard1  x:collection1_shard1_replica_n43] o.a.s.s.SolrIndexSearcher Opening [Searcher@7520053[collection1_shard1_replica_n43] main]
   [junit4]   2> 634411 INFO  (qtp420643146-5974) [n:127.0.0.1:51760__e%2Fq c:collection1 s:shard1  x:collection1_shard1_replica_n43] o.a.s.r.ManagedResourceStorage Configured ZooKeeperStorageIO with znodeBase: /configs/conf1
   [junit4]   2> 634411 INFO  (qtp420643146-5974) [n:127.0.0.1:51760__e%2Fq c:collection1 s:shard1  x:collection1_shard1_replica_n43] o.a.s.r.ManagedResourceStorage Loaded null at path _rest_managed.json using ZooKeeperStorageIO:path=/configs/conf1
   [junit4]   2> 634412 INFO  (qtp420643146-5974) [n:127.0.0.1:51760__e%2Fq c:collection1 s:shard1  x:collection1_shard1_replica_n43] o.a.s.h.ReplicationHandler Commits will be reserved for 10000ms.
   [junit4]   2> 634413 INFO  (searcherExecutor-2663-thread-1-processing-n:127.0.0.1:51760__e%2Fq x:collection1_shard1_replica_n43 s:shard1 c:collection1) [n:127.0.0.1:51760__e%2Fq c:collection1 s:shard1  x:collection1_shard1_replica_n43] o.a.s.c.SolrCore [collection1_shard1_replica_n43] Registered new searcher Searcher@7520053[collection1_shard1_replica_n43] main{ExitableDirectoryReader(UninvertingDirectoryReader())}
   [junit4]   2> 634413 INFO  (qtp420643146-5974) [n:127.0.0.1:51760__e%2Fq c:collection1 s:shard1  x:collection1_shard1_replica_n43] o.a.s.u.UpdateLog Could not find max version in index or recent updates, using new clock 1581779576656232448
   [junit4]   2> 634420 INFO  (qtp420643146-5974) [n:127.0.0.1:51760__e%2Fq c:collection1 s:shard1  x:collection1_shard1_replica_n43] o.a.s.c.ShardLeaderElectionContext Enough replicas found to continue.
   [junit4]   2> 634420 INFO  (qtp420643146-5974) [n:127.0.0.1:51760__e%2Fq c:collection1 s:shard1  x:collection1_shard1_replica_n43] o.a.s.c.ShardLeaderElectionContext I may be the new leader - try and sync
   [junit4]   2> 634420 INFO  (qtp420643146-5974) [n:127.0.0.1:51760__e%2Fq c:collection1 s:shard1  x:collection1_shard1_replica_n43] o.a.s.c.SyncStrategy Sync replicas to http://127.0.0.1:51760/_e/q/collection1_shard1_replica_n43/
   [junit4]   2> 634420 INFO  (qtp420643146-5974) [n:127.0.0.1:51760__e%2Fq c:collection1 s:shard1  x:collection1_shard1_replica_n43] o.a.s.c.SyncStrategy Sync Success - now sync replicas to me
   [junit4]   2> 634420 INFO  (qtp420643146-5974) [n:127.0.0.1:51760__e%2Fq c:collection1 s:shard1  x:collection1_shard1_replica_n43] o.a.s.c.SyncStrategy http://127.0.0.1:51760/_e/q/collection1_shard1_replica_n43/ has no replicas
   [junit4]   2> 634420 INFO  (qtp420643146-5974) [n:127.0.0.1:51760__e%2Fq c:collection1 s:shard1  x:collection1_shard1_replica_n43] o.a.s.c.ShardLeaderElectionContext Found all replicas participating in election, clear LIR
   [junit4]   2> 634424 INFO  (qtp420643146-5974) [n:127.0.0.1:51760__e%2Fq c:collection1 s:shard1  x:collection1_shard1_replica_n43] o.a.s.c.ShardLeaderElectionContext I am the new leader: http://127.0.0.1:51760/_e/q/collection1_shard1_replica_n43/ shard1
   [junit4]   2> 634531 INFO  (qtp420643146-5974) [n:127.0.0.1:51760__e%2Fq c:collection1 s:shard1  x:collection1_shard1_replica_n43] o.a.s.c.ZkController I am the leader, no recovery necessary
   [junit4]   2> 634532 INFO  (qtp420643146-5974) [n:127.0.0.1:51760__e%2Fq c:collection1 s:shard1  x:collection1_shard1_replica_n43] o.a.s.s.HttpSolrCall [admin] webapp=null path=/admin/cores params={qt=/admin/cores&collection.configName=conf1&name=collection1_shard1_replica_n43&action=CREATE&collection=collection1&shard=shard1&wt=javabin&version=2&replicaType=NRT} status=0 QTime=1479
   [junit4]   2> 634534 INFO  (qtp540886988-5896) [n:127.0.0.1:51724__e%2Fq    ] o.a.s.s.HttpSolrCall [admin] webapp=null path=/admin/collections params={node=127.0.0.1:51760__e%252Fq&action=ADDREPLICA&collection=collection1&shard=shard1&type=NRT&wt=javabin&version=2} status=0 QTime=1488
   [junit4]   2> 634909 INFO  (TEST-TestDynamicLoading.testDynamicLoading-seed#[E1A73044852D3954]) [    ] o.a.s.c.AbstractFullDistribZkTestBase create jetty 3 in directory /Users/jenkins/workspace/Lucene-Solr-master-MacOSX/solr/build/solr-core/test/J1/temp/solr.core.TestDynamicLoading_E1A73044852D3954-001/shard-3-001 of type NRT
   [junit4]   2> 634909 INFO  (TEST-TestDynamicLoading.testDynamicLoading-seed#[E1A73044852D3954]) [    ] o.e.j.s.Server jetty-9.3.20.v20170531
   [junit4]   2> 634913 INFO  (TEST-TestDynamicLoading.testDynamicLoading-seed#[E1A73044852D3954]) [    ] o.e.j.s.h.ContextHandler Started o.e.j.s.ServletContextHandler@4bb1e878{/_e/q,null,AVAILABLE}
   [junit4]   2> 634914 INFO  (TEST-TestDynamicLoading.testDynamicLoading-seed#[E1A73044852D3954]) [    ] o.e.j.s.AbstractConnector Started ServerConnector@6bb7c6bb{HTTP/1.1,[http/1.1]}{127.0.0.1:51776}
   [junit4]   2> 634914 INFO  (TEST-TestDynamicLoading.testDynamicLoading-seed#[E1A73044852D3954]) [    ] o.e.j.s.Server Started @638029ms
   [junit4]   2> 634914 INFO  (TEST-TestDynamicLoading.testDynamicLoading-seed#[E1A73044852D3954]) [    ] o.a.s.c.s.e.JettySolrRunner Jetty properties: {solr.data.dir=/Users/jenkins/workspace/Lucene-Solr-master-MacOSX/solr/build/solr-core/test/J1/temp/solr.core.TestDynamicLoading_E1A73044852D3954-001/tempDir-001/jetty3, replicaType=NRT, solrconfig=solrconfig.xml, hostContext=/_e/q, hostPort=51776, coreRootDirectory=/Users/jenkins/workspace/Lucene-Solr-master-MacOSX/solr/build/solr-core/test/J1/temp/solr.core.TestDynamicLoading_E1A73044852D3954-001/shard-3-001/cores}
   [junit4]   2> 634914 ERROR (TEST-TestDynamicLoading.testDynamicLoading-seed#[E1A73044852D3954]) [    ] o.a.s.u.StartupLoggingUtils Missing Java Option solr.log.dir. Logging may be missing or incomplete.
   [junit4]   2> 634915 INFO  (TEST-TestDynamicLoading.testDynamicLoading-seed#[E1A73044852D3954]) [    ] o.a.s.s.SolrDispatchFilter  ___      _       Welcome to Apache Solr™ version 8.0.0
   [junit4]   2> 634915 INFO  (TEST-TestDynamicLoading.testDynamicLoading-seed#[E1A73044852D3954]) [    ] o.a.s.s.SolrDispatchFilter / __| ___| |_ _   Starting in cloud mode on port null
   [junit4]   2> 634915 INFO  (TEST-TestDynamicLoading.testDynamicLoading-seed#[E1A73044852D3954]) [    ] o.a.s.s.SolrDispatchFilter \__ \/ _ \ | '_|  Install dir: null, Default config dir: null
   [junit4]   2> 634915 INFO  (TEST-TestDynamicLoading.testDynamicLoading-seed#[E1A73044852D3954]) [    ] o.a.s.s.SolrDispatchFilter |___/\___/_|_|    Start time: 2017-10-20T12:29:16.975Z
   [junit4]   2> 634919 INFO  (TEST-TestDynamicLoading.testDynamicLoading-seed#[E1A73044852D3954]) [    ] o.a.s.s.SolrDispatchFilter Loading solr.xml from SolrHome (not found in ZooKeeper)
   [junit4]   2> 634919 INFO  (TEST-TestDynamicLoading.testDynamicLoading-seed#[E1A73044852D3954]) [    ] o.a.s.c.SolrXmlConfig Loading container configuration from /Users/jenkins/workspace/Lucene-Solr-master-MacOSX/solr/build/solr-core/test/J1/temp/solr.core.TestDynamicLoading_E1A73044852D3954-001/shard-3-001/solr.xml
   [junit4]   2> 634925 INFO  (TEST-TestDynamicLoading.testDynamicLoading-seed#[E1A73044852D3954]) [    ] o.a.s.c.SolrXmlConfig Configuration parameter autoReplicaFailoverWorkLoopDelay is ignored
   [junit4]   2> 634925 INFO  (TEST-TestDynamicLoading.testDynamicLoading-seed#[E1A73044852D3954]) [    ] o.a.s.c.SolrXmlConfig Configuration parameter autoReplicaFailoverBadNodeExpiration is ignored
   [junit4]   2> 634935 INFO  (TEST-TestDynamicLoading.testDynamicLoading-seed#[E1A73044852D3954]) [    ] o.a.s.c.SolrXmlConfig MBean server found: com.sun.jmx.mbeanserver.JmxMBeanServer@7c661cc1, but no JMX reporters were configured - adding default JMX reporter.
   [junit4]   2> 634938 INFO  (TEST-TestDynamicLoading.testDynamicLoading-seed#[E1A73044852D3954]) [    ] o.a.s.c.ZkContainer Zookeeper client=127.0.0.1:51721/solr
   [junit4]   2> 634954 INFO  (TEST-TestDynamicLoading.testDynamicLoading-seed#[E1A73044852D3954]) [n:127.0.0.1:51776__e%2Fq    ] o.a.s.c.c.ZkStateReader Updated live nodes from ZooKeeper... (0) -> (3)
   [junit4]   2> 634957 INFO  (TEST-TestDynamicLoading.testDynamicLoading-seed#[E1A73044852D3954]) [n:127.0.0.1:51776__e%2Fq    ] o.a.s.c.Overseer Overseer (id=null) closing
   [junit4]   2> 634960 INFO  (TEST-TestDynamicLoading.testDynamicLoading-seed#[E1A73044852D3954]) [n:127.0.0.1:51776__e%2Fq    ] o.a.s.c.ZkController Register node as live in ZooKeeper:/live_nodes/127.0.0.1:51776__e%2Fq
   [junit4]   2> 634962 INFO  (zkCallback-1585-thread-1) [    ] o.a.s.c.c.ZkStateReader Updated live nodes from ZooKeeper... (3) -> (4)
   [junit4]   2> 634962 INFO  (zkCallback-1590-thread-1-processing-n:127.0.0.1:51749__e%2Fq) [n:127.0.0.1:51749__e%2Fq    ] o.a.s.c.c.ZkStateReader Updated live nodes from ZooKeeper... (3) -> (4)
   [junit4]   2> 634962 INFO  (zkCallback-1577-thread-2-processing-n:127.0.0.1:51724__e%2Fq) [n:127.0.0.1:51724__e%2Fq    ] o.a.s.c.c.ZkStateReader Updated live nodes from ZooKeeper... (3) -> (4)
   [junit4]   2> 634962 INFO  (zkCallback-1596-thread-1-processing-n:127.0.0.1:51760__e%2Fq) [n:127.0.0.1:51760__e%2Fq    ] o.a.s.c.c.ZkStateReader Updated live nodes from ZooKeeper... (3) -> (4)
   [junit4]   2> 634963 INFO  (zkCallback-1602-thread-1-processing-n:127.0.0.1:51776__e%2Fq) [n:127.0.0.1:51776__e%2Fq    ] o.a.s.c.c.ZkStateReader Updated live nodes from ZooKeeper... (3) -> (4)
   [junit4]   2> 635052 INFO  (OverseerCollectionConfigSetProcessor-98861223031537668-127.0.0.1:51724__e%2Fq-n_0000000000) [n:127.0.0.1:51724__e%2Fq    ] o.a.s.c.OverseerTaskQueue Response ZK path: /overseer/collection-queue-work/qnr-0000000006 doesn't exist.  Requestor may have disconnected from ZooKeeper
   [junit4]   2> 635069 INFO  (TEST-TestDynamicLoading.testDynamicLoading-seed#[E1A73044852D3954]) [n:127.0.0.1:51776__e%2Fq    ] o.a.s.m.r.SolrJmxReporter JMX monitoring for 'solr.node' (registry 'solr.node') enabled at server: com.sun.jmx.mbeanserver.JmxMBeanServer@7c661cc1
   [junit4]   2> 635079 INFO  (TEST-TestDynamicLoading.testDynamicLoading-seed#[E1A73044852D3954]) [n:127.0.0.1:51776__e%2Fq    ] o.a.s.m.r.SolrJmxReporter JMX monitoring for 'solr.jvm' (registry 'solr.jvm') enabled at server: com.sun.jmx.mbeanserver.JmxMBeanServer@7c661cc1
   [junit4]   2> 635079 INFO  (TEST-TestDynamicLoading.testDynamicLoading-seed#[E1A73044852D3954]) [n:127.0.0.1:51776__e%2Fq    ] o.a.s.m.r.SolrJmxReporter JMX monitoring for 'solr.jetty' (registry 'solr.jetty') enabled at server: com.sun.jmx.mbeanserver.JmxMBeanServer@7c661cc1
   [junit4]   2> 635081 INFO  (TEST-TestDynamicLoading.testDynamicLoading-seed#[E1A73044852D3954]) [n:127.0.0.1:51776__e%2Fq    ] o.a.s.c.CorePropertiesLocator Found 0 core definitions underneath /Users/jenkins/workspace/Lucene-Solr-master-MacOSX/solr/build/solr-core/test/J1/temp/solr.core.TestDynamicLoading_E1A73044852D3954-001/shard-3-001/cores
   [junit4]   2> 635127 INFO  (qtp540886988-5899) [n:127.0.0.1:51724__e%2Fq    ] o.a.s.h.a.CollectionsHandler Invoked Collection Action :addreplica with params node=127.0.0.1:51776__e%252Fq&action=ADDREPLICA&collection=collection1&shard=shard2&type=NRT&wt=javabin&version=2 and sendToOCPQueue=true
   [junit4]   2> 635131 INFO  (OverseerThreadFactory-2638-thread-5-processing-n:127.0.0.1:51724__e%2Fq) [n:127.0.0.1:51724__e%2Fq    ] o.a.s.c.AddReplicaCmd Node Identified 127.0.0.1:51776__e%2Fq for creating new replica
   [junit4]   2> 635142 INFO  (qtp1790992006-6003) [n:127.0.0.1:51776__e%2Fq    ] o.a.s.h.a.CoreAdminOperation core create command qt=/admin/cores&collection.configName=conf1&name=collection1_shard2_replica_n45&action=CREATE&collection=collection1&shard=shard2&wt=javabin&version=2&replicaType=NRT
   [junit4]   2> 635143 INFO  (qtp1790992006-6003) [n:127.0.0.1:51776__e%2Fq    ] o.a.s.c.TransientSolrCoreCacheDefault Allocating transient cache for 4 transient cores
   [junit4]   2> 636175 INFO  (qtp1790992006-6003) [n:127.0.0.1:51776__e%2Fq c:collection1 s:shard2  x:collection1_shard2_replica_n45] o.a.s.c.SolrConfig Using Lucene MatchVersion: 8.0.0
   [junit4]   2> 636202 INFO  (qtp1790992006-6003) [n:127.0.0.1:51776__e%2Fq c:collection1 s:shard2  x:collection1_shard2_replica_n45] o.a.s.s.IndexSchema [collection1_shard2_replica_n45] Schema name=test
   [junit4]   2> 636350 INFO  (qtp1790992006-6003) [n:127.0.0.1:51776__e%2Fq c:collection1 s:shard2  x:collection1_shard2_replica_n45] o.a.s.s.IndexSchema Loaded schema test/1.0 with uniqueid field id
   [junit4]   2> 636373 INFO  (qtp1790992006-6003) [n:127.0.0.1:51776__e%2Fq c:collection1 s:shard2  x:collection1_shard2_replica_n45] o.a.s.c.CoreContainer Creating SolrCore 'collection1_shard2_replica_n45' using configuration from collection collection1, trusted=true
   [junit4]   2> 636373 INFO  (qtp1790992006-6003) [n:127.0.0.1:51776__e%2Fq c:collection1 s:shard2  x:collection1_shard2_replica_n45] o.a.s.m.r.SolrJmxReporter JMX monitoring for 'solr.core.collection1.shard2.replica_n45' (registry 'solr.core.collection1.shard2.replica_n45') enabled at server: com.sun.jmx.mbeanserver.JmxMBeanServer@7c661cc1
   [junit4]   2> 636373 INFO  (qtp1790992006-6003) [n:127.0.0.1:51776__e%2Fq c:collection1 s:shard2  x:collection1_shard2_replica_n45] o.a.s.c.SolrCore solr.RecoveryStrategy.Builder
   [junit4]   2> 636373 INFO  (qtp1790992006-6003) [n:127.0.0.1:51776__e%2Fq c:collection1 s:shard2  x:collection1_shard2_replica_n45] o.a.s.c.SolrCore [[collection1_shard2_replica_n45] ] Opening new SolrCore at [/Users/jenkins/workspace/Lucene-Solr-master-MacOSX/solr/build/solr-core/test/J1/temp/solr.core.TestDynamicLoading_E1A73044852D3954-001/shard-3-001/cores/collection1_shard2_replica_n45], dataDir=[/Users/jenkins/workspace/Lucene-Solr-master-MacOSX/solr/build/solr-core/test/J1/temp/solr.core.TestDynamicLoading_E1A73044852D3954-001/shard-3-001/cores/collection1_shard2_replica_n45/data/]
   [junit4]   2> 636375 INFO  (qtp1790992006-6003) [n:127.0.0.1:51776__e%2Fq c:collection1 s:shard2  x:collection1_shard2_replica_n45] o.a.s.u.RandomMergePolicy RandomMergePolicy wrapping class org.apache.lucene.index.AlcoholicMergePolicy: [AlcoholicMergePolicy: minMergeSize=0, mergeFactor=10, maxMergeSize=721972694, maxMergeSizeForForcedMerge=9223372036854775807, calibrateSizeByDeletes=true, maxMergeDocs=2147483647, maxCFSSegmentSizeMB=8.796093022207999E12, noCFSRatio=0.1]
   [junit4]   2> 636377 WARN  (qtp1790992006-6003) [n:127.0.0.1:51776__e%2Fq c:collection1 s:shard2  x:collection1_shard2_replica_n45] o.a.s.c.RequestHandlers INVALID paramSet a in requestHandler {type = requestHandler,name = /dump,class = DumpRequestHandler,attributes = {initParams=a, name=/dump, class=DumpRequestHandler},args = {defaults={a=A,b=B}}}
   [junit4]   2> 636428 INFO  (qtp1790992006-6003) [n:127.0.0.1:51776__e%2Fq c:collection1 s:shard2  x:collection1_shard2_replica_n45] o.a.s.u.UpdateHandler Using UpdateLog implementation: org.apache.solr.update.UpdateLog
   [junit4]   2> 636428 INFO  (qtp1790992006-6003) [n:127.0.0.1:51776__e%2Fq c:collection1 s:shard2  x:collection1_shard2_replica_n45] o.a.s.u.UpdateLog Initializing UpdateLog: dataDir= defaultSyncLevel=FLUSH numRecordsToKeep=100 maxNumLogsToKeep=10 numVersionBuckets=65536
   [junit4]   2> 636429 INFO  (qtp1790992006-6003) [n:127.0.0.1:51776__e%2Fq c:collection1 s:shard2  x:collection1_shard2_replica_n45] o.a.s.u.CommitTracker Hard AutoCommit: disabled
   [junit4]   2> 636429 INFO  (qtp1790992006-6003) [n:127.0.0.1:51776__e%2Fq c:collection1 s:shard2  x:collection1_shard2_replica_n45] o.a.s.u.CommitTracker Soft AutoCommit: disabled
   [junit4]   2> 636429 INFO  (qtp1790992006-6003) [n:127.0.0.1:51776__e%2Fq c:collection1 s:shard2  x:collection1_shard2_replica_n45] o.a.s.u.RandomMergePolicy RandomMergePolicy wrapping class org.apache.lucene.index.TieredMergePolicy: [TieredMergePolicy: maxMergeAtOnce=23, maxMergeAtOnceExplicit=29, maxMergedSegmentMB=99.6728515625, floorSegmentMB=1.14453125, forceMergeDeletesPctAllowed=25.267315203646564, segmentsPerTier=25.0, maxCFSSegmentSizeMB=8.796093022207999E12, noCFSRatio=0.4533779829516632
   [junit4]   2> 636430 INFO  (qtp1790992006-6003) [n:127.0.0.1:51776__e%2Fq c:collection1 s:shard2  x:collection1_shard2_replica_n45] o.a.s.s.SolrIndexSearcher Opening [Searcher@16c80e78[collection1_shard2_replica_n45] main]
   [junit4]   2> 636431 INFO  (qtp1790992006-6003) [n:127.0.0.1:51776__e%2Fq c:collection1 s:shard2  x:collection1_shard2_replica_n45] o.a.s.r.ManagedResourceStorage Configured ZooKeeperStorageIO with znodeBase: /configs/conf1
   [junit4]   2> 636432 INFO  (qtp1790992006-6003) [n:127.0.0.1:51776__e%2Fq c:collection1 s:shard2  x:collection1_shard2_replica_n45] o.a.s.r.ManagedResourceStorage Loaded null at path _rest_managed.json using ZooKeeperStorageIO:path=/configs/conf1
   [junit4]   2> 636432 INFO  (qtp1790992006-6003) [n:127.0.0.1:51776__e%2Fq c:collection1 s:shard2  x:collection1_shard2_replica_n45] o.a.s.h.ReplicationHandler Commits will be reserved for 10000ms.
   [junit4]   2> 636432 INFO  (qtp1790992006-6003) [n:127.0.0.1:51776__e%2Fq c:collection1 s:shard2  x:collection1_shard2_replica_n45] o.a.s.u.UpdateLog Could not find max version in index or recent updates, using new clock 1581779578773307392
   [junit4]   2> 636433 INFO  (searcherExecutor-2674-thread-1-processing-n:127.0.0.1:51776__e%2Fq x:collection1_shard2_replica_n45 s:shard2 c:collection1) [n:127.0.0.1:51776__e%2Fq c:collection1 s:shard2  x:collection1_shard2_replica_n45] o.a.s.c.SolrCore [collection1_shard2_replica_n45] Registered new searcher Searcher@16c80e78[collection1_shard2_replica_n45] main{ExitableDirectoryReader(UninvertingDirectoryReader())}
   [junit4]   2> 636443 INFO  (qtp1790992006-6003) [n:127.0.0.1:51776__e%2Fq c:collection1 s:shard2  x:collection1_shard2_replica_n45] o.a.s.c.ZkController Core needs to recover:collection1_shard2_replica_n45
   [junit4]   2> 636444 INFO  (updateExecutor-1599-thread-1-processing-n:127.0.0.1:51776__e%2Fq x:collection1_shard2_replica_n45 s:shard2 c:collection1) [n:127.0.0.1:51776__e%2Fq c:collection1 s:shard2 r:core_node46 x:collection1_shard2_replica_n45] o.a.s.u.DefaultSolrCoreState Running recovery
   [junit4]   2> 636444 INFO  (recoveryExecutor-1600-thread-1-processing-n:127.0.0.1:51776__e%2Fq x:collection1_shard2_replica_n45 s:shard2 c:collection1 r:core_node46) [n:127.0.0.1:51776__e%2Fq c:collection1 s:shard2 r:core_node46 x:collection1_shard2_replica_n45] o.a.s.c.RecoveryStrategy Starting recovery process. recoveringAfterStartup=true
   [junit4]   2> 636444 INFO  (recoveryExecutor-1600-thread-1-processing-n:127.0.0.1:51776__e%2Fq x:collection1_shard2_replica_n45 s:shard2 c:collection1 r:core_node46) [n:127.0.0.1:51776__e%2Fq c:collection1 s:shard2 r:core_node46 x:collection1_shard2_replica_n45] o.a.s.c.RecoveryStrategy ###### startupVersions=[[]]
   [junit4]   2> 636444 INFO  (qtp1790992006-6003) [n:127.0.0.1:51776__e%2Fq c:collection1 s:shard2  x:collection1_shard2_replica_n45] o.a.s.s.HttpSolrCall [admin] webapp=null path=/admin/cores params={qt=/admin/cores&collection.configName=conf1&name=collection1_shard2_replica_n45&action=CREATE&collection=collection1&shard=shard2&wt=javabin&version=2&replicaType=NRT} status=0 QTime=1302
   [junit4]   2> 636444 INFO  (recoveryExecutor-1600-thread-1-processing-n:127.0.0.1:51776__e%2Fq x:collection1_shard2_replica_n45 s:shard2 c:collection1 r:core_node46) [n:127.0.0.1:51776__e%2Fq c:collection1 s:shard2 r:core_node46 x:collection1_shard2_replica_n45] o.a.s.c.RecoveryStrategy Begin buffering updates. core=[collection1_shard2_replica_n45]
   [junit4]   2> 636444 INFO  (recoveryExecutor-1600-thread-1-processing-n:127.0.0.1:51776__e%2Fq x:collection1_shard2_replica_n45 s:shard2 c:collection1 r:core_node46) [n:127.0.0.1:51776__e%2Fq c:collection1 s:shard2 r:core_node46 x:collection1_shard2_replica_n45] o.a.s.u.UpdateLog Starting to buffer updates. FSUpdateLog{state=ACTIVE, tlog=null}
   [junit4]   2> 636444 INFO  (recoveryExecutor-1600-thread-1-processing-n:127.0.0.1:51776__e%2Fq x:collection1_shard2_replica_n45 s:shard2 c:collection1 r:core_node46) [n:127.0.0.1:51776__e%2Fq c:collection1 s:shard2 r:core_node46 x:collection1_shard2_replica_n45] o.a.s.c.RecoveryStrategy Publishing state of core [collection1_shard2_replica_n45] as recovering, leader is [http://127.0.0.1:51749/_e/q/collection1_shard2_replica_n41/] and I am [http://127.0.0.1:51776/_e/q/collection1_shard2_replica_n45/]
   [junit4]   2> 636447 INFO  (qtp540886988-5899) [n:127.0.0.1:51724__e%2Fq    ] o.a.s.s.HttpSolrCall [admin] webapp=null path=/admin/collections params={node=127.0.0.1:51776__e%252Fq&action=ADDREPLICA&collection=collection1&shard=shard2&type=NRT&wt=javabin&version=2} status=0 QTime=1319
   [junit4]   2> 636448 INFO  (recoveryExecutor-1600-thread-1-processing-n:127.0.0.1:51776__e%2Fq x:collection1_shard2_replica_n45 s:shard2 c:collection1 r:core_node46) [n:127.0.0.1:51776__e%2Fq c:collection1 s:shard2 r:core_node46 x:collection1_shard2_replica_n45] o.a.s.c.RecoveryStrategy Sending prep recovery command to [http://127.0.0.1:51749/_e/q]; [WaitForState: action=PREPRECOVERY&core=collection1_shard2_replica_n41&nodeName=127.0.0.1:51776__e%252Fq&coreNodeName=core_node46&state=recovering&checkLive=true&onlyIfLeader=true&onlyIfLeaderActive=true]
   [junit4]   2> 636449 INFO  (qtp2091341040-5947) [n:127.0.0.1:51749__e%2Fq    ] o.a.s.h.a.PrepRecoveryOp Going to wait for coreNodeName: core_node46, state: recovering, checkLive: true, onlyIfLeader: true, onlyIfLeaderActive: true, maxTime: 183 s
   [junit4]   2> 636449 INFO  (qtp2091341040-5947) [n:127.0.0.1:51749__e%2Fq    ] o.a.s.h.a.PrepRecoveryOp In WaitForState(recovering): collection=collection1, shard=shard2, thisCore=collection1_shard2_replica_n41, leaderDoesNotNeedRecovery=false, isLeader? true, live=true, checkLive=true, currentState=down, localState=active, nodeName=127.0.0.1:51776__e%2Fq, coreNodeName=core_node46, onlyIfActiveCheckResult=false, nodeProps: core_node46:{"core":"collection1_shard2_replica_n45","base_url":"http://127.0.0.1:51776/_e/q","node_name":"127.0.0.1:51776__e%2Fq","state":"down","type":"NRT"}
   [junit4]   2> 636677 INFO  (TEST-TestDynamicLoading.testDynamicLoading-seed#[E1A73044852D3954]) [    ] o.a.s.c.AbstractFullDistribZkTestBase create jetty 4 in directory /Users/jenkins/workspace/Lucene-Solr-master-MacOSX/solr/build/solr-core/test/J1/temp/solr.core.TestDynamicLoading_E1A73044852D3954-001/shard-4-001 of type NRT
   [junit4]   2> 636677 INFO  (TEST-TestDynamicLoading.testDynamicLoading-seed#[E1A73044852D3954]) [    ] o.e.j.s.Server jetty-9.3.20.v20170531
   [junit4]   2> 636679 INFO  (TEST-TestDynamicLoading.testDynamicLoading-seed#[E1A73044852D3954]) [    ] o.e.j.s.h.ContextHandler Started o.e.j.s.ServletContextHandler@1c044bbd{/_e/q,null,AVAILABLE}
   [junit4]   2> 636679 INFO  (TEST-TestDynamicLoading.testDynamicLoading-seed#[E1A73044852D3954]) [    ] o.e.j.s.AbstractConnector Started ServerConnector@46845d3a{HTTP/1.1,[http/1.1]}{127.0.0.1:51783}
   [junit4]   2> 636679 INFO  (TEST-TestDynamicLoading.testDynamicLoading-seed#[E1A73044852D3954]) [    ] o.e.j.s.Server Started @639794ms
   [junit4]   2> 636679 INFO  (TEST-TestDynamicLoading.testDynamicLoading-seed#[E1A73044852D3954]) [    ] o.a.s.c.s.e.JettySolrRunner Jetty properties: {solr.data.dir=/Users/jenkins/workspace/Lucene-Solr-master-MacOSX/solr/build/solr-core/test/J1/temp/solr.core.TestDynamicLoading_E1A73044852D3954-001/tempDir-001/jetty4, solrconfig=solrconfig.xml, hostContext=/_e/q, hostPort=51783, coreRootDirectory=/Users/jenkins/workspace/Lucene-Solr-master-MacOSX/solr/build/solr-core/test/J1/temp/solr.core.TestDynamicLoading_E1A73044852D3954-001/shard-4-001/cores}
   [junit4]   2> 636680 ERROR (TEST-TestDynamicLoading.testDynamicLoading-seed#[E1A73044852D3954]) [    ] o.a.s.u.StartupLoggingUtils Missing Java Option solr.log.dir. Logging may be missing or incomplete.
   [junit4]   2> 636680 INFO  (TEST-TestDynamicLoading.testDynamicLoading-seed#[E1A73044852D3954]) [    ] o.a.s.s.SolrDispatchFilter  ___      _       Welcome to Apache Solr™ version 8.0.0
   [junit4]   2> 636680 INFO  (TEST-TestDynamicLoading.testDynamicLoading-seed#[E1A73044852D3954]) [    ] o.a.s.s.SolrDispatchFilter / __| ___| |_ _   Starting in cloud mode on port null
   [junit4]   2> 636680 INFO  (TEST-TestDynamicLoading.testDynamicLoading-seed#[E1A73044852D3954]) [    ] o.a.s.s.SolrDispatchFilter \__ \/ _ \ | '_|  Install dir: null, Default config dir: null
   [junit4]   2> 636680 INFO  (TEST-TestDynamicLoading.testDynamicLoading-seed#[E1A73044852D3954]) [    ] o.a.s.s.SolrDispatchFilter |___/\___/_|_|    Start time: 2017-10-20T12:29:18.740Z
   [junit4]   2> 636683 INFO  (TEST-TestDynamicLoading.testDynamicLoading-seed#[E1A73044852D3954]) [    ] o.a.s.s.SolrDispatchFilter Loading solr.xml from SolrHome (not found in ZooKeeper)
   [junit4]   2> 636683 INFO  (TEST-TestDynamicLoading.testDynamicLoading-seed#[E1A73044852D3954]) [    ] o.a.s.c.SolrXmlConfig Loading container configuration from /Users/jenkins/workspace/Lucene-Solr-master-MacOSX/solr/build/solr-core/test/J1/temp/solr.core.TestDynamicLoading_E1A73044852D3954-001/shard-4-001/solr.xml
   [junit4]   2> 636694 INFO  (TEST-TestDynamicLoading.testDynamicLoading-seed#[E1A73044852D3954]) [    ] o.a.s.c.SolrXmlConfig Configuration parameter autoReplicaFailoverWorkLoopDelay is ignored
   [junit4]   2> 636694 INFO  (TEST-TestDynamicLoading.testDynamicLoading-seed#[E1A73044852D3954]) [    ] o.a.s.c.SolrXmlConfig Configuration parameter autoReplicaFailoverBadNodeExpiration is ignored
   [junit4]   2> 636694 INFO  (TEST-TestDynamicLoading.testDynamicLoading-seed#[E1A73044852D3954]) [    ] o.a.s.c.SolrXmlConfig MBean server found: com.sun.jmx.mbeanserver.JmxMBeanServer@7c661cc1, but no JMX reporters were configured - adding default JMX reporter.
   [junit4]   2> 636697 INFO  (TEST-TestDynamicLoading.testDynamicLoading-seed#[E1A73044852D3954]) [    ] o.a.s.c.ZkContainer Zookeeper client=127.0.0.1:51721/solr
   [junit4]   2> 636711 INFO  (TEST-TestDynamicLoading.testDynamicLoading-seed#[E1A73044852D3954]) [n:127.0.0.1:51783__e%2Fq    ] o.a.s.c.c.ZkStateReader Updated live nodes from ZooKeeper... (0) -> (4)
   [junit4]   2> 636714 INFO  (TEST-TestDynamicLoading.testDynamicLoading-seed#[E1A73044852D3954]) [n:127.0.0.1:51783__e%2Fq    ] o.a.s.c.Overseer Overseer (id=null) closing
   [junit4]   2> 636717 INFO  (TEST-TestDynamicLoading.testDynamicLoading-seed#[E1A73044852D3954]) [n:127.0.0.1:51783__e%2Fq    ] o.a.s.c.ZkController Register node as live in ZooKeeper:/live_nodes/127.0.0.1:51783__e%2Fq
   [junit4]   2> 636719 INFO  (zkCallback-1590-thread-1-processing-n:127.0.0.1:51749__e%2Fq) [n:127.0.0.1:51749__e%2Fq    ] o.a.s.c.c.ZkStateReader Updated live nodes from ZooKeeper... (4) -> (5)
   [junit4]   2> 636720 INFO  (zkCallback-1577-thread-1-processing-n:127.0.0.1:51724__e%2Fq) [n:127.0.0.1:51724__e%2Fq    ] o.a.s.c.c.ZkStateReader Updated live nodes from ZooKeeper... (4) -> (5)
   [junit4]   2> 636720 INFO  (zkCallback-1585-thread-1) [    ] o.a.s.c.c.ZkStateReader Updated live nodes from ZooKeeper... (4) -> (5)
   [junit4]   2> 636720 INFO  (zkCallback-1602-thread-1-processing-n:127.0.0.1:51776__e%2Fq) [n:127.0.0.1:51776__e%2Fq    ] o.a.s.c.c.ZkStateReader Updated live nodes from ZooKeeper... (4) -> (5)
   [junit4]   2> 636720 INFO  (zkCallback-1596-thread-1-processing-n:127.0.0.1:51760__e%2Fq) [n:127.0.0.1:51760__e%2Fq    ] o.a.s.c.c.ZkStateReader Updated live nodes from ZooKeeper... (4) -> (5)
   [junit4]   2> 636720 INFO  (zkCallback-1609-thread-1-processing-n:127.0.0.1:51783__e%2Fq) [n:127.0.0.1:51783__e%2Fq    ] o.a.s.c.c.ZkStateReader Updated live nodes from ZooKeeper... (4) -> (5)
   [junit4]   2> 636787 INFO  (TEST-TestDynamicLoading.testDynamicLoading-seed#[E1A73044852D3954]) [n:127.0.0.1:51783__e%2Fq    ] o.a.s.m.r.SolrJmxReporter JMX monitoring for 'solr.node' (registry 'solr.node') enabled at server: com.sun.jmx.mbeanserver.JmxMBeanServer@7c661cc1
   [junit4]   2> 636793 INFO  (TEST-TestDynamicLoading.testDynamicLoading-seed#[E1A73044852D3954]) [n:127.0.0.1:51783__e%2Fq    ] o.a.s.m.r.SolrJmxReporter JMX monitoring for 'solr.jvm' (registry 'solr.jvm') enabled at server: com.sun.jmx.mbeanserver.JmxMBeanServer@7c661cc1
   [junit4]   2> 636794 INFO  (TEST-TestDynamicLoading.testDynamicLoading-seed#[E1A73044852D3954]) [n:127.0.0.1:51783__e%2Fq    ] o.a.s.m.r.SolrJmxReporter JMX monitoring for 'solr.jetty' (registry 'solr.jetty') enabled at server: com.sun.jmx.mbeanserver.JmxMBeanServer@7c661cc1
   [junit4]   2> 636795 INFO  (TEST-TestDynamicLoading.testDynamicLoading-seed#[E1A73044852D3954]) [n:127.0.0.1:51783__e%2Fq    ] o.a.s.c.CorePropertiesLocator Found 0 core definitions underneath /Users/jenkins/workspace/Lucene-Solr-master-MacOSX/solr/build/solr-core/test/J1/temp/solr.core.TestDynamicLoading_E1A73044852D3954-001/shard-4-001/cores
   [junit4]   2> 636840 INFO  (qtp540886988-5900) [n:127.0.0.1:51724__e%2Fq    ] o.a.s.h.a.CollectionsHandler Invoked Collection Action :addreplica with params node=127.0.0.1:51783__e%252Fq&action=ADDREPLICA&collection=collection1&shard=shard1&type=NRT&wt=javabin&version=2 and sendToOCPQueue=true
   [junit4]   2> 636843 INFO  (OverseerCollectionConfigSetProcessor-98861223031537668-127.0.0.1:51724__e%2Fq-n_0000000000) [n:127.0.0.1:51724__e%2Fq    ] o.a.s.c.OverseerTaskQueue Response ZK path: /overseer/collection-queue-work/qnr-0000000008 doesn't exist.  Requestor may have disconnected from ZooKeeper
   [junit4]   2> 636844 INFO  (OverseerThreadFactory-2638-thread-5-processing-n:127.0.0.1:51724__e%2Fq) [n:127.0.0.1:51724__e%2Fq    ] o.a.s.c.AddReplicaCmd Node Identified 127.0.0.1:51783__e%2Fq for creating new replica
   [junit4]   2> 636848 INFO  (qtp722649544-6036) [n:127.0.0.1:51783__e%2Fq    ] o.a.s.h.a.CoreAdminOperation core create command qt=/admin/cores&collection.configName=conf1&name=collection1_shard1_replica_n47&action=CREATE&collection=collection1&shard=shard1&wt=javabin&version=2&replicaType=NRT
   [junit4]   2> 636849 INFO  (qtp722649544-6036) [n:127.0.0.1:51783__e%2Fq    ] o.a.s.c.TransientSolrCoreCacheDefault Allocating transient cache for 4 transient cores
   [junit4]   2> 637457 INFO  (qtp2091341040-5947) [n:127.0.0.1:51749__e%2Fq    ] o.a.s.h.a.PrepRecoveryOp In WaitForState(recovering): collection=collection1, shard=shard2, thisCore=collection1_shard2_replica_n41, leaderDoesNotNeedRecovery=false, isLeader? true, live=true, checkLive=true, currentState=recovering, localState=active, nodeName=127.0.0.1:51776__e%2Fq, coreNodeName=core_node46, onlyIfActiveCheckResult=false, nodeProps: core_node46:{"core":"collection1_shard2_replica_n45","base_url":"http://127.0.0.1:51776/_e/q","node_name":"127.0.0.1:51776__e%2Fq","state":"recovering","type":"NRT"}
   [junit4]   2> 637457 INFO  (qtp2091341040-5947) [n:127.0.0.1:51749__e%2Fq    ] o.a.s.h.a.PrepRecoveryOp Waited coreNodeName: core_node46, state: recovering, checkLive: true, onlyIfLeader: true for: 1 seconds.
   [junit4]   2> 637457 INFO  (qtp2091341040-5947) [n:127.0.0.1:51749__e%2Fq    ] o.a.s.s.HttpSolrCall [admin] webapp=null path=/admin/cores params={nodeName=127.0.0.1:51776__e%252Fq&onlyIfLeaderActive=true&core=collection1_shard2_replica_n41&coreNodeName=core_node46&action=PREPRECOVERY&checkLive=true&state=recovering&onlyIfLeader=true&wt=javabin&version=2} status=0 QTime=1008
   [junit4]   2> 637886 INFO  (qtp722649544-6036) [n:127.0.0.1:51783__e%2Fq c:collection1 s:shard1  x:collection1_shard1_replica_n47] o.a.s.c.SolrConfig Using Lucene MatchVersion: 8.0.0
   [junit4]   2> 637917 INFO  (qtp722649544-6036) [n:127.0.0.1:51783__e%2Fq c:collection1 s:shard1  x:collection1_shard1_replica_n47] o.a.s.s.IndexSchema [collection1_shard1_replica_n47] Schema name=test
   [junit4]   2> 637959 INFO  (recoveryExecutor-1600-thread-1-processing-n:127.0.0.1:51776__e%2Fq x:collection1_shard2_replica_n45 s:shard2 c:collection1 r:core_node46) [n:127.0.0.1:51776__e%2Fq c:collection1 s:shard2 r:core_node46 x:collection1_shard2_replica_n45] o.a.s.c.RecoveryStrategy Attempting to PeerSync from [http://127.0.0.1

[...truncated too long message...]

.a.s.m.SolrMetricManager Closing metric reporters for registry=solr.node, tag=null
   [junit4]   2> 652953 INFO  (TEST-TestDynamicLoading.testDynamicLoading-seed#[E1A73044852D3954]) [    ] o.a.s.m.r.SolrJmxReporter Closing reporter [org.apache.solr.metrics.reporters.SolrJmxReporter@71c59480: rootName = null, domain = solr.node, service url = null, agent id = null] for registry solr.node / com.codahale.metrics.MetricRegistry@6968fe9f
   [junit4]   2> 652956 INFO  (TEST-TestDynamicLoading.testDynamicLoading-seed#[E1A73044852D3954]) [    ] o.a.s.m.SolrMetricManager Closing metric reporters for registry=solr.jvm, tag=null
   [junit4]   2> 652956 INFO  (TEST-TestDynamicLoading.testDynamicLoading-seed#[E1A73044852D3954]) [    ] o.a.s.m.r.SolrJmxReporter Closing reporter [org.apache.solr.metrics.reporters.SolrJmxReporter@3fe5b3ce: rootName = null, domain = solr.jvm, service url = null, agent id = null] for registry solr.jvm / com.codahale.metrics.MetricRegistry@2807f4d2
   [junit4]   2> 652959 INFO  (TEST-TestDynamicLoading.testDynamicLoading-seed#[E1A73044852D3954]) [    ] o.a.s.m.SolrMetricManager Closing metric reporters for registry=solr.jetty, tag=null
   [junit4]   2> 652959 INFO  (TEST-TestDynamicLoading.testDynamicLoading-seed#[E1A73044852D3954]) [    ] o.a.s.m.r.SolrJmxReporter Closing reporter [org.apache.solr.metrics.reporters.SolrJmxReporter@384d9ace: rootName = null, domain = solr.jetty, service url = null, agent id = null] for registry solr.jetty / com.codahale.metrics.MetricRegistry@362561ca
   [junit4]   2> 652960 INFO  (TEST-TestDynamicLoading.testDynamicLoading-seed#[E1A73044852D3954]) [    ] o.a.s.c.ZkController Remove node as live in ZooKeeper:/live_nodes/127.0.0.1:51783__e%2Fq
   [junit4]   2> 652961 INFO  (TEST-TestDynamicLoading.testDynamicLoading-seed#[E1A73044852D3954]) [    ] o.a.s.m.SolrMetricManager Closing metric reporters for registry=solr.cluster, tag=null
   [junit4]   2> 652962 INFO  (zkCallback-1609-thread-3-processing-n:127.0.0.1:51783__e%2Fq) [n:127.0.0.1:51783__e%2Fq    ] o.a.s.c.c.ZkStateReader Updated live nodes from ZooKeeper... (1) -> (0)
   [junit4]   2> 652962 INFO  (coreCloseExecutor-2736-thread-1) [n:127.0.0.1:51783__e%2Fq c:collection1 s:shard1 r:core_node48 x:collection1_shard1_replica_n47] o.a.s.c.SolrCore [collection1_shard1_replica_n47]  CLOSING SolrCore org.apache.solr.core.SolrCore@3b0b99db
   [junit4]   2> 652962 INFO  (coreCloseExecutor-2736-thread-1) [n:127.0.0.1:51783__e%2Fq c:collection1 s:shard1 r:core_node48 x:collection1_shard1_replica_n47] o.a.s.m.SolrMetricManager Closing metric reporters for registry=solr.core.collection1.shard1.replica_n47, tag=990616027
   [junit4]   2> 652962 INFO  (coreCloseExecutor-2736-thread-1) [n:127.0.0.1:51783__e%2Fq c:collection1 s:shard1 r:core_node48 x:collection1_shard1_replica_n47] o.a.s.m.r.SolrJmxReporter Closing reporter [org.apache.solr.metrics.reporters.SolrJmxReporter@3dc16238: rootName = null, domain = solr.core.collection1.shard1.replica_n47, service url = null, agent id = null] for registry solr.core.collection1.shard1.replica_n47 / com.codahale.metrics.MetricRegistry@64d3c27b
   [junit4]   2> 652970 INFO  (coreCloseExecutor-2736-thread-1) [n:127.0.0.1:51783__e%2Fq c:collection1 s:shard1 r:core_node48 x:collection1_shard1_replica_n47] o.a.s.m.SolrMetricManager Closing metric reporters for registry=solr.collection.collection1.shard1.leader, tag=990616027
   [junit4]   2> 652981 INFO  (TEST-TestDynamicLoading.testDynamicLoading-seed#[E1A73044852D3954]) [    ] o.a.s.c.Overseer Overseer (id=98861223031537682-127.0.0.1:51783__e%2Fq-n_0000000004) closing
   [junit4]   2> 652981 INFO  (OverseerStateUpdate-98861223031537682-127.0.0.1:51783__e%2Fq-n_0000000004) [n:127.0.0.1:51783__e%2Fq    ] o.a.s.c.Overseer Overseer Loop exiting : 127.0.0.1:51783__e%2Fq
   [junit4]   2> 652981 WARN  (OverseerAutoScalingTriggerThread-98861223031537682-127.0.0.1:51783__e%2Fq-n_0000000004) [n:127.0.0.1:51783__e%2Fq    ] o.a.s.c.a.OverseerTriggerThread OverseerTriggerThread woken up but we are closed, exiting.
   [junit4]   2> 652984 INFO  (TEST-TestDynamicLoading.testDynamicLoading-seed#[E1A73044852D3954]) [    ] o.e.j.s.AbstractConnector Stopped ServerConnector@46845d3a{HTTP/1.1,[http/1.1]}{127.0.0.1:0}
   [junit4]   2> 652985 INFO  (TEST-TestDynamicLoading.testDynamicLoading-seed#[E1A73044852D3954]) [    ] o.e.j.s.h.ContextHandler Stopped o.e.j.s.ServletContextHandler@1c044bbd{/_e/q,null,UNAVAILABLE}
   [junit4]   2> 652995 ERROR (TEST-TestDynamicLoading.testDynamicLoading-seed#[E1A73044852D3954]) [    ] o.a.z.s.ZooKeeperServer ZKShutdownHandler is not registered, so ZooKeeper server won't take any action on ERROR or SHUTDOWN server state changes
   [junit4]   2> 652996 INFO  (TEST-TestDynamicLoading.testDynamicLoading-seed#[E1A73044852D3954]) [    ] o.a.s.c.ZkTestServer connecting to 127.0.0.1:51721 51721
   [junit4]   2> 653011 INFO  (Thread-1026) [    ] o.a.s.c.ZkTestServer connecting to 127.0.0.1:51721 51721
   [junit4]   2> 653141 WARN  (Thread-1026) [    ] o.a.s.c.ZkTestServer Watch limit violations: 
   [junit4]   2> Maximum concurrent create/delete watches above limit:
   [junit4]   2> 
   [junit4]   2> 	15	/solr/configs/conf1
   [junit4]   2> 	7	/solr/aliases.json
   [junit4]   2> 	5	/solr/security.json
   [junit4]   2> 	4	/solr/collections/collection1/state.json
   [junit4]   2> 
   [junit4]   2> Maximum concurrent data watches above limit:
   [junit4]   2> 
   [junit4]   2> 	7	/solr/clusterstate.json
   [junit4]   2> 	7	/solr/clusterprops.json
   [junit4]   2> 	2	/solr/autoscaling.json
   [junit4]   2> 
   [junit4]   2> Maximum concurrent children watches above limit:
   [junit4]   2> 
   [junit4]   2> 	7	/solr/live_nodes
   [junit4]   2> 	7	/solr/collections
   [junit4]   2> 	2	/solr/overseer/queue
   [junit4]   2> 	2	/solr/autoscaling/events/.auto_add_replicas
   [junit4]   2> 	2	/solr/overseer/collection-queue-work
   [junit4]   2> 	2	/solr/overseer/queue-work
   [junit4]   2> 
   [junit4]   2> NOTE: reproduce with: ant test  -Dtestcase=TestDynamicLoading -Dtests.method=testDynamicLoading -Dtests.seed=E1A73044852D3954 -Dtests.slow=true -Dtests.locale=sr-CS -Dtests.timezone=Etc/GMT+2 -Dtests.asserts=true -Dtests.file.encoding=UTF-8
   [junit4] FAILURE 26.5s J1 | TestDynamicLoading.testDynamicLoading <<<
   [junit4]    > Throwable #1: java.lang.AssertionError: Could not get expected value  'org.apache.solr.core.BlobStoreTestRequestHandler' for path 'overlay/requestHandler/\/test1/class' full output: {
   [junit4]    >   "responseHeader":{
   [junit4]    >     "status":0,
   [junit4]    >     "QTime":0},
   [junit4]    >   "overlay":{
   [junit4]    >     "znodeVersion":0,
   [junit4]    >     "runtimeLib":{"colltest":{
   [junit4]    >         "name":"colltest",
   [junit4]    >         "version":1}}}},  from server:  null
   [junit4]    > 	at __randomizedtesting.SeedInfo.seed([E1A73044852D3954:39EA1D1372F09CF4]:0)
   [junit4]    > 	at org.apache.solr.core.TestSolrConfigHandler.testForResponseElement(TestSolrConfigHandler.java:557)
   [junit4]    > 	at org.apache.solr.core.TestDynamicLoading.testDynamicLoading(TestDynamicLoading.java:97)
   [junit4]    > 	at org.apache.solr.BaseDistributedSearchTestCase$ShardsRepeatRule$ShardsFixedStatement.callStatement(BaseDistributedSearchTestCase.java:993)
   [junit4]    > 	at org.apache.solr.BaseDistributedSearchTestCase$ShardsRepeatRule$ShardsStatement.evaluate(BaseDistributedSearchTestCase.java:968)
   [junit4]    > 	at java.lang.Thread.run(Thread.java:748)
   [junit4]   2> NOTE: leaving temporary files on disk at: /Users/jenkins/workspace/Lucene-Solr-master-MacOSX/solr/build/solr-core/test/J1/temp/solr.core.TestDynamicLoading_E1A73044852D3954-001
   [junit4]   2> Oct 20, 2017 12:29:35 PM com.carrotsearch.randomizedtesting.ThreadLeakControl checkThreadLeaks
   [junit4]   2> WARNING: Will linger awaiting termination of 1 leaked thread(s).
   [junit4]   2> NOTE: test params are: codec=Asserting(Lucene70): {}, docValues:{}, maxPointsInLeafNode=1373, maxMBSortInHeap=7.072995314449475, sim=RandomSimilarity(queryNorm=false): {}, locale=sr-CS, timezone=Etc/GMT+2
   [junit4]   2> NOTE: Mac OS X 10.11.6 x86_64/Oracle Corporation 1.8.0_144 (64-bit)/cpus=3,threads=1,free=85048336,total=222752768
   [junit4]   2> NOTE: All tests run in this JVM: [TestConfigSetsAPIExclusivity, OpenCloseCoreStressTest, DocValuesNotIndexedTest, TestLuceneIndexBackCompat, RequestLoggingTest, TestStressUserVersions, ChaosMonkeySafeLeaderTest, PolyFieldTest, UninvertDocValuesMergePolicyTest, TestNumericTerms32, DistributedIntervalFacetingTest, TestDocSet, TestSkipOverseerOperations, TestLockTree, TestPivotHelperCode, JvmMetricsTest, FileBasedSpellCheckerTest, DocumentBuilderTest, SpatialRPTFieldTypeTest, SSLMigrationTest, TestRuleBasedAuthorizationPlugin, SolrCoreTest, TestRequestForwarding, CollectionsAPIDistributedZkTest, DateRangeFieldTest, DeleteLastCustomShardedReplicaTest, TestJsonRequest, AliasIntegrationTest, JsonLoaderTest, TestEmbeddedSolrServerConstructors, TestFileDictionaryLookup, TestBlobHandler, RestartWhileUpdatingTest, SearchHandlerTest, ConnectionManagerTest, SimpleFacetsTest, ExternalFileFieldSortTest, TestElisionMultitermQuery, TestCollationFieldDocValues, PreAnalyzedFieldTest, OutOfBoxZkACLAndCredentialsProvidersTest, TestSchemaManager, TestReRankQParserPlugin, TestCloudRecovery, TestScoreJoinQPNoScore, CustomCollectionTest, TestLRUCache, ExecutePlanActionTest, AtomicUpdatesTest, MergeStrategyTest, TestFieldCacheSortRandom, AutoScalingHandlerTest, LeaderElectionIntegrationTest, TestLMJelinekMercerSimilarityFactory, TestSuggestSpellingConverter, TestSolrIndexConfig, TriggerIntegrationTest, LukeRequestHandlerTest, TestSolrDeletionPolicy1, TestExceedMaxTermLength, HdfsWriteToMultipleCollectionsTest, TestInfoStreamLogging, QueryElevationComponentTest, TestCollationField, TestDynamicLoading]
   [junit4] Completed [150/745 (1!)] on J1 in 27.55s, 1 test, 1 failure <<< FAILURES!

[...truncated 49135 lines...]

Mime
View raw message