lucene-dev mailing list archives

Site index · List index
Message view « Date » · « Thread »
Top « Date » · « Thread »
From Policeman Jenkins Server <jenk...@thetaphi.de>
Subject [JENKINS] Lucene-Solr-7.x-Windows (32bit/jdk1.8.0_144) - Build # 248 - Still Unstable!
Date Sat, 14 Oct 2017 20:15:25 GMT
Build: https://jenkins.thetaphi.de/job/Lucene-Solr-7.x-Windows/248/
Java: 32bit/jdk1.8.0_144 -server -XX:+UseConcMarkSweepGC

2 tests failed.
FAILED:  org.apache.solr.cloud.TestCloudSearcherWarming.testRepFactor1LeaderStartup

Error Message:
 null Live Nodes: [127.0.0.1:57038_solr] Last available state: DocCollection(testRepFactor1LeaderStartup//collections/testRepFactor1LeaderStartup/state.json/4)={   "pullReplicas":"0",   "replicationFactor":"1",   "shards":{"shard1":{       "range":"80000000-7fffffff",       "state":"active",       "replicas":{"core_node2":{           "core":"testRepFactor1LeaderStartup_shard1_replica_n1",           "base_url":"http://127.0.0.1:57038/solr",           "node_name":"127.0.0.1:57038_solr",           "state":"active",           "type":"NRT",           "leader":"true"}}}},   "router":{"name":"compositeId"},   "maxShardsPerNode":"1",   "autoAddReplicas":"false",   "nrtReplicas":"1",   "tlogReplicas":"0"}

Stack Trace:
java.lang.AssertionError: 
null
Live Nodes: [127.0.0.1:57038_solr]
Last available state: DocCollection(testRepFactor1LeaderStartup//collections/testRepFactor1LeaderStartup/state.json/4)={
  "pullReplicas":"0",
  "replicationFactor":"1",
  "shards":{"shard1":{
      "range":"80000000-7fffffff",
      "state":"active",
      "replicas":{"core_node2":{
          "core":"testRepFactor1LeaderStartup_shard1_replica_n1",
          "base_url":"http://127.0.0.1:57038/solr",
          "node_name":"127.0.0.1:57038_solr",
          "state":"active",
          "type":"NRT",
          "leader":"true"}}}},
  "router":{"name":"compositeId"},
  "maxShardsPerNode":"1",
  "autoAddReplicas":"false",
  "nrtReplicas":"1",
  "tlogReplicas":"0"}
	at __randomizedtesting.SeedInfo.seed([225115A8932EDC87:F579587082CE9569]:0)
	at org.junit.Assert.fail(Assert.java:93)
	at org.apache.solr.cloud.SolrCloudTestCase.waitForState(SolrCloudTestCase.java:269)
	at org.apache.solr.cloud.TestCloudSearcherWarming.testRepFactor1LeaderStartup(TestCloudSearcherWarming.java:126)
	at sun.reflect.NativeMethodAccessorImpl.invoke0(Native Method)
	at sun.reflect.NativeMethodAccessorImpl.invoke(NativeMethodAccessorImpl.java:62)
	at sun.reflect.DelegatingMethodAccessorImpl.invoke(DelegatingMethodAccessorImpl.java:43)
	at java.lang.reflect.Method.invoke(Method.java:498)
	at com.carrotsearch.randomizedtesting.RandomizedRunner.invoke(RandomizedRunner.java:1737)
	at com.carrotsearch.randomizedtesting.RandomizedRunner$8.evaluate(RandomizedRunner.java:934)
	at com.carrotsearch.randomizedtesting.RandomizedRunner$9.evaluate(RandomizedRunner.java:970)
	at com.carrotsearch.randomizedtesting.RandomizedRunner$10.evaluate(RandomizedRunner.java:984)
	at com.carrotsearch.randomizedtesting.rules.SystemPropertiesRestoreRule$1.evaluate(SystemPropertiesRestoreRule.java:57)
	at org.apache.lucene.util.TestRuleSetupTeardownChained$1.evaluate(TestRuleSetupTeardownChained.java:49)
	at org.apache.lucene.util.AbstractBeforeAfterRule$1.evaluate(AbstractBeforeAfterRule.java:45)
	at org.apache.lucene.util.TestRuleThreadAndTestName$1.evaluate(TestRuleThreadAndTestName.java:48)
	at org.apache.lucene.util.TestRuleIgnoreAfterMaxFailures$1.evaluate(TestRuleIgnoreAfterMaxFailures.java:64)
	at org.apache.lucene.util.TestRuleMarkFailure$1.evaluate(TestRuleMarkFailure.java:47)
	at com.carrotsearch.randomizedtesting.rules.StatementAdapter.evaluate(StatementAdapter.java:36)
	at com.carrotsearch.randomizedtesting.ThreadLeakControl$StatementRunner.run(ThreadLeakControl.java:368)
	at com.carrotsearch.randomizedtesting.ThreadLeakControl.forkTimeoutingTask(ThreadLeakControl.java:817)
	at com.carrotsearch.randomizedtesting.ThreadLeakControl$3.evaluate(ThreadLeakControl.java:468)
	at com.carrotsearch.randomizedtesting.RandomizedRunner.runSingleTest(RandomizedRunner.java:943)
	at com.carrotsearch.randomizedtesting.RandomizedRunner$5.evaluate(RandomizedRunner.java:829)
	at com.carrotsearch.randomizedtesting.RandomizedRunner$6.evaluate(RandomizedRunner.java:879)
	at com.carrotsearch.randomizedtesting.RandomizedRunner$7.evaluate(RandomizedRunner.java:890)
	at com.carrotsearch.randomizedtesting.rules.StatementAdapter.evaluate(StatementAdapter.java:36)
	at com.carrotsearch.randomizedtesting.rules.SystemPropertiesRestoreRule$1.evaluate(SystemPropertiesRestoreRule.java:57)
	at org.apache.lucene.util.AbstractBeforeAfterRule$1.evaluate(AbstractBeforeAfterRule.java:45)
	at com.carrotsearch.randomizedtesting.rules.StatementAdapter.evaluate(StatementAdapter.java:36)
	at org.apache.lucene.util.TestRuleStoreClassName$1.evaluate(TestRuleStoreClassName.java:41)
	at com.carrotsearch.randomizedtesting.rules.NoShadowingOrOverridesOnMethodsRule$1.evaluate(NoShadowingOrOverridesOnMethodsRule.java:40)
	at com.carrotsearch.randomizedtesting.rules.NoShadowingOrOverridesOnMethodsRule$1.evaluate(NoShadowingOrOverridesOnMethodsRule.java:40)
	at com.carrotsearch.randomizedtesting.rules.StatementAdapter.evaluate(StatementAdapter.java:36)
	at com.carrotsearch.randomizedtesting.rules.StatementAdapter.evaluate(StatementAdapter.java:36)
	at com.carrotsearch.randomizedtesting.rules.StatementAdapter.evaluate(StatementAdapter.java:36)
	at org.apache.lucene.util.TestRuleAssertionsRequired$1.evaluate(TestRuleAssertionsRequired.java:53)
	at org.apache.lucene.util.TestRuleMarkFailure$1.evaluate(TestRuleMarkFailure.java:47)
	at org.apache.lucene.util.TestRuleIgnoreAfterMaxFailures$1.evaluate(TestRuleIgnoreAfterMaxFailures.java:64)
	at org.apache.lucene.util.TestRuleIgnoreTestSuites$1.evaluate(TestRuleIgnoreTestSuites.java:54)
	at com.carrotsearch.randomizedtesting.rules.StatementAdapter.evaluate(StatementAdapter.java:36)
	at com.carrotsearch.randomizedtesting.ThreadLeakControl$StatementRunner.run(ThreadLeakControl.java:368)
	at java.lang.Thread.run(Thread.java:748)


FAILED:  org.apache.solr.cloud.TestCloudSearcherWarming.testPeersyncFailureReplicationSuccess

Error Message:
0

Stack Trace:
java.lang.ArrayIndexOutOfBoundsException: 0
	at __randomizedtesting.SeedInfo.seed([225115A8932EDC87:F60076E74290EBE4]:0)
	at java.util.concurrent.CopyOnWriteArrayList.get(CopyOnWriteArrayList.java:387)
	at java.util.concurrent.CopyOnWriteArrayList.get(CopyOnWriteArrayList.java:396)
	at org.apache.solr.cloud.MiniSolrCloudCluster.getJettySolrRunner(MiniSolrCloudCluster.java:367)
	at org.apache.solr.cloud.TestCloudSearcherWarming.testPeersyncFailureReplicationSuccess(TestCloudSearcherWarming.java:141)
	at sun.reflect.NativeMethodAccessorImpl.invoke0(Native Method)
	at sun.reflect.NativeMethodAccessorImpl.invoke(NativeMethodAccessorImpl.java:62)
	at sun.reflect.DelegatingMethodAccessorImpl.invoke(DelegatingMethodAccessorImpl.java:43)
	at java.lang.reflect.Method.invoke(Method.java:498)
	at com.carrotsearch.randomizedtesting.RandomizedRunner.invoke(RandomizedRunner.java:1737)
	at com.carrotsearch.randomizedtesting.RandomizedRunner$8.evaluate(RandomizedRunner.java:934)
	at com.carrotsearch.randomizedtesting.RandomizedRunner$9.evaluate(RandomizedRunner.java:970)
	at com.carrotsearch.randomizedtesting.RandomizedRunner$10.evaluate(RandomizedRunner.java:984)
	at com.carrotsearch.randomizedtesting.rules.SystemPropertiesRestoreRule$1.evaluate(SystemPropertiesRestoreRule.java:57)
	at org.apache.lucene.util.TestRuleSetupTeardownChained$1.evaluate(TestRuleSetupTeardownChained.java:49)
	at org.apache.lucene.util.AbstractBeforeAfterRule$1.evaluate(AbstractBeforeAfterRule.java:45)
	at org.apache.lucene.util.TestRuleThreadAndTestName$1.evaluate(TestRuleThreadAndTestName.java:48)
	at org.apache.lucene.util.TestRuleIgnoreAfterMaxFailures$1.evaluate(TestRuleIgnoreAfterMaxFailures.java:64)
	at org.apache.lucene.util.TestRuleMarkFailure$1.evaluate(TestRuleMarkFailure.java:47)
	at com.carrotsearch.randomizedtesting.rules.StatementAdapter.evaluate(StatementAdapter.java:36)
	at com.carrotsearch.randomizedtesting.ThreadLeakControl$StatementRunner.run(ThreadLeakControl.java:368)
	at com.carrotsearch.randomizedtesting.ThreadLeakControl.forkTimeoutingTask(ThreadLeakControl.java:817)
	at com.carrotsearch.randomizedtesting.ThreadLeakControl$3.evaluate(ThreadLeakControl.java:468)
	at com.carrotsearch.randomizedtesting.RandomizedRunner.runSingleTest(RandomizedRunner.java:943)
	at com.carrotsearch.randomizedtesting.RandomizedRunner$5.evaluate(RandomizedRunner.java:829)
	at com.carrotsearch.randomizedtesting.RandomizedRunner$6.evaluate(RandomizedRunner.java:879)
	at com.carrotsearch.randomizedtesting.RandomizedRunner$7.evaluate(RandomizedRunner.java:890)
	at com.carrotsearch.randomizedtesting.rules.StatementAdapter.evaluate(StatementAdapter.java:36)
	at com.carrotsearch.randomizedtesting.rules.SystemPropertiesRestoreRule$1.evaluate(SystemPropertiesRestoreRule.java:57)
	at org.apache.lucene.util.AbstractBeforeAfterRule$1.evaluate(AbstractBeforeAfterRule.java:45)
	at com.carrotsearch.randomizedtesting.rules.StatementAdapter.evaluate(StatementAdapter.java:36)
	at org.apache.lucene.util.TestRuleStoreClassName$1.evaluate(TestRuleStoreClassName.java:41)
	at com.carrotsearch.randomizedtesting.rules.NoShadowingOrOverridesOnMethodsRule$1.evaluate(NoShadowingOrOverridesOnMethodsRule.java:40)
	at com.carrotsearch.randomizedtesting.rules.NoShadowingOrOverridesOnMethodsRule$1.evaluate(NoShadowingOrOverridesOnMethodsRule.java:40)
	at com.carrotsearch.randomizedtesting.rules.StatementAdapter.evaluate(StatementAdapter.java:36)
	at com.carrotsearch.randomizedtesting.rules.StatementAdapter.evaluate(StatementAdapter.java:36)
	at com.carrotsearch.randomizedtesting.rules.StatementAdapter.evaluate(StatementAdapter.java:36)
	at org.apache.lucene.util.TestRuleAssertionsRequired$1.evaluate(TestRuleAssertionsRequired.java:53)
	at org.apache.lucene.util.TestRuleMarkFailure$1.evaluate(TestRuleMarkFailure.java:47)
	at org.apache.lucene.util.TestRuleIgnoreAfterMaxFailures$1.evaluate(TestRuleIgnoreAfterMaxFailures.java:64)
	at org.apache.lucene.util.TestRuleIgnoreTestSuites$1.evaluate(TestRuleIgnoreTestSuites.java:54)
	at com.carrotsearch.randomizedtesting.rules.StatementAdapter.evaluate(StatementAdapter.java:36)
	at com.carrotsearch.randomizedtesting.ThreadLeakControl$StatementRunner.run(ThreadLeakControl.java:368)
	at java.lang.Thread.run(Thread.java:748)




Build Log:
[...truncated 12759 lines...]
   [junit4] Suite: org.apache.solr.cloud.TestCloudSearcherWarming
   [junit4]   2> 1841978 INFO  (SUITE-TestCloudSearcherWarming-seed#[225115A8932EDC87]-worker) [    ] o.a.s.SolrTestCaseJ4 SecureRandom sanity checks: test.solr.allowed.securerandom=null & java.security.egd=file:/dev/./urandom
   [junit4]   2> Creating dataDir: C:\Users\jenkins\workspace\Lucene-Solr-7.x-Windows\solr\build\solr-core\test\J0\temp\solr.cloud.TestCloudSearcherWarming_225115A8932EDC87-001\init-core-data-001
   [junit4]   2> 1841980 WARN  (SUITE-TestCloudSearcherWarming-seed#[225115A8932EDC87]-worker) [    ] o.a.s.SolrTestCaseJ4 startTrackingSearchers: numOpens=1 numCloses=1
   [junit4]   2> 1841980 INFO  (SUITE-TestCloudSearcherWarming-seed#[225115A8932EDC87]-worker) [    ] o.a.s.SolrTestCaseJ4 Using PointFields (NUMERIC_POINTS_SYSPROP=true) w/NUMERIC_DOCVALUES_SYSPROP=false
   [junit4]   2> 1841987 INFO  (SUITE-TestCloudSearcherWarming-seed#[225115A8932EDC87]-worker) [    ] o.a.s.SolrTestCaseJ4 Randomized ssl (false) and clientAuth (false) via: @org.apache.solr.util.RandomizeSSL(reason=, value=NaN, ssl=NaN, clientAuth=NaN)
   [junit4]   2> 1841989 INFO  (SUITE-TestCloudSearcherWarming-seed#[225115A8932EDC87]-worker) [    ] o.a.s.c.MiniSolrCloudCluster Starting cluster of 1 servers in C:\Users\jenkins\workspace\Lucene-Solr-7.x-Windows\solr\build\solr-core\test\J0\temp\solr.cloud.TestCloudSearcherWarming_225115A8932EDC87-001\tempDir-001
   [junit4]   2> 1841990 INFO  (SUITE-TestCloudSearcherWarming-seed#[225115A8932EDC87]-worker) [    ] o.a.s.c.ZkTestServer STARTING ZK TEST SERVER
   [junit4]   2> 1841990 INFO  (Thread-3930) [    ] o.a.s.c.ZkTestServer client port:0.0.0.0/0.0.0.0:0
   [junit4]   2> 1841990 INFO  (Thread-3930) [    ] o.a.s.c.ZkTestServer Starting server
   [junit4]   2> 1841999 ERROR (Thread-3930) [    ] o.a.z.s.ZooKeeperServer ZKShutdownHandler is not registered, so ZooKeeper server won't take any action on ERROR or SHUTDOWN server state changes
   [junit4]   2> 1842090 INFO  (SUITE-TestCloudSearcherWarming-seed#[225115A8932EDC87]-worker) [    ] o.a.s.c.ZkTestServer start zk server on port:57034
   [junit4]   2> 1842104 INFO  (jetty-launcher-2945-thread-1) [    ] o.e.j.s.Server jetty-9.3.20.v20170531
   [junit4]   2> 1842106 INFO  (jetty-launcher-2945-thread-1) [    ] o.e.j.s.h.ContextHandler Started o.e.j.s.ServletContextHandler@11a7db2{/solr,null,AVAILABLE}
   [junit4]   2> 1842109 INFO  (jetty-launcher-2945-thread-1) [    ] o.e.j.s.AbstractConnector Started ServerConnector@76d31a{HTTP/1.1,[http/1.1]}{127.0.0.1:57038}
   [junit4]   2> 1842109 INFO  (jetty-launcher-2945-thread-1) [    ] o.e.j.s.Server Started @1849838ms
   [junit4]   2> 1842109 INFO  (jetty-launcher-2945-thread-1) [    ] o.a.s.c.s.e.JettySolrRunner Jetty properties: {hostContext=/solr, hostPort=57038}
   [junit4]   2> 1842109 ERROR (jetty-launcher-2945-thread-1) [    ] o.a.s.u.StartupLoggingUtils Missing Java Option solr.log.dir. Logging may be missing or incomplete.
   [junit4]   2> 1842110 INFO  (jetty-launcher-2945-thread-1) [    ] o.a.s.s.SolrDispatchFilter  ___      _       Welcome to Apache Solr? version 7.2.0
   [junit4]   2> 1842110 INFO  (jetty-launcher-2945-thread-1) [    ] o.a.s.s.SolrDispatchFilter / __| ___| |_ _   Starting in cloud mode on port null
   [junit4]   2> 1842110 INFO  (jetty-launcher-2945-thread-1) [    ] o.a.s.s.SolrDispatchFilter \__ \/ _ \ | '_|  Install dir: null, Default config dir: null
   [junit4]   2> 1842110 INFO  (jetty-launcher-2945-thread-1) [    ] o.a.s.s.SolrDispatchFilter |___/\___/_|_|    Start time: 2017-10-14T19:28:31.033Z
   [junit4]   2> 1842114 INFO  (jetty-launcher-2945-thread-1) [    ] o.a.s.s.SolrDispatchFilter solr.xml found in ZooKeeper. Loading...
   [junit4]   2> 1842149 WARN  (NIOServerCxn.Factory:0.0.0.0/0.0.0.0:0) [    ] o.a.z.s.NIOServerCnxn caught end of stream exception
   [junit4]   2> EndOfStreamException: Unable to read additional data from client sessionid 0x15f1c5bfac50001, likely client has closed socket
   [junit4]   2> 	at org.apache.zookeeper.server.NIOServerCnxn.doIO(NIOServerCnxn.java:239)
   [junit4]   2> 	at org.apache.zookeeper.server.NIOServerCnxnFactory.run(NIOServerCnxnFactory.java:203)
   [junit4]   2> 	at java.lang.Thread.run(Thread.java:748)
   [junit4]   2> 1842156 INFO  (jetty-launcher-2945-thread-1) [    ] o.a.s.c.ZkContainer Zookeeper client=127.0.0.1:57034/solr
   [junit4]   2> 1842160 WARN  (NIOServerCxn.Factory:0.0.0.0/0.0.0.0:0) [    ] o.a.z.s.NIOServerCnxn caught end of stream exception
   [junit4]   2> EndOfStreamException: Unable to read additional data from client sessionid 0x15f1c5bfac50002, likely client has closed socket
   [junit4]   2> 	at org.apache.zookeeper.server.NIOServerCnxn.doIO(NIOServerCnxn.java:239)
   [junit4]   2> 	at org.apache.zookeeper.server.NIOServerCnxnFactory.run(NIOServerCnxnFactory.java:203)
   [junit4]   2> 	at java.lang.Thread.run(Thread.java:748)
   [junit4]   2> 1842284 INFO  (jetty-launcher-2945-thread-1) [n:127.0.0.1:57038_solr    ] o.a.s.c.Overseer Overseer (id=null) closing
   [junit4]   2> 1842285 INFO  (jetty-launcher-2945-thread-1) [n:127.0.0.1:57038_solr    ] o.a.s.c.OverseerElectionContext I am going to be the leader 127.0.0.1:57038_solr
   [junit4]   2> 1842286 INFO  (jetty-launcher-2945-thread-1) [n:127.0.0.1:57038_solr    ] o.a.s.c.Overseer Overseer (id=98828898200256515-127.0.0.1:57038_solr-n_0000000000) starting
   [junit4]   2> 1842293 INFO  (jetty-launcher-2945-thread-1) [n:127.0.0.1:57038_solr    ] o.a.s.c.ZkController Register node as live in ZooKeeper:/live_nodes/127.0.0.1:57038_solr
   [junit4]   2> 1842301 INFO  (OverseerStateUpdate-98828898200256515-127.0.0.1:57038_solr-n_0000000000) [n:127.0.0.1:57038_solr    ] o.a.s.c.c.ZkStateReader Updated live nodes from ZooKeeper... (0) -> (1)
   [junit4]   2> 1842473 INFO  (jetty-launcher-2945-thread-1) [n:127.0.0.1:57038_solr    ] o.a.s.m.r.SolrJmxReporter JMX monitoring for 'solr_57038.solr.node' (registry 'solr.node') enabled at server: com.sun.jmx.mbeanserver.JmxMBeanServer@156d5f6
   [junit4]   2> 1842478 INFO  (jetty-launcher-2945-thread-1) [n:127.0.0.1:57038_solr    ] o.a.s.m.r.SolrJmxReporter JMX monitoring for 'solr_57038.solr.jvm' (registry 'solr.jvm') enabled at server: com.sun.jmx.mbeanserver.JmxMBeanServer@156d5f6
   [junit4]   2> 1842479 INFO  (jetty-launcher-2945-thread-1) [n:127.0.0.1:57038_solr    ] o.a.s.m.r.SolrJmxReporter JMX monitoring for 'solr_57038.solr.jetty' (registry 'solr.jetty') enabled at server: com.sun.jmx.mbeanserver.JmxMBeanServer@156d5f6
   [junit4]   2> 1842480 INFO  (jetty-launcher-2945-thread-1) [n:127.0.0.1:57038_solr    ] o.a.s.c.CorePropertiesLocator Found 0 core definitions underneath C:\Users\jenkins\workspace\Lucene-Solr-7.x-Windows\solr\build\solr-core\test\J0\temp\solr.cloud.TestCloudSearcherWarming_225115A8932EDC87-001\tempDir-001\node1\.
   [junit4]   2> 1842515 INFO  (SUITE-TestCloudSearcherWarming-seed#[225115A8932EDC87]-worker) [    ] o.a.s.c.c.ZkStateReader Updated live nodes from ZooKeeper... (0) -> (1)
   [junit4]   2> 1842516 INFO  (SUITE-TestCloudSearcherWarming-seed#[225115A8932EDC87]-worker) [    ] o.a.s.c.s.i.ZkClientClusterStateProvider Cluster at 127.0.0.1:57034/solr ready
   [junit4]   2> 1842580 INFO  (TEST-TestCloudSearcherWarming.testRepFactor1LeaderStartup-seed#[225115A8932EDC87]) [    ] o.a.s.SolrTestCaseJ4 ###Starting testRepFactor1LeaderStartup
   [junit4]   2> 1842589 INFO  (qtp11726034-18480) [n:127.0.0.1:57038_solr    ] o.a.s.h.a.CollectionsHandler Invoked Collection Action :delete with params name=testRepFactor1LeaderStartup&action=DELETE&wt=javabin&version=2 and sendToOCPQueue=true
   [junit4]   2> 1842595 INFO  (OverseerThreadFactory-7545-thread-1-processing-n:127.0.0.1:57038_solr) [n:127.0.0.1:57038_solr    ] o.a.s.c.OverseerCollectionMessageHandler Executing Collection Cmd : action=UNLOAD&deleteInstanceDir=true&deleteDataDir=true
   [junit4]   2> 1842596 ERROR (OverseerThreadFactory-7545-thread-1-processing-n:127.0.0.1:57038_solr) [n:127.0.0.1:57038_solr    ] o.a.s.c.OverseerCollectionMessageHandler Collection: testRepFactor1LeaderStartup operation: delete failed:org.apache.solr.common.SolrException: Could not find collection : testRepFactor1LeaderStartup
   [junit4]   2> 	at org.apache.solr.common.cloud.ClusterState.getCollection(ClusterState.java:111)
   [junit4]   2> 	at org.apache.solr.cloud.OverseerCollectionMessageHandler.collectionCmd(OverseerCollectionMessageHandler.java:798)
   [junit4]   2> 	at org.apache.solr.cloud.DeleteCollectionCmd.call(DeleteCollectionCmd.java:91)
   [junit4]   2> 	at org.apache.solr.cloud.OverseerCollectionMessageHandler.processMessage(OverseerCollectionMessageHandler.java:229)
   [junit4]   2> 	at org.apache.solr.cloud.OverseerTaskProcessor$Runner.run(OverseerTaskProcessor.java:464)
   [junit4]   2> 	at org.apache.solr.common.util.ExecutorUtil$MDCAwareThreadPoolExecutor.lambda$execute$0(ExecutorUtil.java:188)
   [junit4]   2> 	at java.util.concurrent.ThreadPoolExecutor.runWorker(ThreadPoolExecutor.java:1149)
   [junit4]   2> 	at java.util.concurrent.ThreadPoolExecutor$Worker.run(ThreadPoolExecutor.java:624)
   [junit4]   2> 	at java.lang.Thread.run(Thread.java:748)
   [junit4]   2> 
   [junit4]   2> 1842609 INFO  (qtp11726034-18480) [n:127.0.0.1:57038_solr    ] o.a.s.s.HttpSolrCall [admin] webapp=null path=/admin/collections params={name=testRepFactor1LeaderStartup&action=DELETE&wt=javabin&version=2} status=400 QTime=21
   [junit4]   2> 1842610 INFO  (qtp11726034-18481) [n:127.0.0.1:57038_solr    ] o.a.s.h.a.CollectionsHandler Invoked Collection Action :delete with params name=testPeersyncFailureReplicationSuccess&action=DELETE&wt=javabin&version=2 and sendToOCPQueue=true
   [junit4]   2> 1842613 INFO  (OverseerCollectionConfigSetProcessor-98828898200256515-127.0.0.1:57038_solr-n_0000000000) [n:127.0.0.1:57038_solr    ] o.a.s.c.OverseerTaskQueue Response ZK path: /overseer/collection-queue-work/qnr-0000000000 doesn't exist.  Requestor may have disconnected from ZooKeeper
   [junit4]   2> 1842613 INFO  (OverseerThreadFactory-7545-thread-2-processing-n:127.0.0.1:57038_solr) [n:127.0.0.1:57038_solr    ] o.a.s.c.OverseerCollectionMessageHandler Executing Collection Cmd : action=UNLOAD&deleteInstanceDir=true&deleteDataDir=true
   [junit4]   2> 1842613 ERROR (OverseerThreadFactory-7545-thread-2-processing-n:127.0.0.1:57038_solr) [n:127.0.0.1:57038_solr    ] o.a.s.c.OverseerCollectionMessageHandler Collection: testPeersyncFailureReplicationSuccess operation: delete failed:org.apache.solr.common.SolrException: Could not find collection : testPeersyncFailureReplicationSuccess
   [junit4]   2> 	at org.apache.solr.common.cloud.ClusterState.getCollection(ClusterState.java:111)
   [junit4]   2> 	at org.apache.solr.cloud.OverseerCollectionMessageHandler.collectionCmd(OverseerCollectionMessageHandler.java:798)
   [junit4]   2> 	at org.apache.solr.cloud.DeleteCollectionCmd.call(DeleteCollectionCmd.java:91)
   [junit4]   2> 	at org.apache.solr.cloud.OverseerCollectionMessageHandler.processMessage(OverseerCollectionMessageHandler.java:229)
   [junit4]   2> 	at org.apache.solr.cloud.OverseerTaskProcessor$Runner.run(OverseerTaskProcessor.java:464)
   [junit4]   2> 	at org.apache.solr.common.util.ExecutorUtil$MDCAwareThreadPoolExecutor.lambda$execute$0(ExecutorUtil.java:188)
   [junit4]   2> 	at java.util.concurrent.ThreadPoolExecutor.runWorker(ThreadPoolExecutor.java:1149)
   [junit4]   2> 	at java.util.concurrent.ThreadPoolExecutor$Worker.run(ThreadPoolExecutor.java:624)
   [junit4]   2> 	at java.lang.Thread.run(Thread.java:748)
   [junit4]   2> 
   [junit4]   2> 1842617 INFO  (qtp11726034-18481) [n:127.0.0.1:57038_solr    ] o.a.s.s.HttpSolrCall [admin] webapp=null path=/admin/collections params={name=testPeersyncFailureReplicationSuccess&action=DELETE&wt=javabin&version=2} status=400 QTime=6
   [junit4]   2> 1842617 INFO  (qtp11726034-18482) [n:127.0.0.1:57038_solr    ] o.a.s.h.a.CollectionsHandler Invoked Collection Action :create with params pullReplicas=0&replicationFactor=1&name=testRepFactor1LeaderStartup&nrtReplicas=1&action=CREATE&numShards=1&tlogReplicas=0&createNodeSet=127.0.0.1:57038_solr&wt=javabin&version=2 and sendToOCPQueue=true
   [junit4]   2> 1842620 INFO  (OverseerThreadFactory-7545-thread-3-processing-n:127.0.0.1:57038_solr) [n:127.0.0.1:57038_solr    ] o.a.s.c.CreateCollectionCmd Create collection testRepFactor1LeaderStartup
   [junit4]   2> 1842620 INFO  (OverseerCollectionConfigSetProcessor-98828898200256515-127.0.0.1:57038_solr-n_0000000000) [n:127.0.0.1:57038_solr    ] o.a.s.c.OverseerTaskQueue Response ZK path: /overseer/collection-queue-work/qnr-0000000002 doesn't exist.  Requestor may have disconnected from ZooKeeper
   [junit4]   2> 1842620 INFO  (OverseerThreadFactory-7545-thread-3-processing-n:127.0.0.1:57038_solr) [n:127.0.0.1:57038_solr    ] o.a.s.c.CreateCollectionCmd Only _default config set found, using it.
   [junit4]   2> 1842621 INFO  (OverseerThreadFactory-7545-thread-3-processing-n:127.0.0.1:57038_solr) [n:127.0.0.1:57038_solr    ] o.a.s.c.c.ZkConfigManager Copying zk node /configs/_default/managed-schema to /configs/testRepFactor1LeaderStartup/managed-schema
   [junit4]   2> 1842625 INFO  (OverseerThreadFactory-7545-thread-3-processing-n:127.0.0.1:57038_solr) [n:127.0.0.1:57038_solr    ] o.a.s.c.c.ZkConfigManager Copying zk node /configs/_default/protwords.txt to /configs/testRepFactor1LeaderStartup/protwords.txt
   [junit4]   2> 1842627 INFO  (OverseerThreadFactory-7545-thread-3-processing-n:127.0.0.1:57038_solr) [n:127.0.0.1:57038_solr    ] o.a.s.c.c.ZkConfigManager Copying zk node /configs/_default/solrconfig.xml to /configs/testRepFactor1LeaderStartup/solrconfig.xml
   [junit4]   2> 1842631 INFO  (OverseerThreadFactory-7545-thread-3-processing-n:127.0.0.1:57038_solr) [n:127.0.0.1:57038_solr    ] o.a.s.c.c.ZkConfigManager Copying zk node /configs/_default/synonyms.txt to /configs/testRepFactor1LeaderStartup/synonyms.txt
   [junit4]   2> 1842634 INFO  (OverseerThreadFactory-7545-thread-3-processing-n:127.0.0.1:57038_solr) [n:127.0.0.1:57038_solr    ] o.a.s.c.c.ZkConfigManager Copying zk node /configs/_default/stopwords.txt to /configs/testRepFactor1LeaderStartup/stopwords.txt
   [junit4]   2> 1842637 INFO  (OverseerThreadFactory-7545-thread-3-processing-n:127.0.0.1:57038_solr) [n:127.0.0.1:57038_solr    ] o.a.s.c.c.ZkConfigManager Copying zk node /configs/_default/lang/contractions_it.txt to /configs/testRepFactor1LeaderStartup/lang/contractions_it.txt
   [junit4]   2> 1842641 INFO  (OverseerThreadFactory-7545-thread-3-processing-n:127.0.0.1:57038_solr) [n:127.0.0.1:57038_solr    ] o.a.s.c.c.ZkConfigManager Copying zk node /configs/_default/lang/contractions_ca.txt to /configs/testRepFactor1LeaderStartup/lang/contractions_ca.txt
   [junit4]   2> 1842643 INFO  (OverseerThreadFactory-7545-thread-3-processing-n:127.0.0.1:57038_solr) [n:127.0.0.1:57038_solr    ] o.a.s.c.c.ZkConfigManager Copying zk node /configs/_default/lang/stemdict_nl.txt to /configs/testRepFactor1LeaderStartup/lang/stemdict_nl.txt
   [junit4]   2> 1842646 INFO  (OverseerThreadFactory-7545-thread-3-processing-n:127.0.0.1:57038_solr) [n:127.0.0.1:57038_solr    ] o.a.s.c.c.ZkConfigManager Copying zk node /configs/_default/lang/stopwords_hy.txt to /configs/testRepFactor1LeaderStartup/lang/stopwords_hy.txt
   [junit4]   2> 1842649 INFO  (OverseerThreadFactory-7545-thread-3-processing-n:127.0.0.1:57038_solr) [n:127.0.0.1:57038_solr    ] o.a.s.c.c.ZkConfigManager Copying zk node /configs/_default/lang/stopwords_no.txt to /configs/testRepFactor1LeaderStartup/lang/stopwords_no.txt
   [junit4]   2> 1842651 INFO  (OverseerThreadFactory-7545-thread-3-processing-n:127.0.0.1:57038_solr) [n:127.0.0.1:57038_solr    ] o.a.s.c.c.ZkConfigManager Copying zk node /configs/_default/lang/stopwords_id.txt to /configs/testRepFactor1LeaderStartup/lang/stopwords_id.txt
   [junit4]   2> 1842654 INFO  (OverseerThreadFactory-7545-thread-3-processing-n:127.0.0.1:57038_solr) [n:127.0.0.1:57038_solr    ] o.a.s.c.c.ZkConfigManager Copying zk node /configs/_default/lang/stopwords_da.txt to /configs/testRepFactor1LeaderStartup/lang/stopwords_da.txt
   [junit4]   2> 1842657 INFO  (OverseerThreadFactory-7545-thread-3-processing-n:127.0.0.1:57038_solr) [n:127.0.0.1:57038_solr    ] o.a.s.c.c.ZkConfigManager Copying zk node /configs/_default/lang/stopwords_ga.txt to /configs/testRepFactor1LeaderStartup/lang/stopwords_ga.txt
   [junit4]   2> 1842659 INFO  (OverseerThreadFactory-7545-thread-3-processing-n:127.0.0.1:57038_solr) [n:127.0.0.1:57038_solr    ] o.a.s.c.c.ZkConfigManager Copying zk node /configs/_default/lang/stopwords_hi.txt to /configs/testRepFactor1LeaderStartup/lang/stopwords_hi.txt
   [junit4]   2> 1842662 INFO  (OverseerThreadFactory-7545-thread-3-processing-n:127.0.0.1:57038_solr) [n:127.0.0.1:57038_solr    ] o.a.s.c.c.ZkConfigManager Copying zk node /configs/_default/lang/stopwords_ja.txt to /configs/testRepFactor1LeaderStartup/lang/stopwords_ja.txt
   [junit4]   2> 1842665 INFO  (OverseerThreadFactory-7545-thread-3-processing-n:127.0.0.1:57038_solr) [n:127.0.0.1:57038_solr    ] o.a.s.c.c.ZkConfigManager Copying zk node /configs/_default/lang/stopwords_pt.txt to /configs/testRepFactor1LeaderStartup/lang/stopwords_pt.txt
   [junit4]   2> 1842668 INFO  (OverseerThreadFactory-7545-thread-3-processing-n:127.0.0.1:57038_solr) [n:127.0.0.1:57038_solr    ] o.a.s.c.c.ZkConfigManager Copying zk node /configs/_default/lang/stopwords_hu.txt to /configs/testRepFactor1LeaderStartup/lang/stopwords_hu.txt
   [junit4]   2> 1842670 INFO  (OverseerThreadFactory-7545-thread-3-processing-n:127.0.0.1:57038_solr) [n:127.0.0.1:57038_solr    ] o.a.s.c.c.ZkConfigManager Copying zk node /configs/_default/lang/stopwords_el.txt to /configs/testRepFactor1LeaderStartup/lang/stopwords_el.txt
   [junit4]   2> 1842673 INFO  (OverseerThreadFactory-7545-thread-3-processing-n:127.0.0.1:57038_solr) [n:127.0.0.1:57038_solr    ] o.a.s.c.c.ZkConfigManager Copying zk node /configs/_default/lang/stopwords_ru.txt to /configs/testRepFactor1LeaderStartup/lang/stopwords_ru.txt
   [junit4]   2> 1842675 INFO  (OverseerThreadFactory-7545-thread-3-processing-n:127.0.0.1:57038_solr) [n:127.0.0.1:57038_solr    ] o.a.s.c.c.ZkConfigManager Copying zk node /configs/_default/lang/stopwords_tr.txt to /configs/testRepFactor1LeaderStartup/lang/stopwords_tr.txt
   [junit4]   2> 1842678 INFO  (OverseerThreadFactory-7545-thread-3-processing-n:127.0.0.1:57038_solr) [n:127.0.0.1:57038_solr    ] o.a.s.c.c.ZkConfigManager Copying zk node /configs/_default/lang/stopwords_ar.txt to /configs/testRepFactor1LeaderStartup/lang/stopwords_ar.txt
   [junit4]   2> 1842680 INFO  (OverseerThreadFactory-7545-thread-3-processing-n:127.0.0.1:57038_solr) [n:127.0.0.1:57038_solr    ] o.a.s.c.c.ZkConfigManager Copying zk node /configs/_default/lang/userdict_ja.txt to /configs/testRepFactor1LeaderStartup/lang/userdict_ja.txt
   [junit4]   2> 1842683 INFO  (OverseerThreadFactory-7545-thread-3-processing-n:127.0.0.1:57038_solr) [n:127.0.0.1:57038_solr    ] o.a.s.c.c.ZkConfigManager Copying zk node /configs/_default/lang/stopwords_eu.txt to /configs/testRepFactor1LeaderStartup/lang/stopwords_eu.txt
   [junit4]   2> 1842685 INFO  (OverseerThreadFactory-7545-thread-3-processing-n:127.0.0.1:57038_solr) [n:127.0.0.1:57038_solr    ] o.a.s.c.c.ZkConfigManager Copying zk node /configs/_default/lang/stopwords_it.txt to /configs/testRepFactor1LeaderStartup/lang/stopwords_it.txt
   [junit4]   2> 1842688 INFO  (OverseerThreadFactory-7545-thread-3-processing-n:127.0.0.1:57038_solr) [n:127.0.0.1:57038_solr    ] o.a.s.c.c.ZkConfigManager Copying zk node /configs/_default/lang/stopwords_cz.txt to /configs/testRepFactor1LeaderStartup/lang/stopwords_cz.txt
   [junit4]   2> 1842690 INFO  (OverseerThreadFactory-7545-thread-3-processing-n:127.0.0.1:57038_solr) [n:127.0.0.1:57038_solr    ] o.a.s.c.c.ZkConfigManager Copying zk node /configs/_default/lang/stoptags_ja.txt to /configs/testRepFactor1LeaderStartup/lang/stoptags_ja.txt
   [junit4]   2> 1842692 INFO  (OverseerThreadFactory-7545-thread-3-processing-n:127.0.0.1:57038_solr) [n:127.0.0.1:57038_solr    ] o.a.s.c.c.ZkConfigManager Copying zk node /configs/_default/lang/contractions_fr.txt to /configs/testRepFactor1LeaderStartup/lang/contractions_fr.txt
   [junit4]   2> 1842694 INFO  (OverseerThreadFactory-7545-thread-3-processing-n:127.0.0.1:57038_solr) [n:127.0.0.1:57038_solr    ] o.a.s.c.c.ZkConfigManager Copying zk node /configs/_default/lang/stopwords_de.txt to /configs/testRepFactor1LeaderStartup/lang/stopwords_de.txt
   [junit4]   2> 1842697 INFO  (OverseerThreadFactory-7545-thread-3-processing-n:127.0.0.1:57038_solr) [n:127.0.0.1:57038_solr    ] o.a.s.c.c.ZkConfigManager Copying zk node /configs/_default/lang/stopwords_fa.txt to /configs/testRepFactor1LeaderStartup/lang/stopwords_fa.txt
   [junit4]   2> 1842699 INFO  (OverseerThreadFactory-7545-thread-3-processing-n:127.0.0.1:57038_solr) [n:127.0.0.1:57038_solr    ] o.a.s.c.c.ZkConfigManager Copying zk node /configs/_default/lang/contractions_ga.txt to /configs/testRepFactor1LeaderStartup/lang/contractions_ga.txt
   [junit4]   2> 1842701 INFO  (OverseerThreadFactory-7545-thread-3-processing-n:127.0.0.1:57038_solr) [n:127.0.0.1:57038_solr    ] o.a.s.c.c.ZkConfigManager Copying zk node /configs/_default/lang/stopwords_ca.txt to /configs/testRepFactor1LeaderStartup/lang/stopwords_ca.txt
   [junit4]   2> 1842703 INFO  (OverseerThreadFactory-7545-thread-3-processing-n:127.0.0.1:57038_solr) [n:127.0.0.1:57038_solr    ] o.a.s.c.c.ZkConfigManager Copying zk node /configs/_default/lang/stopwords_nl.txt to /configs/testRepFactor1LeaderStartup/lang/stopwords_nl.txt
   [junit4]   2> 1842705 INFO  (OverseerThreadFactory-7545-thread-3-processing-n:127.0.0.1:57038_solr) [n:127.0.0.1:57038_solr    ] o.a.s.c.c.ZkConfigManager Copying zk node /configs/_default/lang/stopwords_bg.txt to /configs/testRepFactor1LeaderStartup/lang/stopwords_bg.txt
   [junit4]   2> 1842710 INFO  (OverseerThreadFactory-7545-thread-3-processing-n:127.0.0.1:57038_solr) [n:127.0.0.1:57038_solr    ] o.a.s.c.c.ZkConfigManager Copying zk node /configs/_default/lang/stopwords_en.txt to /configs/testRepFactor1LeaderStartup/lang/stopwords_en.txt
   [junit4]   2> 1842712 INFO  (OverseerThreadFactory-7545-thread-3-processing-n:127.0.0.1:57038_solr) [n:127.0.0.1:57038_solr    ] o.a.s.c.c.ZkConfigManager Copying zk node /configs/_default/lang/stopwords_es.txt to /configs/testRepFactor1LeaderStartup/lang/stopwords_es.txt
   [junit4]   2> 1842715 INFO  (OverseerThreadFactory-7545-thread-3-processing-n:127.0.0.1:57038_solr) [n:127.0.0.1:57038_solr    ] o.a.s.c.c.ZkConfigManager Copying zk node /configs/_default/lang/stopwords_lv.txt to /configs/testRepFactor1LeaderStartup/lang/stopwords_lv.txt
   [junit4]   2> 1842717 INFO  (OverseerThreadFactory-7545-thread-3-processing-n:127.0.0.1:57038_solr) [n:127.0.0.1:57038_solr    ] o.a.s.c.c.ZkConfigManager Copying zk node /configs/_default/lang/stopwords_ro.txt to /configs/testRepFactor1LeaderStartup/lang/stopwords_ro.txt
   [junit4]   2> 1842719 INFO  (OverseerThreadFactory-7545-thread-3-processing-n:127.0.0.1:57038_solr) [n:127.0.0.1:57038_solr    ] o.a.s.c.c.ZkConfigManager Copying zk node /configs/_default/lang/stopwords_th.txt to /configs/testRepFactor1LeaderStartup/lang/stopwords_th.txt
   [junit4]   2> 1842721 INFO  (OverseerThreadFactory-7545-thread-3-processing-n:127.0.0.1:57038_solr) [n:127.0.0.1:57038_solr    ] o.a.s.c.c.ZkConfigManager Copying zk node /configs/_default/lang/stopwords_fr.txt to /configs/testRepFactor1LeaderStartup/lang/stopwords_fr.txt
   [junit4]   2> 1842723 INFO  (OverseerThreadFactory-7545-thread-3-processing-n:127.0.0.1:57038_solr) [n:127.0.0.1:57038_solr    ] o.a.s.c.c.ZkConfigManager Copying zk node /configs/_default/lang/stopwords_sv.txt to /configs/testRepFactor1LeaderStartup/lang/stopwords_sv.txt
   [junit4]   2> 1842725 INFO  (OverseerThreadFactory-7545-thread-3-processing-n:127.0.0.1:57038_solr) [n:127.0.0.1:57038_solr    ] o.a.s.c.c.ZkConfigManager Copying zk node /configs/_default/lang/stopwords_fi.txt to /configs/testRepFactor1LeaderStartup/lang/stopwords_fi.txt
   [junit4]   2> 1842727 INFO  (OverseerThreadFactory-7545-thread-3-processing-n:127.0.0.1:57038_solr) [n:127.0.0.1:57038_solr    ] o.a.s.c.c.ZkConfigManager Copying zk node /configs/_default/lang/hyphenations_ga.txt to /configs/testRepFactor1LeaderStartup/lang/hyphenations_ga.txt
   [junit4]   2> 1842729 INFO  (OverseerThreadFactory-7545-thread-3-processing-n:127.0.0.1:57038_solr) [n:127.0.0.1:57038_solr    ] o.a.s.c.c.ZkConfigManager Copying zk node /configs/_default/lang/stopwords_gl.txt to /configs/testRepFactor1LeaderStartup/lang/stopwords_gl.txt
   [junit4]   2> 1842731 INFO  (OverseerThreadFactory-7545-thread-3-processing-n:127.0.0.1:57038_solr) [n:127.0.0.1:57038_solr    ] o.a.s.c.c.ZkConfigManager Copying zk node /configs/_default/params.json to /configs/testRepFactor1LeaderStartup/params.json
   [junit4]   2> 1842842 INFO  (OverseerStateUpdate-98828898200256515-127.0.0.1:57038_solr-n_0000000000) [n:127.0.0.1:57038_solr    ] o.a.s.c.o.SliceMutator createReplica() {
   [junit4]   2>   "operation":"ADDREPLICA",
   [junit4]   2>   "collection":"testRepFactor1LeaderStartup",
   [junit4]   2>   "shard":"shard1",
   [junit4]   2>   "core":"testRepFactor1LeaderStartup_shard1_replica_n1",
   [junit4]   2>   "state":"down",
   [junit4]   2>   "base_url":"http://127.0.0.1:57038/solr",
   [junit4]   2>   "type":"NRT"} 
   [junit4]   2> 1843045 INFO  (qtp11726034-18484) [n:127.0.0.1:57038_solr    ] o.a.s.h.a.CoreAdminOperation core create command qt=/admin/cores&coreNodeName=core_node2&collection.configName=testRepFactor1LeaderStartup&newCollection=true&name=testRepFactor1LeaderStartup_shard1_replica_n1&action=CREATE&numShards=1&collection=testRepFactor1LeaderStartup&shard=shard1&wt=javabin&version=2&replicaType=NRT
   [junit4]   2> 1843047 INFO  (qtp11726034-18484) [n:127.0.0.1:57038_solr    ] o.a.s.c.TransientSolrCoreCacheDefault Allocating transient cache for 2147483647 transient cores
   [junit4]   2> 1843162 INFO  (zkCallback-2952-thread-1-processing-n:127.0.0.1:57038_solr) [n:127.0.0.1:57038_solr    ] o.a.s.c.c.ZkStateReader A cluster state change: [WatchedEvent state:SyncConnected type:NodeDataChanged path:/collections/testRepFactor1LeaderStartup/state.json] for collection [testRepFactor1LeaderStartup] has occurred - updating... (live nodes size: [1])
   [junit4]   2> 1843163 INFO  (zkCallback-2952-thread-2-processing-n:127.0.0.1:57038_solr) [n:127.0.0.1:57038_solr    ] o.a.s.c.c.ZkStateReader A cluster state change: [WatchedEvent state:SyncConnected type:NodeDataChanged path:/collections/testRepFactor1LeaderStartup/state.json] for collection [testRepFactor1LeaderStartup] has occurred - updating... (live nodes size: [1])
   [junit4]   2> 1844084 INFO  (qtp11726034-18484) [n:127.0.0.1:57038_solr c:testRepFactor1LeaderStartup s:shard1 r:core_node2 x:testRepFactor1LeaderStartup_shard1_replica_n1] o.a.s.c.RequestParams conf resource params.json loaded . version : 0 
   [junit4]   2> 1844084 INFO  (qtp11726034-18484) [n:127.0.0.1:57038_solr c:testRepFactor1LeaderStartup s:shard1 r:core_node2 x:testRepFactor1LeaderStartup_shard1_replica_n1] o.a.s.c.RequestParams request params refreshed to version 0
   [junit4]   2> 1844087 WARN  (qtp11726034-18484) [n:127.0.0.1:57038_solr c:testRepFactor1LeaderStartup s:shard1 r:core_node2 x:testRepFactor1LeaderStartup_shard1_replica_n1] o.a.s.c.SolrConfig Couldn't add files from C:\Users\jenkins\workspace\Lucene-Solr-7.x-Windows\solr\build\solr-core\test\J0\temp\solr.cloud.TestCloudSearcherWarming_225115A8932EDC87-001\tempDir-001\node1\testRepFactor1LeaderStartup_shard1_replica_n1\..\..\..\..\contrib\extraction\lib filtered by .*\.jar to classpath: C:\Users\jenkins\workspace\Lucene-Solr-7.x-Windows\solr\build\solr-core\test\J0\temp\solr.cloud.TestCloudSearcherWarming_225115A8932EDC87-001\tempDir-001\node1\testRepFactor1LeaderStartup_shard1_replica_n1\..\..\..\..\contrib\extraction\lib
   [junit4]   2> 1844088 WARN  (qtp11726034-18484) [n:127.0.0.1:57038_solr c:testRepFactor1LeaderStartup s:shard1 r:core_node2 x:testRepFactor1LeaderStartup_shard1_replica_n1] o.a.s.c.SolrConfig Couldn't add files from C:\Users\jenkins\workspace\Lucene-Solr-7.x-Windows\solr\build\solr-core\test\J0\temp\solr.cloud.TestCloudSearcherWarming_225115A8932EDC87-001\tempDir-001\node1\testRepFactor1LeaderStartup_shard1_replica_n1\..\..\..\..\dist filtered by solr-cell-\d.*\.jar to classpath: C:\Users\jenkins\workspace\Lucene-Solr-7.x-Windows\solr\build\solr-core\test\J0\temp\solr.cloud.TestCloudSearcherWarming_225115A8932EDC87-001\tempDir-001\node1\testRepFactor1LeaderStartup_shard1_replica_n1\..\..\..\..\dist
   [junit4]   2> 1844090 WARN  (qtp11726034-18484) [n:127.0.0.1:57038_solr c:testRepFactor1LeaderStartup s:shard1 r:core_node2 x:testRepFactor1LeaderStartup_shard1_replica_n1] o.a.s.c.SolrConfig Couldn't add files from C:\Users\jenkins\workspace\Lucene-Solr-7.x-Windows\solr\build\solr-core\test\J0\temp\solr.cloud.TestCloudSearcherWarming_225115A8932EDC87-001\tempDir-001\node1\testRepFactor1LeaderStartup_shard1_replica_n1\..\..\..\..\contrib\clustering\lib filtered by .*\.jar to classpath: C:\Users\jenkins\workspace\Lucene-Solr-7.x-Windows\solr\build\solr-core\test\J0\temp\solr.cloud.TestCloudSearcherWarming_225115A8932EDC87-001\tempDir-001\node1\testRepFactor1LeaderStartup_shard1_replica_n1\..\..\..\..\contrib\clustering\lib
   [junit4]   2> 1844090 WARN  (qtp11726034-18484) [n:127.0.0.1:57038_solr c:testRepFactor1LeaderStartup s:shard1 r:core_node2 x:testRepFactor1LeaderStartup_shard1_replica_n1] o.a.s.c.SolrConfig Couldn't add files from C:\Users\jenkins\workspace\Lucene-Solr-7.x-Windows\solr\build\solr-core\test\J0\temp\solr.cloud.TestCloudSearcherWarming_225115A8932EDC87-001\tempDir-001\node1\testRepFactor1LeaderStartup_shard1_replica_n1\..\..\..\..\dist filtered by solr-clustering-\d.*\.jar to classpath: C:\Users\jenkins\workspace\Lucene-Solr-7.x-Windows\solr\build\solr-core\test\J0\temp\solr.cloud.TestCloudSearcherWarming_225115A8932EDC87-001\tempDir-001\node1\testRepFactor1LeaderStartup_shard1_replica_n1\..\..\..\..\dist
   [junit4]   2> 1844092 WARN  (qtp11726034-18484) [n:127.0.0.1:57038_solr c:testRepFactor1LeaderStartup s:shard1 r:core_node2 x:testRepFactor1LeaderStartup_shard1_replica_n1] o.a.s.c.SolrConfig Couldn't add files from C:\Users\jenkins\workspace\Lucene-Solr-7.x-Windows\solr\build\solr-core\test\J0\temp\solr.cloud.TestCloudSearcherWarming_225115A8932EDC87-001\tempDir-001\node1\testRepFactor1LeaderStartup_shard1_replica_n1\..\..\..\..\contrib\langid\lib filtered by .*\.jar to classpath: C:\Users\jenkins\workspace\Lucene-Solr-7.x-Windows\solr\build\solr-core\test\J0\temp\solr.cloud.TestCloudSearcherWarming_225115A8932EDC87-001\tempDir-001\node1\testRepFactor1LeaderStartup_shard1_replica_n1\..\..\..\..\contrib\langid\lib
   [junit4]   2> 1844093 WARN  (qtp11726034-18484) [n:127.0.0.1:57038_solr c:testRepFactor1LeaderStartup s:shard1 r:core_node2 x:testRepFactor1LeaderStartup_shard1_replica_n1] o.a.s.c.SolrConfig Couldn't add files from C:\Users\jenkins\workspace\Lucene-Solr-7.x-Windows\solr\build\solr-core\test\J0\temp\solr.cloud.TestCloudSearcherWarming_225115A8932EDC87-001\tempDir-001\node1\testRepFactor1LeaderStartup_shard1_replica_n1\..\..\..\..\dist filtered by solr-langid-\d.*\.jar to classpath: C:\Users\jenkins\workspace\Lucene-Solr-7.x-Windows\solr\build\solr-core\test\J0\temp\solr.cloud.TestCloudSearcherWarming_225115A8932EDC87-001\tempDir-001\node1\testRepFactor1LeaderStartup_shard1_replica_n1\..\..\..\..\dist
   [junit4]   2> 1844094 WARN  (qtp11726034-18484) [n:127.0.0.1:57038_solr c:testRepFactor1LeaderStartup s:shard1 r:core_node2 x:testRepFactor1LeaderStartup_shard1_replica_n1] o.a.s.c.SolrConfig Couldn't add files from C:\Users\jenkins\workspace\Lucene-Solr-7.x-Windows\solr\build\solr-core\test\J0\temp\solr.cloud.TestCloudSearcherWarming_225115A8932EDC87-001\tempDir-001\node1\testRepFactor1LeaderStartup_shard1_replica_n1\..\..\..\..\contrib\velocity\lib filtered by .*\.jar to classpath: C:\Users\jenkins\workspace\Lucene-Solr-7.x-Windows\solr\build\solr-core\test\J0\temp\solr.cloud.TestCloudSearcherWarming_225115A8932EDC87-001\tempDir-001\node1\testRepFactor1LeaderStartup_shard1_replica_n1\..\..\..\..\contrib\velocity\lib
   [junit4]   2> 1844095 WARN  (qtp11726034-18484) [n:127.0.0.1:57038_solr c:testRepFactor1LeaderStartup s:shard1 r:core_node2 x:testRepFactor1LeaderStartup_shard1_replica_n1] o.a.s.c.SolrConfig Couldn't add files from C:\Users\jenkins\workspace\Lucene-Solr-7.x-Windows\solr\build\solr-core\test\J0\temp\solr.cloud.TestCloudSearcherWarming_225115A8932EDC87-001\tempDir-001\node1\testRepFactor1LeaderStartup_shard1_replica_n1\..\..\..\..\dist filtered by solr-velocity-\d.*\.jar to classpath: C:\Users\jenkins\workspace\Lucene-Solr-7.x-Windows\solr\build\solr-core\test\J0\temp\solr.cloud.TestCloudSearcherWarming_225115A8932EDC87-001\tempDir-001\node1\testRepFactor1LeaderStartup_shard1_replica_n1\..\..\..\..\dist
   [junit4]   2> 1844104 INFO  (qtp11726034-18484) [n:127.0.0.1:57038_solr c:testRepFactor1LeaderStartup s:shard1 r:core_node2 x:testRepFactor1LeaderStartup_shard1_replica_n1] o.a.s.c.SolrConfig Using Lucene MatchVersion: 7.2.0
   [junit4]   2> 1844131 INFO  (qtp11726034-18484) [n:127.0.0.1:57038_solr c:testRepFactor1LeaderStartup s:shard1 r:core_node2 x:testRepFactor1LeaderStartup_shard1_replica_n1] o.a.s.s.IndexSchema [testRepFactor1LeaderStartup_shard1_replica_n1] Schema name=default-config
   [junit4]   2> 1844300 INFO  (qtp11726034-18484) [n:127.0.0.1:57038_solr c:testRepFactor1LeaderStartup s:shard1 r:core_node2 x:testRepFactor1LeaderStartup_shard1_replica_n1] o.a.s.s.IndexSchema Loaded schema default-config/1.6 with uniqueid field id
   [junit4]   2> 1844348 INFO  (qtp11726034-18484) [n:127.0.0.1:57038_solr c:testRepFactor1LeaderStartup s:shard1 r:core_node2 x:testRepFactor1LeaderStartup_shard1_replica_n1] o.a.s.c.CoreContainer Creating SolrCore 'testRepFactor1LeaderStartup_shard1_replica_n1' using configuration from collection testRepFactor1LeaderStartup, trusted=true
   [junit4]   2> 1844356 INFO  (qtp11726034-18484) [n:127.0.0.1:57038_solr c:testRepFactor1LeaderStartup s:shard1 r:core_node2 x:testRepFactor1LeaderStartup_shard1_replica_n1] o.a.s.m.r.SolrJmxReporter JMX monitoring for 'solr_57038.solr.core.testRepFactor1LeaderStartup.shard1.replica_n1' (registry 'solr.core.testRepFactor1LeaderStartup.shard1.replica_n1') enabled at server: com.sun.jmx.mbeanserver.JmxMBeanServer@156d5f6
   [junit4]   2> 1844356 INFO  (qtp11726034-18484) [n:127.0.0.1:57038_solr c:testRepFactor1LeaderStartup s:shard1 r:core_node2 x:testRepFactor1LeaderStartup_shard1_replica_n1] o.a.s.c.SolrCore solr.RecoveryStrategy.Builder
   [junit4]   2> 1844356 INFO  (qtp11726034-18484) [n:127.0.0.1:57038_solr c:testRepFactor1LeaderStartup s:shard1 r:core_node2 x:testRepFactor1LeaderStartup_shard1_replica_n1] o.a.s.c.SolrCore [[testRepFactor1LeaderStartup_shard1_replica_n1] ] Opening new SolrCore at [C:\Users\jenkins\workspace\Lucene-Solr-7.x-Windows\solr\build\solr-core\test\J0\temp\solr.cloud.TestCloudSearcherWarming_225115A8932EDC87-001\tempDir-001\node1\testRepFactor1LeaderStartup_shard1_replica_n1], dataDir=[C:\Users\jenkins\workspace\Lucene-Solr-7.x-Windows\solr\build\solr-core\test\J0\temp\solr.cloud.TestCloudSearcherWarming_225115A8932EDC87-001\tempDir-001\node1\.\testRepFactor1LeaderStartup_shard1_replica_n1\data\]
   [junit4]   2> 1844375 INFO  (qtp11726034-18484) [n:127.0.0.1:57038_solr c:testRepFactor1LeaderStartup s:shard1 r:core_node2 x:testRepFactor1LeaderStartup_shard1_replica_n1] o.a.s.r.XSLTResponseWriter xsltCacheLifetimeSeconds=5
   [junit4]   2> 1844463 INFO  (qtp11726034-18484) [n:127.0.0.1:57038_solr c:testRepFactor1LeaderStartup s:shard1 r:core_node2 x:testRepFactor1LeaderStartup_shard1_replica_n1] o.a.s.u.UpdateHandler Using UpdateLog implementation: org.apache.solr.update.UpdateLog
   [junit4]   2> 1844463 INFO  (qtp11726034-18484) [n:127.0.0.1:57038_solr c:testRepFactor1LeaderStartup s:shard1 r:core_node2 x:testRepFactor1LeaderStartup_shard1_replica_n1] o.a.s.u.UpdateLog Initializing UpdateLog: dataDir= defaultSyncLevel=FLUSH numRecordsToKeep=100 maxNumLogsToKeep=10 numVersionBuckets=65536
   [junit4]   2> 1844465 INFO  (qtp11726034-18484) [n:127.0.0.1:57038_solr c:testRepFactor1LeaderStartup s:shard1 r:core_node2 x:testRepFactor1LeaderStartup_shard1_replica_n1] o.a.s.u.CommitTracker Hard AutoCommit: if uncommited for 15000ms; 
   [junit4]   2> 1844466 INFO  (qtp11726034-18484) [n:127.0.0.1:57038_solr c:testRepFactor1LeaderStartup s:shard1 r:core_node2 x:testRepFactor1LeaderStartup_shard1_replica_n1] o.a.s.u.CommitTracker Soft AutoCommit: disabled
   [junit4]   2> 1844468 INFO  (qtp11726034-18484) [n:127.0.0.1:57038_solr c:testRepFactor1LeaderStartup s:shard1 r:core_node2 x:testRepFactor1LeaderStartup_shard1_replica_n1] o.a.s.s.SolrIndexSearcher Opening [Searcher@3a23ce[testRepFactor1LeaderStartup_shard1_replica_n1] main]
   [junit4]   2> 1844470 INFO  (qtp11726034-18484) [n:127.0.0.1:57038_solr c:testRepFactor1LeaderStartup s:shard1 r:core_node2 x:testRepFactor1LeaderStartup_shard1_replica_n1] o.a.s.r.ManagedResourceStorage Configured ZooKeeperStorageIO with znodeBase: /configs/testRepFactor1LeaderStartup
   [junit4]   2> 1844470 INFO  (qtp11726034-18484) [n:127.0.0.1:57038_solr c:testRepFactor1LeaderStartup s:shard1 r:core_node2 x:testRepFactor1LeaderStartup_shard1_replica_n1] o.a.s.r.ManagedResourceStorage Loaded null at path _rest_managed.json using ZooKeeperStorageIO:path=/configs/testRepFactor1LeaderStartup
   [junit4]   2> 1844470 INFO  (qtp11726034-18484) [n:127.0.0.1:57038_solr c:testRepFactor1LeaderStartup s:shard1 r:core_node2 x:testRepFactor1LeaderStartup_shard1_replica_n1] o.a.s.s.ZkIndexSchemaReader Creating ZooKeeper watch for the managed schema at /configs/testRepFactor1LeaderStartup/managed-schema
   [junit4]   2> 1844471 INFO  (qtp11726034-18484) [n:127.0.0.1:57038_solr c:testRepFactor1LeaderStartup s:shard1 r:core_node2 x:testRepFactor1LeaderStartup_shard1_replica_n1] o.a.s.s.ZkIndexSchemaReader Current schema version 0 is already the latest
   [junit4]   2> 1844472 INFO  (qtp11726034-18484) [n:127.0.0.1:57038_solr c:testRepFactor1LeaderStartup s:shard1 r:core_node2 x:testRepFactor1LeaderStartup_shard1_replica_n1] o.a.s.h.c.SpellCheckComponent Initializing spell checkers
   [junit4]   2> 1844472 INFO  (qtp11726034-18484) [n:127.0.0.1:57038_solr c:testRepFactor1LeaderStartup s:shard1 r:core_node2 x:testRepFactor1LeaderStartup_shard1_replica_n1] o.a.s.s.DirectSolrSpellChecker init: {name=default,field=_text_,classname=solr.DirectSolrSpellChecker,distanceMeasure=internal,accuracy=0.5,maxEdits=2,minPrefix=1,maxInspections=5,minQueryLength=4,maxQueryFrequency=0.01}
   [junit4]   2> 1844474 INFO  (qtp11726034-18484) [n:127.0.0.1:57038_solr c:testRepFactor1LeaderStartup s:shard1 r:core_node2 x:testRepFactor1LeaderStartup_shard1_replica_n1] o.a.s.h.ReplicationHandler Commits will be reserved for 10000ms.
   [junit4]   2> 1844474 INFO  (searcherExecutor-7548-thread-1-processing-n:127.0.0.1:57038_solr x:testRepFactor1LeaderStartup_shard1_replica_n1 s:shard1 c:testRepFactor1LeaderStartup r:core_node2) [n:127.0.0.1:57038_solr c:testRepFactor1LeaderStartup s:shard1 r:core_node2 x:testRepFactor1LeaderStartup_shard1_replica_n1] o.a.s.c.QuerySenderListener QuerySenderListener sending requests to Searcher@3a23ce[testRepFactor1LeaderStartup_shard1_replica_n1] main{ExitableDirectoryReader(UninvertingDirectoryReader())}
   [junit4]   2> 1844474 INFO  (searcherExecutor-7548-thread-1-processing-n:127.0.0.1:57038_solr x:testRepFactor1LeaderStartup_shard1_replica_n1 s:shard1 c:testRepFactor1LeaderStartup r:core_node2) [n:127.0.0.1:57038_solr c:testRepFactor1LeaderStartup s:shard1 r:core_node2 x:testRepFactor1LeaderStartup_shard1_replica_n1] o.a.s.c.QuerySenderListener QuerySenderListener done.
   [junit4]   2> 1844474 INFO  (searcherExecutor-7548-thread-1-processing-n:127.0.0.1:57038_solr x:testRepFactor1LeaderStartup_shard1_replica_n1 s:shard1 c:testRepFactor1LeaderStartup r:core_node2) [n:127.0.0.1:57038_solr c:testRepFactor1LeaderStartup s:shard1 r:core_node2 x:testRepFactor1LeaderStartup_shard1_replica_n1] o.a.s.h.c.SpellCheckComponent Loading spell index for spellchecker: default
   [junit4]   2> 1844474 INFO  (qtp11726034-18484) [n:127.0.0.1:57038_solr c:testRepFactor1LeaderStartup s:shard1 r:core_node2 x:testRepFactor1LeaderStartup_shard1_replica_n1] o.a.s.u.UpdateLog Could not find max version in index or recent updates, using new clock 1581262373804572672
   [junit4]   2> 1844475 INFO  (searcherExecutor-7548-thread-1-processing-n:127.0.0.1:57038_solr x:testRepFactor1LeaderStartup_shard1_replica_n1 s:shard1 c:testRepFactor1LeaderStartup r:core_node2) [n:127.0.0.1:57038_solr c:testRepFactor1LeaderStartup s:shard1 r:core_node2 x:testRepFactor1LeaderStartup_shard1_replica_n1] o.a.s.c.SolrCore [testRepFactor1LeaderStartup_shard1_replica_n1] Registered new searcher Searcher@3a23ce[testRepFactor1LeaderStartup_shard1_replica_n1] main{ExitableDirectoryReader(UninvertingDirectoryReader())}
   [junit4]   2> 1844480 INFO  (qtp11726034-18484) [n:127.0.0.1:57038_solr c:testRepFactor1LeaderStartup s:shard1 r:core_node2 x:testRepFactor1LeaderStartup_shard1_replica_n1] o.a.s.c.ShardLeaderElectionContext Enough replicas found to continue.
   [junit4]   2> 1844480 INFO  (qtp11726034-18484) [n:127.0.0.1:57038_solr c:testRepFactor1LeaderStartup s:shard1 r:core_node2 x:testRepFactor1LeaderStartup_shard1_replica_n1] o.a.s.c.ShardLeaderElectionContext I may be the new leader - try and sync
   [junit4]   2> 1844480 INFO  (qtp11726034-18484) [n:127.0.0.1:57038_solr c:testRepFactor1LeaderStartup s:shard1 r:core_node2 x:testRepFactor1LeaderStartup_shard1_replica_n1] o.a.s.c.SyncStrategy Sync replicas to http://127.0.0.1:57038/solr/testRepFactor1LeaderStartup_shard1_replica_n1/
   [junit4]   2> 1844480 INFO  (qtp11726034-18484) [n:127.0.0.1:57038_solr c:testRepFactor1LeaderStartup s:shard1 r:core_node2 x:testRepFactor1LeaderStartup_shard1_replica_n1] o.a.s.c.SyncStrategy Sync Success - now sync replicas to me
   [junit4]   2> 1844480 INFO  (qtp11726034-18484) [n:127.0.0.1:57038_solr c:testRepFactor1LeaderStartup s:shard1 r:core_node2 x:testRepFactor1LeaderStartup_shard1_replica_n1] o.a.s.c.SyncStrategy http://127.0.0.1:57038/solr/testRepFactor1LeaderStartup_shard1_replica_n1/ has no replicas
   [junit4]   2> 1844480 INFO  (qtp11726034-18484) [n:127.0.0.1:57038_solr c:testRepFactor1LeaderStartup s:shard1 r:core_node2 x:testRepFactor1LeaderStartup_shard1_replica_n1] o.a.s.c.ShardLeaderElectionContext Found all replicas participating in election, clear LIR
   [junit4]   2> 1844485 INFO  (qtp11726034-18484) [n:127.0.0.1:57038_solr c:testRepFactor1LeaderStartup s:shard1 r:core_node2 x:testRepFactor1LeaderStartup_shard1_replica_n1] o.a.s.c.ShardLeaderElectionContext I am the new leader: http://127.0.0.1:57038/solr/testRepFactor1LeaderStartup_shard1_replica_n1/ shard1
   [junit4]   2> 1844590 INFO  (zkCallback-2952-thread-1-processing-n:127.0.0.1:57038_solr) [n:127.0.0.1:57038_solr    ] o.a.s.c.c.ZkStateReader A cluster state change: [WatchedEvent state:SyncConnected type:NodeDataChanged path:/collections/testRepFactor1LeaderStartup/state.json] for collection [testRepFactor1LeaderStartup] has occurred - updating... (live nodes size: [1])
   [junit4]   2> 1844590 INFO  (zkCallback-2952-thread-2-processing-n:127.0.0.1:57038_solr) [n:127.0.0.1:57038_solr    ] o.a.s.c.c.ZkStateReader A cluster state change: [WatchedEvent state:SyncConnected type:NodeDataChanged path:/collections/testRepFactor1LeaderStartup/state.json] for collection [testRepFactor1LeaderStartup] has occurred - updating... (live nodes size: [1])
   [junit4]   2> 1844638 INFO  (qtp11726034-18484) [n:127.0.0.1:57038_solr c:testRepFactor1LeaderStartup s:shard1 r:core_node2 x:testRepFactor1LeaderStartup_shard1_replica_n1] o.a.s.c.ZkController I am the leader, no recovery necessary
   [junit4]   2> 1844640 INFO  (qtp11726034-18484) [n:127.0.0.1:57038_solr c:testRepFactor1LeaderStartup s:shard1 r:core_node2 x:testRepFactor1LeaderStartup_shard1_replica_n1] o.a.s.s.HttpSolrCall [admin] webapp=null path=/admin/cores params={qt=/admin/cores&coreNodeName=core_node2&collection.configName=testRepFactor1LeaderStartup&newCollection=true&name=testRepFactor1LeaderStartup_shard1_replica_n1&action=CREATE&numShards=1&collection=testRepFactor1LeaderStartup&shard=shard1&wt=javabin&version=2&replicaType=NRT} status=0 QTime=1594
   [junit4]   2> 1844644 INFO  (qtp11726034-18482) [n:127.0.0.1:57038_solr    ] o.a.s.h.a.CollectionsHandler Wait for new collection to be active for at most 30 seconds. Check all shard replicas
   [junit4]   2> 1844747 INFO  (zkCallback-2952-thread-1-processing-n:127.0.0.1:57038_solr) [n:127.0.0.1:57038_solr    ] o.a.s.c.c.ZkStateReader A cluster state change: [WatchedEvent state:SyncConnected type:NodeDataChanged path:/collections/testRepFactor1LeaderStartup/state.json] for collection [testRepFactor1LeaderStartup] has occurred - updating... (live nodes size: [1])
   [junit4]   2> 1844747 INFO  (zkCallback-2952-thread-2-processing-n:127.0.0.1:57038_solr) [n:127.0.0.1:57038_solr    ] o.a.s.c.c.ZkStateReader A cluster state change: [WatchedEvent state:SyncConnected type:NodeDataChanged path:/collections/testRepFactor1LeaderStartup/state.json] for collection [testRepFactor1LeaderStartup] has occurred - updating... (live nodes size: [1])
   [junit4]   2> 1845645 INFO  (qtp11726034-18482) [n:127.0.0.1:57038_solr    ] o.a.s.s.HttpSolrCall [admin] webapp=null path=/admin/collections params={pullReplicas=0&replicationFactor=1&name=testRepFactor1LeaderStartup&nrtReplicas=1&action=CREATE&numShards=1&tlogReplicas=0&createNodeSet=127.0.0.1:57038_solr&wt=javabin&version=2} status=0 QTime=3026
   [junit4]   2> java.lang.RuntimeException
   [junit4]   2> 	at org.apache.solr.cloud.TestCloudSearcherWarming$SleepingSolrEventListener.init(TestCloudSearcherWarming.java:306)
   [junit4]   2> 	at org.apache.solr.core.SolrCore.createInitInstance(SolrCore.java:827)
   [junit4]   2> 	at org.apache.solr.handler.SolrConfigHandler$Command.verifyClass(SolrConfigHandler.java:562)
   [junit4]   2> 	at org.apache.solr.handler.SolrConfigHandler$Command.updateNamedPlugin(SolrConfigHandler.java:533)
   [junit4]   2> 	at org.apache.solr.handler.SolrConfigHandler$Command.handleCommands(SolrConfigHandler.java:482)
   [junit4]   2> 	at org.apache.solr.handler.SolrConfigHandler$Command.handlePOST(SolrConfigHandler.java:346)
   [junit4]   2> 	at org.apache.solr.handler.SolrConfigHandler$Command.access$100(SolrConfigHandler.java:159)
   [junit4]   2> 	at org.apache.solr.handler.SolrConfigHandler.handleRequestBody(SolrConfigHandler.java:137)
   [junit4]   2> 	at org.apache.solr.handler.RequestHandlerBase.handleRequest(RequestHandlerBase.java:177)
   [junit4]   2> 	at org.apache.solr.core.SolrCore.execute(SolrCore.java:2484)
   [junit4]   2> 	at org.apache.solr.servlet.HttpSolrCall.execute(HttpSolrCall.java:720)
   [junit4]   2> 	at org.apache.solr.servlet.HttpSolrCall.call(HttpSolrCall.java:526)
   [junit4]   2> 	at org.apache.solr.servlet.SolrDispatchFilter.doFilter(SolrDispatchFilter.java:382)
   [junit4]   2> 	at org.apache.solr.servlet.SolrDispatchFilter.doFilter(SolrDispatchFilter.java:326)
   [junit4]   2> 	at org.eclipse.jetty.servlet.ServletHandler$CachedChain.doFilter(ServletHandler.java:1759)
   [junit4]   2> 	at org.apache.solr.client.solrj.embedded.JettySolrRunner$DebugFilter.doFilter(JettySolrRunner.java:139)
   [junit4]   2> 	at org.eclipse.jetty.servlet.ServletHandler$CachedChain.doFilter(ServletHandler.java:1759)
   [junit4]   2> 	at org.eclipse.jetty.servlet.ServletHandler.doHandle(ServletHandler.java:582)
   [junit4]   2> 	at org.eclipse.jetty.server.session.SessionHandler.doHandle(SessionHandler.java:224)
   [junit4]   2> 	at org.eclipse.jetty.server.handler.ContextHandler.doHandle(ContextHandler.java:1180)
   [junit4]   2> 	at org.eclipse.jetty.servlet.ServletHandler.doScope(ServletHandler.java:512)
   [junit4]   2> 	at org.eclipse.jetty.server.session.SessionHandler.doScope(SessionHandler.java:185)
   [junit4]   2> 	at org.eclipse.jetty.server.handler.ContextHandler.doScope(ContextHandler.java:1112)
   [junit4]   2> 	at org.eclipse.jetty.server.handler.ScopedHandler.handle(ScopedHandler.java:141)
   [junit4]   2> 	at org.eclipse.jetty.server.handler.gzip.GzipHandler.handle(GzipHandler.java:426)
   [junit4]   2> 	at org.eclipse.jetty.server.handler.HandlerWrapper.handle(HandlerWrapper.java:134)
   [junit4]   2> 	at org.eclipse.jetty.server.Server.handle(Server.java:534)
   [junit4]   2> 	at org.eclipse.jetty.server.HttpChannel.handle(HttpChannel.java:320)
   [junit4]   2> 	at org.eclipse.jetty.server.HttpConnection.onFillable(HttpConnection.java:251)
   [junit4]   2> 	at org.eclipse.jetty.io.AbstractConnection$ReadCallback.succeeded(AbstractConnection.java:283)
   [junit4]   2> 	at org.eclipse.jetty.io.FillInterest.fillable(FillInterest.java:108)
   [junit4]   2> 	at org.eclipse.jetty.io.SelectChannelEndPoint$2.run(SelectChannelEndPoint.java:93)
   [junit4]   2> 	at org.eclipse.jetty.util.thread.strategy.ExecuteProduceConsume.executeProduceConsume(ExecuteProduceConsume.java:303)
   [junit4]   2> 	at org.eclipse.jetty.util.thread.strategy.ExecuteProduceConsume.produceConsume(ExecuteProduceConsume.java:148)
   [junit4]   2> 	at org.eclipse.jetty.util.thread.strategy.ExecuteProduceConsume.run(ExecuteProduceConsume.java:136)
   [junit4]   2> 	at org.eclipse.jetty.util.thread.QueuedThreadPool.runJob(QueuedThreadPool.java:671)
   [junit4]   2> 	at org.eclipse.jetty.util.thread.QueuedThreadPool$2.run(QueuedThreadPool.java:589)
   [junit4]   2> 	at java.lang.Thread.run(Thread.java:748)
   [junit4]   1> {event=newSearcher}
   [junit4]   2> java.lang.RuntimeException
   [junit4]   2> 	at org.apache.solr.cloud.TestCloudSearcherWarming$SleepingSolrEventListener.init(TestCloudSearcherWarming.java:306)
   [junit4]   2> 	at org.apache.solr.core.SolrCore.createInitInstance(SolrCore.java:827)
   [junit4]   2> 	at org.apache.solr.handler.SolrConfigHandler$Command.verifyClass(SolrConfigHandler.java:562)
   [junit4]   2> 	at org.apache.solr.handler.SolrConfigHandler$Command.updateNamedPlugin(SolrConfigHandler.java:533)
   [junit4]   2> 	at org.apache.solr.handler.SolrConfigHandler$Command.handleCommands(SolrConfigHandler.java:482)
   [junit4]   2> 	at org.apache.solr.handler.SolrConfigHandler$Command.handlePOST(SolrConfigHandler.java:346)
   [junit4]   2> 	at org.apache.solr.handler.SolrConfigHandler$Command.access$100(SolrConfigHandler.java:159)
   [junit4]   2> 	at org.apache.solr.handler.SolrConfigHandler.handleRequestBody(SolrConfigHandler.java:137)
   [junit4]   2> 	at org.apache.solr.handler.RequestHandlerBase.handleRequest(RequestHandlerBase.java:177)
   [junit4]   2> 	at org.apache.solr.core.SolrCore.execute(SolrCore.java:2484)
   [junit4]   2> 	at org.apache.solr.servlet.HttpSolrCall.execute(HttpSolrCall.java:720)
   [junit4]   2> 	at org.apache.solr.servlet.HttpSolrCall.call(HttpSolrCall.java:526)
   [junit4]   2> 	at org.apache.solr.servlet.SolrDispatchFilter.doFilter(SolrDispatchFilter.java:382)
   [junit4]   2> 	at org.apache.solr.servlet.SolrDispatchFilter.doFilter(SolrDispatchFilter.java:326)
   [junit4]   2> 	at org.eclipse.jetty.servlet.ServletHandler$CachedChain.doFilter(ServletHandler.java:1759)
   [junit4]   2> 	at org.apache.solr.client.solrj.embedded.JettySolrRunner$DebugFilter.doFilter(JettySolrRunner.java:139)
   [junit4]   2> 	at org.eclipse.jetty.servlet.ServletHandler$CachedChain.doFilter(ServletHandler.java:1759)
   [junit4]   2> 	at org.eclipse.jetty.servlet.ServletHandler.doHandle(ServletHandler.java:582)
   [junit4]   2> 	at org.eclipse.jetty.server.session.SessionHandler.doHandle(SessionHandler.java:224)
   [junit4]   2> 	at org.eclipse.jetty.server.handler.ContextHandler.doHandle(ContextHandler.java:1180)
   [junit4]   2> 	at org.eclipse.jetty.servlet.ServletHandler.doScope(ServletHandler.java:512)
   [junit4]   2> 	at org.eclipse.jetty.server.session.SessionHandler.doScope(SessionHandler.java:185)
   [junit4]   2> 	at org.eclipse.jetty.server.handler.ContextHandler.doScope(ContextHandler.java:1112)
   [junit4]   2> 	at org.eclipse.jetty.server.handler.ScopedHandler.handle(ScopedHandler.java:141)
   [junit4]   2> 	at org.eclipse.jetty.server.handler.gzip.GzipHandler.handle(GzipHandler.java:426)
   [junit4]   2> 	at org.eclipse.jetty.server.handler.HandlerWrapper.handle(HandlerWrapper.java:134)
   [junit4]   2> 	at org.eclipse.jetty.server.Server.handle(Server.java:534)
   [junit4]   2> 	at org.eclipse.jetty.server.HttpChannel.handle(HttpChannel.java:320)
   [junit4]   2> 	at org.eclipse.jetty.server.HttpConnection.onFillable(HttpConnection.java:251)
   [junit4]   2> 	at org.eclipse.jetty.io.AbstractConnection$ReadCallback.succeeded(AbstractConnection.java:283)
   [junit4]   2> 	at org.eclipse.jetty.io.FillInterest.fillable(FillInterest.java:108)
   [junit4]   2> 	at org.eclipse.jetty.io.SelectChannelEndPoint$2.run(SelectChannelEndPoint.java:93)
   [junit4]   2> 	at org.eclipse.jetty.util.thread.strategy.ExecuteProduceConsume.executeProduceConsume(ExecuteProduceConsume.java:303)
   [junit4]   2> 	at org.eclipse.jetty.util.thread.strategy.ExecuteProduceConsume.produceConsume(ExecuteProduceConsume.java:148)
   [junit4]   2> 	at org.eclipse.jetty.util.thread.strategy.ExecuteProduceConsume.run(ExecuteProduceConsume.java:136)
   [junit4]   2> 	at org.eclipse.jetty.util.thread.QueuedThreadPool.runJob(QueuedThreadPool.java:671)
   [junit4]   2> 	at org.eclipse.jetty.util.thread.QueuedThreadPool$2.run(QueuedThreadPool.java:589)
   [junit4]   2> 	at java.lang.Thread.run(Thread.java:748)
   [junit4]   1> {event=firstSearcher}
   [junit4]   2> 1845655 INFO  (qtp11726034-18479) [n:127.0.0.1:57038_solr c:testRepFactor1LeaderStartup s:shard1 r:core_node2 x:testRepFactor1LeaderStartup_shard1_replica_n1] o.a.s.h.SolrConfigHandler Executed config commands successfully and persisted to ZK [{"add-listener":{
   [junit4]   2>     "name":"newSearcherListener",
   [junit4]   2>     "event":"newSearcher",
   [junit4]   2>     "class":"org.apache.solr.cloud.TestCloudSearcherWarming$SleepingSolrEventListener"}}, {"add-listener":{
   [junit4]   2>     "name":"firstSearcherListener",
   [junit4]   2>     "event":"firstSearcher",
   [junit4]   2>     "class":"org.apache.solr.cloud.TestCloudSearcherWarming$SleepingSolrEventListener"}}]
   [junit4]   2> 1845656 INFO  (qtp11726034-18479) [n:127.0.0.1:57038_solr c:testRepFactor1LeaderStartup s:shard1 r:core_node2 x:testRepFactor1LeaderStartup_shard1_replica_n1] o.a.s.h.SolrConfigHandler Waiting up to 30 secs for 1 replicas to set the property overlay to be of version 0 for collection testRepFactor1LeaderStartup
   [junit4]   2> 1845656 INFO  (Thread-3940) [n:127.0.0.1:57038_solr    ] o.a.s.c.SolrCore config update listener called for core testRepFactor1LeaderStartup_shard1_replica_n1
   [junit4]   2> 1845657 INFO  (Thread-3940) [n:127.0.0.1:57038_solr    ] o.a.s.c.SolrCore core reload testRepFactor1LeaderStartup_shard1_replica_n1
   [junit4]   2> 1845660 INFO  (solrHandlerExecutor-7553-thread-1-processing-n:127.0.0.1:57038_solr x:testRepFactor1LeaderStartup_shard1_replica_n1 s:shard1 c:testRepFactor1LeaderStartup r:core_node2) [n:127.0.0.1:57038_solr c:testRepFactor1LeaderStartup s:shard1 r:core_node2 x:testRepFactor1LeaderStartup_shard1_replica_n1] o.a.s.h.SolrConfigHandler Time elapsed : 0 secs, maxWait 30
   [junit4]   2> 1845678 INFO  (Thread-3940) [n:127.0.0.1:57038_solr    ] o.a.s.c.RequestParams conf resource params.json loaded . version : 0 
   [junit4]   2> 1845678 INFO  (Thread-3940) [n:127.0.0.1:57038_solr    ] o.a.s.c.RequestParams request params refreshed to version 0
   [junit4]   2> 1845679 WARN  (Thread-3940) [n:127.0.0.1:57038_solr    ] o.a.s.c.SolrConfig Couldn't add files from C:\Users\jenkins\workspace\Lucene-Solr-7.x-Windows\solr\build\solr-core\test\J0\temp\solr.cloud.TestCloudSearcherWarming_225115A8932EDC87-001\tempDir-001\node1\testRepFactor1LeaderStartup_shard1_replica_n1\..\..\..\..\contrib\extraction\lib filtered by .*\.jar to classpath: C:\Users\jenkins\workspace\Lucene-Solr-7.x-Windows\solr\build\solr-core\test\J0\temp\solr.cloud.TestCloudSearcherWarming_225115A8932EDC87-001\tempDir-001\node1\testRepFactor1LeaderStartup_shard1_replica_n1\..\..\..\..\contrib\extraction\lib
   [junit4]   2> 1845681 WARN  (Thread-3940) [n:127.0.0.1:57038_solr    ] o.a.s.c.SolrConfig Couldn't add files from C:\Users\jenkins\workspace\Lucene-Solr-7.x-Windows\solr\build\solr-core\test\J0\temp\solr.cloud.TestCloudSearcherWarming_225115A8932EDC87-001\tempDir-001\node1\testRepFactor1LeaderStartup_shard1_replica_n1\..\..\..\..\dist filtered by solr-cell-\d.*\.jar to classpath: C:\Users\jenkins\workspace\Lucene-Solr-7.x-Windows\solr\build\solr-core\test\J0\temp\solr.cloud.TestCloudSearcherWarming_225115A8932EDC87-001\tempDir-001\node1\testRepFactor1LeaderStartup_shard1_replica_n1\..\..\..\..\dist
   [junit4]   2> 1845681 WARN  (Thread-3940) [n:127.0.0.1:57038_solr    ] o.a.s.c.SolrConfig Couldn't add files from C:\Users\jenkins\workspace\Lucene-Solr-7.x-Windows\solr\build\solr-core\test\J0\temp\solr.cloud.TestCloudSearcherWarming_225115A8932EDC87-001\tempDir-001\node1\testRepFactor1LeaderStartup_shard1_replica_n1\..\..\..\..\contrib\clustering\lib filtered by .*\.jar to classpath: C:\Users\jenkins\workspace\Lucene-Solr-7.x-Windows\solr\build\solr-core\test\J0\temp\solr.cloud.TestCloudSearcherWarming_225115A8932EDC87-001\tempDir-001\node1\testRepFactor1LeaderStartup_shard1_replica_n1\..\..\..\..\contrib\clustering\lib
   [junit4]   2> 1845681 WARN  (Thread-3940) [n:127.0.0.1:57038_solr    ] o.a.s.c.SolrConfig Couldn't add files from C:\Users\jenkins\workspace\Lucene-Solr-7.x-Windows\solr\build\solr-core\test\J0\temp\solr.cloud.TestCloudSearcherWarming_225115A8932EDC87-001\tempDir-001\node1\testRepFactor1LeaderStartup_shard1_replica_n1\..\..\..\..\dist filtered by solr-clustering-\d.*\.jar to classpath: C:\Users\jenkins\workspace\Lucene-Solr-7.x-Windows\solr\build\solr-core\test\J0\temp\solr.cloud.TestCloudSearcherWarming_225115A8932EDC87-001\tempDir-001\node1\testRepFactor1LeaderStartup_shard1_replica_n1\..\..\..\..\dist
   [junit4]   2> 1845681 WARN  (Thread-3940) [n:127.0.0.1:57038_solr    ] o.a.s.c.SolrConfig Couldn't add files from C:\Users\jenkins\workspace\Lucene-Solr-7.x-Windows\solr\build\solr-core\test\J0\temp\solr.cloud.TestCloudSearcherWarming_225115A8932EDC87-001\tempDir-001\node1\testRepFactor1LeaderStartup_shard1_replica_n1\..\..\..\..\contrib\langid\lib filtered by .*\.jar to classpath: C:\Users\jenkins\workspace\Lucene-Solr-7.x-Windows\solr\build\solr-core\test\J0\temp\solr.cloud.TestCloudSearcherWarming_225115A8932EDC87-001\tempDir-001\node1\testRepFactor1LeaderStartup_shard1_replica_n1\..\..\..\..\contrib\langid\lib
   [junit4]   2> 1845681 WARN  (Thread-3940) [n:127.0.0.1:57038_solr    ] o.a.s.c.SolrConfig Couldn't add files from C:\Users\jenkins\workspace\Lucene-Solr-7.x-Windows\solr\build\solr-core\test\J0\temp\solr.cloud.TestCloudSearcherWarming_225115A8932EDC87-001\tempDir-001\node1\testRepFactor1LeaderStartup_shard1_replica_n1\..\..\..\..\dist filtered by solr-langid-\d.*\.jar to classpath: C:\Users\jenkins\workspace\Lucene-Solr-7.x-Windows\solr\build\solr-core\test\J0\temp\solr.cloud.TestCloudSearcherWarming_225115A8932EDC87-001\tempDir-001\node1\testRepFactor1LeaderStartup_shard1_replica_n1\..\..\..\..\dist
   [junit4]   2> 1845681 WARN  (Thread-3940) [n:127.0.0.1:57038_solr    ] o.a.s.c.SolrConfig Couldn't add files from C:\Users\jenkins\workspace\Lucene-Solr-7.x-Windows\solr\build\solr-core\test\J0\temp\solr.cloud.TestCloudSearcherWarming_225115A8932EDC87-001\tempDir-001\node1\testRepFactor1LeaderStartup_shard1_replica_n1\..\..\..\..\contrib\velocity\lib filtered by .*\.jar to classpath: C:\Users\jenkins\workspace\Lucene-Solr-7.x-Windows\solr\build\solr-core\test\J0\temp\solr.cloud.TestCloudSearcherWarming_225115A8932EDC87-001\tempDir-001\node1\testRepFactor1LeaderStartup_shard1_replica_n1\..\..\..\..\contrib\velocity\lib
   [junit4]   2> 1845681 WARN  (Thread-3940) [n:127.0.0.1:57038_solr    ] o.a.s.c.SolrConfig Couldn't add files from C:\Users\jenkins\workspace\Lucene-Solr-7.x-Windows\solr\build\solr-core\test\J0\temp\solr.cloud.TestCloudSearcherWarming_225115A8932EDC87-001\tempDir-001\node1\testRepFactor1LeaderStartup_shard1_replica_n1\..\..\..\..\dist filtered by solr-velocity-\d.*\.jar to classpath: C:\Users\jenkins\workspace\Lucene-Solr-7.x-Windows\solr\build\solr-core\test\J0\temp\solr.cloud.TestCloudSearcherWarming_225115A8932EDC87-001\tempDir-001\node1\testRepFactor1LeaderStartup_shard1_replica_n1\..\..\..\..\dist
   [junit4]   2> 1845689 INFO  (Thread-3940) [n:127.0.0.1:57038_solr    ] o.a.s.c.SolrConfig Using Lucene MatchVersion: 7.2.0
   [junit4]   2> 1845720 INFO  (Thread-3940) [n:127.0.0.1:57038_solr    ] o.a.s.s.IndexSchema [testRepFactor1LeaderStartup_shard1_replica_n1] Schema name=default-config
   [junit4]   2> 1845763 INFO  (qtp11726034-18478) [n:127.0.0.1:57038_solr c:testRepFactor1LeaderStartup s:shard1 r:core_node2 x:testRepFactor1LeaderStartup_shard1_replica_n1] o.a.s.h.SolrConfigHandler expecting overlay version 0 but my version is -1
   [junit4]   2> 1845763 INFO  (qtp11726034-18478) [n:127.0.0.1:57038_solr c:testRepFactor1LeaderStartup s:shard1 r:core_node2 x:testRepFactor1LeaderStartup_shard1_replica_n1] o.a.s.c.S.Request [testRepFactor1LeaderStartup_shard1_replica_n1]  webapp=/solr path=/config/znodeVersion params={overlay=0&wt=javabin&version=2} status=0 QTime=0
   [junit4]   2> 1845763 INFO  (solrHandlerExecutor-7553-thread-1-processing-n:127.0.0.1:57038_solr x:testRepFactor1LeaderStartup_shard1_replica_n1 s:shard1 c:testRepFactor1LeaderStartup r:core_node2) [n:127.0.0.1:57038_solr c:testRepFactor1LeaderStartup s:shard1 r:core_node2 x:testRepFactor1LeaderStartup_shard1_replica_n1] o.a.s.h.SolrConfigHandler Could not get expectedVersion 0 from http://127.0.0.1:57038/solr/testRepFactor1LeaderStartup_shard1_replica_n1/ for prop overlay   after 1 attempts
   [junit4]   2> 1845763 INFO  (solrHandlerExecutor-7553-thread-1-processing-n:127.0.0.1:57038_solr x:testRepFactor1LeaderStartup_shard1_replica_n1 s:shard1 c:testRepFactor1LeaderStartup r:core_node2) [n:127.0.0.1:57038_solr c:testRepFactor1LeaderStartup s:shard1 r:core_node2 x:testRepFactor1LeaderStartup_shard1_replica_n1] o.a.s.h.SolrConfigHandler Time elapsed : 0 secs, maxWait 30
   [junit4]   2> 1845764 INFO  (SolrConfigHandler-refreshconf) [n:127.0.0.1:57038_solr c:testRepFactor1LeaderStartup s:shard1 r:core_node2 x:testRepFactor1LeaderStartup_shard1_replica_n1] o.a.s.h.SolrConfigHandler Another reload is in progress . Not doing anything
   [junit4]   2> 1845864 INFO  (qtp11726034-18478) [n:127.0.0.1:57038_solr c:testRepFactor1LeaderStartup s:shard1 r:core_node2 x:testRepFactor1LeaderStartup_shard1_replica_n1] o.a.s.h.SolrConfigHandler expecting overlay version 0 but my version is -1
   [junit4]   2> 1845865 INFO  (qtp11726034-18478) [n:127.0.0.1:57038_solr c:testRepFactor1LeaderStartup s:shard1 r:core_node2 x:testRepFactor1LeaderStartup_shard1_replica_n1] o.a.s.c.S.Request [testRepFactor1LeaderStartup_shard1_replica_n1]  webapp=/solr path=/config/znodeVersion params={overlay=0&wt=javabin&version=2} status=0 QTime=0
   [junit4]   2> 1845865 INFO  (solrHandlerExecutor-7553-thread-1-processing-n:127.0.0.1:57038_solr x:testRepFactor1LeaderStartup_shard1_replica_n1 s:shard1 c:testRepFactor1LeaderStartup r:core_node2) [n:127.0.0.1:57038_solr c:testRepFactor1LeaderStartup s:shard1 r:core_node2 x:testRepFactor1LeaderStartup_shard1_replica_n1] o.a.s.h.SolrConfigHandler Could not get expectedVersion 0 from http://127.0.0.1:57038/solr/testRepFactor1LeaderStartup_shard1_replica_n1/ for prop overlay   after 2 attempts
   [junit4]   2> 1845865 INFO  (solrHandlerExecutor-7553-thread-1-processing-n:127.0.0.1:57038_solr x:testRepFactor1LeaderStartup_shard1_replica_n1 s:shard1 c:testRepFactor1LeaderStartup r:core_node2) [n:127.0.0.1:57038_solr c:testRepFactor1LeaderStartup s:shard1 r:core_node2 x:testRepFactor1LeaderStartup_shard1_replica_n1] o.a.s.h.SolrConfigHandler Time elapsed : 0 secs, maxWait 30
   [junit4]   2> 1845865 INFO  (SolrConfigHandler-refreshconf) [n:127.0.0.1:57038_solr c:testRepFactor1LeaderStartup s:shard1 r:core_node2 x:testRepFactor1LeaderStartup_shard1_replica_n1] o.a.s.h.SolrConfigHandler Another reload is in progress . Not doing anything
   [junit4]   2> 1845884 INFO  (Thread-3940) [n:127.0.0.1:57038_solr    ] o.a.s.s.IndexSchema Loaded schema default-config/1.6 with uniqueid field id
   [junit4]   2> 1845923 INFO  (Thread-3940) [n:127.0.0.1:57038_solr    ] o.a.s.c.CoreContainer Reloading SolrCore 'testRepFactor1LeaderStartup_shard1_replica_n1' using configuration from collection testRepFactor1LeaderStartup
   [junit4]   2> 1845951 INFO  (Thread-3940) [n:127.0.0.1:57038_solr c:testRepFactor1LeaderStartup s:shard1 r:core_node2 x:testRepFactor1LeaderStartup_shard1_replica_n1] o.a.s.m.r.SolrJmxReporter JMX monitoring for 'solr_57038.solr.core.testRepFactor1LeaderStartup.shard1.replica_n1' (registry 'solr.core.testRepFactor1LeaderStartup.shard1.replica_n1') enabled at server: com.sun.jmx.mbeanserver.JmxMBeanServer@156d5f6
   [junit4]   2> 1845951 INFO  (Thread-3940) [n:127.0.0.1:57038_solr c:testRepFactor1LeaderStartup s:shard1 r:core_node2 x:testRepFactor1LeaderStartup_shard1_replica_n1] o.a.s.c.SolrCore [[testRepFactor1LeaderStartup_shard1_replica_n1] ] Opening new SolrCore at [C:\Users\jenkins\workspace\Lucene-Solr-7.x-Windows\solr\build\solr-core\test\J0\temp\solr.cloud.TestCloudSearcherWarming_225115A8932EDC87-001\tempDir-001\node1\testRepFactor1LeaderStartup_shard1_replica_n1], dataDir=[C:\Users\jenkins\workspace\Lucene-Solr-7.x-Windows\solr\build\solr-core\test\J0\temp\solr.cloud.TestCloudSearcherWarming_225115A8932EDC87-001\tempDir-001\node1\.\testRepFactor1LeaderStartup_shard1_replica_n1\data\]
   [junit4]   2> java.lang.RuntimeException
   [junit4]   2> 	at org.apache.solr.cloud.TestCloudSearcherWarming$SleepingSolrEventListener.init(TestCloudSearcherWarming.java:306)
   [junit4]   2> 	at org.apache.solr.core.SolrCore.createInitInstance(SolrCore.java:827)
   [junit4]   2> 	at org.apache.solr.core.SolrCore.initListeners(SolrCore.java:574)
   [junit4]   2> 	at org.apache.solr.core.SolrCore.<init>(SolrCore.java:927)
   [junit4]   2> 	at org.apache.solr.core.SolrCore.reload(SolrCore.java:637)
   [junit4]   2> 	at org.apache.solr.core.CoreContainer.reload(CoreContainer.java:1277)
   [junit4]   2> 	at org.apache.solr.core.SolrCore.lambda$getConfListener$20(SolrCore.java:2950)
   [junit4]   2> 	at org.apache.solr.cloud.ZkController.lambda$fireEventListeners$5(ZkController.java:2515)
   [junit4]   2> 	at java.lang.Thread.run(Thread.java:748)
   [junit4]   1> {event=newSearcher}
   [junit4]   2> java.lang.RuntimeException
   [junit4]   2> 	at org.apache.solr.cloud.TestCloudSearcherWarming$SleepingSolrEventListener.init(TestCloudSearcherWarming.java:306)
   [junit4]   2> 	at org.apache.solr.core.SolrCore.createInitInstance(SolrCore.java:827)
   [junit4]   2> 	at org.apache.solr.core.SolrCore.initListeners(SolrCore.java:570)
   [junit4]   2> 	at org.apache.solr.core.SolrCore.<init>(SolrCore.java:927)
   [junit4]   2> 	at org.apache.solr.core.SolrCore.reload(SolrCore.java:637)
   [junit4]   2> 	at org.apache.solr.core.CoreContainer.reload(CoreContainer.java:1277)
   [junit4]   2> 	at org.apache.solr.core.SolrCore.lambda$getConfListener$20(SolrCore.java:2950)
   [junit4]   2> 	at org.apache.solr.cloud.ZkController.lambda$fireEventListeners$5(ZkController.java:2515)
   [junit4]   2> 	at java.lang.Thread.run(Thread.java:748)
   [junit4]   1> {event=firstSearcher}
   [junit4]   2> 1845957 INFO  (Thread-3940) [n:127.0.0.1:57038_solr c:testRepFactor1LeaderStartup s:shard1 r:core_node2 x:testRepFactor1LeaderStartup_shard1_replica_n1] o.a.s.r.XSLTResponseWriter xsltCacheLifetimeSeconds=5
   [junit4]   2> 1845966 INFO  (qtp11726034-18483) [n:127.0.0.1:57038_solr c:testRepFactor1LeaderStartup s:shard1 r:core_node2 x:testRepFactor1LeaderStartup_shard1_replica_n1] o.a.s.h.SolrConfigHandler expecting overlay version 0 but my version is -1
   [junit4]   2> 1845966 INFO  (qtp11726034-18483) [n:127.0.0.1:57038_solr c:testRepFactor1LeaderStartup s:shard1 r:core_node2 x:testRepFactor1LeaderStartup_shard1_replica_n1] o.a.s.c.S.Request [testRepFactor1LeaderStartup_shard1_replica_n1]  webapp=/solr path=/config/znodeVersion params={overlay=0&wt=javabin&version=2} status=0 QTime=0
   [junit4]   2> 1845967 INFO  (SolrConfigHandler-refreshconf) [n:127.0.0.1:57038_solr c:testRepFactor1LeaderStartup s:shard1 r:core_node2 x:testRepFactor1LeaderStartup_shard1_replica_n1] o.a.s.h.SolrConfigHandler Another reload is in progress . Not doing anything
   [junit4]   2> 1845967 INFO  (solrHandlerExecutor-7553-thread-1-processing-n:127.0.0.1:57038_solr x:testRepFactor1LeaderStartup_shard1_replica_n1 s:shard1 c:testRepFactor1LeaderStartup r:core_node2) [n:127.0.0.1:57038_solr c:testRepFactor1LeaderStartup s:shard1 r:core_node2 x:testRepFactor1LeaderStartup_shard1_replica_n1] o.a.s.h.SolrConfigHandler Could not get expectedVersion 0 from http://127.0.0.1:57038/solr/testRepFactor1LeaderStartup_shard1_replica_n1/ for prop overlay   after 3 attempts
   [junit4]   2> 1845967 INFO  (solrHandlerExecutor-7553-thread-1-processing-n:127.0.0.1:57038_solr x:testRepFactor1LeaderStartup_shard1_replica_n1 s:shard1 c:testRepFactor1LeaderStartup r:core_node2) [n:127.0.0.1:57038_solr c:testRepFactor1LeaderStartup s:shard1 r:core_node2 x:testRepFactor1LeaderStartup_shard1_replica_n1] o.a.s.h.SolrConfigHandler Time elapsed : 0 secs, maxWait 30
   [junit4]   2> 1846051 INFO  (Thread-3940) [n:127.0.0.1:57038_solr c:testRepFactor1LeaderStartup s:shard1 r:core_node2 x:testRepFactor1LeaderStartup_shard1_replica_n1] o.a.s.u.CommitTracker Hard AutoCommit: if uncommited for 15000ms; 
   [junit4]   2> 1846051 INFO  (Thread-3940) [n:127.0.0.1:57038_solr c:testRepFactor1LeaderStartup s:shard1 r:core_node2 x:testRepFactor1LeaderStartup_shard1_replica_n1] o.a.s.u.CommitTracker Soft AutoCommit: disabled
   [junit4]   2> 1846059 INFO  (Thread-3940) [n:127.0.0.1:57038_solr c:testRepFactor1LeaderStartup s:shard1 r:core_node2 x:testRepFactor1LeaderStartup_shard1_replica_n1] o.a.s.s.SolrIndexSearcher Opening [Searcher@15e3665[testRepFactor1LeaderStartup_shard1_replica_n1] main]
   [junit4]   2> 1846060 INFO  (Thread-3940) [n:127.0.0.1:57038_solr c:testRepFactor1LeaderStartup s:shard1 r:core_node2 x:testRepFactor1LeaderStartup_shard1_replica_n1] o.a.s.r.ManagedResourceStorage Configured ZooKeeperStorageIO with znodeBase: /configs/testRepFactor1LeaderStartup
   [junit4]   2> 1846061 INFO  (Thread-3940) [n:127.0.0.1:57038_solr c:testRepFactor1LeaderStartup s:shard1 r:core_node2 x:testRepFactor1LeaderStartup_shard1_replica_n1] o.a.s.r.ManagedResourceStorage Loaded null at path _rest_managed.json using ZooKeeperStorageIO:path=/configs/testRepFactor1LeaderStartup
   [junit4]   2> 1846061 INFO  (Thread-3940) [n:127.0.0.1:57038_solr c:testRepFactor1LeaderStartup s:shard1 r:core_node2 x:testRepFactor1LeaderStartup_shard1_replica_n1] o.a.s.s.ZkIndexSchemaReader Creating ZooKeeper watch for the managed schema at /configs/testRepFactor1LeaderStartup/managed-schema
   [junit4]   2> 1846062 INFO  (Thread-3940) [n:127.0.0.1:57038_solr c:testRepFactor1LeaderStartup s:shard1 r:core_node2 x:testRepFactor1LeaderStartup_shard1_replica_n1] o.a.s.s.ZkIndexSchemaReader Current schema version 0 is already the latest
   [junit4]   2> 1846062 INFO  (Thread-3940) [n:127.0.0.1:57038_solr c:testRepFactor1LeaderStartup s:shard1 r:core_node2 x:testRepFactor1LeaderStartup_shard1_replica_n1] o.a.s.h.c.SpellCheckComponent Initializing spell checkers
   [junit4]   2> 1846063 INFO  (Thread-3940) [n:127.0.0.1:57038_solr c:testRepFactor1LeaderStartup s:shard1 r:core_node2 x:testRepFactor1LeaderStartup_shard1_replica_n1] o.a.s.s.DirectSolrSpellChecker init: {name=default,field=_text_,classname=solr.DirectSolrSpellChecker,distanceMeasure=internal,accuracy=0.5,maxEdits=2,minPrefix=1,maxInspections=5,minQueryLength=4,maxQueryFrequency=0.01}
   [junit4]   2> 1846064 INFO  (Thread-3940) [n:127.0.0.1:57038_solr c:testRepFactor1LeaderStartup s:shard1 r:core_node2 x:testRepFactor1LeaderStartup_shard1_replica_n1] o.a.s.h.ReplicationHandler Commits will be reserved for 10000ms.
   [junit4]   2> 1846064 INFO  (searcherExecutor-7554-thread-1-processing-n:127.0.0.1:57038_solr x:testRepFactor1LeaderStartup_shard1_replica_n1 s:shard1 c:testRepFactor1LeaderStartup r:core_node2) [n:127.0.0.1:57038_solr c:testRepFactor1LeaderStartup s:shard1 r:core_node2 x:testRepFactor1LeaderStartup_shard1_replica_n1] o.a.s.c.QuerySenderListener QuerySenderListener sending requests to Searcher@15e3665[testRepFactor1LeaderStartup_shard1_replica_n1] main{ExitableDirectoryReader(UninvertingDirectoryReader())}
   [junit4]   2> 1846064 INFO  (searcherExecutor-7554-thread-1-processing-n:127.0.0.1:57038_solr x:testRepFactor1LeaderStartup_shard1_replica_n1 s:shard1 c:testRepFactor1LeaderStartup r:core_node2) [n:127.0.0.1:57038_solr c:testRepFactor1LeaderStartup s:shard1 r:core_node2 x:testRepFactor1LeaderStartup_shard1_replica_n1] o.a.s.c.QuerySenderListener QuerySenderListener done.
   [junit4]   2> 1846064 INFO  (Thread-3940) [n:127.0.0.1:57038_solr c:testRepFactor1LeaderStartup s:shard1 r:core_node2 x:testRepFactor1LeaderStartup_shard1_replica_n1] o.a.s.u.UpdateLog Could not find max version in index or recent updates, using new clock 1581262375471808512
   [junit4]   2> 1846064 INFO  (searcherExecutor-7554-thread-1-processing-n:127.0.0.1:57038_solr x:testRepFactor1LeaderStartup_shard1_replica_n1 s:shard1 c:testRepFactor1LeaderStartup r:core_node2) [n:127.0.0.1:57038_solr c:testRepFactor1LeaderStartup s:shard1 r:core_node2 x:testRepFactor1LeaderStartup_shard1_replica_n1] o.a.s.h.c.SpellCheckComponent Loading spell index for spellchecker: default
   [junit4]   2> 1846067 INFO  (searcherExecutor-7554-thread-1-processing-n:127.0.0.1:57038_solr x:testRepFactor1LeaderStartup_shard1_replica_n1 s:shard1 c:testRepFactor1LeaderStartup r:core_node2) [n:127.0.0.1:57038_solr c:testRepFactor1LeaderStartup s:shard1 r:core_node2 x:testRepFactor1LeaderStartup_shard1_replica_n1] o.a.s.c.SolrCore [testRepFactor1LeaderStartup_shard1_replica_n1] Registered new searcher Searcher@15e3665[testRepFactor1LeaderStartup_shard1_replica_n1] main{ExitableDirectoryReader(UninvertingDirectoryReader())}
   [junit4]   2> 1846071 INFO  (Thread-3940) [n:127.0.0.1:57038_solr c:testRepFactor1LeaderStartup s:shard1 r:core_node2 x:testRepFactor1LeaderStartup_shard1_replica_n1] o.a.s.u.DefaultSolrCoreState New IndexWriter is ready to be used.
   [junit4]   2> 1846073 INFO  (Thread-3940) [n:127.0.0.1:57038_solr c:testRepFactor1LeaderStartup s:shard1 r:core_node2 x:testRepFactor1LeaderStartup_shard1_replica_n1] o.a.s.s.SolrIndexSearcher Opening [Searcher@185ebc9[testRepFactor1LeaderStartup_shard1_replica_n1] main]
   [junit4]   2> 1846074 INFO  (qtp11726034-18484) [n:127.0.0.1:57038_solr c:testRepFactor1LeaderStartup s:shard1 r:core_node2 x:testRepFactor1LeaderStartup_shard1_replica_n1] o.a.s.h.SolrConfigHandler I already have the expected version 0 of config
   [junit4]   2> 1846074 INFO  (qtp11726034-18484) [n:127.0.0.1:57038_solr c:testRepFactor1LeaderStartup s:shard1 r:core_node2 x:testRepFactor1LeaderStartup_shard1_replica_n1] o.a.s.h.SolrConfigHandler isStale false , resourceloader org.apache.solr.cloud.ZkSolrResourceLoader
   [junit4]   2> 1846074 INFO  (searcherExecutor-7554-thread-1-processing-n:127.0.0.1:57038_solr x:testRepFactor1LeaderStartup_shard1_replica_n1 s:shard1 c:testRepFactor1LeaderStartup r:core_node2) [n:127.0.0.1:57038_solr c:testRepFactor1LeaderStartup s:shard1 r:core_node2 x:testRepFactor1LeaderStartup_shard1_replica_n1] o.a.s.c.QuerySenderListener QuerySenderListener sending requests to Searcher@185ebc9[testRepFactor1LeaderStartup_shard1_replica_n1] main{ExitableDirectoryReader(UninvertingDirectoryReader())}
   [junit4]   2> 1846074 INFO  (searcherExecutor-7554-thread-1-processing-n:127.0.0.1:57038_solr x:testRepFactor1LeaderStartup_shard1_replica_n1 s:shard1 c:testRepFactor1LeaderStartup r:core_node2) [n:127.0.0.1:57038_solr c:testRepFactor1LeaderStartup s:shard1 r:core_node2 x:testRepFactor1LeaderStartup_shard1_replica_n1] o.a.s.c.QuerySenderListener QuerySenderListener done.
   [junit4]   2> 1846074 INFO  (qtp11726034-18484) [n:127.0.0.1:57038_solr c:testRepFactor1LeaderStartup s:shard1 r:core_node2 x:testRepFactor1LeaderStartup_shard1_replica_n1] o.a.s.c.S.Request [testRepFactor1LeaderStartup_shard1_replica_n1]  webapp=/solr path=/config/znodeVersion params={overlay=0&wt=javabin&version=2} status=0 QTime=0
   [junit4]   2> 1846076 INFO  (qtp11726034-18479) [n:127.0.0.1:57038_solr c:testRepFactor1LeaderStartup s:shard1 r:core_node2 x:testRepFactor1LeaderStartup_shard1_replica_n1] o.a.s.h.SolrConfigHandler Took 420.0ms to set the property overlay to be of version 0 for collection testRepFactor1LeaderStartup
   [junit4]   2> 1846077 INFO  (qtp11726034-18479) [n:127.0.0.1:57038_solr c:testRepFactor1LeaderStartup s:shard1 r:core_node2 x:testRepFactor1LeaderStartup_shard1_replica_n1] o.a.s.c.S.Request [testRepFactor1LeaderStartup_shard1_replica_n1]  webapp=/solr path=/config params={wt=javabin&version=2} status=0 QTime=428
   [junit4]   2> 1846077 INFO  (qtp11726034-18479) [n:127.0.0.1:57038_solr c:testRepFactor1LeaderStartup s:shard1 r:core_node2 x:testRepFactor1LeaderStartup_shard1_replica_n1] o.a.s.c.SolrCore [testRepFactor1LeaderStartup_shard1_replica_n1]  CLOSING SolrCore org.apache.solr.core.SolrCore@15d09ae
   [junit4]   2> 1846077 INFO  (qtp11726034-18479) [n:127.0.0.1:57038_solr c:testRepFactor1LeaderStartup s:shard1 r:core_node2 x:testRepFactor1LeaderStartup_shard1_replica_n1] o.a.s.m.SolrMetricManager Closing metric reporters for registry=solr.core.testRepFactor1LeaderStartup.shard1.replica_n1, tag=22874542
   [junit4]   2> 1846077 INFO  (qtp11726034-18479) [n:127.0.0.1:57038_solr c:testRepFactor1LeaderStartup s:shard1 r:core_node2 x:testRepFactor1LeaderStartup_shard1_replica_n1] o.a.s.m.r.SolrJmxReporter Closing reporter [org.apache.solr.metrics.reporters.SolrJmxReporter@579dff: rootName = solr_57038, domain = solr.core.testRepFactor1LeaderStartup.shard1.replica_n1, service url = null, agent id = null] for registry solr.core.testRepFactor1LeaderStartup.shard1.replica_n1 / com.codahale.metrics.MetricRegistry@faaba0
   [junit4]   2> 1846077 INFO  (searcherExecutor-7554-thread-1-processing-n:127.0.0.1:57038_solr x:testRepFactor1LeaderStartup_shard1_replica_n1 s:shard1 c:testRepFactor1LeaderStartup r:core_node2) [n:127.0.0.1:57038_solr c:testRepFactor1LeaderStartup s:shard1 r:core_node2 x:testRepFactor1LeaderStartup_shard1_replica_n1] o.a.s.c.SolrCore [testRepFactor1LeaderStartup_shard1_replica_n1] Registered new searcher Searcher@185ebc9[testRepFactor1LeaderStartup_shard1_replica_n1] main{ExitableDirectoryReader(UninvertingDirectoryReader())}
   [junit4]   2> 1846087 INFO  (qtp11726034-18479) [n:127.0.0

[...truncated too long message...]

e state: DocCollection(testRepFactor1LeaderStartup//collections/testRepFactor1LeaderStartup/state.json/4)={
   [junit4]    >   "pullReplicas":"0",
   [junit4]    >   "replicationFactor":"1",
   [junit4]    >   "shards":{"shard1":{
   [junit4]    >       "range":"80000000-7fffffff",
   [junit4]    >       "state":"active",
   [junit4]    >       "replicas":{"core_node2":{
   [junit4]    >           "core":"testRepFactor1LeaderStartup_shard1_replica_n1",
   [junit4]    >           "base_url":"http://127.0.0.1:57038/solr",
   [junit4]    >           "node_name":"127.0.0.1:57038_solr",
   [junit4]    >           "state":"active",
   [junit4]    >           "type":"NRT",
   [junit4]    >           "leader":"true"}}}},
   [junit4]    >   "router":{"name":"compositeId"},
   [junit4]    >   "maxShardsPerNode":"1",
   [junit4]    >   "autoAddReplicas":"false",
   [junit4]    >   "nrtReplicas":"1",
   [junit4]    >   "tlogReplicas":"0"}
   [junit4]    > 	at __randomizedtesting.SeedInfo.seed([225115A8932EDC87:F579587082CE9569]:0)
   [junit4]    > 	at org.apache.solr.cloud.SolrCloudTestCase.waitForState(SolrCloudTestCase.java:269)
   [junit4]    > 	at org.apache.solr.cloud.TestCloudSearcherWarming.testRepFactor1LeaderStartup(TestCloudSearcherWarming.java:126)
   [junit4]    > 	at java.lang.Thread.run(Thread.java:748)
   [junit4]   2> 1936483 INFO  (TEST-TestCloudSearcherWarming.testPeersyncFailureReplicationSuccess-seed#[225115A8932EDC87]) [    ] o.a.s.SolrTestCaseJ4 ###Starting testPeersyncFailureReplicationSuccess
   [junit4]   2> 1936483 INFO  (TEST-TestCloudSearcherWarming.testPeersyncFailureReplicationSuccess-seed#[225115A8932EDC87]) [    ] o.a.s.SolrTestCaseJ4 ###Ending testPeersyncFailureReplicationSuccess
   [junit4]   2> NOTE: reproduce with: ant test  -Dtestcase=TestCloudSearcherWarming -Dtests.method=testPeersyncFailureReplicationSuccess -Dtests.seed=225115A8932EDC87 -Dtests.slow=true -Dtests.locale=pt -Dtests.timezone=America/Argentina/ComodRivadavia -Dtests.asserts=true -Dtests.file.encoding=ISO-8859-1
   [junit4] ERROR   0.02s J0 | TestCloudSearcherWarming.testPeersyncFailureReplicationSuccess <<<
   [junit4]    > Throwable #1: java.lang.ArrayIndexOutOfBoundsException: 0
   [junit4]    > 	at __randomizedtesting.SeedInfo.seed([225115A8932EDC87:F60076E74290EBE4]:0)
   [junit4]    > 	at java.util.concurrent.CopyOnWriteArrayList.get(CopyOnWriteArrayList.java:387)
   [junit4]    > 	at java.util.concurrent.CopyOnWriteArrayList.get(CopyOnWriteArrayList.java:396)
   [junit4]    > 	at org.apache.solr.cloud.MiniSolrCloudCluster.getJettySolrRunner(MiniSolrCloudCluster.java:367)
   [junit4]    > 	at org.apache.solr.cloud.TestCloudSearcherWarming.testPeersyncFailureReplicationSuccess(TestCloudSearcherWarming.java:141)
   [junit4]    > 	at java.lang.Thread.run(Thread.java:748)
   [junit4]   2> 1936498 ERROR (SUITE-TestCloudSearcherWarming-seed#[225115A8932EDC87]-worker) [    ] o.a.z.s.ZooKeeperServer ZKShutdownHandler is not registered, so ZooKeeper server won't take any action on ERROR or SHUTDOWN server state changes
   [junit4]   2> 1936503 WARN  (NIOServerCxn.Factory:0.0.0.0/0.0.0.0:0) [    ] o.a.z.s.NIOServerCnxn caught end of stream exception
   [junit4]   2> EndOfStreamException: Unable to read additional data from client sessionid 0x15f1c5bfac50005, likely client has closed socket
   [junit4]   2> 	at org.apache.zookeeper.server.NIOServerCnxn.doIO(NIOServerCnxn.java:239)
   [junit4]   2> 	at org.apache.zookeeper.server.NIOServerCnxnFactory.run(NIOServerCnxnFactory.java:203)
   [junit4]   2> 	at java.lang.Thread.run(Thread.java:748)
   [junit4]   2> 1936531 INFO  (SUITE-TestCloudSearcherWarming-seed#[225115A8932EDC87]-worker) [    ] o.a.s.c.ZkTestServer connecting to 127.0.0.1:57034 57034
   [junit4]   2> 1936535 INFO  (Thread-3930) [    ] o.a.s.c.ZkTestServer connecting to 127.0.0.1:57034 57034
   [junit4]   2> 1936538 WARN  (Thread-3930) [    ] o.a.s.c.ZkTestServer Watch limit violations: 
   [junit4]   2> Maximum concurrent create/delete watches above limit:
   [junit4]   2> 
   [junit4]   2> 	2	/solr/aliases.json
   [junit4]   2> 	2	/solr/configs/testRepFactor1LeaderStartup/managed-schema
   [junit4]   2> 	2	/solr/clusterprops.json
   [junit4]   2> 	2	/solr/configs/testRepFactor1LeaderStartup
   [junit4]   2> 
   [junit4]   2> Maximum concurrent data watches above limit:
   [junit4]   2> 
   [junit4]   2> 	7	/solr/collections/testRepFactor1LeaderStartup/state.json
   [junit4]   2> 	2	/solr/clusterstate.json
   [junit4]   2> 
   [junit4]   2> Maximum concurrent children watches above limit:
   [junit4]   2> 
   [junit4]   2> 	2	/solr/live_nodes
   [junit4]   2> 	2	/solr/collections
   [junit4]   2> 
   [junit4]   2> NOTE: leaving temporary files on disk at: C:\Users\jenkins\workspace\Lucene-Solr-7.x-Windows\solr\build\solr-core\test\J0\temp\solr.cloud.TestCloudSearcherWarming_225115A8932EDC87-001
   [junit4]   2> Oct 14, 2017 7:30:05 PM com.carrotsearch.randomizedtesting.ThreadLeakControl checkThreadLeaks
   [junit4]   2> WARNING: Will linger awaiting termination of 2 leaked thread(s).
   [junit4]   2> NOTE: test params are: codec=Asserting(Lucene70): {}, docValues:{}, maxPointsInLeafNode=1512, maxMBSortInHeap=5.4238643831924644, sim=RandomSimilarity(queryNorm=false): {}, locale=pt, timezone=America/Argentina/ComodRivadavia
   [junit4]   2> NOTE: Windows 10 10.0 x86/Oracle Corporation 1.8.0_144 (32-bit)/cpus=3,threads=1,free=247763216,total=518979584
   [junit4]   2> NOTE: All tests run in this JVM: [TestStressReorder, TestXIncludeConfig, IgnoreCommitOptimizeUpdateProcessorFactoryTest, TestOmitPositions, UniqFieldsUpdateProcessorFactoryTest, WordBreakSolrSpellCheckerTest, BlockJoinFacetDistribTest, HdfsWriteToMultipleCollectionsTest, ResourceLoaderTest, LeaderInitiatedRecoveryOnCommitTest, RemoteQueryErrorTest, BadCopyFieldTest, OverseerTest, TestTolerantSearch, TestEmbeddedSolrServerSchemaAPI, DisMaxRequestHandlerTest, TestMaxScoreQueryParser, AnalyticsMergeStrategyTest, ReturnFieldsTest, NodeMutatorTest, TestNumericTokenStream, ExitableDirectoryReaderTest, CustomCollectionTest, TestWriterPerf, TestDefaultStatsCache, BlockJoinFacetSimpleTest, BinaryUpdateRequestHandlerTest, TestPerFieldSimilarityWithDefaultOverride, TestPhraseSuggestions, HdfsRecoveryZkTest, HighlighterTest, DeleteLastCustomShardedReplicaTest, SpatialHeatmapFacetsTest, SolrXmlInZkTest, TestSolrCLIRunExample, NoCacheHeaderTest, TestCloudNestedDocsSort, TestHashPartitioner, ClassificationUpdateProcessorIntegrationTest, ScriptEngineTest, TestJavabinTupleStreamParser, CollectionStateFormat2Test, MetricsHandlerTest, TestManagedResource, SolrJmxReporterCloudTest, TestReversedWildcardFilterFactory, ChaosMonkeyNothingIsSafeWithPullReplicasTest, DistanceFunctionTest, TestCloudJSONFacetJoinDomain, TestLFUCache, OverseerStatusTest, BitVectorTest, TestShardHandlerFactory, PeerSyncReplicationTest, RuleEngineTest, TestRandomCollapseQParserPlugin, TestHdfsBackupRestoreCore, QueryResultKeyTest, TestIBSimilarityFactory, TestGeoJSONResponseWriter, V2StandaloneTest, RequestHandlersTest, TestSchemaManager, TestMinMaxOnMultiValuedField, ZkCLITest, TestScoreJoinQPNoScore, TestUseDocValuesAsStored, HLLUtilTest, TestRuleBasedAuthorizationPlugin, TestObjectReleaseTracker, TestClusterStateMutator, PeerSyncTest, TestSystemCollAutoCreate, ConjunctionSolrSpellCheckerTest, TestStressInPlaceUpdates, TestFaceting, DistributedFacetPivotWhiteBoxTest, TestNumericRangeQuery32, RecoveryZkTest, TestSolrConfigHandler, SuggestComponentTest, SyncSliceTest, SolrIndexSplitterTest, TestHighFrequencyDictionaryFactory, ClusterStateTest, DistanceUnitsTest, PreAnalyzedFieldManagedSchemaCloudTest, CheckHdfsIndexTest, QueryElevationComponentTest, ChangedSchemaMergeTest, TimeZoneUtilsTest, TestLeaderElectionZkExpiry, TestInPlaceUpdatesDistrib, UtilsToolTest, ConnectionReuseTest, TestPayloadScoreQParserPlugin, HdfsDirectoryTest, HdfsSyncSliceTest, TestGroupingSearch, SharedFSAutoReplicaFailoverTest, DeleteReplicaTest, DocValuesNotIndexedTest, HdfsBasicDistributedZkTest, NotRequiredUniqueKeyTest, TestFieldCacheReopen, SpatialRPTFieldTypeTest, FullHLLTest, OutputWriterTest, TestManagedSchemaThreadSafety, DistributedFacetPivotSmallAdvancedTest, TestSchemaVersionResource, TestExactSharedStatsCache, UUIDFieldTest, CloudExitableDirectoryReaderTest, TestInitQParser, TestSegmentSorting, NumericFieldsTest, TestReplicaProperties, DistribDocExpirationUpdateProcessorTest, TestDeleteCollectionOnDownNodes, TestSort, CursorMarkTest, TestIndexingPerformance, ReplicationFactorTest, TestRequestStatusCollectionAPI, MoveReplicaHDFSFailoverTest, TestFieldResource, MergeStrategyTest, TestFuzzyAnalyzedSuggestions, TestSolrConfigHandlerCloud, NodeAddedTriggerTest, TestUpdate, TestEmbeddedSolrServerAdminHandler, PreAnalyzedUpdateProcessorTest, MigrateRouteKeyTest, TestJmxIntegration, TestConfigSetsAPI, TestCopyFieldCollectionResource, ComputePlanActionTest, CursorPagingTest, TestMacros, TestSolrCloudWithSecureImpersonation, DateFieldTest, TestCloudPseudoReturnFields, TestCoreContainer, BlobRepositoryCloudTest, SuggesterTest, TestConfigOverlay, TestFieldTypeResource, RegexBoostProcessorTest, CoreAdminHandlerTest, OverriddenZkACLAndCredentialsProvidersTest, TestTlogReplica, TestDFRSimilarityFactory, TestUniqueKeyFieldResource, DeleteStatusTest, ChaosMonkeyNothingIsSafeTest, RAMDirectoryFactoryTest, TestReRankQParserPlugin, TestJsonRequest, CachingDirectoryFactoryTest, AssignTest, TestCollationFieldDocValues, TestSurroundQueryParser, TestUnifiedSolrHighlighter, HdfsNNFailoverTest, TestReplicationHandler, SmileWriterTest, CSVRequestHandlerTest, TestComplexPhraseQParserPlugin, TestSolrDeletionPolicy2, ZkFailoverTest, TestCollectionAPI, TestDelegationWithHadoopAuth, SolrCLIZkUtilsTest, SolrGangliaReporterTest, TestCloudSearcherWarming]
   [junit4] Completed [369/744 (1!)] on J0 in 95.35s, 2 tests, 1 failure, 1 error <<< FAILURES!

[...truncated 44054 lines...]

Mime
View raw message