lucene-dev mailing list archives

Site index · List index
Message view « Date » · « Thread »
Top « Date » · « Thread »
From Policeman Jenkins Server <jenk...@thetaphi.de>
Subject [JENKINS] Lucene-Solr-7.x-Linux (64bit/jdk1.8.0_144) - Build # 525 - Still Unstable!
Date Sun, 01 Oct 2017 00:13:27 GMT
Build: https://jenkins.thetaphi.de/job/Lucene-Solr-7.x-Linux/525/
Java: 64bit/jdk1.8.0_144 -XX:+UseCompressedOops -XX:+UseParallelGC

4 tests failed.
FAILED:  org.apache.solr.client.solrj.io.stream.StreamExpressionTest.testExecutorStream

Error Message:
Error from server at https://127.0.0.1:37155/solr/workQueue_shard2_replica_n3: Expected mime type application/octet-stream but got text/html. <html> <head> <meta http-equiv="Content-Type" content="text/html;charset=ISO-8859-1"/> <title>Error 404 </title> </head> <body> <h2>HTTP ERROR: 404</h2> <p>Problem accessing /solr/workQueue_shard2_replica_n3/update. Reason: <pre>    Can not find: /solr/workQueue_shard2_replica_n3/update</pre></p> <hr /><a href="http://eclipse.org/jetty">Powered by Jetty:// 9.3.20.v20170531</a><hr/> </body> </html> 

Stack Trace:
org.apache.solr.client.solrj.impl.CloudSolrClient$RouteException: Error from server at https://127.0.0.1:37155/solr/workQueue_shard2_replica_n3: Expected mime type application/octet-stream but got text/html. <html>
<head>
<meta http-equiv="Content-Type" content="text/html;charset=ISO-8859-1"/>
<title>Error 404 </title>
</head>
<body>
<h2>HTTP ERROR: 404</h2>
<p>Problem accessing /solr/workQueue_shard2_replica_n3/update. Reason:
<pre>    Can not find: /solr/workQueue_shard2_replica_n3/update</pre></p>
<hr /><a href="http://eclipse.org/jetty">Powered by Jetty:// 9.3.20.v20170531</a><hr/>
</body>
</html>

	at __randomizedtesting.SeedInfo.seed([23D9F35E063A277F:11972A525500D6F]:0)
	at org.apache.solr.client.solrj.impl.CloudSolrClient.directUpdate(CloudSolrClient.java:539)
	at org.apache.solr.client.solrj.impl.CloudSolrClient.sendRequest(CloudSolrClient.java:993)
	at org.apache.solr.client.solrj.impl.CloudSolrClient.requestWithRetryOnStaleState(CloudSolrClient.java:862)
	at org.apache.solr.client.solrj.impl.CloudSolrClient.request(CloudSolrClient.java:793)
	at org.apache.solr.client.solrj.SolrRequest.process(SolrRequest.java:178)
	at org.apache.solr.client.solrj.request.UpdateRequest.commit(UpdateRequest.java:233)
	at org.apache.solr.client.solrj.io.stream.StreamExpressionTest.testExecutorStream(StreamExpressionTest.java:7471)
	at sun.reflect.NativeMethodAccessorImpl.invoke0(Native Method)
	at sun.reflect.NativeMethodAccessorImpl.invoke(NativeMethodAccessorImpl.java:62)
	at sun.reflect.DelegatingMethodAccessorImpl.invoke(DelegatingMethodAccessorImpl.java:43)
	at java.lang.reflect.Method.invoke(Method.java:498)
	at com.carrotsearch.randomizedtesting.RandomizedRunner.invoke(RandomizedRunner.java:1737)
	at com.carrotsearch.randomizedtesting.RandomizedRunner$8.evaluate(RandomizedRunner.java:934)
	at com.carrotsearch.randomizedtesting.RandomizedRunner$9.evaluate(RandomizedRunner.java:970)
	at com.carrotsearch.randomizedtesting.RandomizedRunner$10.evaluate(RandomizedRunner.java:984)
	at com.carrotsearch.randomizedtesting.rules.SystemPropertiesRestoreRule$1.evaluate(SystemPropertiesRestoreRule.java:57)
	at org.apache.lucene.util.TestRuleSetupTeardownChained$1.evaluate(TestRuleSetupTeardownChained.java:49)
	at org.apache.lucene.util.AbstractBeforeAfterRule$1.evaluate(AbstractBeforeAfterRule.java:45)
	at org.apache.lucene.util.TestRuleThreadAndTestName$1.evaluate(TestRuleThreadAndTestName.java:48)
	at org.apache.lucene.util.TestRuleIgnoreAfterMaxFailures$1.evaluate(TestRuleIgnoreAfterMaxFailures.java:64)
	at org.apache.lucene.util.TestRuleMarkFailure$1.evaluate(TestRuleMarkFailure.java:47)
	at com.carrotsearch.randomizedtesting.rules.StatementAdapter.evaluate(StatementAdapter.java:36)
	at com.carrotsearch.randomizedtesting.ThreadLeakControl$StatementRunner.run(ThreadLeakControl.java:368)
	at com.carrotsearch.randomizedtesting.ThreadLeakControl.forkTimeoutingTask(ThreadLeakControl.java:817)
	at com.carrotsearch.randomizedtesting.ThreadLeakControl$3.evaluate(ThreadLeakControl.java:468)
	at com.carrotsearch.randomizedtesting.RandomizedRunner.runSingleTest(RandomizedRunner.java:943)
	at com.carrotsearch.randomizedtesting.RandomizedRunner$5.evaluate(RandomizedRunner.java:829)
	at com.carrotsearch.randomizedtesting.RandomizedRunner$6.evaluate(RandomizedRunner.java:879)
	at com.carrotsearch.randomizedtesting.RandomizedRunner$7.evaluate(RandomizedRunner.java:890)
	at com.carrotsearch.randomizedtesting.rules.StatementAdapter.evaluate(StatementAdapter.java:36)
	at com.carrotsearch.randomizedtesting.rules.SystemPropertiesRestoreRule$1.evaluate(SystemPropertiesRestoreRule.java:57)
	at org.apache.lucene.util.AbstractBeforeAfterRule$1.evaluate(AbstractBeforeAfterRule.java:45)
	at com.carrotsearch.randomizedtesting.rules.StatementAdapter.evaluate(StatementAdapter.java:36)
	at org.apache.lucene.util.TestRuleStoreClassName$1.evaluate(TestRuleStoreClassName.java:41)
	at com.carrotsearch.randomizedtesting.rules.NoShadowingOrOverridesOnMethodsRule$1.evaluate(NoShadowingOrOverridesOnMethodsRule.java:40)
	at com.carrotsearch.randomizedtesting.rules.NoShadowingOrOverridesOnMethodsRule$1.evaluate(NoShadowingOrOverridesOnMethodsRule.java:40)
	at com.carrotsearch.randomizedtesting.rules.StatementAdapter.evaluate(StatementAdapter.java:36)
	at com.carrotsearch.randomizedtesting.rules.StatementAdapter.evaluate(StatementAdapter.java:36)
	at com.carrotsearch.randomizedtesting.rules.StatementAdapter.evaluate(StatementAdapter.java:36)
	at org.apache.lucene.util.TestRuleAssertionsRequired$1.evaluate(TestRuleAssertionsRequired.java:53)
	at org.apache.lucene.util.TestRuleMarkFailure$1.evaluate(TestRuleMarkFailure.java:47)
	at org.apache.lucene.util.TestRuleIgnoreAfterMaxFailures$1.evaluate(TestRuleIgnoreAfterMaxFailures.java:64)
	at org.apache.lucene.util.TestRuleIgnoreTestSuites$1.evaluate(TestRuleIgnoreTestSuites.java:54)
	at com.carrotsearch.randomizedtesting.rules.StatementAdapter.evaluate(StatementAdapter.java:36)
	at com.carrotsearch.randomizedtesting.ThreadLeakControl$StatementRunner.run(ThreadLeakControl.java:368)
	at java.lang.Thread.run(Thread.java:748)
Caused by: org.apache.solr.client.solrj.impl.HttpSolrClient$RemoteSolrException: Error from server at https://127.0.0.1:37155/solr/workQueue_shard2_replica_n3: Expected mime type application/octet-stream but got text/html. <html>
<head>
<meta http-equiv="Content-Type" content="text/html;charset=ISO-8859-1"/>
<title>Error 404 </title>
</head>
<body>
<h2>HTTP ERROR: 404</h2>
<p>Problem accessing /solr/workQueue_shard2_replica_n3/update. Reason:
<pre>    Can not find: /solr/workQueue_shard2_replica_n3/update</pre></p>
<hr /><a href="http://eclipse.org/jetty">Powered by Jetty:// 9.3.20.v20170531</a><hr/>
</body>
</html>

	at org.apache.solr.client.solrj.impl.HttpSolrClient.executeMethod(HttpSolrClient.java:591)
	at org.apache.solr.client.solrj.impl.HttpSolrClient.request(HttpSolrClient.java:253)
	at org.apache.solr.client.solrj.impl.HttpSolrClient.request(HttpSolrClient.java:242)
	at org.apache.solr.client.solrj.impl.LBHttpSolrClient.doRequest(LBHttpSolrClient.java:483)
	at org.apache.solr.client.solrj.impl.LBHttpSolrClient.request(LBHttpSolrClient.java:413)
	at org.apache.solr.client.solrj.impl.CloudSolrClient.lambda$directUpdate$0(CloudSolrClient.java:516)
	at java.util.concurrent.FutureTask.run(FutureTask.java:266)
	at org.apache.solr.common.util.ExecutorUtil$MDCAwareThreadPoolExecutor.lambda$execute$0(ExecutorUtil.java:188)
	at java.util.concurrent.ThreadPoolExecutor.runWorker(ThreadPoolExecutor.java:1149)
	at java.util.concurrent.ThreadPoolExecutor$Worker.run(ThreadPoolExecutor.java:624)
	... 1 more


FAILED:  junit.framework.TestSuite.org.apache.solr.core.TestLazyCores

Error Message:
1 thread leaked from SUITE scope at org.apache.solr.core.TestLazyCores:     1) Thread[id=1714, name=searcherExecutor-860-thread-1, state=WAITING, group=TGRP-TestLazyCores]         at sun.misc.Unsafe.park(Native Method)         at java.util.concurrent.locks.LockSupport.park(LockSupport.java:175)         at java.util.concurrent.locks.AbstractQueuedSynchronizer$ConditionObject.await(AbstractQueuedSynchronizer.java:2039)         at java.util.concurrent.LinkedBlockingQueue.take(LinkedBlockingQueue.java:442)         at java.util.concurrent.ThreadPoolExecutor.getTask(ThreadPoolExecutor.java:1074)         at java.util.concurrent.ThreadPoolExecutor.runWorker(ThreadPoolExecutor.java:1134)         at java.util.concurrent.ThreadPoolExecutor$Worker.run(ThreadPoolExecutor.java:624)         at java.lang.Thread.run(Thread.java:748)

Stack Trace:
com.carrotsearch.randomizedtesting.ThreadLeakError: 1 thread leaked from SUITE scope at org.apache.solr.core.TestLazyCores: 
   1) Thread[id=1714, name=searcherExecutor-860-thread-1, state=WAITING, group=TGRP-TestLazyCores]
        at sun.misc.Unsafe.park(Native Method)
        at java.util.concurrent.locks.LockSupport.park(LockSupport.java:175)
        at java.util.concurrent.locks.AbstractQueuedSynchronizer$ConditionObject.await(AbstractQueuedSynchronizer.java:2039)
        at java.util.concurrent.LinkedBlockingQueue.take(LinkedBlockingQueue.java:442)
        at java.util.concurrent.ThreadPoolExecutor.getTask(ThreadPoolExecutor.java:1074)
        at java.util.concurrent.ThreadPoolExecutor.runWorker(ThreadPoolExecutor.java:1134)
        at java.util.concurrent.ThreadPoolExecutor$Worker.run(ThreadPoolExecutor.java:624)
        at java.lang.Thread.run(Thread.java:748)
	at __randomizedtesting.SeedInfo.seed([3CE0F72696511F2D]:0)


FAILED:  junit.framework.TestSuite.org.apache.solr.core.TestLazyCores

Error Message:
There are still zombie threads that couldn't be terminated:    1) Thread[id=1714, name=searcherExecutor-860-thread-1, state=WAITING, group=TGRP-TestLazyCores]         at sun.misc.Unsafe.park(Native Method)         at java.util.concurrent.locks.LockSupport.park(LockSupport.java:175)         at java.util.concurrent.locks.AbstractQueuedSynchronizer$ConditionObject.await(AbstractQueuedSynchronizer.java:2039)         at java.util.concurrent.LinkedBlockingQueue.take(LinkedBlockingQueue.java:442)         at java.util.concurrent.ThreadPoolExecutor.getTask(ThreadPoolExecutor.java:1074)         at java.util.concurrent.ThreadPoolExecutor.runWorker(ThreadPoolExecutor.java:1134)         at java.util.concurrent.ThreadPoolExecutor$Worker.run(ThreadPoolExecutor.java:624)         at java.lang.Thread.run(Thread.java:748)

Stack Trace:
com.carrotsearch.randomizedtesting.ThreadLeakError: There are still zombie threads that couldn't be terminated:
   1) Thread[id=1714, name=searcherExecutor-860-thread-1, state=WAITING, group=TGRP-TestLazyCores]
        at sun.misc.Unsafe.park(Native Method)
        at java.util.concurrent.locks.LockSupport.park(LockSupport.java:175)
        at java.util.concurrent.locks.AbstractQueuedSynchronizer$ConditionObject.await(AbstractQueuedSynchronizer.java:2039)
        at java.util.concurrent.LinkedBlockingQueue.take(LinkedBlockingQueue.java:442)
        at java.util.concurrent.ThreadPoolExecutor.getTask(ThreadPoolExecutor.java:1074)
        at java.util.concurrent.ThreadPoolExecutor.runWorker(ThreadPoolExecutor.java:1134)
        at java.util.concurrent.ThreadPoolExecutor$Worker.run(ThreadPoolExecutor.java:624)
        at java.lang.Thread.run(Thread.java:748)
	at __randomizedtesting.SeedInfo.seed([3CE0F72696511F2D]:0)


FAILED:  org.apache.solr.core.TestLazyCores.testNoCommit

Error Message:
Exception during query

Stack Trace:
java.lang.RuntimeException: Exception during query
	at __randomizedtesting.SeedInfo.seed([3CE0F72696511F2D:E38056F75D767C88]:0)
	at org.apache.solr.SolrTestCaseJ4.assertQ(SolrTestCaseJ4.java:884)
	at org.apache.solr.core.TestLazyCores.check10(TestLazyCores.java:847)
	at org.apache.solr.core.TestLazyCores.testNoCommit(TestLazyCores.java:829)
	at sun.reflect.NativeMethodAccessorImpl.invoke0(Native Method)
	at sun.reflect.NativeMethodAccessorImpl.invoke(NativeMethodAccessorImpl.java:62)
	at sun.reflect.DelegatingMethodAccessorImpl.invoke(DelegatingMethodAccessorImpl.java:43)
	at java.lang.reflect.Method.invoke(Method.java:498)
	at com.carrotsearch.randomizedtesting.RandomizedRunner.invoke(RandomizedRunner.java:1737)
	at com.carrotsearch.randomizedtesting.RandomizedRunner$8.evaluate(RandomizedRunner.java:934)
	at com.carrotsearch.randomizedtesting.RandomizedRunner$9.evaluate(RandomizedRunner.java:970)
	at com.carrotsearch.randomizedtesting.RandomizedRunner$10.evaluate(RandomizedRunner.java:984)
	at com.carrotsearch.randomizedtesting.rules.SystemPropertiesRestoreRule$1.evaluate(SystemPropertiesRestoreRule.java:57)
	at org.apache.lucene.util.TestRuleSetupTeardownChained$1.evaluate(TestRuleSetupTeardownChained.java:49)
	at org.apache.lucene.util.AbstractBeforeAfterRule$1.evaluate(AbstractBeforeAfterRule.java:45)
	at org.apache.lucene.util.TestRuleThreadAndTestName$1.evaluate(TestRuleThreadAndTestName.java:48)
	at org.apache.lucene.util.TestRuleIgnoreAfterMaxFailures$1.evaluate(TestRuleIgnoreAfterMaxFailures.java:64)
	at org.apache.lucene.util.TestRuleMarkFailure$1.evaluate(TestRuleMarkFailure.java:47)
	at com.carrotsearch.randomizedtesting.rules.StatementAdapter.evaluate(StatementAdapter.java:36)
	at com.carrotsearch.randomizedtesting.ThreadLeakControl$StatementRunner.run(ThreadLeakControl.java:368)
	at com.carrotsearch.randomizedtesting.ThreadLeakControl.forkTimeoutingTask(ThreadLeakControl.java:817)
	at com.carrotsearch.randomizedtesting.ThreadLeakControl$3.evaluate(ThreadLeakControl.java:468)
	at com.carrotsearch.randomizedtesting.RandomizedRunner.runSingleTest(RandomizedRunner.java:943)
	at com.carrotsearch.randomizedtesting.RandomizedRunner$5.evaluate(RandomizedRunner.java:829)
	at com.carrotsearch.randomizedtesting.RandomizedRunner$6.evaluate(RandomizedRunner.java:879)
	at com.carrotsearch.randomizedtesting.RandomizedRunner$7.evaluate(RandomizedRunner.java:890)
	at com.carrotsearch.randomizedtesting.rules.StatementAdapter.evaluate(StatementAdapter.java:36)
	at com.carrotsearch.randomizedtesting.rules.SystemPropertiesRestoreRule$1.evaluate(SystemPropertiesRestoreRule.java:57)
	at org.apache.lucene.util.AbstractBeforeAfterRule$1.evaluate(AbstractBeforeAfterRule.java:45)
	at com.carrotsearch.randomizedtesting.rules.StatementAdapter.evaluate(StatementAdapter.java:36)
	at org.apache.lucene.util.TestRuleStoreClassName$1.evaluate(TestRuleStoreClassName.java:41)
	at com.carrotsearch.randomizedtesting.rules.NoShadowingOrOverridesOnMethodsRule$1.evaluate(NoShadowingOrOverridesOnMethodsRule.java:40)
	at com.carrotsearch.randomizedtesting.rules.NoShadowingOrOverridesOnMethodsRule$1.evaluate(NoShadowingOrOverridesOnMethodsRule.java:40)
	at com.carrotsearch.randomizedtesting.rules.StatementAdapter.evaluate(StatementAdapter.java:36)
	at com.carrotsearch.randomizedtesting.rules.StatementAdapter.evaluate(StatementAdapter.java:36)
	at com.carrotsearch.randomizedtesting.rules.StatementAdapter.evaluate(StatementAdapter.java:36)
	at org.apache.lucene.util.TestRuleAssertionsRequired$1.evaluate(TestRuleAssertionsRequired.java:53)
	at org.apache.lucene.util.TestRuleMarkFailure$1.evaluate(TestRuleMarkFailure.java:47)
	at org.apache.lucene.util.TestRuleIgnoreAfterMaxFailures$1.evaluate(TestRuleIgnoreAfterMaxFailures.java:64)
	at org.apache.lucene.util.TestRuleIgnoreTestSuites$1.evaluate(TestRuleIgnoreTestSuites.java:54)
	at com.carrotsearch.randomizedtesting.rules.StatementAdapter.evaluate(StatementAdapter.java:36)
	at com.carrotsearch.randomizedtesting.ThreadLeakControl$StatementRunner.run(ThreadLeakControl.java:368)
	at java.lang.Thread.run(Thread.java:748)
Caused by: java.lang.RuntimeException: REQUEST FAILED: xpath=//result[@numFound='10']
	xml response was: <?xml version="1.0" encoding="UTF-8"?>
<response>
<lst name="responseHeader"><int name="status">0</int><int name="QTime">0</int><lst name="params"><str name="q">*:*</str></lst></lst><result name="response" numFound="0" start="0"></result>
</response>

	request was:q=*:*
	at org.apache.solr.SolrTestCaseJ4.assertQ(SolrTestCaseJ4.java:877)
	... 41 more




Build Log:
[...truncated 11609 lines...]
   [junit4] Suite: org.apache.solr.core.TestLazyCores
   [junit4]   2> Creating dataDir: /home/jenkins/workspace/Lucene-Solr-7.x-Linux/solr/build/solr-core/test/J0/temp/solr.core.TestLazyCores_3CE0F72696511F2D-001/init-core-data-001
   [junit4]   2> 139088 WARN  (SUITE-TestLazyCores-seed#[3CE0F72696511F2D]-worker) [    ] o.a.s.SolrTestCaseJ4 startTrackingSearchers: numOpens=1 numCloses=1
   [junit4]   2> 139088 INFO  (SUITE-TestLazyCores-seed#[3CE0F72696511F2D]-worker) [    ] o.a.s.SolrTestCaseJ4 Using PointFields (NUMERIC_POINTS_SYSPROP=true) w/NUMERIC_DOCVALUES_SYSPROP=false
   [junit4]   2> 139089 INFO  (SUITE-TestLazyCores-seed#[3CE0F72696511F2D]-worker) [    ] o.a.s.SolrTestCaseJ4 Randomized ssl (false) and clientAuth (true) via: @org.apache.solr.util.RandomizeSSL(reason=, ssl=NaN, value=NaN, clientAuth=NaN)
   [junit4]   2> 139090 INFO  (SUITE-TestLazyCores-seed#[3CE0F72696511F2D]-worker) [    ] o.a.s.SolrTestCaseJ4 SecureRandom sanity checks: test.solr.allowed.securerandom=null & java.security.egd=file:/dev/./urandom
   [junit4]   2> 139090 INFO  (TEST-TestLazyCores.testCreateTransientFromAdmin-seed#[3CE0F72696511F2D]) [    ] o.a.s.SolrTestCaseJ4 ###Starting testCreateTransientFromAdmin
   [junit4]   2> 139098 INFO  (TEST-TestLazyCores.testCreateTransientFromAdmin-seed#[3CE0F72696511F2D]) [    ] o.a.s.c.SolrXmlConfig Loading container configuration from /home/jenkins/workspace/Lucene-Solr-7.x-Linux/solr/build/solr-core/test/J0/temp/solr.core.TestLazyCores_3CE0F72696511F2D-001/tempDir-001/solr.xml
   [junit4]   2> 139101 INFO  (TEST-TestLazyCores.testCreateTransientFromAdmin-seed#[3CE0F72696511F2D]) [    ] o.a.s.c.SolrXmlConfig MBean server found: com.sun.jmx.mbeanserver.JmxMBeanServer@61ad97b1, but no JMX reporters were configured - adding default JMX reporter.
   [junit4]   2> 139118 INFO  (TEST-TestLazyCores.testCreateTransientFromAdmin-seed#[3CE0F72696511F2D]) [    ] o.a.s.m.r.SolrJmxReporter JMX monitoring for 'solr.node' (registry 'solr.node') enabled at server: com.sun.jmx.mbeanserver.JmxMBeanServer@61ad97b1
   [junit4]   2> 139118 INFO  (TEST-TestLazyCores.testCreateTransientFromAdmin-seed#[3CE0F72696511F2D]) [    ] o.a.s.m.r.SolrJmxReporter JMX monitoring for 'solr.jvm' (registry 'solr.jvm') enabled at server: com.sun.jmx.mbeanserver.JmxMBeanServer@61ad97b1
   [junit4]   2> 139118 INFO  (TEST-TestLazyCores.testCreateTransientFromAdmin-seed#[3CE0F72696511F2D]) [    ] o.a.s.m.r.SolrJmxReporter JMX monitoring for 'solr.jetty' (registry 'solr.jetty') enabled at server: com.sun.jmx.mbeanserver.JmxMBeanServer@61ad97b1
   [junit4]   2> 139121 INFO  (TEST-TestLazyCores.testCreateTransientFromAdmin-seed#[3CE0F72696511F2D]) [    ] o.a.s.c.TransientSolrCoreCacheDefault Allocating transient cache for 4 transient cores
   [junit4]   2> 139146 INFO  (coreLoadExecutor-644-thread-1) [    x:collection1] o.a.s.c.SolrConfig Using Lucene MatchVersion: 7.1.0
   [junit4]   2> 139159 INFO  (coreLoadExecutor-644-thread-1) [    x:collection1] o.a.s.s.IndexSchema [collection1] Schema name=tiny
   [junit4]   2> 139159 INFO  (coreLoadExecutor-644-thread-3) [    x:collection5] o.a.s.c.SolrConfig Using Lucene MatchVersion: 7.1.0
   [junit4]   2> 139159 INFO  (coreLoadExecutor-644-thread-2) [    x:collection2] o.a.s.c.SolrConfig Using Lucene MatchVersion: 7.1.0
   [junit4]   2> 139162 INFO  (coreLoadExecutor-644-thread-1) [    x:collection1] o.a.s.s.IndexSchema Loaded schema tiny/1.1 with uniqueid field id
   [junit4]   2> 139162 INFO  (coreLoadExecutor-644-thread-1) [    x:collection1] o.a.s.c.CoreContainer Creating SolrCore 'collection1' using configuration from instancedir /home/jenkins/workspace/Lucene-Solr-7.x-Linux/solr/build/solr-core/test/J0/temp/solr.core.TestLazyCores_3CE0F72696511F2D-001/tempDir-001/./collection1, trusted=true
   [junit4]   2> 139162 INFO  (coreLoadExecutor-644-thread-1) [    x:collection1] o.a.s.m.r.SolrJmxReporter JMX monitoring for 'solr.core.collection1' (registry 'solr.core.collection1') enabled at server: com.sun.jmx.mbeanserver.JmxMBeanServer@61ad97b1
   [junit4]   2> 139162 INFO  (coreLoadExecutor-644-thread-1) [    x:collection1] o.a.s.c.SolrCore solr.RecoveryStrategy.Builder
   [junit4]   2> 139162 INFO  (coreLoadExecutor-644-thread-1) [    x:collection1] o.a.s.c.SolrCore [[collection1] ] Opening new SolrCore at [/home/jenkins/workspace/Lucene-Solr-7.x-Linux/solr/build/solr-core/test/J0/temp/solr.core.TestLazyCores_3CE0F72696511F2D-001/tempDir-001/collection1], dataDir=[/home/jenkins/workspace/Lucene-Solr-7.x-Linux/solr/build/solr-core/test/J0/temp/solr.core.TestLazyCores_3CE0F72696511F2D-001/tempDir-001/./collection1/data/]
   [junit4]   2> 139164 INFO  (coreLoadExecutor-644-thread-2) [    x:collection2] o.a.s.s.IndexSchema [collection2] Schema name=tiny
   [junit4]   2> 139164 INFO  (coreLoadExecutor-644-thread-3) [    x:collection5] o.a.s.s.IndexSchema [collection5] Schema name=tiny
   [junit4]   2> 139165 INFO  (coreLoadExecutor-644-thread-1) [    x:collection1] o.a.s.u.RandomMergePolicy RandomMergePolicy wrapping class org.apache.lucene.index.TieredMergePolicy: [TieredMergePolicy: maxMergeAtOnce=48, maxMergeAtOnceExplicit=24, maxMergedSegmentMB=4.6015625, floorSegmentMB=1.4599609375, forceMergeDeletesPctAllowed=22.610725253419485, segmentsPerTier=10.0, maxCFSSegmentSizeMB=8.796093022207999E12, noCFSRatio=0.5553719341167676
   [junit4]   2> 139166 INFO  (coreLoadExecutor-644-thread-3) [    x:collection5] o.a.s.s.IndexSchema Loaded schema tiny/1.1 with uniqueid field id
   [junit4]   2> 139166 INFO  (coreLoadExecutor-644-thread-3) [    x:collection5] o.a.s.c.CoreContainer Creating SolrCore 'collection5' using configuration from instancedir /home/jenkins/workspace/Lucene-Solr-7.x-Linux/solr/build/solr-core/test/J0/temp/solr.core.TestLazyCores_3CE0F72696511F2D-001/tempDir-001/./collection5, trusted=true
   [junit4]   2> 139166 INFO  (coreLoadExecutor-644-thread-3) [    x:collection5] o.a.s.m.r.SolrJmxReporter JMX monitoring for 'solr.core.collection5' (registry 'solr.core.collection5') enabled at server: com.sun.jmx.mbeanserver.JmxMBeanServer@61ad97b1
   [junit4]   2> 139166 INFO  (coreLoadExecutor-644-thread-3) [    x:collection5] o.a.s.c.SolrCore solr.RecoveryStrategy.Builder
   [junit4]   2> 139166 INFO  (coreLoadExecutor-644-thread-3) [    x:collection5] o.a.s.c.SolrCore [[collection5] ] Opening new SolrCore at [/home/jenkins/workspace/Lucene-Solr-7.x-Linux/solr/build/solr-core/test/J0/temp/solr.core.TestLazyCores_3CE0F72696511F2D-001/tempDir-001/collection5], dataDir=[/home/jenkins/workspace/Lucene-Solr-7.x-Linux/solr/build/solr-core/test/J0/temp/solr.core.TestLazyCores_3CE0F72696511F2D-001/tempDir-001/./collection5/data/]
   [junit4]   2> 139168 INFO  (coreLoadExecutor-644-thread-3) [    x:collection5] o.a.s.u.RandomMergePolicy RandomMergePolicy wrapping class org.apache.lucene.index.TieredMergePolicy: [TieredMergePolicy: maxMergeAtOnce=48, maxMergeAtOnceExplicit=24, maxMergedSegmentMB=4.6015625, floorSegmentMB=1.4599609375, forceMergeDeletesPctAllowed=22.610725253419485, segmentsPerTier=10.0, maxCFSSegmentSizeMB=8.796093022207999E12, noCFSRatio=0.5553719341167676
   [junit4]   2> 139170 INFO  (coreLoadExecutor-644-thread-2) [    x:collection2] o.a.s.s.IndexSchema Loaded schema tiny/1.1 with uniqueid field id
   [junit4]   2> 139170 INFO  (coreLoadExecutor-644-thread-2) [    x:collection2] o.a.s.c.CoreContainer Creating SolrCore 'collection2' using configuration from instancedir /home/jenkins/workspace/Lucene-Solr-7.x-Linux/solr/build/solr-core/test/J0/temp/solr.core.TestLazyCores_3CE0F72696511F2D-001/tempDir-001/./collection2, trusted=true
   [junit4]   2> 139170 INFO  (coreLoadExecutor-644-thread-2) [    x:collection2] o.a.s.m.r.SolrJmxReporter JMX monitoring for 'solr.core.collection2' (registry 'solr.core.collection2') enabled at server: com.sun.jmx.mbeanserver.JmxMBeanServer@61ad97b1
   [junit4]   2> 139170 INFO  (coreLoadExecutor-644-thread-2) [    x:collection2] o.a.s.c.SolrCore solr.RecoveryStrategy.Builder
   [junit4]   2> 139170 INFO  (coreLoadExecutor-644-thread-2) [    x:collection2] o.a.s.c.SolrCore [[collection2] ] Opening new SolrCore at [/home/jenkins/workspace/Lucene-Solr-7.x-Linux/solr/build/solr-core/test/J0/temp/solr.core.TestLazyCores_3CE0F72696511F2D-001/tempDir-001/collection2], dataDir=[/home/jenkins/workspace/Lucene-Solr-7.x-Linux/solr/build/solr-core/test/J0/temp/solr.core.TestLazyCores_3CE0F72696511F2D-001/tempDir-001/./collection2/data/]
   [junit4]   2> 139172 INFO  (coreLoadExecutor-644-thread-2) [    x:collection2] o.a.s.u.RandomMergePolicy RandomMergePolicy wrapping class org.apache.lucene.index.TieredMergePolicy: [TieredMergePolicy: maxMergeAtOnce=48, maxMergeAtOnceExplicit=24, maxMergedSegmentMB=4.6015625, floorSegmentMB=1.4599609375, forceMergeDeletesPctAllowed=22.610725253419485, segmentsPerTier=10.0, maxCFSSegmentSizeMB=8.796093022207999E12, noCFSRatio=0.5553719341167676
   [junit4]   2> 139250 INFO  (coreLoadExecutor-644-thread-3) [    x:collection5] o.a.s.u.CommitTracker Hard AutoCommit: disabled
   [junit4]   2> 139250 INFO  (coreLoadExecutor-644-thread-3) [    x:collection5] o.a.s.u.CommitTracker Soft AutoCommit: disabled
   [junit4]   2> 139250 INFO  (coreLoadExecutor-644-thread-1) [    x:collection1] o.a.s.u.CommitTracker Hard AutoCommit: disabled
   [junit4]   2> 139250 INFO  (coreLoadExecutor-644-thread-1) [    x:collection1] o.a.s.u.CommitTracker Soft AutoCommit: disabled
   [junit4]   2> 139250 INFO  (coreLoadExecutor-644-thread-3) [    x:collection5] o.a.s.u.RandomMergePolicy RandomMergePolicy wrapping class org.apache.lucene.index.TieredMergePolicy: [TieredMergePolicy: maxMergeAtOnce=39, maxMergeAtOnceExplicit=15, maxMergedSegmentMB=15.1806640625, floorSegmentMB=1.697265625, forceMergeDeletesPctAllowed=27.354695061717983, segmentsPerTier=21.0, maxCFSSegmentSizeMB=8.796093022207999E12, noCFSRatio=0.0
   [junit4]   2> 139251 INFO  (coreLoadExecutor-644-thread-1) [    x:collection1] o.a.s.u.RandomMergePolicy RandomMergePolicy wrapping class org.apache.lucene.index.TieredMergePolicy: [TieredMergePolicy: maxMergeAtOnce=39, maxMergeAtOnceExplicit=15, maxMergedSegmentMB=15.1806640625, floorSegmentMB=1.697265625, forceMergeDeletesPctAllowed=27.354695061717983, segmentsPerTier=21.0, maxCFSSegmentSizeMB=8.796093022207999E12, noCFSRatio=0.0
   [junit4]   2> 139251 INFO  (coreLoadExecutor-644-thread-3) [    x:collection5] o.a.s.s.SolrIndexSearcher Opening [Searcher@1f37c81f[collection5] main]
   [junit4]   2> 139251 INFO  (coreLoadExecutor-644-thread-1) [    x:collection1] o.a.s.s.SolrIndexSearcher Opening [Searcher@2674e37e[collection1] main]
   [junit4]   2> 139251 INFO  (coreLoadExecutor-644-thread-3) [    x:collection5] o.a.s.r.ManagedResourceStorage File-based storage initialized to use dir: /home/jenkins/workspace/Lucene-Solr-7.x-Linux/solr/build/solr-core/test/J0/temp/solr.core.TestLazyCores_3CE0F72696511F2D-001/tempDir-001/collection5/conf
   [junit4]   2> 139251 INFO  (coreLoadExecutor-644-thread-1) [    x:collection1] o.a.s.r.ManagedResourceStorage File-based storage initialized to use dir: /home/jenkins/workspace/Lucene-Solr-7.x-Linux/solr/build/solr-core/test/J0/temp/solr.core.TestLazyCores_3CE0F72696511F2D-001/tempDir-001/collection1/conf
   [junit4]   2> 139251 INFO  (coreLoadExecutor-644-thread-3) [    x:collection5] o.a.s.h.ReplicationHandler Commits will be reserved for 10000ms.
   [junit4]   2> 139251 INFO  (coreLoadExecutor-644-thread-1) [    x:collection1] o.a.s.h.ReplicationHandler Commits will be reserved for 10000ms.
   [junit4]   2> 139252 INFO  (searcherExecutor-645-thread-1-processing-x:collection1) [    x:collection1] o.a.s.c.SolrCore [collection1] Registered new searcher Searcher@2674e37e[collection1] main{ExitableDirectoryReader(UninvertingDirectoryReader())}
   [junit4]   2> 139255 INFO  (searcherExecutor-646-thread-1-processing-x:collection5) [    x:collection5] o.a.s.c.SolrCore [collection5] Registered new searcher Searcher@1f37c81f[collection5] main{ExitableDirectoryReader(UninvertingDirectoryReader())}
   [junit4]   2> 139268 INFO  (coreLoadExecutor-644-thread-2) [    x:collection2] o.a.s.u.CommitTracker Hard AutoCommit: disabled
   [junit4]   2> 139268 INFO  (coreLoadExecutor-644-thread-2) [    x:collection2] o.a.s.u.CommitTracker Soft AutoCommit: disabled
   [junit4]   2> 139269 INFO  (coreLoadExecutor-644-thread-2) [    x:collection2] o.a.s.u.RandomMergePolicy RandomMergePolicy wrapping class org.apache.lucene.index.TieredMergePolicy: [TieredMergePolicy: maxMergeAtOnce=39, maxMergeAtOnceExplicit=15, maxMergedSegmentMB=15.1806640625, floorSegmentMB=1.697265625, forceMergeDeletesPctAllowed=27.354695061717983, segmentsPerTier=21.0, maxCFSSegmentSizeMB=8.796093022207999E12, noCFSRatio=0.0
   [junit4]   2> 139270 INFO  (coreLoadExecutor-644-thread-2) [    x:collection2] o.a.s.s.SolrIndexSearcher Opening [Searcher@427e0890[collection2] main]
   [junit4]   2> 139270 INFO  (coreLoadExecutor-644-thread-2) [    x:collection2] o.a.s.r.ManagedResourceStorage File-based storage initialized to use dir: /home/jenkins/workspace/Lucene-Solr-7.x-Linux/solr/build/solr-core/test/J0/temp/solr.core.TestLazyCores_3CE0F72696511F2D-001/tempDir-001/collection2/conf
   [junit4]   2> 139270 INFO  (coreLoadExecutor-644-thread-2) [    x:collection2] o.a.s.h.ReplicationHandler Commits will be reserved for 10000ms.
   [junit4]   2> 139271 INFO  (searcherExecutor-647-thread-1-processing-x:collection2) [    x:collection2] o.a.s.c.SolrCore [collection2] Registered new searcher Searcher@427e0890[collection2] main{ExitableDirectoryReader(UninvertingDirectoryReader())}
   [junit4]   2> 139276 INFO  (TEST-TestLazyCores.testCreateTransientFromAdmin-seed#[3CE0F72696511F2D]) [    ] o.a.s.h.a.CoreAdminOperation core create command loadOnStartup=true&transient=true&name=core1&action=CREATE&wt=xml
   [junit4]   2> 139284 INFO  (TEST-TestLazyCores.testCreateTransientFromAdmin-seed#[3CE0F72696511F2D]) [    x:core1] o.a.s.c.SolrConfig Using Lucene MatchVersion: 7.1.0
   [junit4]   2> 139288 INFO  (TEST-TestLazyCores.testCreateTransientFromAdmin-seed#[3CE0F72696511F2D]) [    x:core1] o.a.s.s.IndexSchema [core1] Schema name=tiny
   [junit4]   2> 139290 INFO  (TEST-TestLazyCores.testCreateTransientFromAdmin-seed#[3CE0F72696511F2D]) [    x:core1] o.a.s.s.IndexSchema Loaded schema tiny/1.1 with uniqueid field id
   [junit4]   2> 139290 INFO  (TEST-TestLazyCores.testCreateTransientFromAdmin-seed#[3CE0F72696511F2D]) [    x:core1] o.a.s.c.CoreContainer Creating SolrCore 'core1' using configuration from instancedir /home/jenkins/workspace/Lucene-Solr-7.x-Linux/solr/build/solr-core/test/J0/temp/solr.core.TestLazyCores_3CE0F72696511F2D-001/tempDir-001/./core1, trusted=true
   [junit4]   2> 139290 INFO  (TEST-TestLazyCores.testCreateTransientFromAdmin-seed#[3CE0F72696511F2D]) [    x:core1] o.a.s.m.r.SolrJmxReporter JMX monitoring for 'solr.core.core1' (registry 'solr.core.core1') enabled at server: com.sun.jmx.mbeanserver.JmxMBeanServer@61ad97b1
   [junit4]   2> 139290 INFO  (TEST-TestLazyCores.testCreateTransientFromAdmin-seed#[3CE0F72696511F2D]) [    x:core1] o.a.s.c.SolrCore solr.RecoveryStrategy.Builder
   [junit4]   2> 139291 INFO  (TEST-TestLazyCores.testCreateTransientFromAdmin-seed#[3CE0F72696511F2D]) [    x:core1] o.a.s.c.SolrCore [[core1] ] Opening new SolrCore at [/home/jenkins/workspace/Lucene-Solr-7.x-Linux/solr/build/solr-core/test/J0/temp/solr.core.TestLazyCores_3CE0F72696511F2D-001/tempDir-001/core1], dataDir=[/home/jenkins/workspace/Lucene-Solr-7.x-Linux/solr/build/solr-core/test/J0/temp/solr.core.TestLazyCores_3CE0F72696511F2D-001/tempDir-001/./core1/data/]
   [junit4]   2> 139293 INFO  (TEST-TestLazyCores.testCreateTransientFromAdmin-seed#[3CE0F72696511F2D]) [    x:core1] o.a.s.u.RandomMergePolicy RandomMergePolicy wrapping class org.apache.lucene.index.LogByteSizeMergePolicy: [LogByteSizeMergePolicy: minMergeSize=1677721, mergeFactor=15, maxMergeSize=2147483648, maxMergeSizeForForcedMerge=9223372036854775807, calibrateSizeByDeletes=false, maxMergeDocs=2147483647, maxCFSSegmentSizeMB=8.796093022207999E12, noCFSRatio=1.0]
   [junit4]   2> 139336 INFO  (TEST-TestLazyCores.testCreateTransientFromAdmin-seed#[3CE0F72696511F2D]) [    x:core1] o.a.s.u.CommitTracker Hard AutoCommit: disabled
   [junit4]   2> 139336 INFO  (TEST-TestLazyCores.testCreateTransientFromAdmin-seed#[3CE0F72696511F2D]) [    x:core1] o.a.s.u.CommitTracker Soft AutoCommit: disabled
   [junit4]   2> 139337 INFO  (TEST-TestLazyCores.testCreateTransientFromAdmin-seed#[3CE0F72696511F2D]) [    x:core1] o.a.s.u.RandomMergePolicy RandomMergePolicy wrapping class org.apache.lucene.index.AlcoholicMergePolicy: [AlcoholicMergePolicy: minMergeSize=0, mergeFactor=10, maxMergeSize=280000533, maxMergeSizeForForcedMerge=9223372036854775807, calibrateSizeByDeletes=true, maxMergeDocs=2147483647, maxCFSSegmentSizeMB=8.796093022207999E12, noCFSRatio=0.1]
   [junit4]   2> 139338 INFO  (TEST-TestLazyCores.testCreateTransientFromAdmin-seed#[3CE0F72696511F2D]) [    x:core1] o.a.s.s.SolrIndexSearcher Opening [Searcher@35489590[core1] main]
   [junit4]   2> 139338 INFO  (TEST-TestLazyCores.testCreateTransientFromAdmin-seed#[3CE0F72696511F2D]) [    x:core1] o.a.s.r.ManagedResourceStorage File-based storage initialized to use dir: /home/jenkins/workspace/Lucene-Solr-7.x-Linux/solr/build/solr-core/test/J0/temp/solr.core.TestLazyCores_3CE0F72696511F2D-001/tempDir-001/core1/conf
   [junit4]   2> 139339 INFO  (TEST-TestLazyCores.testCreateTransientFromAdmin-seed#[3CE0F72696511F2D]) [    x:core1] o.a.s.h.ReplicationHandler Commits will be reserved for 10000ms.
   [junit4]   2> 139339 INFO  (TEST-TestLazyCores.testCreateTransientFromAdmin-seed#[3CE0F72696511F2D]) [    x:core1] o.a.s.h.a.CoreAdminOperation core create command loadOnStartup=false&transient=true&name=core2&action=CREATE&wt=xml
   [junit4]   2> 139339 INFO  (searcherExecutor-658-thread-1-processing-x:core1) [    x:core1] o.a.s.c.SolrCore [core1] Registered new searcher Searcher@35489590[core1] main{ExitableDirectoryReader(UninvertingDirectoryReader())}
   [junit4]   2> 139347 INFO  (TEST-TestLazyCores.testCreateTransientFromAdmin-seed#[3CE0F72696511F2D]) [    x:core1] o.a.s.c.SolrConfig Using Lucene MatchVersion: 7.1.0
   [junit4]   2> 139351 INFO  (TEST-TestLazyCores.testCreateTransientFromAdmin-seed#[3CE0F72696511F2D]) [    x:core1] o.a.s.s.IndexSchema [core2] Schema name=tiny
   [junit4]   2> 139352 INFO  (TEST-TestLazyCores.testCreateTransientFromAdmin-seed#[3CE0F72696511F2D]) [    x:core1] o.a.s.s.IndexSchema Loaded schema tiny/1.1 with uniqueid field id
   [junit4]   2> 139353 INFO  (TEST-TestLazyCores.testCreateTransientFromAdmin-seed#[3CE0F72696511F2D]) [    x:core1] o.a.s.c.CoreContainer Creating SolrCore 'core2' using configuration from instancedir /home/jenkins/workspace/Lucene-Solr-7.x-Linux/solr/build/solr-core/test/J0/temp/solr.core.TestLazyCores_3CE0F72696511F2D-001/tempDir-001/./core2, trusted=true
   [junit4]   2> 139353 INFO  (TEST-TestLazyCores.testCreateTransientFromAdmin-seed#[3CE0F72696511F2D]) [    x:core1] o.a.s.m.r.SolrJmxReporter JMX monitoring for 'solr.core.core2' (registry 'solr.core.core2') enabled at server: com.sun.jmx.mbeanserver.JmxMBeanServer@61ad97b1
   [junit4]   2> 139353 INFO  (TEST-TestLazyCores.testCreateTransientFromAdmin-seed#[3CE0F72696511F2D]) [    x:core1] o.a.s.c.SolrCore solr.RecoveryStrategy.Builder
   [junit4]   2> 139353 INFO  (TEST-TestLazyCores.testCreateTransientFromAdmin-seed#[3CE0F72696511F2D]) [    x:core1] o.a.s.c.SolrCore [[core2] ] Opening new SolrCore at [/home/jenkins/workspace/Lucene-Solr-7.x-Linux/solr/build/solr-core/test/J0/temp/solr.core.TestLazyCores_3CE0F72696511F2D-001/tempDir-001/core2], dataDir=[/home/jenkins/workspace/Lucene-Solr-7.x-Linux/solr/build/solr-core/test/J0/temp/solr.core.TestLazyCores_3CE0F72696511F2D-001/tempDir-001/./core2/data/]
   [junit4]   2> 139355 INFO  (TEST-TestLazyCores.testCreateTransientFromAdmin-seed#[3CE0F72696511F2D]) [    x:core1] o.a.s.u.RandomMergePolicy RandomMergePolicy wrapping class org.apache.lucene.index.TieredMergePolicy: [TieredMergePolicy: maxMergeAtOnce=13, maxMergeAtOnceExplicit=31, maxMergedSegmentMB=30.3251953125, floorSegmentMB=1.3896484375, forceMergeDeletesPctAllowed=8.251169627335909, segmentsPerTier=21.0, maxCFSSegmentSizeMB=8.796093022207999E12, noCFSRatio=1.0
   [junit4]   2> 139541 INFO  (TEST-TestLazyCores.testCreateTransientFromAdmin-seed#[3CE0F72696511F2D]) [    x:core1] o.a.s.u.CommitTracker Hard AutoCommit: disabled
   [junit4]   2> 139541 INFO  (TEST-TestLazyCores.testCreateTransientFromAdmin-seed#[3CE0F72696511F2D]) [    x:core1] o.a.s.u.CommitTracker Soft AutoCommit: disabled
   [junit4]   2> 139542 INFO  (TEST-TestLazyCores.testCreateTransientFromAdmin-seed#[3CE0F72696511F2D]) [    x:core1] o.a.s.u.RandomMergePolicy RandomMergePolicy wrapping class org.apache.lucene.index.LogDocMergePolicy: [LogDocMergePolicy: minMergeSize=1000, mergeFactor=29, maxMergeSize=9223372036854775807, maxMergeSizeForForcedMerge=9223372036854775807, calibrateSizeByDeletes=true, maxMergeDocs=2147483647, maxCFSSegmentSizeMB=8.796093022207999E12, noCFSRatio=0.30880523570571117]
   [junit4]   2> 139542 INFO  (TEST-TestLazyCores.testCreateTransientFromAdmin-seed#[3CE0F72696511F2D]) [    x:core1] o.a.s.s.SolrIndexSearcher Opening [Searcher@673e0666[core2] main]
   [junit4]   2> 139543 INFO  (TEST-TestLazyCores.testCreateTransientFromAdmin-seed#[3CE0F72696511F2D]) [    x:core1] o.a.s.r.ManagedResourceStorage File-based storage initialized to use dir: /home/jenkins/workspace/Lucene-Solr-7.x-Linux/solr/build/solr-core/test/J0/temp/solr.core.TestLazyCores_3CE0F72696511F2D-001/tempDir-001/core2/conf
   [junit4]   2> 139543 INFO  (TEST-TestLazyCores.testCreateTransientFromAdmin-seed#[3CE0F72696511F2D]) [    x:core1] o.a.s.h.ReplicationHandler Commits will be reserved for 10000ms.
   [junit4]   2> 139544 INFO  (TEST-TestLazyCores.testCreateTransientFromAdmin-seed#[3CE0F72696511F2D]) [    x:core1] o.a.s.h.a.CoreAdminOperation core create command loadOnStartup=true&transient=true&name=core3&action=CREATE&wt=xml
   [junit4]   2> 139544 INFO  (searcherExecutor-663-thread-1-processing-x:core1) [    x:core1] o.a.s.c.SolrCore [core2] Registered new searcher Searcher@673e0666[core2] main{ExitableDirectoryReader(UninvertingDirectoryReader())}
   [junit4]   2> 139551 INFO  (TEST-TestLazyCores.testCreateTransientFromAdmin-seed#[3CE0F72696511F2D]) [    x:core1] o.a.s.c.SolrConfig Using Lucene MatchVersion: 7.1.0
   [junit4]   2> 139562 INFO  (TEST-TestLazyCores.testCreateTransientFromAdmin-seed#[3CE0F72696511F2D]) [    x:core1] o.a.s.s.IndexSchema [core3] Schema name=tiny
   [junit4]   2> 139563 INFO  (TEST-TestLazyCores.testCreateTransientFromAdmin-seed#[3CE0F72696511F2D]) [    x:core1] o.a.s.s.IndexSchema Loaded schema tiny/1.1 with uniqueid field id
   [junit4]   2> 139563 INFO  (TEST-TestLazyCores.testCreateTransientFromAdmin-seed#[3CE0F72696511F2D]) [    x:core1] o.a.s.c.CoreContainer Creating SolrCore 'core3' using configuration from instancedir /home/jenkins/workspace/Lucene-Solr-7.x-Linux/solr/build/solr-core/test/J0/temp/solr.core.TestLazyCores_3CE0F72696511F2D-001/tempDir-001/./core3, trusted=true
   [junit4]   2> 139564 INFO  (TEST-TestLazyCores.testCreateTransientFromAdmin-seed#[3CE0F72696511F2D]) [    x:core1] o.a.s.m.r.SolrJmxReporter JMX monitoring for 'solr.core.core3' (registry 'solr.core.core3') enabled at server: com.sun.jmx.mbeanserver.JmxMBeanServer@61ad97b1
   [junit4]   2> 139564 INFO  (TEST-TestLazyCores.testCreateTransientFromAdmin-seed#[3CE0F72696511F2D]) [    x:core1] o.a.s.c.SolrCore solr.RecoveryStrategy.Builder
   [junit4]   2> 139564 INFO  (TEST-TestLazyCores.testCreateTransientFromAdmin-seed#[3CE0F72696511F2D]) [    x:core1] o.a.s.c.SolrCore [[core3] ] Opening new SolrCore at [/home/jenkins/workspace/Lucene-Solr-7.x-Linux/solr/build/solr-core/test/J0/temp/solr.core.TestLazyCores_3CE0F72696511F2D-001/tempDir-001/core3], dataDir=[/home/jenkins/workspace/Lucene-Solr-7.x-Linux/solr/build/solr-core/test/J0/temp/solr.core.TestLazyCores_3CE0F72696511F2D-001/tempDir-001/./core3/data/]
   [junit4]   2> 139565 INFO  (TEST-TestLazyCores.testCreateTransientFromAdmin-seed#[3CE0F72696511F2D]) [    x:core1] o.a.s.u.RandomMergePolicy RandomMergePolicy wrapping class org.apache.lucene.index.LogByteSizeMergePolicy: [LogByteSizeMergePolicy: minMergeSize=1677721, mergeFactor=17, maxMergeSize=2147483648, maxMergeSizeForForcedMerge=9223372036854775807, calibrateSizeByDeletes=false, maxMergeDocs=2147483647, maxCFSSegmentSizeMB=1.6259765625, noCFSRatio=0.6828455127553219]
   [junit4]   2> 139604 INFO  (TEST-TestLazyCores.testCreateTransientFromAdmin-seed#[3CE0F72696511F2D]) [    x:core1] o.a.s.u.CommitTracker Hard AutoCommit: disabled
   [junit4]   2> 139604 INFO  (TEST-TestLazyCores.testCreateTransientFromAdmin-seed#[3CE0F72696511F2D]) [    x:core1] o.a.s.u.CommitTracker Soft AutoCommit: disabled
   [junit4]   2> 139605 INFO  (TEST-TestLazyCores.testCreateTransientFromAdmin-seed#[3CE0F72696511F2D]) [    x:core1] o.a.s.u.RandomMergePolicy RandomMergePolicy wrapping class org.apache.lucene.index.LogDocMergePolicy: [LogDocMergePolicy: minMergeSize=1000, mergeFactor=23, maxMergeSize=9223372036854775807, maxMergeSizeForForcedMerge=9223372036854775807, calibrateSizeByDeletes=true, maxMergeDocs=2147483647, maxCFSSegmentSizeMB=8.796093022207999E12, noCFSRatio=1.0]
   [junit4]   2> 139605 INFO  (TEST-TestLazyCores.testCreateTransientFromAdmin-seed#[3CE0F72696511F2D]) [    x:core1] o.a.s.s.SolrIndexSearcher Opening [Searcher@1da3aa13[core3] main]
   [junit4]   2> 139605 INFO  (TEST-TestLazyCores.testCreateTransientFromAdmin-seed#[3CE0F72696511F2D]) [    x:core1] o.a.s.r.ManagedResourceStorage File-based storage initialized to use dir: /home/jenkins/workspace/Lucene-Solr-7.x-Linux/solr/build/solr-core/test/J0/temp/solr.core.TestLazyCores_3CE0F72696511F2D-001/tempDir-001/core3/conf
   [junit4]   2> 139606 INFO  (TEST-TestLazyCores.testCreateTransientFromAdmin-seed#[3CE0F72696511F2D]) [    x:core1] o.a.s.h.ReplicationHandler Commits will be reserved for 10000ms.
   [junit4]   2> 139606 INFO  (TEST-TestLazyCores.testCreateTransientFromAdmin-seed#[3CE0F72696511F2D]) [    x:core1] o.a.s.h.a.CoreAdminOperation core create command loadOnStartup=false&transient=true&name=core4&action=CREATE&wt=xml
   [junit4]   2> 139606 INFO  (searcherExecutor-668-thread-1-processing-x:core1) [    x:core1] o.a.s.c.SolrCore [core3] Registered new searcher Searcher@1da3aa13[core3] main{ExitableDirectoryReader(UninvertingDirectoryReader())}
   [junit4]   2> 139612 INFO  (TEST-TestLazyCores.testCreateTransientFromAdmin-seed#[3CE0F72696511F2D]) [    x:core1] o.a.s.c.SolrConfig Using Lucene MatchVersion: 7.1.0
   [junit4]   2> 139615 INFO  (TEST-TestLazyCores.testCreateTransientFromAdmin-seed#[3CE0F72696511F2D]) [    x:core1] o.a.s.s.IndexSchema [core4] Schema name=tiny
   [junit4]   2> 139616 INFO  (TEST-TestLazyCores.testCreateTransientFromAdmin-seed#[3CE0F72696511F2D]) [    x:core1] o.a.s.s.IndexSchema Loaded schema tiny/1.1 with uniqueid field id
   [junit4]   2> 139617 INFO  (TEST-TestLazyCores.testCreateTransientFromAdmin-seed#[3CE0F72696511F2D]) [    x:core1] o.a.s.c.CoreContainer Creating SolrCore 'core4' using configuration from instancedir /home/jenkins/workspace/Lucene-Solr-7.x-Linux/solr/build/solr-core/test/J0/temp/solr.core.TestLazyCores_3CE0F72696511F2D-001/tempDir-001/./core4, trusted=true
   [junit4]   2> 139617 INFO  (TEST-TestLazyCores.testCreateTransientFromAdmin-seed#[3CE0F72696511F2D]) [    x:core1] o.a.s.m.r.SolrJmxReporter JMX monitoring for 'solr.core.core4' (registry 'solr.core.core4') enabled at server: com.sun.jmx.mbeanserver.JmxMBeanServer@61ad97b1
   [junit4]   2> 139617 INFO  (TEST-TestLazyCores.testCreateTransientFromAdmin-seed#[3CE0F72696511F2D]) [    x:core1] o.a.s.c.SolrCore solr.RecoveryStrategy.Builder
   [junit4]   2> 139617 INFO  (TEST-TestLazyCores.testCreateTransientFromAdmin-seed#[3CE0F72696511F2D]) [    x:core1] o.a.s.c.SolrCore [[core4] ] Opening new SolrCore at [/home/jenkins/workspace/Lucene-Solr-7.x-Linux/solr/build/solr-core/test/J0/temp/solr.core.TestLazyCores_3CE0F72696511F2D-001/tempDir-001/core4], dataDir=[/home/jenkins/workspace/Lucene-Solr-7.x-Linux/solr/build/solr-core/test/J0/temp/solr.core.TestLazyCores_3CE0F72696511F2D-001/tempDir-001/./core4/data/]
   [junit4]   2> 139618 INFO  (TEST-TestLazyCores.testCreateTransientFromAdmin-seed#[3CE0F72696511F2D]) [    x:core1] o.a.s.u.RandomMergePolicy RandomMergePolicy wrapping class org.apache.lucene.index.LogDocMergePolicy: [LogDocMergePolicy: minMergeSize=1000, mergeFactor=25, maxMergeSize=9223372036854775807, maxMergeSizeForForcedMerge=9223372036854775807, calibrateSizeByDeletes=false, maxMergeDocs=2147483647, maxCFSSegmentSizeMB=1.990234375, noCFSRatio=0.0]
   [junit4]   2> 139657 INFO  (TEST-TestLazyCores.testCreateTransientFromAdmin-seed#[3CE0F72696511F2D]) [    x:core1] o.a.s.u.CommitTracker Hard AutoCommit: disabled
   [junit4]   2> 139657 INFO  (TEST-TestLazyCores.testCreateTransientFromAdmin-seed#[3CE0F72696511F2D]) [    x:core1] o.a.s.u.CommitTracker Soft AutoCommit: disabled
   [junit4]   2> 139658 INFO  (TEST-TestLazyCores.testCreateTransientFromAdmin-seed#[3CE0F72696511F2D]) [    x:core1] o.a.s.u.RandomMergePolicy RandomMergePolicy wrapping class org.apache.lucene.index.TieredMergePolicy: [TieredMergePolicy: maxMergeAtOnce=49, maxMergeAtOnceExplicit=38, maxMergedSegmentMB=64.498046875, floorSegmentMB=0.728515625, forceMergeDeletesPctAllowed=13.01410141719643, segmentsPerTier=28.0, maxCFSSegmentSizeMB=8.796093022207999E12, noCFSRatio=1.0
   [junit4]   2> 139658 INFO  (TEST-TestLazyCores.testCreateTransientFromAdmin-seed#[3CE0F72696511F2D]) [    x:core1] o.a.s.s.SolrIndexSearcher Opening [Searcher@b86e393[core4] main]
   [junit4]   2> 139658 INFO  (TEST-TestLazyCores.testCreateTransientFromAdmin-seed#[3CE0F72696511F2D]) [    x:core1] o.a.s.r.ManagedResourceStorage File-based storage initialized to use dir: /home/jenkins/workspace/Lucene-Solr-7.x-Linux/solr/build/solr-core/test/J0/temp/solr.core.TestLazyCores_3CE0F72696511F2D-001/tempDir-001/core4/conf
   [junit4]   2> 139659 INFO  (TEST-TestLazyCores.testCreateTransientFromAdmin-seed#[3CE0F72696511F2D]) [    x:core1] o.a.s.h.ReplicationHandler Commits will be reserved for 10000ms.
   [junit4]   2> 139660 INFO  (TEST-TestLazyCores.testCreateTransientFromAdmin-seed#[3CE0F72696511F2D]) [    x:core1] o.a.s.c.TransientSolrCoreCacheDefault Closing transient core [collection2]
   [junit4]   2> 139660 INFO  (Thread-295) [    ] o.a.s.c.SolrCore [collection2]  CLOSING SolrCore org.apache.solr.core.SolrCore@6f92c624
   [junit4]   2> 139660 INFO  (searcherExecutor-673-thread-1-processing-x:core1) [    x:core1] o.a.s.c.SolrCore [core4] Registered new searcher Searcher@b86e393[core4] main{ExitableDirectoryReader(UninvertingDirectoryReader())}
   [junit4]   2> 139660 INFO  (Thread-295) [    ] o.a.s.m.SolrMetricManager Closing metric reporters for registry=solr.core.collection2, tag=1871889956
   [junit4]   2> 139660 INFO  (TEST-TestLazyCores.testCreateTransientFromAdmin-seed#[3CE0F72696511F2D]) [    x:core1] o.a.s.h.a.CoreAdminOperation core create command loadOnStartup=false&transient=true&name=core5&action=CREATE&wt=xml
   [junit4]   2> 139660 INFO  (Thread-295) [    ] o.a.s.m.r.SolrJmxReporter Closing reporter [org.apache.solr.metrics.reporters.SolrJmxReporter@7104cca4: rootName = null, domain = solr.core.collection2, service url = null, agent id = null] for registry solr.core.collection2 / com.codahale.metrics.MetricRegistry@1a42f52f
   [junit4]   2> 139669 INFO  (TEST-TestLazyCores.testCreateTransientFromAdmin-seed#[3CE0F72696511F2D]) [    x:core1] o.a.s.c.SolrConfig Using Lucene MatchVersion: 7.1.0
   [junit4]   2> 139673 INFO  (TEST-TestLazyCores.testCreateTransientFromAdmin-seed#[3CE0F72696511F2D]) [    x:core1] o.a.s.s.IndexSchema [core5] Schema name=tiny
   [junit4]   2> 139675 INFO  (TEST-TestLazyCores.testCreateTransientFromAdmin-seed#[3CE0F72696511F2D]) [    x:core1] o.a.s.s.IndexSchema Loaded schema tiny/1.1 with uniqueid field id
   [junit4]   2> 139675 INFO  (TEST-TestLazyCores.testCreateTransientFromAdmin-seed#[3CE0F72696511F2D]) [    x:core1] o.a.s.c.CoreContainer Creating SolrCore 'core5' using configuration from instancedir /home/jenkins/workspace/Lucene-Solr-7.x-Linux/solr/build/solr-core/test/J0/temp/solr.core.TestLazyCores_3CE0F72696511F2D-001/tempDir-001/./core5, trusted=true
   [junit4]   2> 139676 INFO  (TEST-TestLazyCores.testCreateTransientFromAdmin-seed#[3CE0F72696511F2D]) [    x:core1] o.a.s.m.r.SolrJmxReporter JMX monitoring for 'solr.core.core5' (registry 'solr.core.core5') enabled at server: com.sun.jmx.mbeanserver.JmxMBeanServer@61ad97b1
   [junit4]   2> 139676 INFO  (TEST-TestLazyCores.testCreateTransientFromAdmin-seed#[3CE0F72696511F2D]) [    x:core1] o.a.s.c.SolrCore solr.RecoveryStrategy.Builder
   [junit4]   2> 139676 INFO  (TEST-TestLazyCores.testCreateTransientFromAdmin-seed#[3CE0F72696511F2D]) [    x:core1] o.a.s.c.SolrCore [[core5] ] Opening new SolrCore at [/home/jenkins/workspace/Lucene-Solr-7.x-Linux/solr/build/solr-core/test/J0/temp/solr.core.TestLazyCores_3CE0F72696511F2D-001/tempDir-001/core5], dataDir=[/home/jenkins/workspace/Lucene-Solr-7.x-Linux/solr/build/solr-core/test/J0/temp/solr.core.TestLazyCores_3CE0F72696511F2D-001/tempDir-001/./core5/data/]
   [junit4]   2> 139678 INFO  (TEST-TestLazyCores.testCreateTransientFromAdmin-seed#[3CE0F72696511F2D]) [    x:core1] o.a.s.u.RandomMergePolicy RandomMergePolicy wrapping class org.apache.lucene.index.LogByteSizeMergePolicy: [LogByteSizeMergePolicy: minMergeSize=1677721, mergeFactor=11, maxMergeSize=2147483648, maxMergeSizeForForcedMerge=9223372036854775807, calibrateSizeByDeletes=false, maxMergeDocs=2147483647, maxCFSSegmentSizeMB=8.796093022207999E12, noCFSRatio=0.0]
   [junit4]   2> 139725 INFO  (TEST-TestLazyCores.testCreateTransientFromAdmin-seed#[3CE0F72696511F2D]) [    x:core1] o.a.s.u.CommitTracker Hard AutoCommit: disabled
   [junit4]   2> 139725 INFO  (TEST-TestLazyCores.testCreateTransientFromAdmin-seed#[3CE0F72696511F2D]) [    x:core1] o.a.s.u.CommitTracker Soft AutoCommit: disabled
   [junit4]   2> 139727 INFO  (TEST-TestLazyCores.testCreateTransientFromAdmin-seed#[3CE0F72696511F2D]) [    x:core1] o.a.s.u.RandomMergePolicy RandomMergePolicy wrapping class org.apache.lucene.index.TieredMergePolicy: [TieredMergePolicy: maxMergeAtOnce=33, maxMergeAtOnceExplicit=19, maxMergedSegmentMB=63.0634765625, floorSegmentMB=0.7001953125, forceMergeDeletesPctAllowed=4.308038909978721, segmentsPerTier=42.0, maxCFSSegmentSizeMB=8.796093022207999E12, noCFSRatio=1.0
   [junit4]   2> 139727 INFO  (TEST-TestLazyCores.testCreateTransientFromAdmin-seed#[3CE0F72696511F2D]) [    x:core1] o.a.s.s.SolrIndexSearcher Opening [Searcher@2e2889f9[core5] main]
   [junit4]   2> 139727 INFO  (TEST-TestLazyCores.testCreateTransientFromAdmin-seed#[3CE0F72696511F2D]) [    x:core1] o.a.s.r.ManagedResourceStorage File-based storage initialized to use dir: /home/jenkins/workspace/Lucene-Solr-7.x-Linux/solr/build/solr-core/test/J0/temp/solr.core.TestLazyCores_3CE0F72696511F2D-001/tempDir-001/core5/conf
   [junit4]   2> 139728 INFO  (TEST-TestLazyCores.testCreateTransientFromAdmin-seed#[3CE0F72696511F2D]) [    x:core1] o.a.s.h.ReplicationHandler Commits will be reserved for 10000ms.
   [junit4]   2> 139728 INFO  (TEST-TestLazyCores.testCreateTransientFromAdmin-seed#[3CE0F72696511F2D]) [    x:core1] o.a.s.c.TransientSolrCoreCacheDefault Closing transient core [core1]
   [junit4]   2> 139728 INFO  (Thread-295) [    ] o.a.s.c.SolrCore [core1]  CLOSING SolrCore org.apache.solr.core.SolrCore@3242bf45
   [junit4]   2> 139729 INFO  (Thread-295) [    ] o.a.s.m.SolrMetricManager Closing metric reporters for registry=solr.core.core1, tag=843235141
   [junit4]   2> 139729 INFO  (searcherExecutor-678-thread-1-processing-x:core1) [    x:core1] o.a.s.c.SolrCore [core5] Registered new searcher Searcher@2e2889f9[core5] main{ExitableDirectoryReader(UninvertingDirectoryReader())}
   [junit4]   2> 139729 INFO  (Thread-295) [    ] o.a.s.m.r.SolrJmxReporter Closing reporter [org.apache.solr.metrics.reporters.SolrJmxReporter@3af26355: rootName = null, domain = solr.core.core1, service url = null, agent id = null] for registry solr.core.core1 / com.codahale.metrics.MetricRegistry@10ba9e5f
   [junit4]   2> 139740 INFO  (TEST-TestLazyCores.testCreateTransientFromAdmin-seed#[3CE0F72696511F2D]) [    x:core1] o.a.s.c.SolrConfig Using Lucene MatchVersion: 7.1.0
   [junit4]   2> 139750 INFO  (TEST-TestLazyCores.testCreateTransientFromAdmin-seed#[3CE0F72696511F2D]) [    x:core1] o.a.s.s.IndexSchema [core1] Schema name=tiny
   [junit4]   2> 139751 INFO  (TEST-TestLazyCores.testCreateTransientFromAdmin-seed#[3CE0F72696511F2D]) [    x:core1] o.a.s.s.IndexSchema Loaded schema tiny/1.1 with uniqueid field id
   [junit4]   2> 139751 INFO  (TEST-TestLazyCores.testCreateTransientFromAdmin-seed#[3CE0F72696511F2D]) [    x:core1] o.a.s.c.CoreContainer Creating SolrCore 'core1' using configuration from instancedir /home/jenkins/workspace/Lucene-Solr-7.x-Linux/solr/build/solr-core/test/J0/temp/solr.core.TestLazyCores_3CE0F72696511F2D-001/tempDir-001/./core1, trusted=true
   [junit4]   2> 139767 INFO  (TEST-TestLazyCores.testCreateTransientFromAdmin-seed#[3CE0F72696511F2D]) [    x:core1] o.a.s.m.r.SolrJmxReporter JMX monitoring for 'solr.core.core1' (registry 'solr.core.core1') enabled at server: com.sun.jmx.mbeanserver.JmxMBeanServer@61ad97b1
   [junit4]   2> 139767 INFO  (TEST-TestLazyCores.testCreateTransientFromAdmin-seed#[3CE0F72696511F2D]) [    x:core1] o.a.s.c.SolrCore solr.RecoveryStrategy.Builder
   [junit4]   2> 139767 INFO  (TEST-TestLazyCores.testCreateTransientFromAdmin-seed#[3CE0F72696511F2D]) [    x:core1] o.a.s.c.SolrCore [[core1] ] Opening new SolrCore at [/home/jenkins/workspace/Lucene-Solr-7.x-Linux/solr/build/solr-core/test/J0/temp/solr.core.TestLazyCores_3CE0F72696511F2D-001/tempDir-001/core1], dataDir=[/home/jenkins/workspace/Lucene-Solr-7.x-Linux/solr/build/solr-core/test/J0/temp/solr.core.TestLazyCores_3CE0F72696511F2D-001/tempDir-001/./core1/data/]
   [junit4]   2> 139789 INFO  (TEST-TestLazyCores.testCreateTransientFromAdmin-seed#[3CE0F72696511F2D]) [    x:core1] o.a.s.u.CommitTracker Hard AutoCommit: disabled
   [junit4]   2> 139789 INFO  (TEST-TestLazyCores.testCreateTransientFromAdmin-seed#[3CE0F72696511F2D]) [    x:core1] o.a.s.u.CommitTracker Soft AutoCommit: disabled
   [junit4]   2> 139790 INFO  (TEST-TestLazyCores.testCreateTransientFromAdmin-seed#[3CE0F72696511F2D]) [    x:core1] o.a.s.u.RandomMergePolicy RandomMergePolicy wrapping class org.apache.lucene.index.TieredMergePolicy: [TieredMergePolicy: maxMergeAtOnce=36, maxMergeAtOnceExplicit=22, maxMergedSegmentMB=34.30859375, floorSegmentMB=1.1298828125, forceMergeDeletesPctAllowed=19.352643757288394, segmentsPerTier=48.0, maxCFSSegmentSizeMB=8.796093022207999E12, noCFSRatio=1.0
   [junit4]   2> 139790 INFO  (TEST-TestLazyCores.testCreateTransientFromAdmin-seed#[3CE0F72696511F2D]) [    x:core1] o.a.s.s.SolrIndexSearcher Opening [Searcher@501fa430[core1] main]
   [junit4]   2> 139790 INFO  (TEST-TestLazyCores.testCreateTransientFromAdmin-seed#[3CE0F72696511F2D]) [    x:core1] o.a.s.r.ManagedResourceStorage File-based storage initialized to use dir: /home/jenkins/workspace/Lucene-Solr-7.x-Linux/solr/build/solr-core/test/J0/temp/solr.core.TestLazyCores_3CE0F72696511F2D-001/tempDir-001/core1/conf
   [junit4]   2> 139790 INFO  (TEST-TestLazyCores.testCreateTransientFromAdmin-seed#[3CE0F72696511F2D]) [    x:core1] o.a.s.h.ReplicationHandler Commits will be reserved for 10000ms.
   [junit4]   2> 139791 INFO  (TEST-TestLazyCores.testCreateTransientFromAdmin-seed#[3CE0F72696511F2D]) [    x:core1] o.a.s.c.TransientSolrCoreCacheDefault Closing transient core [core2]
   [junit4]   2> 139791 INFO  (Thread-295) [    ] o.a.s.c.SolrCore [core2]  CLOSING SolrCore org.apache.solr.core.SolrCore@17d912c2
   [junit4]   2> 139791 INFO  (Thread-295) [    ] o.a.s.m.SolrMetricManager Closing metric reporters for registry=solr.core.core2, tag=400102082
   [junit4]   2> 139791 INFO  (Thread-295) [    ] o.a.s.m.r.SolrJmxReporter Closing reporter [org.apache.solr.metrics.reporters.SolrJmxReporter@bd8a572: rootName = null, domain = solr.core.core2, service url = null, agent id = null] for registry solr.core.core2 / com.codahale.metrics.MetricRegistry@585e7e39
   [junit4]   2> 139791 INFO  (searcherExecutor-682-thread-1-processing-x:core1) [    x:core1] o.a.s.c.SolrCore [core1] Registered new searcher Searcher@501fa430[core1] main{ExitableDirectoryReader(UninvertingDirectoryReader())}
   [junit4]   2> 139800 INFO  (TEST-TestLazyCores.testCreateTransientFromAdmin-seed#[3CE0F72696511F2D]) [    x:core1] o.a.s.c.SolrConfig Using Lucene MatchVersion: 7.1.0
   [junit4]   2> 139803 INFO  (TEST-TestLazyCores.testCreateTransientFromAdmin-seed#[3CE0F72696511F2D]) [    x:core1] o.a.s.s.IndexSchema [core2] Schema name=tiny
   [junit4]   2> 139804 INFO  (TEST-TestLazyCores.testCreateTransientFromAdmin-seed#[3CE0F72696511F2D]) [    x:core1] o.a.s.s.IndexSchema Loaded schema tiny/1.1 with uniqueid field id
   [junit4]   2> 139804 INFO  (TEST-TestLazyCores.testCreateTransientFromAdmin-seed#[3CE0F72696511F2D]) [    x:core1] o.a.s.c.CoreContainer Creating SolrCore 'core2' using configuration from instancedir /home/jenkins/workspace/Lucene-Solr-7.x-Linux/solr/build/solr-core/test/J0/temp/solr.core.TestLazyCores_3CE0F72696511F2D-001/tempDir-001/./core2, trusted=true
   [junit4]   2> 139814 INFO  (TEST-TestLazyCores.testCreateTransientFromAdmin-seed#[3CE0F72696511F2D]) [    x:core1] o.a.s.m.r.SolrJmxReporter JMX monitoring for 'solr.core.core2' (registry 'solr.core.core2') enabled at server: com.sun.jmx.mbeanserver.JmxMBeanServer@61ad97b1
   [junit4]   2> 139814 INFO  (TEST-TestLazyCores.testCreateTransientFromAdmin-seed#[3CE0F72696511F2D]) [    x:core1] o.a.s.c.SolrCore solr.RecoveryStrategy.Builder
   [junit4]   2> 139814 INFO  (TEST-TestLazyCores.testCreateTransientFromAdmin-seed#[3CE0F72696511F2D]) [    x:core1] o.a.s.c.SolrCore [[core2] ] Opening new SolrCore at [/home/jenkins/workspace/Lucene-Solr-7.x-Linux/solr/build/solr-core/test/J0/temp/solr.core.TestLazyCores_3CE0F72696511F2D-001/tempDir-001/core2], dataDir=[/home/jenkins/workspace/Lucene-Solr-7.x-Linux/solr/build/solr-core/test/J0/temp/solr.core.TestLazyCores_3CE0F72696511F2D-001/tempDir-001/./core2/data/]
   [junit4]   2> 139833 INFO  (TEST-TestLazyCores.testCreateTransientFromAdmin-seed#[3CE0F72696511F2D]) [    x:core1] o.a.s.u.CommitTracker Hard AutoCommit: disabled
   [junit4]   2> 139833 INFO  (TEST-TestLazyCores.testCreateTransientFromAdmin-seed#[3CE0F72696511F2D]) [    x:core1] o.a.s.u.CommitTracker Soft AutoCommit: disabled
   [junit4]   2> 139834 INFO  (TEST-TestLazyCores.testCreateTransientFromAdmin-seed#[3CE0F72696511F2D]) [    x:core1] o.a.s.u.RandomMergePolicy RandomMergePolicy wrapping class org.apache.lucene.index.TieredMergePolicy: [TieredMergePolicy: maxMergeAtOnce=20, maxMergeAtOnceExplicit=10, maxMergedSegmentMB=22.0087890625, floorSegmentMB=1.6611328125, forceMergeDeletesPctAllowed=3.1477036113439114, segmentsPerTier=48.0, maxCFSSegmentSizeMB=8.796093022207999E12, noCFSRatio=0.6846048777926309
   [junit4]   2> 139834 INFO  (TEST-TestLazyCores.testCreateTransientFromAdmin-seed#[3CE0F72696511F2D]) [    x:core1] o.a.s.s.SolrIndexSearcher Opening [Searcher@68be3f38[core2] main]
   [junit4]   2> 139835 INFO  (TEST-TestLazyCores.testCreateTransientFromAdmin-seed#[3CE0F72696511F2D]) [    x:core1] o.a.s.r.ManagedResourceStorage File-based storage initialized to use dir: /home/jenkins/workspace/Lucene-Solr-7.x-Linux/solr/build/solr-core/test/J0/temp/solr.core.TestLazyCores_3CE0F72696511F2D-001/tempDir-001/core2/conf
   [junit4]   2> 139835 INFO  (TEST-TestLazyCores.testCreateTransientFromAdmin-seed#[3CE0F72696511F2D]) [    x:core1] o.a.s.h.ReplicationHandler Commits will be reserved for 10000ms.
   [junit4]   2> 139835 INFO  (TEST-TestLazyCores.testCreateTransientFromAdmin-seed#[3CE0F72696511F2D]) [    x:core1] o.a.s.c.TransientSolrCoreCacheDefault Closing transient core [core3]
   [junit4]   2> 139835 INFO  (Thread-295) [    ] o.a.s.c.SolrCore [core3]  CLOSING SolrCore org.apache.solr.core.SolrCore@1d5d58e
   [junit4]   2> 139835 INFO  (Thread-295) [    ] o.a.s.m.SolrMetricManager Closing metric reporters for registry=solr.core.core3, tag=30791054
   [junit4]   2> 139835 INFO  (Thread-295) [    ] o.a.s.m.r.SolrJmxReporter Closing reporter [org.apache.solr.metrics.reporters.SolrJmxReporter@55a41953: rootName = null, domain = solr.core.core3, service url = null, agent id = null] for registry solr.core.core3 / com.codahale.metrics.MetricRegistry@202b3228
   [junit4]   2> 139837 INFO  (searcherExecutor-686-thread-1-processing-x:core1) [    x:core1] o.a.s.c.SolrCore [core2] Registered new searcher Searcher@68be3f38[core2] main{ExitableDirectoryReader(UninvertingDirectoryReader())}
   [junit4]   2> 139849 INFO  (TEST-TestLazyCores.testCreateTransientFromAdmin-seed#[3CE0F72696511F2D]) [    x:core1] o.a.s.c.SolrConfig Using Lucene MatchVersion: 7.1.0
   [junit4]   2> 139853 INFO  (TEST-TestLazyCores.testCreateTransientFromAdmin-seed#[3CE0F72696511F2D]) [    x:core1] o.a.s.s.IndexSchema [core3] Schema name=tiny
   [junit4]   2> 139855 INFO  (TEST-TestLazyCores.testCreateTransientFromAdmin-seed#[3CE0F72696511F2D]) [    x:core1] o.a.s.s.IndexSchema Loaded schema tiny/1.1 with uniqueid field id
   [junit4]   2> 139855 INFO  (TEST-TestLazyCores.testCreateTransientFromAdmin-seed#[3CE0F72696511F2D]) [    x:core1] o.a.s.c.CoreContainer Creating SolrCore 'core3' using configuration from instancedir /home/jenkins/workspace/Lucene-Solr-7.x-Linux/solr/build/solr-core/test/J0/temp/solr.core.TestLazyCores_3CE0F72696511F2D-001/tempDir-001/./core3, trusted=true
   [junit4]   2> 139871 INFO  (TEST-TestLazyCores.testCreateTransientFromAdmin-seed#[3CE0F72696511F2D]) [    x:core1] o.a.s.m.r.SolrJmxReporter JMX monitoring for 'solr.core.core3' (registry 'solr.core.core3') enabled at server: com.sun.jmx.mbeanserver.JmxMBeanServer@61ad97b1
   [junit4]   2> 139871 INFO  (TEST-TestLazyCores.testCreateTransientFromAdmin-seed#[3CE0F72696511F2D]) [    x:core1] o.a.s.c.SolrCore solr.RecoveryStrategy.Builder
   [junit4]   2> 139871 INFO  (TEST-TestLazyCores.testCreateTransientFromAdmin-seed#[3CE0F72696511F2D]) [    x:core1] o.a.s.c.SolrCore [[core3] ] Opening new SolrCore at [/home/jenkins/workspace/Lucene-Solr-7.x-Linux/solr/build/solr-core/test/J0/temp/solr.core.TestLazyCores_3CE0F72696511F2D-001/tempDir-001/core3], dataDir=[/home/jenkins/workspace/Lucene-Solr-7.x-Linux/solr/build/solr-core/test/J0/temp/solr.core.TestLazyCores_3CE0F72696511F2D-001/tempDir-001/./core3/data/]
   [junit4]   2> 139899 INFO  (TEST-TestLazyCores.testCreateTransientFromAdmin-seed#[3CE0F72696511F2D]) [    x:core1] o.a.s.u.CommitTracker Hard AutoCommit: disabled
   [junit4]   2> 139899 INFO  (TEST-TestLazyCores.testCreateTransientFromAdmin-seed#[3CE0F72696511F2D]) [    x:core1] o.a.s.u.CommitTracker Soft AutoCommit: disabled
   [junit4]   2> 139900 INFO  (TEST-TestLazyCores.testCreateTransientFromAdmin-seed#[3CE0F72696511F2D]) [    x:core1] o.a.s.u.RandomMergePolicy RandomMergePolicy wrapping class org.apache.lucene.index.TieredMergePolicy: [TieredMergePolicy: maxMergeAtOnce=19, maxMergeAtOnceExplicit=46, maxMergedSegmentMB=1.052734375, floorSegmentMB=0.876953125, forceMergeDeletesPctAllowed=18.40032746336884, segmentsPerTier=21.0, maxCFSSegmentSizeMB=8.796093022207999E12, noCFSRatio=1.0
   [junit4]   2> 139900 INFO  (TEST-TestLazyCores.testCreateTransientFromAdmin-seed#[3CE0F72696511F2D]) [    x:core1] o.a.s.s.SolrIndexSearcher Opening [Searcher@75bb261e[core3] main]
   [junit4]   2> 139900 INFO  (TEST-TestLazyCores.testCreateTransientFromAdmin-seed#[3CE0F72696511F2D]) [    x:core1] o.a.s.r.ManagedResourceStorage File-based storage initialized to use dir: /home/jenkins/workspace/Lucene-Solr-7.x-Linux/solr/build/solr-core/test/J0/temp/solr.core.TestLazyCores_3CE0F72696511F2D-001/tempDir-001/core3/conf
   [junit4]   2> 139901 INFO  (TEST-TestLazyCores.testCreateTransientFromAdmin-seed#[3CE0F72696511F2D]) [    x:core1] o.a.s.h.ReplicationHandler Commits will be reserved for 10000ms.
   [junit4]   2> 139901 INFO  (TEST-TestLazyCores.testCreateTransientFromAdmin-seed#[3CE0F72696511F2D]) [    x:core1] o.a.s.c.TransientSolrCoreCacheDefault Closing transient core [core4]
   [junit4]   2> 139901 INFO  (Thread-295) [    ] o.a.s.c.SolrCore [core4]  CLOSING SolrCore org.apache.solr.core.SolrCore@740a1aca
   [junit4]   2> 139901 INFO  (Thread-295) [    ] o.a.s.m.SolrMetricManager Closing metric reporters for registry=solr.core.core4, tag=1946819274
   [junit4]   2> 139901 INFO  (Thread-295) [    ] o.a.s.m.r.SolrJmxReporter Closing reporter [org.apache.solr.metrics.reporters.SolrJmxReporter@12a71ad5: rootName = null, domain = solr.core.core4, service url = null, agent id = null] for registry solr.core.core4 / com.codahale.metrics.MetricRegistry@1e13e25e
   [junit4]   2> 139908 INFO  (searcherExecutor-690-thread-1-processing-x:core1) [    x:core1] o.a.s.c.SolrCore [core3] Registered new searcher Searcher@75bb261e[core3] main{ExitableDirectoryReader(UninvertingDirectoryReader())}
   [junit4]   2> 139918 INFO  (TEST-TestLazyCores.testCreateTransientFromAdmin-seed#[3CE0F72696511F2D]) [    x:core1] o.a.s.c.SolrConfig Using Lucene MatchVersion: 7.1.0
   [junit4]   2> 139921 INFO  (TEST-TestLazyCores.testCreateTransientFromAdmin-seed#[3CE0F72696511F2D]) [    x:core1] o.a.s.s.IndexSchema [core4] Schema name=tiny
   [junit4]   2> 139923 INFO  (TEST-TestLazyCores.testCreateTransientFromAdmin-seed#[3CE0F72696511F2D]) [    x:core1] o.a.s.s.IndexSchema Loaded schema tiny/1.1 with uniqueid field id
   [junit4]   2> 139923 INFO  (TEST-TestLazyCores.testCreateTransientFromAdmin-seed#[3CE0F72696511F2D]) [    x:core1] o.a.s.c.CoreContainer Creating SolrCore 'core4' using configuration from instancedir /home/jenkins/workspace/Lucene-Solr-7.x-Linux/solr/build/solr-core/test/J0/temp/solr.core.TestLazyCores_3CE0F72696511F2D-001/tempDir-001/./core4, trusted=true
   [junit4]   2> 139932 INFO  (TEST-TestLazyCores.testCreateTransientFromAdmin-seed#[3CE0F72696511F2D]) [    x:core1] o.a.s.m.r.SolrJmxReporter JMX monitoring for 'solr.core.core4' (registry 'solr.core.core4') enabled at server: com.sun.jmx.mbeanserver.JmxMBeanServer@61ad97b1
   [junit4]   2> 139933 INFO  (TEST-TestLazyCores.testCreateTransientFromAdmin-seed#[3CE0F72696511F2D]) [    x:core1] o.a.s.c.SolrCore solr.RecoveryStrategy.Builder
   [junit4]   2> 139933 INFO  (TEST-TestLazyCores.testCreateTransientFromAdmin-seed#[3CE0F72696511F2D]) [    x:core1] o.a.s.c.SolrCore [[core4] ] Opening new SolrCore at [/home/jenkins/workspace/Lucene-Solr-7.x-Linux/solr/build/solr-core/test/J0/temp/solr.core.TestLazyCores_3CE0F72696511F2D-001/tempDir-001/core4], dataDir=[/home/jenkins/workspace/Lucene-Solr-7.x-Linux/solr/build/solr-core/test/J0/temp/solr.core.TestLazyCores_3CE0F72696511F2D-001/tempDir-001/./core4/data/]
   [junit4]   2> 139955 INFO  (TEST-TestLazyCores.testCreateTransientFromAdmin-seed#[3CE0F72696511F2D]) [    x:core1] o.a.s.u.CommitTracker Hard AutoCommit: disabled
   [junit4]   2> 139955 INFO  (TEST-TestLazyCores.testCreateTransientFromAdmin-seed#[3CE0F72696511F2D]) [    x:core1] o.a.s.u.CommitTracker Soft AutoCommit: disabled
   [junit4]   2> 139956 INFO  (TEST-TestLazyCores.testCreateTransientFromAdmin-seed#[3CE0F72696511F2D]) [    x:core1] o.a.s.u.RandomMergePolicy RandomMergePolicy wrapping class org.apache.lucene.index.TieredMergePolicy: [TieredMergePolicy: maxMergeAtOnce=26, maxMergeAtOnceExplicit=16, maxMergedSegmentMB=82.4853515625, floorSegmentMB=0.322265625, forceMergeDeletesPctAllowed=12.378114688374636, segmentsPerTier=15.0, maxCFSSegmentSizeMB=8.796093022207999E12, noCFSRatio=1.0
   [junit4]   2> 139956 INFO  (TEST-TestLazyCores.testCreateTransientFromAdmin-seed#[3CE0F72696511F2D]) [    x:core1] o.a.s.s.SolrIndexSearcher Opening [Searcher@6bb11e43[core4] main]
   [junit4]   2> 139956 INFO  (TEST-TestLazyCores.testCreateTransientFromAdmin-seed#[3CE0F72696511F2D]) [    x:core1] o.a.s.r.ManagedResourceStorage File-based storage initialized to use dir: /home/jenkins/workspace/Lucene-Solr-7.x-Linux/solr/build/solr-core/test/J0/temp/solr.core.TestLazyCores_3CE0F72696511F2D-001/tempDir-001/core4/conf
   [junit4]   2> 139957 INFO  (TEST-TestLazyCores.testCreateTransientFromAdmin-seed#[3CE0F72696511F2D]) [    x:core1] o.a.s.h.ReplicationHandler Commits will be reserved for 10000ms.
   [junit4]   2> 139957 INFO  (TEST-TestLazyCores.testCreateTransientFromAdmin-seed#[3CE0F72696511F2D]) [    x:core1] o.a.s.c.TransientSolrCoreCacheDefault Closing transient core [core5]
   [junit4]   2> 139957 INFO  (Thread-295) [    ] o.a.s.c.SolrCore [core5]  CLOSING SolrCore org.apache.solr.core.SolrCore@4fe1e2b8
   [junit4]   2> 139957 INFO  (Thread-295) [    ] o.a.s.m.SolrMetricManager Closing metric reporters for registry=solr.core.core5, tag=1340203704
   [junit4]   2> 139957 INFO  (Thread-295) [    ] o.a.s.m.r.SolrJmxReporter Closing reporter [org.apache.solr.metrics.reporters.SolrJmxReporter@1eb4cc00: rootName = null, domain = solr.core.core5, service url = null, agent id = null] for registry solr.core.core5 / com.codahale.metrics.MetricRegistry@3b2f3ab6
   [junit4]   2> 139958 INFO  (searcherExecutor-694-thread-1-processing-x:core1) [    x:core1] o.a.s.c.SolrCore [core4] Registered new searcher Searcher@6bb11e43[core4] main{ExitableDirectoryReader(UninvertingDirectoryReader())}
   [junit4]   2> 139968 INFO  (TEST-TestLazyCores.testCreateTransientFromAdmin-seed#[3CE0F72696511F2D]) [    x:core1] o.a.s.c.SolrConfig Using Lucene MatchVersion: 7.1.0
   [junit4]   2> 139971 INFO  (TEST-TestLazyCores.testCreateTransientFromAdmin-seed#[3CE0F72696511F2D]) [    x:core1] o.a.s.s.IndexSchema [core5] Schema name=tiny
   [junit4]   2> 139972 INFO  (TEST-TestLazyCores.testCreateTransientFromAdmin-seed#[3CE0F72696511F2D]) [    x:core1] o.a.s.s.IndexSchema Loaded schema tiny/1.1 with uniqueid field id
   [junit4]   2> 139972 INFO  (TEST-TestLazyCores.testCreateTransientFromAdmin-seed#[3CE0F72696511F2D]) [    x:core1] o.a.s.c.CoreContainer Creating SolrCore 'core5' using configuration from instancedir /home/jenkins/workspace/Lucene-Solr-7.x-Linux/solr/build/solr-core/test/J0/temp/solr.core.TestLazyCores_3CE0F72696511F2D-001/tempDir-001/./core5, trusted=true
   [junit4]   2> 139982 INFO  (TEST-TestLazyCores.testCreateTransientFromAdmin-seed#[3CE0F72696511F2D]) [    x:core1] o.a.s.m.r.SolrJmxReporter JMX monitoring for 'solr.core.core5' (registry 'solr.core.core5') enabled at server: com.sun.jmx.mbeanserver.JmxMBeanServer@61ad97b1
   [junit4]   2> 139982 INFO  (TEST-TestLazyCores.testCreateTransientFromAdmin-seed#[3CE0F72696511F2D]) [    x:core1] o.a.s.c.SolrCore solr.RecoveryStrategy.Builder
   [junit4]   2> 139982 INFO  (TEST-TestLazyCores.testCreateTransientFromAdmin-seed#[3CE0F72696511F2D]) [    x:core1] o.a.s.c.SolrCore [[core5] ] Opening new SolrCore at [/home/jenkins/workspace/Lucene-Solr-7.x-Linux/solr/build/solr-core/test/J0/temp/solr.core.TestLazyCores_3CE0F72696511F2D-001/tempDir-001/core5], dataDir=[/home/jenkins/workspace/Lucene-Solr-7.x-Linux/solr/build/solr-core/test/J0/temp/solr.core.TestLazyCores_3CE0F72696511F2D-001/tempDir-001/./core5/data/]
   [junit4]   2> 140002 INFO  (TEST-TestLazyCores.testCreateTransientFromAdmin-seed#[3CE0F72696511F2D]) [    x:core1] o.a.s.u.CommitTracker Hard AutoCommit: disabled
   [junit4]   2> 140002 INFO  (TEST-TestLazyCores.testCreateTransientFromAdmin-seed#[3CE0F72696511F2D]) [    x:core1] o.a.s.u.CommitTracker Soft AutoCommit: disabled
   [junit4]   2> 140003 INFO  (TEST-TestLazyCores.testCreateTransientFromAdmin-seed#[3CE0F72696511F2D]) [    x:core1] o.a.s.u.RandomMergePolicy RandomMergePolicy wrapping class org.apache.lucene.index.TieredMergePolicy: [TieredMergePolicy: maxMergeAtOnce=30, maxMergeAtOnceExplicit=29, maxMergedSegmentMB=43.123046875, floorSegmentMB=1.8681640625, forceMergeDeletesPctAllowed=18.90822277895523, segmentsPerTier=10.0, maxCFSSegmentSizeMB=8.796093022207999E12, noCFSRatio=0.0
   [junit4]   2> 140003 INFO  (TEST-TestLazyCores.testCreateTransientFromAdmin-seed#[3CE0F72696511F2D]) [    x:core1] o.a.s.s.SolrIndexSearcher Opening [Searcher@dc94987[core5] main]
   [junit4]   2> 140003 INFO  (TEST-TestLazyCores.testCreateTransientFromAdmin-seed#[3CE0F72696511F2D]) [    x:core1] o.a.s.r.ManagedResourceStorage File-based storage initialized to use dir: /home/jenkins/workspace/Lucene-Solr-7.x-Linux/solr/build/solr-core/test/J0/temp/solr.core.TestLazyCores_3CE0F72696511F2D-001/tempDir-001/core5/conf
   [junit4]   2> 140003 INFO  (TEST-TestLazyCores.testCreateTransientFromAdmin-seed#[3CE0F72696511F2D]) [    x:core1] o.a.s.h.ReplicationHandler Commits will be reserved for 10000ms.
   [junit4]   2> 140004 INFO  (TEST-TestLazyCores.testCreateTransientFromAdmin-seed#[3CE0F72696511F2D]) [    x:core1] o.a.s.c.TransientSolrCoreCacheDefault Closing transient core [core1]
   [junit4]   2> 140005 INFO  (searcherExecutor-698-thread-1-processing-x:core1) [    x:core1] o.a.s.c.SolrCore [core5] Registered new searcher Searcher@dc94987[core5] main{ExitableDirectoryReader(UninvertingDirectoryReader())}
   [junit4]   2> 140005 INFO  (TEST-TestLazyCores.testCreateTransientFromAdmin-seed#[3CE0F72696511F2D]) [    x:core1] o.a.s.m.SolrMetricManager Closing metric reporters for registry=solr.core.core2, tag=null
   [junit4]   2> 140005 INFO  (TEST-TestLazyCores.testCreateTransientFromAdmin-seed#[3CE0F72696511F2D]) [    x:core1] o.a.s.m.r.SolrJmxReporter Closing reporter [org.apache.solr.metrics.reporters.SolrJmxReporter@1881b46b: rootName = null, domain = solr.core.core2, service url = null, agent id = null] for registry solr.core.core2 / com.codahale.metrics.MetricRegistry@585e7e39
   [junit4]   2> 140010 INFO  (TEST-TestLazyCores.testCreateTransientFromAdmin-seed#[3CE0F72696511F2D]) [    x:core1] o.a.s.c.SolrCore Core core2 is not yet closed, waiting 100 ms before checking again.
   [junit4]   2> 140110 INFO  (TEST-TestLazyCores.testCreateTransientFromAdmin-seed#[3CE0F72696511F2D]) [    x:core1] o.a.s.c.SolrCore Core core2 is not yet closed, waiting 100 ms before checking again.
   [junit4]   2> 140210 INFO  (TEST-TestLazyCores.testCreateTransientFromAdmin-seed#[3CE0F72696511F2D]) [    x:core1] o.a.s.c.SolrCore Core core2 is not yet closed, waiting 100 ms before checking again.
   [junit4]   2> 140310 INFO  (TEST-TestLazyCores.testCreateTransientFromAdmin-seed#[3CE0F72696511F2D]) [    x:core1] o.a.s.c.SolrCore Core core2 is not yet closed, waiting 100 ms before checking again.
   [junit4]   2> 140410 INFO  (TEST-TestLazyCores.testCreateTransientFromAdmin-seed#[3CE0F72696511F2D]) [    x:core1] o.a.s.c.SolrCore Core core2 is not yet closed, waiting 100 ms before checking again.
   [junit4]   2> 140511 INFO  (TEST-TestLazyCores.testCreateTransientFromAdmin-seed#[3CE0F72696511F2D]) [    x:core1] o.a.s.c.SolrCore Core core2 is not yet closed, waiting 100 ms before checking again.
   [junit4]   2> 140525 INFO  (Thread-296) [    x:core1] o.a.s.c.SolrCore [core1]  CLOSING SolrCore org.apache.solr.core.SolrCore@2e7f9b3f
   [junit4]   2> 140525 INFO  (Thread-296) [    x:core1] o.a.s.m.SolrMetricManager Closing metric reporters for registry=solr.core.core1, tag=780114751
   [junit4]   2> 140525 INFO  (Thread-296) [    x:core1] o.a.s.m.r.SolrJmxReporter Closing reporter [org.apache.solr.metrics.reporters.SolrJmxReporter@22a0f1d0: rootName = null, domain = solr.core.core1, service url = null, agent id = null] for registry solr.core.core1 / com.codahale.metrics.MetricRegistry@10ba9e5f
   [junit4]   2> 140531 INFO  (Thread-296) [    x:core1] o.a.s.c.SolrCore [core2]  CLOSING SolrCore org.apache.solr.core.SolrCore@7f5a8ab6
   [junit4]   2> 140531 INFO  (Thread-296) [    x:core1] o.a.s.m.SolrMetricManager Closing metric reporters for registry=solr.core.core2, tag=2136640182
   [junit4]   2> 140611 INFO  (TEST-TestLazyCores.testCreateTransientFromAdmin-seed#[3CE0F72696511F2D]) [    x:core1] o.a.s.m.SolrMetricManager Closing metric reporters for registry=solr.core.core3, tag=null
   [junit4]   2> 140611 INFO  (TEST-TestLazyCores.testCreateTransientFromAdmin-seed#[3CE0F72696511F2D]) [    x:core1] o.a.s.m.r.SolrJmxReporter Closing reporter [org.apache.solr.metrics.reporters.SolrJmxReporter@7cfaa4c2: rootName = null, domain = solr.core.core3, service url = null, agent id = null] for registry solr.core.core3 / com.codahale.metrics.MetricRegistry@202b3228
   [junit4]   2> 140618 INFO  (TEST-TestLazyCores.testCreateTransientFromAdmin-seed#[3CE0F72696511F2D]) [    x:core1] o.a.s.c.SolrCore [core3]  CLOSING SolrCore org.apache.solr.core.SolrCore@520d4c23
   [junit4]   2> 140618 INFO  (TEST-TestLazyCores.testCreateTransientFromAdmin-seed#[3CE0F72696511F2D]) [    x:core1] o.a.s.m.SolrMetricManager Closing metric reporters for registry=solr.core.core3, tag=1376603171
   [junit4]   2> 140619 INFO  (TEST-TestLazyCores.testCreateTransientFromAdmin-seed#[3CE0F72696511F2D]) [    x:core1] o.a.s.m.SolrMetricManager Closing metric reporters for registry=solr.core.core4, tag=null
   [junit4]   2> 140619 INFO  (TEST-TestLazyCores.testCreateTransientFromAdmin-seed#[3CE0F72696511F2D]) [    x:core1] o.a.s.m.r.SolrJmxReporter Closing reporter [org.apache.solr.metrics.reporters.SolrJmxReporter@3f9e02dd: rootName = null, domain = solr.core.core4, service url = null, agent id = null] for registry solr.core.core4 / com.codahale.metrics.MetricRegistry@1e13e25e
   [junit4]   2> 140627 INFO  (TEST-TestLazyCores.testCreateTransientFromAdmin-seed#[3CE0F72696511F2D]) [    x:core1] o.a.s.c.SolrCore [core4]  CLOSING SolrCore org.apache.solr.core.SolrCore@5666ccf2
   [junit4]   2> 140627 INFO  (TEST-TestLazyCores.testCreateTransientFromAdmin-seed#[3CE0F72696511F2D]) [    x:core1] o.a.s.m.SolrMetricManager Closing metric reporters for registry=solr.core.core4, tag=1449577714
   [junit4]   2> 140628 INFO  (TEST-TestLazyCores.testCreateTransientFromAdmin-seed#[3CE0F72696511F2D]) [    x:core1] o.a.s.m.SolrMetricManager Closing metric reporters for registry=solr.core.core5, tag=null
   [junit4]   2> 140628 INFO  (TEST-TestLazyCores.testCreateTransientFromAdmin-seed#[3CE0F72696511F2D]) [    x:core1] o.a.s.m.r.SolrJmxReporter Closing reporter [org.apache.solr.metrics.reporters.SolrJmxReporter@44453588: rootName = null, domain = solr.core.core5, service url = null, agent id = null] for registry solr.core.core5 / com.codahale.metrics.MetricRegistry@3b2f3ab6
   [junit4]   2> 140637 INFO  (TEST-TestLazyCores.testCreateTransientFromAdmin-seed#[3CE0F72696511F2D]) [    x:core1] o.a.s.c.SolrCore [core5]  CLOSING SolrCore org.apache.solr.core.SolrCore@18e3b044
   [junit4]   2> 140637 INFO  (TEST-TestLazyCores.testCreateTransientFromAdmin-seed#[3CE0F72696511F2D]) [    x:core1] o.a.s.m.SolrMetricManager Closing metric reporters for registry=solr.core.core5, tag=417574980
   [junit4]   2> 140638 INFO  (TEST-TestLazyCores.testCreateTransientFromAdmin-seed#[3CE0F72696511F2D]) [    x:core1] o.a.s.c.CoreContainer Shutting down CoreContainer instance=1681971590
   [junit4]   2> 140638 INFO  (TEST-TestLazyCores.testCreateTransientFromAdmin-seed#[3CE0F72696511F2D]) [    x:core1] o.a.s.m.SolrMetricManager Closing metric reporters for registry=solr.node, tag=null
   [junit4]   2> 140638 INFO  (TEST-TestLazyCores.testCreateTransientFromAdmin-seed#[3CE0F72696511F2D]) [    x:core1] o.a.s.m.r.SolrJmxReporter Closing reporter [org.apache.solr.metrics.reporters.SolrJmxReporter@6207289a: rootName = null, domain = solr.node, service url = null, agent id = null] for registry solr.node / com.codahale.metrics.MetricRegistry@31388e70
   [junit4]   2> 140641 INFO  (TEST-TestLazyCores.testCreateTransientFromAdmin-seed#[3CE0F72696511F2D]) [    x:core1] o.a.s.m.SolrMetricManager Closing metric reporters for registry=solr.jvm, tag=null
   [junit4]   2> 140641 INFO  (TEST-TestLazyCores.testCreateTransientFromAdmin-seed#[3CE0F72696511F2D]) [    x:core1] o.a.s.m.r.SolrJmxReporter Closing reporter [org.apache.solr.metrics.reporters.SolrJmxReporter@1faae658: rootName = null, domain = solr.jvm, service url = null, agent id = null] for registry solr.jvm / com.codahale.metrics.MetricRegistry@1f4ade76
   [junit4]   2> 140641 INFO  (TEST-TestLazyCores.testCreateTransientFromAdmin-seed#[3CE0F72696511F2D]) [    x:core1] o.a.s.m.SolrMetricManager Closing metric reporters for registry=solr.jetty, tag=null
   [junit4]   2> 140642 INFO  (TEST-TestLazyCores.testCreateTransientFromAdmin-seed#[3CE0F72696511F2D]) [    x:core1] o.a.s.m.r.SolrJmxReporter Closing reporter [org.apache.solr.metrics.reporters.SolrJmxReporter@751dffc0: rootName = null, domain = solr.jetty, service url = null, agent id = null] for registry solr.jetty / com.codahale.metrics.MetricRegistry@364475d6
   [junit4]   2> 140642 INFO  (coreCloseExecutor-707-thread-1-processing-x:core1) [    x:collection1] o.a.s.c.SolrCore [collection1]  CLOSING SolrCore org.apache.solr.core.SolrCore@64862e2f
   [junit4]   2> 140642 INFO  (coreCloseExecutor-707-thread-1-processing-x:core1) [    x:collection1] o.a.s.m.SolrMetricManager Closing metric reporters for registry=solr.core.collection1, tag=1686515247
   [junit4]   2> 140642 INFO  (coreCloseExecutor-707-thread-2-processing-x:core1) [    x:collection5] o.a.s.c.SolrCore [collection5]  CLOSING SolrCore org.apache.solr.core.SolrCore@37a711cf
   [junit4]   2> 140642 INFO  (coreCloseExecutor-707-thread-1-processing-x:core1) [    x:collection1] o.a.s.m.r.SolrJmxReporter Closing reporter [org.apache.solr.metrics.reporters.SolrJmxReporter@3713b8f8: rootName = null, domain = solr.core.collection1, service url = null, agent id = null] for registry solr.core.collection1 / com.codahale.metrics.MetricRegistry@41c475c1
   [junit4]   2> 140647 INFO  (coreCloseExecutor-707-thread-2-processing-x:core1) [    x:collection5] o.a.s.m.SolrMetricManager Closing metric reporters for registry=solr.core.collection5, tag=933695951
   [junit4]   2> 140647 INFO  (coreCloseExecutor-707-thread-2-processing-x:core1) [    x:collection5] o.a.s.m.r.SolrJmxReporter Closing reporter [org.apache.solr.metrics.reporters.SolrJmxReporter@40ce03fd: rootName = null, domain = solr.core.collection5, service url = null, agent id = null] for registry solr.core.collection5 / com.codahale.metrics.MetricRegistry@db237cd
   [junit4]   2> 140653 INFO  (TEST-TestLazyCores.testCreateTransientFromAdmin-seed#[3CE0F72696511F2D]) [    x:core1] o.a.s.SolrTestCaseJ4 ###Ending testCreateTransientFromAdmin
   [junit4]   2> 140654 INFO  (TEST-TestLazyCores.testBadConfigsGenerateErrors-seed#[3CE0F72696511F2D]) [    x:core1] o.a.s.SolrTestCaseJ4 ###Starting testBadConfigsGenerateErrors
   [junit4]   2> 140668 INFO  (TEST-TestLazyCores.testBadConfigsGenerateErrors-seed#[3CE0F72696511F2D]) [    x:core1] o.a.s.c.SolrXmlConfig MBean server found: com.sun.jmx.mbeanserver.JmxMBeanServer@61ad97b1, but no JMX reporters were configured - adding default JMX reporter.
   [junit4]   2> 140692 INFO  (TEST-TestLazyCores.testBadConfigsGenerateErrors-seed#[3CE0F72696511F2D]) [    x:core1] o.a.s.m.r.SolrJmxReporter JMX monitoring for 'solr.node' (registry 'solr.node') enabled at server: com.sun.jmx.mbeanserver.JmxMBeanServer@61ad97b1
   [junit4]   2> 140692 INFO  (TEST-TestLazyCores.testBadConfigsGenerateErrors-seed#[3CE0F72696511F2D]) [    x:core1] o.a.s.m.r.SolrJmxReporter JMX monitoring for 'solr.jvm' (registry 'solr.jvm') enabled at server: com.sun.jmx.mbeanserver.JmxMBeanServer@61ad97b1
   [junit4]   2> 140692 INFO  (TEST-TestLazyCores.testBadConfigsGenerateErrors-seed#[3CE0F72696511F2D]) [    x:core1] o.a.s.m.r.SolrJmxReporter JMX monitoring for 'solr.jetty' (registry 'solr.jetty') enabled at server: com.sun.jmx.mbeanserver.JmxMBeanServer@61ad97b1
   [junit4]   2> 140694 INFO  (TEST-TestLazyCores.testBadConfigsGenerateErrors-seed#[3CE0F72696511F2D]) [    x:core1] o.a.s.c.CorePropertiesLocator Found 6 core definitions underneath /home/jenkins/workspace/Lucene-Solr-7.x-Linux/solr/build/solr-core/test/J0/temp/solr.core.TestLazyCores_3CE0F72696511F2D-001/tempDir-002
   [junit4]   2> 140694 INFO  (TEST-TestLazyCores.testBadConfigsGenerateErrors-seed#[3CE0F72696511F2D]) [    x:core1] o.a.s.c.CorePropertiesLocator Cores are: [badSchema1, core1, badConfig2, badConfig1, badSchema2, core2]
   [junit4]   2> 140694 INFO  (TEST-TestLazyCores.testBadConfigsGenerateErrors-seed#[3CE0F72696511F2D]) [    x:core1] o.a.s.c.TransientSolrCoreCacheDefault Allocating transient cache for 2147483647 transient cores
   [junit4]   2> 140702 INFO  (coreLoadExecutor-714-thread-2-processing-x:core1) [    x:core1] o.a.s.c.SolrConfig Using Lucene MatchVersion: 7.1.0
   [junit4]   2> 140702 INFO  (coreLoadExecutor-714-thread-1-processing-x:core1) [    x:badSchema1] o.a.s.c.SolrConfig Using Lucene MatchVersion: 7.1.0
   [junit4]   2> 140706 INFO  (coreLoadExecutor-714-thread-3-processing-x:core1) [    x:badConfig2] o.a.s.c.Config Ignoring exception matching \QSAXParseException\E
   [junit4]   2> 140708 INFO  (coreLoadExecutor-714-thread-1-processing-x:core1) [    x:badSchema1] o.a.s.c.Config Ignoring exception matching \QSAXParseException\E
   [junit4]   2> 140709 INFO  (coreLoadExecutor-714-thread-3-processing-x:core1) [    x:badConfig1] o.a.s.c.Config Ignoring exception matching \QSAXParseException\E
   [junit4]   2> 140709 INFO  (coreLoadExecutor-714-thread-2-processing-x:core1) [    x:core1] o.a.s.s.IndexSchema [core1] Schema name=tiny
   [junit4]   2> 140710 INFO  (coreLoadExecutor-714-thread-2-processing-x:core1) [    x:core1] o.a.s.s.IndexSchema Loaded schema tiny/1.1 with uniqueid field id
   [junit4]   2> 140710 INFO  (coreLoadExecutor-714-thread-2-processing-x:core1) [    x:core1] o.a.s.c.CoreContainer Creating SolrCore 'core1' using configuration from instancedir /home/jenkins/workspace/Lucene-Solr-7.x-Linux/solr/build/solr-core/test/J0/temp/solr.core.TestLazyCores_3CE0F72696511F2D-001/tempDir-002/core1, trusted=true
   [junit4]   2> 140711 INFO  (coreLoadExecutor-714-thread-2-processing-x:core1) [    x:core1] o.a.s.m.r.SolrJmxReporter JMX monitoring for 'solr.core.core1' (registry 'solr.core.core1') enabled at server: com.sun.jmx.mbeanserver.JmxMBeanServer@61ad97b1
   [junit4]   2> 140711 INFO  (coreLoadExecutor-714-thread-2-processing-x:core1) [    x:core1] o.a.s.c.SolrCore solr.RecoveryStrategy.Builder
   [junit4]   2> 140711 INFO  (coreLoadExecutor-714-thread-2-processing-x:core1) [    x:core1] o.a.s.c.SolrCore [[core1] ] Opening new SolrCore at [/home/jenkins/workspace/Lucene-Solr-7.x-Linux/solr/build/solr-core/test/J0/temp/solr.core.TestLazyCores_3CE0F72696511F2D-001/tempDir-002/core1], dataDir=[/home/jenkins/workspace/Lucene-Solr-7.x-Linux/solr/build/solr-core/test/J0/temp/solr.core.TestLazyCores_3CE0F72696511F2D-001/tempDir-002/core1/data/]
   [junit4]   2> 140713 INFO  (coreLoadExecutor-714-thread-2-processing-x:core1) [    x:core1] o.a.s.u.RandomMergePolicy RandomMergePolicy wrapping class org.apache.lucene.index.TieredMergePolicy: [TieredMergePolicy: maxMergeAtOnce=48, maxMergeAtOnceExplicit=24, maxMergedSegmentMB=4.6015625, floorSegmentMB=1.4599609375, forceMergeDeletesPctAllowed=22.610725253419485, segmentsPerTier=10.0, maxCFSSegmentSizeMB=8.796093022207999E12, noCFSRatio=0.5553719341167676
   [junit4]   2> 140713 INFO  (coreLoadExecutor-714-thread-1-processing-x:core1) [    x:badSchema2] o.a.s.c.SolrConfig Using Lucene MatchVersion: 7.1.0
   [junit4]   2> 140713 INFO  (coreLoadExecutor-714-thread-3-processing-x:core1) [    x:core2] o.a.s.c.SolrConfig Using Lucene MatchVersion: 7.1.0
   [junit4]   2> 140716 INFO  (coreLoadExecutor-714-thread-1-processing-x:core1) [    x:badSchema2] o.a.s.c.Config Ignoring exception matching \QSAXParseException\E
   [junit4]   2> 140717 INFO  (coreLoadExecutor-714-thread-3-processing-x:core1) [    x:core2] o.a.s.s.IndexSchema [core2] Schema name=tiny
   [junit4]   2> 140719 INFO  (coreLoadExecutor-714-thread-3-processing-x:core1) [    x:core2] o.a.s.s.IndexSchema Loaded schema tiny/1.1 with uniqueid field id
   [junit4]   2> 140719 INFO  (coreLoadExecutor-714-thread-3-processing-x:core1) [    x:core2] o.a.s.c.CoreContainer Creating SolrCore 'core2' using configuration from instancedir /home/jenkins/workspace/Lucene-Solr-7.x-Linux/solr/build/solr-core/test/J0/temp/solr.core.TestLazyCores_3CE0F72696511F2D-001/tempDir-002/core2, trusted=true
   [junit4]   2> 140719 INFO  (coreLoadExecutor-714-thread-3-processing-x:core1) [    x:core2] o.a.s.m.r.SolrJmxReporter JMX monitoring for 'solr.core.core2' (registry 'solr.core.core2') enabled at server: com.sun.jmx.mbeanserver.JmxMBeanServer@61ad97b1
   [junit4]   2> 140719 INFO  (coreLoadExecutor-714-thread-3-processing-x:core1) [    x:core2] o.a.s.c.SolrCore solr.RecoveryStrategy.Builder
   [junit4]   2> 140719 INFO  (coreLoadExecutor-714-thread-3-processing-x:core1) [    x:core2] o.a.s.c.SolrCore [[core2] ] Opening new SolrCore at [/home/jenkins/workspace/Lucene-Solr-7.x-Linux/solr/build/solr-core/test/J0/temp/solr.core.TestLazyCores_3CE0F72696511F2D-001/tempDir-002/core2], dataDir=[/home/jenkins/workspace/Lucene-Solr-7.x-Linux/solr/build/solr-core/test/J0/temp/solr.core.TestLazyCores_3CE0F72696511F2D-001/tempDir-002/core2/data/]
   [junit4]   2> 140721 INFO  (coreLoadExecutor-714-thread-3-processing-x:core1) [    x:core2] o.a.s.u.RandomMergePolicy RandomMergePolicy wrapping class org.apache.lucene.index.TieredMergePolicy: [TieredMergePolicy: maxMergeAtOnce=48, maxMergeAtOnceExplicit=24, maxMergedSegmentMB=4.6015625, floorSegmentMB=1.4599609375, forceMergeDeletesPctAllowed=22.610725253419485, segmentsPerTier=10.0, maxCFSSegmentSizeMB=8.796093022207999E12, noCFSRatio=0.5553719341167676
   [junit4]   2> 140754 INFO  (coreLoadExecutor-714-thread-2-processing-x:core1) [    x:core1] o.a.s.u.CommitTracker Hard AutoCommit: disabled
   [junit4]   2> 140754 INFO  (coreLoadExecutor-714-thread-2-processing-x:core1) [    x:core1] o.a.s.u.C

[...truncated too long message...]

/collection1_collection/state.json] for collection [collection1_collection] has occurred - updating... (live nodes size: [3])
   [junit4]   2> 103205 INFO  (zkCallback-30-thread-2-processing-n:127.0.0.1:42685_solr) [n:127.0.0.1:42685_solr    ] o.a.s.c.c.ZkStateReader A cluster state change: [WatchedEvent state:SyncConnected type:NodeDataChanged path:/collections/workQueue/state.json] for collection [workQueue] has occurred - updating... (live nodes size: [3])
   [junit4]   2> 103205 INFO  (zkCallback-30-thread-1-processing-n:127.0.0.1:42685_solr) [n:127.0.0.1:42685_solr    ] o.a.s.c.c.ZkStateReader A cluster state change: [WatchedEvent state:SyncConnected type:NodeDataChanged path:/collections/workQueue/state.json] for collection [workQueue] has occurred - updating... (live nodes size: [3])
   [junit4]   2> 103207 INFO  (zkCallback-31-thread-2-processing-n:127.0.0.1:37155_solr) [n:127.0.0.1:37155_solr    ] o.a.s.c.c.ZkStateReader A cluster state change: [WatchedEvent state:SyncConnected type:NodeDataChanged path:/collections/mainCorpus/state.json] for collection [mainCorpus] has occurred - updating... (live nodes size: [3])
   [junit4]   2> 103214 INFO  (coreCloseExecutor-174-thread-2) [n:127.0.0.1:37155_solr c:mainCorpus s:shard1 r:core_node3 x:mainCorpus_shard1_replica_n1] o.a.s.m.SolrMetricManager Closing metric reporters for registry=solr.collection.mainCorpus.shard1.leader, tag=1780792819
   [junit4]   2> 103219 INFO  (coreCloseExecutor-173-thread-1) [n:127.0.0.1:42685_solr c:collection1_collection s:shard1 r:core_node3 x:collection1_collection_shard1_replica_n1] o.a.s.m.SolrMetricManager Closing metric reporters for registry=solr.collection.collection1_collection.shard1.leader, tag=1455635943
   [junit4]   2> 103220 INFO  (coreCloseExecutor-173-thread-2) [n:127.0.0.1:42685_solr c:workQueue s:shard2 r:core_node4 x:workQueue_shard2_replica_n2] o.a.s.m.SolrMetricManager Closing metric reporters for registry=solr.core.workQueue.shard2.replica_n2, tag=467918333
   [junit4]   2> 103220 INFO  (coreCloseExecutor-173-thread-2) [n:127.0.0.1:42685_solr c:workQueue s:shard2 r:core_node4 x:workQueue_shard2_replica_n2] o.a.s.m.r.SolrJmxReporter Closing reporter [org.apache.solr.metrics.reporters.SolrJmxReporter@7886b004: rootName = solr_42685, domain = solr.core.workQueue.shard2.replica_n2, service url = null, agent id = null] for registry solr.core.workQueue.shard2.replica_n2 / com.codahale.metrics.MetricRegistry@39076a76
   [junit4]   2> 103224 INFO  (zkCallback-31-thread-3-processing-n:127.0.0.1:37155_solr) [n:127.0.0.1:37155_solr    ] o.a.s.c.c.ZkStateReader A cluster state change: [WatchedEvent state:SyncConnected type:NodeDataChanged path:/collections/collection1_collection/state.json] for collection [collection1_collection] has occurred - updating... (live nodes size: [3])
   [junit4]   2> 103228 WARN  (zkCallback-29-thread-1-processing-n:127.0.0.1:34693_solr) [n:127.0.0.1:34693_solr    ] o.a.s.c.c.ZkStateReader ZooKeeper watch triggered, but Solr cannot talk to ZK: [KeeperErrorCode = Session expired for /live_nodes]
   [junit4]   2> 103228 INFO  (jetty-closer-11-thread-1) [    ] o.e.j.s.h.ContextHandler Stopped o.e.j.s.ServletContextHandler@4c34bebe{/solr,null,UNAVAILABLE}
   [junit4]   2> 103230 INFO  (coreCloseExecutor-173-thread-3) [n:127.0.0.1:42685_solr c:mainCorpus s:shard2 r:core_node4 x:mainCorpus_shard2_replica_n2] o.a.s.m.SolrMetricManager Closing metric reporters for registry=solr.core.mainCorpus.shard2.replica_n2, tag=242952413
   [junit4]   2> 103230 INFO  (coreCloseExecutor-173-thread-3) [n:127.0.0.1:42685_solr c:mainCorpus s:shard2 r:core_node4 x:mainCorpus_shard2_replica_n2] o.a.s.m.r.SolrJmxReporter Closing reporter [org.apache.solr.metrics.reporters.SolrJmxReporter@13d60e1b: rootName = solr_42685, domain = solr.core.mainCorpus.shard2.replica_n2, service url = null, agent id = null] for registry solr.core.mainCorpus.shard2.replica_n2 / com.codahale.metrics.MetricRegistry@7123acf6
   [junit4]   2> 103237 INFO  (zkCallback-30-thread-2-processing-n:127.0.0.1:42685_solr) [n:127.0.0.1:42685_solr    ] o.a.s.c.c.ZkStateReader Updated live nodes from ZooKeeper... (3) -> (2)
   [junit4]   2> 103237 INFO  (zkCallback-31-thread-1-processing-n:127.0.0.1:37155_solr) [n:127.0.0.1:37155_solr    ] o.a.s.c.c.ZkStateReader Updated live nodes from ZooKeeper... (3) -> (2)
   [junit4]   2> 103237 INFO  (coreCloseExecutor-173-thread-3) [n:127.0.0.1:42685_solr c:mainCorpus s:shard2 r:core_node4 x:mainCorpus_shard2_replica_n2] o.a.s.m.SolrMetricManager Closing metric reporters for registry=solr.collection.mainCorpus.shard2.leader, tag=242952413
   [junit4]   2> 103237 INFO  (coreCloseExecutor-173-thread-4) [n:127.0.0.1:42685_solr c:destination s:shard1 r:core_node3 x:destination_shard1_replica_n1] o.a.s.m.SolrMetricManager Closing metric reporters for registry=solr.core.destination.shard1.replica_n1, tag=709259398
   [junit4]   2> 103237 INFO  (coreCloseExecutor-173-thread-4) [n:127.0.0.1:42685_solr c:destination s:shard1 r:core_node3 x:destination_shard1_replica_n1] o.a.s.m.r.SolrJmxReporter Closing reporter [org.apache.solr.metrics.reporters.SolrJmxReporter@5854fb8e: rootName = solr_42685, domain = solr.core.destination.shard1.replica_n1, service url = null, agent id = null] for registry solr.core.destination.shard1.replica_n1 / com.codahale.metrics.MetricRegistry@29bc0493
   [junit4]   2> 103245 INFO  (coreCloseExecutor-173-thread-2) [n:127.0.0.1:42685_solr c:workQueue s:shard2 r:core_node4 x:workQueue_shard2_replica_n2] o.a.s.m.SolrMetricManager Closing metric reporters for registry=solr.collection.workQueue.shard2.leader, tag=467918333
   [junit4]   2> 103246 INFO  (coreCloseExecutor-173-thread-4) [n:127.0.0.1:42685_solr c:destination s:shard1 r:core_node3 x:destination_shard1_replica_n1] o.a.s.m.SolrMetricManager Closing metric reporters for registry=solr.collection.destination.shard1.leader, tag=709259398
   [junit4]   2> 103250 INFO  (zkCallback-30-thread-2-processing-n:127.0.0.1:42685_solr) [n:127.0.0.1:42685_solr    ] o.a.s.c.c.ZkStateReader Updated live nodes from ZooKeeper... (2) -> (1)
   [junit4]   2> 103252 INFO  (jetty-closer-11-thread-4) [    ] o.a.s.c.Overseer Overseer (id=98750692546445322-127.0.0.1:42685_solr-n_0000000000) closing
   [junit4]   2> 103252 INFO  (OverseerStateUpdate-98750692546445322-127.0.0.1:42685_solr-n_0000000000) [n:127.0.0.1:42685_solr    ] o.a.s.c.Overseer Overseer Loop exiting : 127.0.0.1:42685_solr
   [junit4]   2> 103254 WARN  (zkCallback-30-thread-2-processing-n:127.0.0.1:42685_solr) [n:127.0.0.1:42685_solr    ] o.a.s.c.c.ZkStateReader ZooKeeper watch triggered, but Solr cannot talk to ZK: [KeeperErrorCode = Session expired for /live_nodes]
   [junit4]   2> 103255 INFO  (jetty-closer-11-thread-4) [    ] o.e.j.s.h.ContextHandler Stopped o.e.j.s.ServletContextHandler@35d3f1b1{/solr,null,UNAVAILABLE}
   [junit4]   2> 104750 WARN  (zkCallback-31-thread-2-processing-n:127.0.0.1:37155_solr) [n:127.0.0.1:37155_solr    ] o.a.s.c.c.ZkStateReader ZooKeeper watch triggered, but Solr cannot talk to ZK: [KeeperErrorCode = Session expired for /live_nodes]
   [junit4]   2> 104750 INFO  (jetty-closer-11-thread-2) [    ] o.e.j.s.h.ContextHandler Stopped o.e.j.s.ServletContextHandler@482a346a{/solr,null,UNAVAILABLE}
   [junit4]   2> 104751 ERROR (SUITE-StreamExpressionTest-seed#[23D9F35E063A277F]-worker) [    ] o.a.z.s.ZooKeeperServer ZKShutdownHandler is not registered, so ZooKeeper server won't take any action on ERROR or SHUTDOWN server state changes
   [junit4]   2> 104751 INFO  (SUITE-StreamExpressionTest-seed#[23D9F35E063A277F]-worker) [    ] o.a.s.c.ZkTestServer connecting to 127.0.0.1:42969 42969
   [junit4]   2> 112423 INFO  (Thread-16) [    ] o.a.s.c.ZkTestServer connecting to 127.0.0.1:42969 42969
   [junit4]   2> 112424 WARN  (Thread-16) [    ] o.a.s.c.ZkTestServer Watch limit violations: 
   [junit4]   2> Maximum concurrent create/delete watches above limit:
   [junit4]   2> 
   [junit4]   2> 	78	/solr/aliases.json
   [junit4]   2> 	11	/solr/configs/conf
   [junit4]   2> 	4	/solr/security.json
   [junit4]   2> 
   [junit4]   2> Maximum concurrent data watches above limit:
   [junit4]   2> 
   [junit4]   2> 	78	/solr/clusterprops.json
   [junit4]   2> 	78	/solr/clusterstate.json
   [junit4]   2> 	22	/solr/collections/destination/state.json
   [junit4]   2> 	22	/solr/collections/mainCorpus/state.json
   [junit4]   2> 	21	/solr/collections/workQueue/state.json
   [junit4]   2> 	20	/solr/collections/parallelDestinationCollection/state.json
   [junit4]   2> 	20	/solr/collections/destinationCollection/state.json
   [junit4]   2> 	20	/solr/collections/parallelDestinationCollection1/state.json
   [junit4]   2> 	12	/solr/collections/collection1_collection/state.json
   [junit4]   2> 	2	/solr/overseer_elect/election/98750692546445322-127.0.0.1:42685_solr-n_0000000000
   [junit4]   2> 
   [junit4]   2> Maximum concurrent children watches above limit:
   [junit4]   2> 
   [junit4]   2> 	78	/solr/live_nodes
   [junit4]   2> 	78	/solr/collections
   [junit4]   2> 
   [junit4]   2> NOTE: leaving temporary files on disk at: /home/jenkins/workspace/Lucene-Solr-7.x-Linux/solr/build/solr-solrj/test/J2/temp/solr.client.solrj.io.stream.StreamExpressionTest_23D9F35E063A277F-001
   [junit4]   2> NOTE: test params are: codec=Lucene70, sim=RandomSimilarity(queryNorm=false): {}, locale=ms, timezone=Europe/Vaduz
   [junit4]   2> NOTE: Linux 4.10.0-33-generic amd64/Oracle Corporation 1.8.0_144 (64-bit)/cpus=8,threads=1,free=207747024,total=523239424
   [junit4]   2> NOTE: All tests run in this JVM: [SolrParamTest, ArcSineEvaluatorTest, ConcurrentUpdateSolrClientBuilderTest, TestPolicy, TestClusteringResponse, FieldValueEvaluatorTest, TestZkConfigManager, SolrExampleXMLTest, HyperbolicTangentEvaluatorTest, TestHash, CloudSolrClientCacheTest, NamedListTest, StreamExpressionTest]
   [junit4] Completed [115/145 (1!)] on J2 in 93.47s, 117 tests, 1 error, 9 skipped <<< FAILURES!

[...truncated 46035 lines...]

Mime
View raw message