lucene-dev mailing list archives

Site index · List index
Message view « Date » · « Thread »
Top « Date » · « Thread »
From Policeman Jenkins Server <jenk...@thetaphi.de>
Subject [JENKINS] Lucene-Solr-master-MacOSX (64bit/jdk1.8.0) - Build # 4238 - Unstable!
Date Thu, 19 Oct 2017 14:19:46 GMT
Build: https://jenkins.thetaphi.de/job/Lucene-Solr-master-MacOSX/4238/
Java: 64bit/jdk1.8.0 -XX:+UseCompressedOops -XX:+UseSerialGC

5 tests failed.
FAILED:  org.apache.solr.cloud.AliasIntegrationTest.test

Error Message:
Error from server at http://127.0.0.1:57564/solr: Expected mime type application/octet-stream but got text/html. <html> <head> <meta http-equiv="Content-Type" content="text/html;charset=ISO-8859-1"/> <title>Error 404 </title> </head> <body> <h2>HTTP ERROR: 404</h2> <p>Problem accessing /solr/select. Reason: <pre>    Can not find: /solr/select</pre></p> <hr /><a href="http://eclipse.org/jetty">Powered by Jetty:// 9.3.20.v20170531</a><hr/> </body> </html> 

Stack Trace:
org.apache.solr.client.solrj.impl.HttpSolrClient$RemoteSolrException: Error from server at http://127.0.0.1:57564/solr: Expected mime type application/octet-stream but got text/html. <html>
<head>
<meta http-equiv="Content-Type" content="text/html;charset=ISO-8859-1"/>
<title>Error 404 </title>
</head>
<body>
<h2>HTTP ERROR: 404</h2>
<p>Problem accessing /solr/select. Reason:
<pre>    Can not find: /solr/select</pre></p>
<hr /><a href="http://eclipse.org/jetty">Powered by Jetty:// 9.3.20.v20170531</a><hr/>
</body>
</html>

	at __randomizedtesting.SeedInfo.seed([5CD9CF70E73B6407:D48DF0AA49C709FF]:0)
	at org.apache.solr.client.solrj.impl.HttpSolrClient.executeMethod(HttpSolrClient.java:590)
	at org.apache.solr.client.solrj.impl.HttpSolrClient.request(HttpSolrClient.java:253)
	at org.apache.solr.client.solrj.impl.HttpSolrClient.request(HttpSolrClient.java:242)
	at org.apache.solr.client.solrj.SolrRequest.process(SolrRequest.java:178)
	at org.apache.solr.client.solrj.SolrClient.query(SolrClient.java:942)
	at org.apache.solr.cloud.AliasIntegrationTest.searchSeveralWays(AliasIntegrationTest.java:155)
	at org.apache.solr.cloud.AliasIntegrationTest.searchSeveralWays(AliasIntegrationTest.java:165)
	at org.apache.solr.cloud.AliasIntegrationTest.searchSeveralWays(AliasIntegrationTest.java:128)
	at org.apache.solr.cloud.AliasIntegrationTest.test(AliasIntegrationTest.java:84)
	at sun.reflect.NativeMethodAccessorImpl.invoke0(Native Method)
	at sun.reflect.NativeMethodAccessorImpl.invoke(NativeMethodAccessorImpl.java:62)
	at sun.reflect.DelegatingMethodAccessorImpl.invoke(DelegatingMethodAccessorImpl.java:43)
	at java.lang.reflect.Method.invoke(Method.java:498)
	at com.carrotsearch.randomizedtesting.RandomizedRunner.invoke(RandomizedRunner.java:1737)
	at com.carrotsearch.randomizedtesting.RandomizedRunner$8.evaluate(RandomizedRunner.java:934)
	at com.carrotsearch.randomizedtesting.RandomizedRunner$9.evaluate(RandomizedRunner.java:970)
	at com.carrotsearch.randomizedtesting.RandomizedRunner$10.evaluate(RandomizedRunner.java:984)
	at com.carrotsearch.randomizedtesting.rules.SystemPropertiesRestoreRule$1.evaluate(SystemPropertiesRestoreRule.java:57)
	at org.apache.lucene.util.TestRuleSetupTeardownChained$1.evaluate(TestRuleSetupTeardownChained.java:49)
	at org.apache.lucene.util.AbstractBeforeAfterRule$1.evaluate(AbstractBeforeAfterRule.java:45)
	at org.apache.lucene.util.TestRuleThreadAndTestName$1.evaluate(TestRuleThreadAndTestName.java:48)
	at org.apache.lucene.util.TestRuleIgnoreAfterMaxFailures$1.evaluate(TestRuleIgnoreAfterMaxFailures.java:64)
	at org.apache.lucene.util.TestRuleMarkFailure$1.evaluate(TestRuleMarkFailure.java:47)
	at com.carrotsearch.randomizedtesting.rules.StatementAdapter.evaluate(StatementAdapter.java:36)
	at com.carrotsearch.randomizedtesting.ThreadLeakControl$StatementRunner.run(ThreadLeakControl.java:368)
	at com.carrotsearch.randomizedtesting.ThreadLeakControl.forkTimeoutingTask(ThreadLeakControl.java:817)
	at com.carrotsearch.randomizedtesting.ThreadLeakControl$3.evaluate(ThreadLeakControl.java:468)
	at com.carrotsearch.randomizedtesting.RandomizedRunner.runSingleTest(RandomizedRunner.java:943)
	at com.carrotsearch.randomizedtesting.RandomizedRunner$5.evaluate(RandomizedRunner.java:829)
	at com.carrotsearch.randomizedtesting.RandomizedRunner$6.evaluate(RandomizedRunner.java:879)
	at com.carrotsearch.randomizedtesting.RandomizedRunner$7.evaluate(RandomizedRunner.java:890)
	at com.carrotsearch.randomizedtesting.rules.StatementAdapter.evaluate(StatementAdapter.java:36)
	at com.carrotsearch.randomizedtesting.rules.SystemPropertiesRestoreRule$1.evaluate(SystemPropertiesRestoreRule.java:57)
	at org.apache.lucene.util.AbstractBeforeAfterRule$1.evaluate(AbstractBeforeAfterRule.java:45)
	at com.carrotsearch.randomizedtesting.rules.StatementAdapter.evaluate(StatementAdapter.java:36)
	at org.apache.lucene.util.TestRuleStoreClassName$1.evaluate(TestRuleStoreClassName.java:41)
	at com.carrotsearch.randomizedtesting.rules.NoShadowingOrOverridesOnMethodsRule$1.evaluate(NoShadowingOrOverridesOnMethodsRule.java:40)
	at com.carrotsearch.randomizedtesting.rules.NoShadowingOrOverridesOnMethodsRule$1.evaluate(NoShadowingOrOverridesOnMethodsRule.java:40)
	at com.carrotsearch.randomizedtesting.rules.StatementAdapter.evaluate(StatementAdapter.java:36)
	at com.carrotsearch.randomizedtesting.rules.StatementAdapter.evaluate(StatementAdapter.java:36)
	at com.carrotsearch.randomizedtesting.rules.StatementAdapter.evaluate(StatementAdapter.java:36)
	at org.apache.lucene.util.TestRuleAssertionsRequired$1.evaluate(TestRuleAssertionsRequired.java:53)
	at org.apache.lucene.util.TestRuleMarkFailure$1.evaluate(TestRuleMarkFailure.java:47)
	at org.apache.lucene.util.TestRuleIgnoreAfterMaxFailures$1.evaluate(TestRuleIgnoreAfterMaxFailures.java:64)
	at org.apache.lucene.util.TestRuleIgnoreTestSuites$1.evaluate(TestRuleIgnoreTestSuites.java:54)
	at com.carrotsearch.randomizedtesting.rules.StatementAdapter.evaluate(StatementAdapter.java:36)
	at com.carrotsearch.randomizedtesting.ThreadLeakControl$StatementRunner.run(ThreadLeakControl.java:368)
	at java.lang.Thread.run(Thread.java:748)


FAILED:  org.apache.solr.cloud.CustomCollectionTest.testRouteFieldForHashRouter

Error Message:
Collection not found: routeFieldColl

Stack Trace:
org.apache.solr.common.SolrException: Collection not found: routeFieldColl
	at __randomizedtesting.SeedInfo.seed([5CD9CF70E73B6407:F4EF51AD785A8F5D]:0)
	at org.apache.solr.client.solrj.impl.CloudSolrClient.requestWithRetryOnStaleState(CloudSolrClient.java:834)
	at org.apache.solr.client.solrj.impl.CloudSolrClient.request(CloudSolrClient.java:800)
	at org.apache.solr.client.solrj.SolrRequest.process(SolrRequest.java:178)
	at org.apache.solr.client.solrj.request.UpdateRequest.commit(UpdateRequest.java:233)
	at org.apache.solr.cloud.CustomCollectionTest.testRouteFieldForHashRouter(CustomCollectionTest.java:166)
	at sun.reflect.NativeMethodAccessorImpl.invoke0(Native Method)
	at sun.reflect.NativeMethodAccessorImpl.invoke(NativeMethodAccessorImpl.java:62)
	at sun.reflect.DelegatingMethodAccessorImpl.invoke(DelegatingMethodAccessorImpl.java:43)
	at java.lang.reflect.Method.invoke(Method.java:498)
	at com.carrotsearch.randomizedtesting.RandomizedRunner.invoke(RandomizedRunner.java:1737)
	at com.carrotsearch.randomizedtesting.RandomizedRunner$8.evaluate(RandomizedRunner.java:934)
	at com.carrotsearch.randomizedtesting.RandomizedRunner$9.evaluate(RandomizedRunner.java:970)
	at com.carrotsearch.randomizedtesting.RandomizedRunner$10.evaluate(RandomizedRunner.java:984)
	at com.carrotsearch.randomizedtesting.rules.SystemPropertiesRestoreRule$1.evaluate(SystemPropertiesRestoreRule.java:57)
	at org.apache.lucene.util.TestRuleSetupTeardownChained$1.evaluate(TestRuleSetupTeardownChained.java:49)
	at org.apache.lucene.util.AbstractBeforeAfterRule$1.evaluate(AbstractBeforeAfterRule.java:45)
	at org.apache.lucene.util.TestRuleThreadAndTestName$1.evaluate(TestRuleThreadAndTestName.java:48)
	at org.apache.lucene.util.TestRuleIgnoreAfterMaxFailures$1.evaluate(TestRuleIgnoreAfterMaxFailures.java:64)
	at org.apache.lucene.util.TestRuleMarkFailure$1.evaluate(TestRuleMarkFailure.java:47)
	at com.carrotsearch.randomizedtesting.rules.StatementAdapter.evaluate(StatementAdapter.java:36)
	at com.carrotsearch.randomizedtesting.ThreadLeakControl$StatementRunner.run(ThreadLeakControl.java:368)
	at com.carrotsearch.randomizedtesting.ThreadLeakControl.forkTimeoutingTask(ThreadLeakControl.java:817)
	at com.carrotsearch.randomizedtesting.ThreadLeakControl$3.evaluate(ThreadLeakControl.java:468)
	at com.carrotsearch.randomizedtesting.RandomizedRunner.runSingleTest(RandomizedRunner.java:943)
	at com.carrotsearch.randomizedtesting.RandomizedRunner$5.evaluate(RandomizedRunner.java:829)
	at com.carrotsearch.randomizedtesting.RandomizedRunner$6.evaluate(RandomizedRunner.java:879)
	at com.carrotsearch.randomizedtesting.RandomizedRunner$7.evaluate(RandomizedRunner.java:890)
	at com.carrotsearch.randomizedtesting.rules.StatementAdapter.evaluate(StatementAdapter.java:36)
	at com.carrotsearch.randomizedtesting.rules.SystemPropertiesRestoreRule$1.evaluate(SystemPropertiesRestoreRule.java:57)
	at org.apache.lucene.util.AbstractBeforeAfterRule$1.evaluate(AbstractBeforeAfterRule.java:45)
	at com.carrotsearch.randomizedtesting.rules.StatementAdapter.evaluate(StatementAdapter.java:36)
	at org.apache.lucene.util.TestRuleStoreClassName$1.evaluate(TestRuleStoreClassName.java:41)
	at com.carrotsearch.randomizedtesting.rules.NoShadowingOrOverridesOnMethodsRule$1.evaluate(NoShadowingOrOverridesOnMethodsRule.java:40)
	at com.carrotsearch.randomizedtesting.rules.NoShadowingOrOverridesOnMethodsRule$1.evaluate(NoShadowingOrOverridesOnMethodsRule.java:40)
	at com.carrotsearch.randomizedtesting.rules.StatementAdapter.evaluate(StatementAdapter.java:36)
	at com.carrotsearch.randomizedtesting.rules.StatementAdapter.evaluate(StatementAdapter.java:36)
	at com.carrotsearch.randomizedtesting.rules.StatementAdapter.evaluate(StatementAdapter.java:36)
	at org.apache.lucene.util.TestRuleAssertionsRequired$1.evaluate(TestRuleAssertionsRequired.java:53)
	at org.apache.lucene.util.TestRuleMarkFailure$1.evaluate(TestRuleMarkFailure.java:47)
	at org.apache.lucene.util.TestRuleIgnoreAfterMaxFailures$1.evaluate(TestRuleIgnoreAfterMaxFailures.java:64)
	at org.apache.lucene.util.TestRuleIgnoreTestSuites$1.evaluate(TestRuleIgnoreTestSuites.java:54)
	at com.carrotsearch.randomizedtesting.rules.StatementAdapter.evaluate(StatementAdapter.java:36)
	at com.carrotsearch.randomizedtesting.ThreadLeakControl$StatementRunner.run(ThreadLeakControl.java:368)
	at java.lang.Thread.run(Thread.java:748)


FAILED:  org.apache.solr.cloud.CustomCollectionTest.testCustomCollectionsAPI

Error Message:
Could not find collection : implicitcoll

Stack Trace:
org.apache.solr.common.SolrException: Could not find collection : implicitcoll
	at __randomizedtesting.SeedInfo.seed([5CD9CF70E73B6407:3638411BDAA1D27F]:0)
	at org.apache.solr.common.cloud.ClusterState.getCollection(ClusterState.java:111)
	at org.apache.solr.cloud.SolrCloudTestCase.getCollectionState(SolrCloudTestCase.java:247)
	at org.apache.solr.cloud.CustomCollectionTest.testCustomCollectionsAPI(CustomCollectionTest.java:68)
	at sun.reflect.NativeMethodAccessorImpl.invoke0(Native Method)
	at sun.reflect.NativeMethodAccessorImpl.invoke(NativeMethodAccessorImpl.java:62)
	at sun.reflect.DelegatingMethodAccessorImpl.invoke(DelegatingMethodAccessorImpl.java:43)
	at java.lang.reflect.Method.invoke(Method.java:498)
	at com.carrotsearch.randomizedtesting.RandomizedRunner.invoke(RandomizedRunner.java:1737)
	at com.carrotsearch.randomizedtesting.RandomizedRunner$8.evaluate(RandomizedRunner.java:934)
	at com.carrotsearch.randomizedtesting.RandomizedRunner$9.evaluate(RandomizedRunner.java:970)
	at com.carrotsearch.randomizedtesting.RandomizedRunner$10.evaluate(RandomizedRunner.java:984)
	at com.carrotsearch.randomizedtesting.rules.SystemPropertiesRestoreRule$1.evaluate(SystemPropertiesRestoreRule.java:57)
	at org.apache.lucene.util.TestRuleSetupTeardownChained$1.evaluate(TestRuleSetupTeardownChained.java:49)
	at org.apache.lucene.util.AbstractBeforeAfterRule$1.evaluate(AbstractBeforeAfterRule.java:45)
	at org.apache.lucene.util.TestRuleThreadAndTestName$1.evaluate(TestRuleThreadAndTestName.java:48)
	at org.apache.lucene.util.TestRuleIgnoreAfterMaxFailures$1.evaluate(TestRuleIgnoreAfterMaxFailures.java:64)
	at org.apache.lucene.util.TestRuleMarkFailure$1.evaluate(TestRuleMarkFailure.java:47)
	at com.carrotsearch.randomizedtesting.rules.StatementAdapter.evaluate(StatementAdapter.java:36)
	at com.carrotsearch.randomizedtesting.ThreadLeakControl$StatementRunner.run(ThreadLeakControl.java:368)
	at com.carrotsearch.randomizedtesting.ThreadLeakControl.forkTimeoutingTask(ThreadLeakControl.java:817)
	at com.carrotsearch.randomizedtesting.ThreadLeakControl$3.evaluate(ThreadLeakControl.java:468)
	at com.carrotsearch.randomizedtesting.RandomizedRunner.runSingleTest(RandomizedRunner.java:943)
	at com.carrotsearch.randomizedtesting.RandomizedRunner$5.evaluate(RandomizedRunner.java:829)
	at com.carrotsearch.randomizedtesting.RandomizedRunner$6.evaluate(RandomizedRunner.java:879)
	at com.carrotsearch.randomizedtesting.RandomizedRunner$7.evaluate(RandomizedRunner.java:890)
	at com.carrotsearch.randomizedtesting.rules.StatementAdapter.evaluate(StatementAdapter.java:36)
	at com.carrotsearch.randomizedtesting.rules.SystemPropertiesRestoreRule$1.evaluate(SystemPropertiesRestoreRule.java:57)
	at org.apache.lucene.util.AbstractBeforeAfterRule$1.evaluate(AbstractBeforeAfterRule.java:45)
	at com.carrotsearch.randomizedtesting.rules.StatementAdapter.evaluate(StatementAdapter.java:36)
	at org.apache.lucene.util.TestRuleStoreClassName$1.evaluate(TestRuleStoreClassName.java:41)
	at com.carrotsearch.randomizedtesting.rules.NoShadowingOrOverridesOnMethodsRule$1.evaluate(NoShadowingOrOverridesOnMethodsRule.java:40)
	at com.carrotsearch.randomizedtesting.rules.NoShadowingOrOverridesOnMethodsRule$1.evaluate(NoShadowingOrOverridesOnMethodsRule.java:40)
	at com.carrotsearch.randomizedtesting.rules.StatementAdapter.evaluate(StatementAdapter.java:36)
	at com.carrotsearch.randomizedtesting.rules.StatementAdapter.evaluate(StatementAdapter.java:36)
	at com.carrotsearch.randomizedtesting.rules.StatementAdapter.evaluate(StatementAdapter.java:36)
	at org.apache.lucene.util.TestRuleAssertionsRequired$1.evaluate(TestRuleAssertionsRequired.java:53)
	at org.apache.lucene.util.TestRuleMarkFailure$1.evaluate(TestRuleMarkFailure.java:47)
	at org.apache.lucene.util.TestRuleIgnoreAfterMaxFailures$1.evaluate(TestRuleIgnoreAfterMaxFailures.java:64)
	at org.apache.lucene.util.TestRuleIgnoreTestSuites$1.evaluate(TestRuleIgnoreTestSuites.java:54)
	at com.carrotsearch.randomizedtesting.rules.StatementAdapter.evaluate(StatementAdapter.java:36)
	at com.carrotsearch.randomizedtesting.ThreadLeakControl$StatementRunner.run(ThreadLeakControl.java:368)
	at java.lang.Thread.run(Thread.java:748)


FAILED:  org.apache.solr.cloud.autoscaling.SystemLogListenerTest.test

Error Message:
IOException occured when talking to server at: https://127.0.0.1:61441/solr/.system

Stack Trace:
org.apache.solr.client.solrj.SolrServerException: IOException occured when talking to server at: https://127.0.0.1:61441/solr/.system
	at __randomizedtesting.SeedInfo.seed([5CD9CF70E73B6407:D48DF0AA49C709FF]:0)
	at org.apache.solr.client.solrj.impl.HttpSolrClient.executeMethod(HttpSolrClient.java:640)
	at org.apache.solr.client.solrj.impl.HttpSolrClient.request(HttpSolrClient.java:253)
	at org.apache.solr.client.solrj.impl.HttpSolrClient.request(HttpSolrClient.java:242)
	at org.apache.solr.client.solrj.impl.LBHttpSolrClient.doRequest(LBHttpSolrClient.java:483)
	at org.apache.solr.client.solrj.impl.LBHttpSolrClient.request(LBHttpSolrClient.java:413)
	at org.apache.solr.client.solrj.impl.CloudSolrClient.sendRequest(CloudSolrClient.java:1086)
	at org.apache.solr.client.solrj.impl.CloudSolrClient.requestWithRetryOnStaleState(CloudSolrClient.java:867)
	at org.apache.solr.client.solrj.impl.CloudSolrClient.requestWithRetryOnStaleState(CloudSolrClient.java:927)
	at org.apache.solr.client.solrj.impl.CloudSolrClient.requestWithRetryOnStaleState(CloudSolrClient.java:927)
	at org.apache.solr.client.solrj.impl.CloudSolrClient.requestWithRetryOnStaleState(CloudSolrClient.java:927)
	at org.apache.solr.client.solrj.impl.CloudSolrClient.requestWithRetryOnStaleState(CloudSolrClient.java:927)
	at org.apache.solr.client.solrj.impl.CloudSolrClient.requestWithRetryOnStaleState(CloudSolrClient.java:927)
	at org.apache.solr.client.solrj.impl.CloudSolrClient.request(CloudSolrClient.java:800)
	at org.apache.solr.client.solrj.SolrRequest.process(SolrRequest.java:178)
	at org.apache.solr.client.solrj.SolrClient.commit(SolrClient.java:484)
	at org.apache.solr.cloud.autoscaling.SystemLogListenerTest.test(SystemLogListenerTest.java:157)
	at sun.reflect.NativeMethodAccessorImpl.invoke0(Native Method)
	at sun.reflect.NativeMethodAccessorImpl.invoke(NativeMethodAccessorImpl.java:62)
	at sun.reflect.DelegatingMethodAccessorImpl.invoke(DelegatingMethodAccessorImpl.java:43)
	at java.lang.reflect.Method.invoke(Method.java:498)
	at com.carrotsearch.randomizedtesting.RandomizedRunner.invoke(RandomizedRunner.java:1737)
	at com.carrotsearch.randomizedtesting.RandomizedRunner$8.evaluate(RandomizedRunner.java:934)
	at com.carrotsearch.randomizedtesting.RandomizedRunner$9.evaluate(RandomizedRunner.java:970)
	at com.carrotsearch.randomizedtesting.RandomizedRunner$10.evaluate(RandomizedRunner.java:984)
	at com.carrotsearch.randomizedtesting.rules.SystemPropertiesRestoreRule$1.evaluate(SystemPropertiesRestoreRule.java:57)
	at org.apache.lucene.util.TestRuleSetupTeardownChained$1.evaluate(TestRuleSetupTeardownChained.java:49)
	at org.apache.lucene.util.AbstractBeforeAfterRule$1.evaluate(AbstractBeforeAfterRule.java:45)
	at org.apache.lucene.util.TestRuleThreadAndTestName$1.evaluate(TestRuleThreadAndTestName.java:48)
	at org.apache.lucene.util.TestRuleIgnoreAfterMaxFailures$1.evaluate(TestRuleIgnoreAfterMaxFailures.java:64)
	at org.apache.lucene.util.TestRuleMarkFailure$1.evaluate(TestRuleMarkFailure.java:47)
	at com.carrotsearch.randomizedtesting.rules.StatementAdapter.evaluate(StatementAdapter.java:36)
	at com.carrotsearch.randomizedtesting.ThreadLeakControl$StatementRunner.run(ThreadLeakControl.java:368)
	at com.carrotsearch.randomizedtesting.ThreadLeakControl.forkTimeoutingTask(ThreadLeakControl.java:817)
	at com.carrotsearch.randomizedtesting.ThreadLeakControl$3.evaluate(ThreadLeakControl.java:468)
	at com.carrotsearch.randomizedtesting.RandomizedRunner.runSingleTest(RandomizedRunner.java:943)
	at com.carrotsearch.randomizedtesting.RandomizedRunner$5.evaluate(RandomizedRunner.java:829)
	at com.carrotsearch.randomizedtesting.RandomizedRunner$6.evaluate(RandomizedRunner.java:879)
	at com.carrotsearch.randomizedtesting.RandomizedRunner$7.evaluate(RandomizedRunner.java:890)
	at com.carrotsearch.randomizedtesting.rules.StatementAdapter.evaluate(StatementAdapter.java:36)
	at com.carrotsearch.randomizedtesting.rules.SystemPropertiesRestoreRule$1.evaluate(SystemPropertiesRestoreRule.java:57)
	at org.apache.lucene.util.AbstractBeforeAfterRule$1.evaluate(AbstractBeforeAfterRule.java:45)
	at com.carrotsearch.randomizedtesting.rules.StatementAdapter.evaluate(StatementAdapter.java:36)
	at org.apache.lucene.util.TestRuleStoreClassName$1.evaluate(TestRuleStoreClassName.java:41)
	at com.carrotsearch.randomizedtesting.rules.NoShadowingOrOverridesOnMethodsRule$1.evaluate(NoShadowingOrOverridesOnMethodsRule.java:40)
	at com.carrotsearch.randomizedtesting.rules.NoShadowingOrOverridesOnMethodsRule$1.evaluate(NoShadowingOrOverridesOnMethodsRule.java:40)
	at com.carrotsearch.randomizedtesting.rules.StatementAdapter.evaluate(StatementAdapter.java:36)
	at com.carrotsearch.randomizedtesting.rules.StatementAdapter.evaluate(StatementAdapter.java:36)
	at com.carrotsearch.randomizedtesting.rules.StatementAdapter.evaluate(StatementAdapter.java:36)
	at org.apache.lucene.util.TestRuleAssertionsRequired$1.evaluate(TestRuleAssertionsRequired.java:53)
	at org.apache.lucene.util.TestRuleMarkFailure$1.evaluate(TestRuleMarkFailure.java:47)
	at org.apache.lucene.util.TestRuleIgnoreAfterMaxFailures$1.evaluate(TestRuleIgnoreAfterMaxFailures.java:64)
	at org.apache.lucene.util.TestRuleIgnoreTestSuites$1.evaluate(TestRuleIgnoreTestSuites.java:54)
	at com.carrotsearch.randomizedtesting.rules.StatementAdapter.evaluate(StatementAdapter.java:36)
	at com.carrotsearch.randomizedtesting.ThreadLeakControl$StatementRunner.run(ThreadLeakControl.java:368)
	at java.lang.Thread.run(Thread.java:748)
Caused by: java.net.SocketException: Too many open files
	at java.net.Socket.createImpl(Socket.java:460)
	at java.net.Socket.getImpl(Socket.java:520)
	at java.net.Socket.setSoTimeout(Socket.java:1141)
	at org.apache.http.impl.conn.DefaultHttpClientConnectionOperator.connect(DefaultHttpClientConnectionOperator.java:120)
	at org.apache.http.impl.conn.PoolingHttpClientConnectionManager.connect(PoolingHttpClientConnectionManager.java:359)
	at org.apache.http.impl.execchain.MainClientExec.establishRoute(MainClientExec.java:381)
	at org.apache.http.impl.execchain.MainClientExec.execute(MainClientExec.java:237)
	at org.apache.http.impl.execchain.ProtocolExec.execute(ProtocolExec.java:185)
	at org.apache.http.impl.execchain.RetryExec.execute(RetryExec.java:89)
	at org.apache.http.impl.execchain.RedirectExec.execute(RedirectExec.java:111)
	at org.apache.http.impl.client.InternalHttpClient.doExecute(InternalHttpClient.java:185)
	at org.apache.http.impl.client.CloseableHttpClient.execute(CloseableHttpClient.java:83)
	at org.apache.http.impl.client.CloseableHttpClient.execute(CloseableHttpClient.java:56)
	at org.apache.solr.client.solrj.impl.HttpSolrClient.executeMethod(HttpSolrClient.java:525)
	... 54 more


FAILED:  org.apache.solr.handler.admin.AutoscalingHistoryHandlerTest.testHistory

Error Message:
action did not execute

Stack Trace:
java.lang.AssertionError: action did not execute
	at __randomizedtesting.SeedInfo.seed([5CD9CF70E73B6407:31256B8D5D739B00]:0)
	at org.junit.Assert.fail(Assert.java:93)
	at org.junit.Assert.assertTrue(Assert.java:43)
	at org.apache.solr.handler.admin.AutoscalingHistoryHandlerTest.testHistory(AutoscalingHistoryHandlerTest.java:260)
	at sun.reflect.NativeMethodAccessorImpl.invoke0(Native Method)
	at sun.reflect.NativeMethodAccessorImpl.invoke(NativeMethodAccessorImpl.java:62)
	at sun.reflect.DelegatingMethodAccessorImpl.invoke(DelegatingMethodAccessorImpl.java:43)
	at java.lang.reflect.Method.invoke(Method.java:498)
	at com.carrotsearch.randomizedtesting.RandomizedRunner.invoke(RandomizedRunner.java:1737)
	at com.carrotsearch.randomizedtesting.RandomizedRunner$8.evaluate(RandomizedRunner.java:934)
	at com.carrotsearch.randomizedtesting.RandomizedRunner$9.evaluate(RandomizedRunner.java:970)
	at com.carrotsearch.randomizedtesting.RandomizedRunner$10.evaluate(RandomizedRunner.java:984)
	at com.carrotsearch.randomizedtesting.rules.SystemPropertiesRestoreRule$1.evaluate(SystemPropertiesRestoreRule.java:57)
	at org.apache.lucene.util.TestRuleSetupTeardownChained$1.evaluate(TestRuleSetupTeardownChained.java:49)
	at org.apache.lucene.util.AbstractBeforeAfterRule$1.evaluate(AbstractBeforeAfterRule.java:45)
	at org.apache.lucene.util.TestRuleThreadAndTestName$1.evaluate(TestRuleThreadAndTestName.java:48)
	at org.apache.lucene.util.TestRuleIgnoreAfterMaxFailures$1.evaluate(TestRuleIgnoreAfterMaxFailures.java:64)
	at org.apache.lucene.util.TestRuleMarkFailure$1.evaluate(TestRuleMarkFailure.java:47)
	at com.carrotsearch.randomizedtesting.rules.StatementAdapter.evaluate(StatementAdapter.java:36)
	at com.carrotsearch.randomizedtesting.ThreadLeakControl$StatementRunner.run(ThreadLeakControl.java:368)
	at com.carrotsearch.randomizedtesting.ThreadLeakControl.forkTimeoutingTask(ThreadLeakControl.java:817)
	at com.carrotsearch.randomizedtesting.ThreadLeakControl$3.evaluate(ThreadLeakControl.java:468)
	at com.carrotsearch.randomizedtesting.RandomizedRunner.runSingleTest(RandomizedRunner.java:943)
	at com.carrotsearch.randomizedtesting.RandomizedRunner$5.evaluate(RandomizedRunner.java:829)
	at com.carrotsearch.randomizedtesting.RandomizedRunner$6.evaluate(RandomizedRunner.java:879)
	at com.carrotsearch.randomizedtesting.RandomizedRunner$7.evaluate(RandomizedRunner.java:890)
	at com.carrotsearch.randomizedtesting.rules.StatementAdapter.evaluate(StatementAdapter.java:36)
	at com.carrotsearch.randomizedtesting.rules.SystemPropertiesRestoreRule$1.evaluate(SystemPropertiesRestoreRule.java:57)
	at org.apache.lucene.util.AbstractBeforeAfterRule$1.evaluate(AbstractBeforeAfterRule.java:45)
	at com.carrotsearch.randomizedtesting.rules.StatementAdapter.evaluate(StatementAdapter.java:36)
	at org.apache.lucene.util.TestRuleStoreClassName$1.evaluate(TestRuleStoreClassName.java:41)
	at com.carrotsearch.randomizedtesting.rules.NoShadowingOrOverridesOnMethodsRule$1.evaluate(NoShadowingOrOverridesOnMethodsRule.java:40)
	at com.carrotsearch.randomizedtesting.rules.NoShadowingOrOverridesOnMethodsRule$1.evaluate(NoShadowingOrOverridesOnMethodsRule.java:40)
	at com.carrotsearch.randomizedtesting.rules.StatementAdapter.evaluate(StatementAdapter.java:36)
	at com.carrotsearch.randomizedtesting.rules.StatementAdapter.evaluate(StatementAdapter.java:36)
	at com.carrotsearch.randomizedtesting.rules.StatementAdapter.evaluate(StatementAdapter.java:36)
	at org.apache.lucene.util.TestRuleAssertionsRequired$1.evaluate(TestRuleAssertionsRequired.java:53)
	at org.apache.lucene.util.TestRuleMarkFailure$1.evaluate(TestRuleMarkFailure.java:47)
	at org.apache.lucene.util.TestRuleIgnoreAfterMaxFailures$1.evaluate(TestRuleIgnoreAfterMaxFailures.java:64)
	at org.apache.lucene.util.TestRuleIgnoreTestSuites$1.evaluate(TestRuleIgnoreTestSuites.java:54)
	at com.carrotsearch.randomizedtesting.rules.StatementAdapter.evaluate(StatementAdapter.java:36)
	at com.carrotsearch.randomizedtesting.ThreadLeakControl$StatementRunner.run(ThreadLeakControl.java:368)
	at java.lang.Thread.run(Thread.java:748)




Build Log:
[...truncated 12081 lines...]
   [junit4] Suite: org.apache.solr.cloud.CustomCollectionTest
   [junit4]   2> 964792 INFO  (SUITE-CustomCollectionTest-seed#[5CD9CF70E73B6407]-worker) [    ] o.a.s.SolrTestCaseJ4 SecureRandom sanity checks: test.solr.allowed.securerandom=null & java.security.egd=file:/dev/./urandom
   [junit4]   2> Creating dataDir: /Users/jenkins/workspace/Lucene-Solr-master-MacOSX/solr/build/solr-core/test/J1/temp/solr.cloud.CustomCollectionTest_5CD9CF70E73B6407-001/init-core-data-001
   [junit4]   2> 964793 WARN  (SUITE-CustomCollectionTest-seed#[5CD9CF70E73B6407]-worker) [    ] o.a.s.SolrTestCaseJ4 startTrackingSearchers: numOpens=7 numCloses=7
   [junit4]   2> 964793 INFO  (SUITE-CustomCollectionTest-seed#[5CD9CF70E73B6407]-worker) [    ] o.a.s.SolrTestCaseJ4 Using PointFields (NUMERIC_POINTS_SYSPROP=true) w/NUMERIC_DOCVALUES_SYSPROP=true
   [junit4]   2> 964796 INFO  (SUITE-CustomCollectionTest-seed#[5CD9CF70E73B6407]-worker) [    ] o.a.s.SolrTestCaseJ4 Randomized ssl (true) and clientAuth (false) via: @org.apache.solr.util.RandomizeSSL(reason=, value=NaN, ssl=NaN, clientAuth=NaN) w/ MAC_OS_X supressed clientAuth
   [junit4]   2> 964797 INFO  (SUITE-CustomCollectionTest-seed#[5CD9CF70E73B6407]-worker) [    ] o.a.s.c.MiniSolrCloudCluster Starting cluster of 4 servers in /Users/jenkins/workspace/Lucene-Solr-master-MacOSX/solr/build/solr-core/test/J1/temp/solr.cloud.CustomCollectionTest_5CD9CF70E73B6407-001/tempDir-001
   [junit4]   2> 964797 INFO  (SUITE-CustomCollectionTest-seed#[5CD9CF70E73B6407]-worker) [    ] o.a.s.c.ZkTestServer STARTING ZK TEST SERVER
   [junit4]   2> 964797 INFO  (Thread-1663) [    ] o.a.s.c.ZkTestServer client port:0.0.0.0/0.0.0.0:0
   [junit4]   2> 964797 INFO  (Thread-1663) [    ] o.a.s.c.ZkTestServer Starting server
   [junit4]   2> 964800 ERROR (Thread-1663) [    ] o.a.z.s.ZooKeeperServer ZKShutdownHandler is not registered, so ZooKeeper server won't take any action on ERROR or SHUTDOWN server state changes
   [junit4]   2> 964901 INFO  (SUITE-CustomCollectionTest-seed#[5CD9CF70E73B6407]-worker) [    ] o.a.s.c.ZkTestServer start zk server on port:54064
   [junit4]   2> 964930 INFO  (jetty-launcher-3517-thread-2) [    ] o.e.j.s.Server jetty-9.3.20.v20170531
   [junit4]   2> 964930 INFO  (jetty-launcher-3517-thread-3) [    ] o.e.j.s.Server jetty-9.3.20.v20170531
   [junit4]   2> 964930 INFO  (jetty-launcher-3517-thread-4) [    ] o.e.j.s.Server jetty-9.3.20.v20170531
   [junit4]   2> 964930 INFO  (jetty-launcher-3517-thread-1) [    ] o.e.j.s.Server jetty-9.3.20.v20170531
   [junit4]   2> 964933 INFO  (jetty-launcher-3517-thread-1) [    ] o.e.j.s.h.ContextHandler Started o.e.j.s.ServletContextHandler@24a5d4ca{/solr,null,AVAILABLE}
   [junit4]   2> 964934 INFO  (jetty-launcher-3517-thread-4) [    ] o.e.j.s.h.ContextHandler Started o.e.j.s.ServletContextHandler@341bc8a9{/solr,null,AVAILABLE}
   [junit4]   2> 964934 INFO  (jetty-launcher-3517-thread-2) [    ] o.e.j.s.h.ContextHandler Started o.e.j.s.ServletContextHandler@64b2a5f7{/solr,null,AVAILABLE}
   [junit4]   2> 964934 INFO  (jetty-launcher-3517-thread-3) [    ] o.e.j.s.h.ContextHandler Started o.e.j.s.ServletContextHandler@36e0fc3b{/solr,null,AVAILABLE}
   [junit4]   2> 964935 INFO  (jetty-launcher-3517-thread-4) [    ] o.e.j.s.AbstractConnector Started ServerConnector@6c608b78{SSL,[ssl, http/1.1]}{127.0.0.1:54067}
   [junit4]   2> 964936 INFO  (jetty-launcher-3517-thread-1) [    ] o.e.j.s.AbstractConnector Started ServerConnector@6d064f47{SSL,[ssl, http/1.1]}{127.0.0.1:54066}
   [junit4]   2> 964936 INFO  (jetty-launcher-3517-thread-4) [    ] o.e.j.s.Server Started @968083ms
   [junit4]   2> 964936 INFO  (jetty-launcher-3517-thread-1) [    ] o.e.j.s.Server Started @968084ms
   [junit4]   2> 964936 INFO  (jetty-launcher-3517-thread-4) [    ] o.a.s.c.s.e.JettySolrRunner Jetty properties: {hostContext=/solr, hostPort=54067}
   [junit4]   2> 964936 INFO  (jetty-launcher-3517-thread-1) [    ] o.a.s.c.s.e.JettySolrRunner Jetty properties: {hostContext=/solr, hostPort=54066}
   [junit4]   2> 964936 INFO  (jetty-launcher-3517-thread-2) [    ] o.e.j.s.AbstractConnector Started ServerConnector@283cd25f{SSL,[ssl, http/1.1]}{127.0.0.1:54068}
   [junit4]   2> 964936 INFO  (jetty-launcher-3517-thread-2) [    ] o.e.j.s.Server Started @968084ms
   [junit4]   2> 964936 INFO  (jetty-launcher-3517-thread-2) [    ] o.a.s.c.s.e.JettySolrRunner Jetty properties: {hostContext=/solr, hostPort=54068}
   [junit4]   2> 964936 ERROR (jetty-launcher-3517-thread-4) [    ] o.a.s.u.StartupLoggingUtils Missing Java Option solr.log.dir. Logging may be missing or incomplete.
   [junit4]   2> 964936 INFO  (jetty-launcher-3517-thread-3) [    ] o.e.j.s.AbstractConnector Started ServerConnector@769f0936{SSL,[ssl, http/1.1]}{127.0.0.1:54069}
   [junit4]   2> 964936 INFO  (jetty-launcher-3517-thread-3) [    ] o.e.j.s.Server Started @968084ms
   [junit4]   2> 964936 ERROR (jetty-launcher-3517-thread-2) [    ] o.a.s.u.StartupLoggingUtils Missing Java Option solr.log.dir. Logging may be missing or incomplete.
   [junit4]   2> 964937 INFO  (jetty-launcher-3517-thread-3) [    ] o.a.s.c.s.e.JettySolrRunner Jetty properties: {hostContext=/solr, hostPort=54069}
   [junit4]   2> 964936 ERROR (jetty-launcher-3517-thread-1) [    ] o.a.s.u.StartupLoggingUtils Missing Java Option solr.log.dir. Logging may be missing or incomplete.
   [junit4]   2> 964937 INFO  (jetty-launcher-3517-thread-4) [    ] o.a.s.s.SolrDispatchFilter  ___      _       Welcome to Apache Solr? version 8.0.0
   [junit4]   2> 964937 ERROR (jetty-launcher-3517-thread-3) [    ] o.a.s.u.StartupLoggingUtils Missing Java Option solr.log.dir. Logging may be missing or incomplete.
   [junit4]   2> 964937 INFO  (jetty-launcher-3517-thread-2) [    ] o.a.s.s.SolrDispatchFilter  ___      _       Welcome to Apache Solr? version 8.0.0
   [junit4]   2> 964937 INFO  (jetty-launcher-3517-thread-2) [    ] o.a.s.s.SolrDispatchFilter / __| ___| |_ _   Starting in cloud mode on port null
   [junit4]   2> 964937 INFO  (jetty-launcher-3517-thread-1) [    ] o.a.s.s.SolrDispatchFilter  ___      _       Welcome to Apache Solr? version 8.0.0
   [junit4]   2> 964937 INFO  (jetty-launcher-3517-thread-2) [    ] o.a.s.s.SolrDispatchFilter \__ \/ _ \ | '_|  Install dir: null, Default config dir: null
   [junit4]   2> 964937 INFO  (jetty-launcher-3517-thread-1) [    ] o.a.s.s.SolrDispatchFilter / __| ___| |_ _   Starting in cloud mode on port null
   [junit4]   2> 964937 INFO  (jetty-launcher-3517-thread-2) [    ] o.a.s.s.SolrDispatchFilter |___/\___/_|_|    Start time: 2017-10-19T13:25:20.191Z
   [junit4]   2> 964937 INFO  (jetty-launcher-3517-thread-1) [    ] o.a.s.s.SolrDispatchFilter \__ \/ _ \ | '_|  Install dir: null, Default config dir: null
   [junit4]   2> 964937 INFO  (jetty-launcher-3517-thread-1) [    ] o.a.s.s.SolrDispatchFilter |___/\___/_|_|    Start time: 2017-10-19T13:25:20.191Z
   [junit4]   2> 964937 INFO  (jetty-launcher-3517-thread-4) [    ] o.a.s.s.SolrDispatchFilter / __| ___| |_ _   Starting in cloud mode on port null
   [junit4]   2> 964937 INFO  (jetty-launcher-3517-thread-4) [    ] o.a.s.s.SolrDispatchFilter \__ \/ _ \ | '_|  Install dir: null, Default config dir: null
   [junit4]   2> 964937 INFO  (jetty-launcher-3517-thread-4) [    ] o.a.s.s.SolrDispatchFilter |___/\___/_|_|    Start time: 2017-10-19T13:25:20.191Z
   [junit4]   2> 964937 INFO  (jetty-launcher-3517-thread-3) [    ] o.a.s.s.SolrDispatchFilter  ___      _       Welcome to Apache Solr? version 8.0.0
   [junit4]   2> 964937 INFO  (jetty-launcher-3517-thread-3) [    ] o.a.s.s.SolrDispatchFilter / __| ___| |_ _   Starting in cloud mode on port null
   [junit4]   2> 964937 INFO  (jetty-launcher-3517-thread-3) [    ] o.a.s.s.SolrDispatchFilter \__ \/ _ \ | '_|  Install dir: null, Default config dir: null
   [junit4]   2> 964937 INFO  (jetty-launcher-3517-thread-3) [    ] o.a.s.s.SolrDispatchFilter |___/\___/_|_|    Start time: 2017-10-19T13:25:20.191Z
   [junit4]   2> 964940 INFO  (jetty-launcher-3517-thread-1) [    ] o.a.s.s.SolrDispatchFilter solr.xml found in ZooKeeper. Loading...
   [junit4]   2> 964940 INFO  (jetty-launcher-3517-thread-2) [    ] o.a.s.s.SolrDispatchFilter solr.xml found in ZooKeeper. Loading...
   [junit4]   2> 964940 INFO  (jetty-launcher-3517-thread-4) [    ] o.a.s.s.SolrDispatchFilter solr.xml found in ZooKeeper. Loading...
   [junit4]   2> 964940 INFO  (jetty-launcher-3517-thread-3) [    ] o.a.s.s.SolrDispatchFilter solr.xml found in ZooKeeper. Loading...
   [junit4]   2> 964947 WARN  (NIOServerCxn.Factory:0.0.0.0/0.0.0.0:0) [    ] o.a.z.s.NIOServerCnxn caught end of stream exception
   [junit4]   2> EndOfStreamException: Unable to read additional data from client sessionid 0x15f34cf46350003, likely client has closed socket
   [junit4]   2> 	at org.apache.zookeeper.server.NIOServerCnxn.doIO(NIOServerCnxn.java:239)
   [junit4]   2> 	at org.apache.zookeeper.server.NIOServerCnxnFactory.run(NIOServerCnxnFactory.java:203)
   [junit4]   2> 	at java.lang.Thread.run(Thread.java:748)
   [junit4]   2> 964949 WARN  (NIOServerCxn.Factory:0.0.0.0/0.0.0.0:0) [    ] o.a.z.s.NIOServerCnxn caught end of stream exception
   [junit4]   2> EndOfStreamException: Unable to read additional data from client sessionid 0x15f34cf46350002, likely client has closed socket
   [junit4]   2> 	at org.apache.zookeeper.server.NIOServerCnxn.doIO(NIOServerCnxn.java:239)
   [junit4]   2> 	at org.apache.zookeeper.server.NIOServerCnxnFactory.run(NIOServerCnxnFactory.java:203)
   [junit4]   2> 	at java.lang.Thread.run(Thread.java:748)
   [junit4]   2> 964949 WARN  (NIOServerCxn.Factory:0.0.0.0/0.0.0.0:0) [    ] o.a.z.s.NIOServerCnxn caught end of stream exception
   [junit4]   2> EndOfStreamException: Unable to read additional data from client sessionid 0x15f34cf46350004, likely client has closed socket
   [junit4]   2> 	at org.apache.zookeeper.server.NIOServerCnxn.doIO(NIOServerCnxn.java:239)
   [junit4]   2> 	at org.apache.zookeeper.server.NIOServerCnxnFactory.run(NIOServerCnxnFactory.java:203)
   [junit4]   2> 	at java.lang.Thread.run(Thread.java:748)
   [junit4]   2> 964950 WARN  (NIOServerCxn.Factory:0.0.0.0/0.0.0.0:0) [    ] o.a.z.s.NIOServerCnxn caught end of stream exception
   [junit4]   2> EndOfStreamException: Unable to read additional data from client sessionid 0x15f34cf46350001, likely client has closed socket
   [junit4]   2> 	at org.apache.zookeeper.server.NIOServerCnxn.doIO(NIOServerCnxn.java:239)
   [junit4]   2> 	at org.apache.zookeeper.server.NIOServerCnxnFactory.run(NIOServerCnxnFactory.java:203)
   [junit4]   2> 	at java.lang.Thread.run(Thread.java:748)
   [junit4]   2> 964951 INFO  (jetty-launcher-3517-thread-2) [    ] o.a.s.c.ZkContainer Zookeeper client=127.0.0.1:54064/solr
   [junit4]   2> 964952 INFO  (jetty-launcher-3517-thread-4) [    ] o.a.s.c.ZkContainer Zookeeper client=127.0.0.1:54064/solr
   [junit4]   2> 964953 INFO  (jetty-launcher-3517-thread-1) [    ] o.a.s.c.ZkContainer Zookeeper client=127.0.0.1:54064/solr
   [junit4]   2> 964955 WARN  (NIOServerCxn.Factory:0.0.0.0/0.0.0.0:0) [    ] o.a.z.s.NIOServerCnxn caught end of stream exception
   [junit4]   2> EndOfStreamException: Unable to read additional data from client sessionid 0x15f34cf46350005, likely client has closed socket
   [junit4]   2> 	at org.apache.zookeeper.server.NIOServerCnxn.doIO(NIOServerCnxn.java:239)
   [junit4]   2> 	at org.apache.zookeeper.server.NIOServerCnxnFactory.run(NIOServerCnxnFactory.java:203)
   [junit4]   2> 	at java.lang.Thread.run(Thread.java:748)
   [junit4]   2> 964957 WARN  (NIOServerCxn.Factory:0.0.0.0/0.0.0.0:0) [    ] o.a.z.s.NIOServerCnxn caught end of stream exception
   [junit4]   2> EndOfStreamException: Unable to read additional data from client sessionid 0x15f34cf46350006, likely client has closed socket
   [junit4]   2> 	at org.apache.zookeeper.server.NIOServerCnxn.doIO(NIOServerCnxn.java:239)
   [junit4]   2> 	at org.apache.zookeeper.server.NIOServerCnxnFactory.run(NIOServerCnxnFactory.java:203)
   [junit4]   2> 	at java.lang.Thread.run(Thread.java:748)
   [junit4]   2> 964957 INFO  (jetty-launcher-3517-thread-3) [    ] o.a.s.c.ZkContainer Zookeeper client=127.0.0.1:54064/solr
   [junit4]   2> 964957 WARN  (NIOServerCxn.Factory:0.0.0.0/0.0.0.0:0) [    ] o.a.z.s.NIOServerCnxn caught end of stream exception
   [junit4]   2> EndOfStreamException: Unable to read additional data from client sessionid 0x15f34cf46350007, likely client has closed socket
   [junit4]   2> 	at org.apache.zookeeper.server.NIOServerCnxn.doIO(NIOServerCnxn.java:239)
   [junit4]   2> 	at org.apache.zookeeper.server.NIOServerCnxnFactory.run(NIOServerCnxnFactory.java:203)
   [junit4]   2> 	at java.lang.Thread.run(Thread.java:748)
   [junit4]   2> 965154 INFO  (jetty-launcher-3517-thread-3) [n:127.0.0.1:54069_solr    ] o.a.s.c.Overseer Overseer (id=null) closing
   [junit4]   2> 965155 INFO  (jetty-launcher-3517-thread-2) [n:127.0.0.1:54068_solr    ] o.a.s.c.Overseer Overseer (id=null) closing
   [junit4]   2> 965155 INFO  (jetty-launcher-3517-thread-4) [n:127.0.0.1:54067_solr    ] o.a.s.c.Overseer Overseer (id=null) closing
   [junit4]   2> 965155 INFO  (jetty-launcher-3517-thread-1) [n:127.0.0.1:54066_solr    ] o.a.s.c.Overseer Overseer (id=null) closing
   [junit4]   2> 965157 INFO  (jetty-launcher-3517-thread-2) [n:127.0.0.1:54068_solr    ] o.a.s.c.OverseerElectionContext I am going to be the leader 127.0.0.1:54068_solr
   [junit4]   2> 965158 INFO  (jetty-launcher-3517-thread-1) [n:127.0.0.1:54066_solr    ] o.a.s.c.ZkController Register node as live in ZooKeeper:/live_nodes/127.0.0.1:54066_solr
   [junit4]   2> 965158 INFO  (jetty-launcher-3517-thread-4) [n:127.0.0.1:54067_solr    ] o.a.s.c.ZkController Register node as live in ZooKeeper:/live_nodes/127.0.0.1:54067_solr
   [junit4]   2> 965158 INFO  (jetty-launcher-3517-thread-3) [n:127.0.0.1:54069_solr    ] o.a.s.c.ZkController Register node as live in ZooKeeper:/live_nodes/127.0.0.1:54069_solr
   [junit4]   2> 965158 INFO  (jetty-launcher-3517-thread-2) [n:127.0.0.1:54068_solr    ] o.a.s.c.Overseer Overseer (id=98855781666193416-127.0.0.1:54068_solr-n_0000000000) starting
   [junit4]   2> 965170 INFO  (zkCallback-3536-thread-1-processing-n:127.0.0.1:54066_solr) [n:127.0.0.1:54066_solr    ] o.a.s.c.c.ZkStateReader Updated live nodes from ZooKeeper... (0) -> (3)
   [junit4]   2> 965181 INFO  (zkCallback-3534-thread-1-processing-n:127.0.0.1:54068_solr) [n:127.0.0.1:54068_solr    ] o.a.s.c.c.ZkStateReader Updated live nodes from ZooKeeper... (0) -> (3)
   [junit4]   2> 965181 INFO  (zkCallback-3538-thread-1-processing-n:127.0.0.1:54067_solr) [n:127.0.0.1:54067_solr    ] o.a.s.c.c.ZkStateReader Updated live nodes from ZooKeeper... (0) -> (3)
   [junit4]   2> 965182 INFO  (zkCallback-3539-thread-1-processing-n:127.0.0.1:54069_solr) [n:127.0.0.1:54069_solr    ] o.a.s.c.c.ZkStateReader Updated live nodes from ZooKeeper... (0) -> (3)
   [junit4]   2> 965224 INFO  (jetty-launcher-3517-thread-2) [n:127.0.0.1:54068_solr    ] o.a.s.c.ZkController Register node as live in ZooKeeper:/live_nodes/127.0.0.1:54068_solr
   [junit4]   2> 965226 INFO  (zkCallback-3539-thread-1-processing-n:127.0.0.1:54069_solr) [n:127.0.0.1:54069_solr    ] o.a.s.c.c.ZkStateReader Updated live nodes from ZooKeeper... (3) -> (4)
   [junit4]   2> 965226 INFO  (zkCallback-3538-thread-1-processing-n:127.0.0.1:54067_solr) [n:127.0.0.1:54067_solr    ] o.a.s.c.c.ZkStateReader Updated live nodes from ZooKeeper... (3) -> (4)
   [junit4]   2> 965227 INFO  (zkCallback-3534-thread-1-processing-n:127.0.0.1:54068_solr) [n:127.0.0.1:54068_solr    ] o.a.s.c.c.ZkStateReader Updated live nodes from ZooKeeper... (3) -> (4)
   [junit4]   2> 965227 INFO  (zkCallback-3536-thread-1-processing-n:127.0.0.1:54066_solr) [n:127.0.0.1:54066_solr    ] o.a.s.c.c.ZkStateReader Updated live nodes from ZooKeeper... (3) -> (4)
   [junit4]   2> 965301 INFO  (jetty-launcher-3517-thread-4) [n:127.0.0.1:54067_solr    ] o.a.s.m.r.SolrJmxReporter JMX monitoring for 'solr_54067.solr.node' (registry 'solr.node') enabled at server: com.sun.jmx.mbeanserver.JmxMBeanServer@44aab74c
   [junit4]   2> 965309 INFO  (jetty-launcher-3517-thread-3) [n:127.0.0.1:54069_solr    ] o.a.s.m.r.SolrJmxReporter JMX monitoring for 'solr_54069.solr.node' (registry 'solr.node') enabled at server: com.sun.jmx.mbeanserver.JmxMBeanServer@44aab74c
   [junit4]   2> 965328 INFO  (jetty-launcher-3517-thread-4) [n:127.0.0.1:54067_solr    ] o.a.s.m.r.SolrJmxReporter JMX monitoring for 'solr_54067.solr.jvm' (registry 'solr.jvm') enabled at server: com.sun.jmx.mbeanserver.JmxMBeanServer@44aab74c
   [junit4]   2> 965328 INFO  (jetty-launcher-3517-thread-4) [n:127.0.0.1:54067_solr    ] o.a.s.m.r.SolrJmxReporter JMX monitoring for 'solr_54067.solr.jetty' (registry 'solr.jetty') enabled at server: com.sun.jmx.mbeanserver.JmxMBeanServer@44aab74c
   [junit4]   2> 965331 INFO  (jetty-launcher-3517-thread-4) [n:127.0.0.1:54067_solr    ] o.a.s.c.CorePropertiesLocator Found 0 core definitions underneath /Users/jenkins/workspace/Lucene-Solr-master-MacOSX/solr/build/solr-core/test/J1/temp/solr.cloud.CustomCollectionTest_5CD9CF70E73B6407-001/tempDir-001/node4/.
   [junit4]   2> 965345 INFO  (jetty-launcher-3517-thread-3) [n:127.0.0.1:54069_solr    ] o.a.s.m.r.SolrJmxReporter JMX monitoring for 'solr_54069.solr.jvm' (registry 'solr.jvm') enabled at server: com.sun.jmx.mbeanserver.JmxMBeanServer@44aab74c
   [junit4]   2> 965345 INFO  (jetty-launcher-3517-thread-3) [n:127.0.0.1:54069_solr    ] o.a.s.m.r.SolrJmxReporter JMX monitoring for 'solr_54069.solr.jetty' (registry 'solr.jetty') enabled at server: com.sun.jmx.mbeanserver.JmxMBeanServer@44aab74c
   [junit4]   2> 965350 INFO  (jetty-launcher-3517-thread-3) [n:127.0.0.1:54069_solr    ] o.a.s.c.CorePropertiesLocator Found 0 core definitions underneath /Users/jenkins/workspace/Lucene-Solr-master-MacOSX/solr/build/solr-core/test/J1/temp/solr.cloud.CustomCollectionTest_5CD9CF70E73B6407-001/tempDir-001/node3/.
   [junit4]   2> 965353 INFO  (jetty-launcher-3517-thread-2) [n:127.0.0.1:54068_solr    ] o.a.s.m.r.SolrJmxReporter JMX monitoring for 'solr_54068.solr.node' (registry 'solr.node') enabled at server: com.sun.jmx.mbeanserver.JmxMBeanServer@44aab74c
   [junit4]   2> 965356 INFO  (jetty-launcher-3517-thread-1) [n:127.0.0.1:54066_solr    ] o.a.s.m.r.SolrJmxReporter JMX monitoring for 'solr_54066.solr.node' (registry 'solr.node') enabled at server: com.sun.jmx.mbeanserver.JmxMBeanServer@44aab74c
   [junit4]   2> 965359 INFO  (jetty-launcher-3517-thread-2) [n:127.0.0.1:54068_solr    ] o.a.s.m.r.SolrJmxReporter JMX monitoring for 'solr_54068.solr.jvm' (registry 'solr.jvm') enabled at server: com.sun.jmx.mbeanserver.JmxMBeanServer@44aab74c
   [junit4]   2> 965359 INFO  (jetty-launcher-3517-thread-2) [n:127.0.0.1:54068_solr    ] o.a.s.m.r.SolrJmxReporter JMX monitoring for 'solr_54068.solr.jetty' (registry 'solr.jetty') enabled at server: com.sun.jmx.mbeanserver.JmxMBeanServer@44aab74c
   [junit4]   2> 965360 INFO  (jetty-launcher-3517-thread-2) [n:127.0.0.1:54068_solr    ] o.a.s.c.CorePropertiesLocator Found 0 core definitions underneath /Users/jenkins/workspace/Lucene-Solr-master-MacOSX/solr/build/solr-core/test/J1/temp/solr.cloud.CustomCollectionTest_5CD9CF70E73B6407-001/tempDir-001/node2/.
   [junit4]   2> 965364 INFO  (jetty-launcher-3517-thread-1) [n:127.0.0.1:54066_solr    ] o.a.s.m.r.SolrJmxReporter JMX monitoring for 'solr_54066.solr.jvm' (registry 'solr.jvm') enabled at server: com.sun.jmx.mbeanserver.JmxMBeanServer@44aab74c
   [junit4]   2> 965365 INFO  (jetty-launcher-3517-thread-1) [n:127.0.0.1:54066_solr    ] o.a.s.m.r.SolrJmxReporter JMX monitoring for 'solr_54066.solr.jetty' (registry 'solr.jetty') enabled at server: com.sun.jmx.mbeanserver.JmxMBeanServer@44aab74c
   [junit4]   2> 965365 INFO  (jetty-launcher-3517-thread-1) [n:127.0.0.1:54066_solr    ] o.a.s.c.CorePropertiesLocator Found 0 core definitions underneath /Users/jenkins/workspace/Lucene-Solr-master-MacOSX/solr/build/solr-core/test/J1/temp/solr.cloud.CustomCollectionTest_5CD9CF70E73B6407-001/tempDir-001/node1/.
   [junit4]   2> 965483 INFO  (SUITE-CustomCollectionTest-seed#[5CD9CF70E73B6407]-worker) [    ] o.a.s.c.c.ZkStateReader Updated live nodes from ZooKeeper... (0) -> (4)
   [junit4]   2> 965484 INFO  (SUITE-CustomCollectionTest-seed#[5CD9CF70E73B6407]-worker) [    ] o.a.s.c.s.i.ZkClientClusterStateProvider Cluster at 127.0.0.1:54064/solr ready
   [junit4]   2> 965516 INFO  (TEST-CustomCollectionTest.testRouteFieldForImplicitRouter-seed#[5CD9CF70E73B6407]) [    ] o.a.s.SolrTestCaseJ4 ###Starting testRouteFieldForImplicitRouter
   [junit4]   2> 965517 INFO  (TEST-CustomCollectionTest.testRouteFieldForImplicitRouter-seed#[5CD9CF70E73B6407]) [    ] o.a.s.c.c.ZkStateReader Updated live nodes from ZooKeeper... (0) -> (4)
   [junit4]   2> 965536 INFO  (qtp1383434849-11409) [n:127.0.0.1:54068_solr    ] o.a.s.h.a.CollectionsHandler Invoked Collection Action :create with params shards=a,b,c,d&replicationFactor=5&collection.configName=conf&maxShardsPerNode=6&router.field=shard_s&name=withShardField&router.name=implicit&nrtReplicas=5&action=CREATE&wt=javabin&version=2 and sendToOCPQueue=true
   [junit4]   2> 965539 INFO  (OverseerThreadFactory-3993-thread-1-processing-n:127.0.0.1:54068_solr) [n:127.0.0.1:54068_solr    ] o.a.s.c.CreateCollectionCmd Create collection withShardField
   [junit4]   2> 965540 WARN  (OverseerThreadFactory-3993-thread-1-processing-n:127.0.0.1:54068_solr) [n:127.0.0.1:54068_solr    ] o.a.s.c.CreateCollectionCmd Specified number of replicas of 5 on collection withShardField is higher than the number of Solr instances currently live or live and part of your createNodeSet(4). It's unusual to run two replica of the same slice on the same Solr-instance.
   [junit4]   2> 965655 INFO  (OverseerStateUpdate-98855781666193416-127.0.0.1:54068_solr-n_0000000000) [n:127.0.0.1:54068_solr    ] o.a.s.c.o.SliceMutator createReplica() {
   [junit4]   2>   "operation":"ADDREPLICA",
   [junit4]   2>   "collection":"withShardField",
   [junit4]   2>   "shard":"a",
   [junit4]   2>   "core":"withShardField_a_replica_n1",
   [junit4]   2>   "state":"down",
   [junit4]   2>   "base_url":"https://127.0.0.1:54066/solr",
   [junit4]   2>   "type":"NRT",
   [junit4]   2>   "waitForFinalState":"false"} 
   [junit4]   2> 965658 INFO  (OverseerStateUpdate-98855781666193416-127.0.0.1:54068_solr-n_0000000000) [n:127.0.0.1:54068_solr    ] o.a.s.c.o.SliceMutator createReplica() {
   [junit4]   2>   "operation":"ADDREPLICA",
   [junit4]   2>   "collection":"withShardField",
   [junit4]   2>   "shard":"a",
   [junit4]   2>   "core":"withShardField_a_replica_n2",
   [junit4]   2>   "state":"down",
   [junit4]   2>   "base_url":"https://127.0.0.1:54069/solr",
   [junit4]   2>   "type":"NRT",
   [junit4]   2>   "waitForFinalState":"false"} 
   [junit4]   2> 965662 INFO  (OverseerStateUpdate-98855781666193416-127.0.0.1:54068_solr-n_0000000000) [n:127.0.0.1:54068_solr    ] o.a.s.c.o.SliceMutator createReplica() {
   [junit4]   2>   "operation":"ADDREPLICA",
   [junit4]   2>   "collection":"withShardField",
   [junit4]   2>   "shard":"a",
   [junit4]   2>   "core":"withShardField_a_replica_n4",
   [junit4]   2>   "state":"down",
   [junit4]   2>   "base_url":"https://127.0.0.1:54067/solr",
   [junit4]   2>   "type":"NRT",
   [junit4]   2>   "waitForFinalState":"false"} 
   [junit4]   2> 965665 INFO  (OverseerStateUpdate-98855781666193416-127.0.0.1:54068_solr-n_0000000000) [n:127.0.0.1:54068_solr    ] o.a.s.c.o.SliceMutator createReplica() {
   [junit4]   2>   "operation":"ADDREPLICA",
   [junit4]   2>   "collection":"withShardField",
   [junit4]   2>   "shard":"a",
   [junit4]   2>   "core":"withShardField_a_replica_n6",
   [junit4]   2>   "state":"down",
   [junit4]   2>   "base_url":"https://127.0.0.1:54068/solr",
   [junit4]   2>   "type":"NRT",
   [junit4]   2>   "waitForFinalState":"false"} 
   [junit4]   2> 965668 INFO  (OverseerStateUpdate-98855781666193416-127.0.0.1:54068_solr-n_0000000000) [n:127.0.0.1:54068_solr    ] o.a.s.c.o.SliceMutator createReplica() {
   [junit4]   2>   "operation":"ADDREPLICA",
   [junit4]   2>   "collection":"withShardField",
   [junit4]   2>   "shard":"a",
   [junit4]   2>   "core":"withShardField_a_replica_n8",
   [junit4]   2>   "state":"down",
   [junit4]   2>   "base_url":"https://127.0.0.1:54066/solr",
   [junit4]   2>   "type":"NRT",
   [junit4]   2>   "waitForFinalState":"false"} 
   [junit4]   2> 965671 INFO  (OverseerStateUpdate-98855781666193416-127.0.0.1:54068_solr-n_0000000000) [n:127.0.0.1:54068_solr    ] o.a.s.c.o.SliceMutator createReplica() {
   [junit4]   2>   "operation":"ADDREPLICA",
   [junit4]   2>   "collection":"withShardField",
   [junit4]   2>   "shard":"b",
   [junit4]   2>   "core":"withShardField_b_replica_n10",
   [junit4]   2>   "state":"down",
   [junit4]   2>   "base_url":"https://127.0.0.1:54069/solr",
   [junit4]   2>   "type":"NRT",
   [junit4]   2>   "waitForFinalState":"false"} 
   [junit4]   2> 965674 INFO  (OverseerStateUpdate-98855781666193416-127.0.0.1:54068_solr-n_0000000000) [n:127.0.0.1:54068_solr    ] o.a.s.c.o.SliceMutator createReplica() {
   [junit4]   2>   "operation":"ADDREPLICA",
   [junit4]   2>   "collection":"withShardField",
   [junit4]   2>   "shard":"b",
   [junit4]   2>   "core":"withShardField_b_replica_n12",
   [junit4]   2>   "state":"down",
   [junit4]   2>   "base_url":"https://127.0.0.1:54067/solr",
   [junit4]   2>   "type":"NRT",
   [junit4]   2>   "waitForFinalState":"false"} 
   [junit4]   2> 965677 INFO  (OverseerStateUpdate-98855781666193416-127.0.0.1:54068_solr-n_0000000000) [n:127.0.0.1:54068_solr    ] o.a.s.c.o.SliceMutator createReplica() {
   [junit4]   2>   "operation":"ADDREPLICA",
   [junit4]   2>   "collection":"withShardField",
   [junit4]   2>   "shard":"b",
   [junit4]   2>   "core":"withShardField_b_replica_n14",
   [junit4]   2>   "state":"down",
   [junit4]   2>   "base_url":"https://127.0.0.1:54068/solr",
   [junit4]   2>   "type":"NRT",
   [junit4]   2>   "waitForFinalState":"false"} 
   [junit4]   2> 965681 INFO  (OverseerStateUpdate-98855781666193416-127.0.0.1:54068_solr-n_0000000000) [n:127.0.0.1:54068_solr    ] o.a.s.c.o.SliceMutator createReplica() {
   [junit4]   2>   "operation":"ADDREPLICA",
   [junit4]   2>   "collection":"withShardField",
   [junit4]   2>   "shard":"b",
   [junit4]   2>   "core":"withShardField_b_replica_n16",
   [junit4]   2>   "state":"down",
   [junit4]   2>   "base_url":"https://127.0.0.1:54066/solr",
   [junit4]   2>   "type":"NRT",
   [junit4]   2>   "waitForFinalState":"false"} 
   [junit4]   2> 965684 INFO  (OverseerStateUpdate-98855781666193416-127.0.0.1:54068_solr-n_0000000000) [n:127.0.0.1:54068_solr    ] o.a.s.c.o.SliceMutator createReplica() {
   [junit4]   2>   "operation":"ADDREPLICA",
   [junit4]   2>   "collection":"withShardField",
   [junit4]   2>   "shard":"b",
   [junit4]   2>   "core":"withShardField_b_replica_n18",
   [junit4]   2>   "state":"down",
   [junit4]   2>   "base_url":"https://127.0.0.1:54069/solr",
   [junit4]   2>   "type":"NRT",
   [junit4]   2>   "waitForFinalState":"false"} 
   [junit4]   2> 965687 INFO  (OverseerStateUpdate-98855781666193416-127.0.0.1:54068_solr-n_0000000000) [n:127.0.0.1:54068_solr    ] o.a.s.c.o.SliceMutator createReplica() {
   [junit4]   2>   "operation":"ADDREPLICA",
   [junit4]   2>   "collection":"withShardField",
   [junit4]   2>   "shard":"c",
   [junit4]   2>   "core":"withShardField_c_replica_n20",
   [junit4]   2>   "state":"down",
   [junit4]   2>   "base_url":"https://127.0.0.1:54067/solr",
   [junit4]   2>   "type":"NRT",
   [junit4]   2>   "waitForFinalState":"false"} 
   [junit4]   2> 965690 INFO  (OverseerStateUpdate-98855781666193416-127.0.0.1:54068_solr-n_0000000000) [n:127.0.0.1:54068_solr    ] o.a.s.c.o.SliceMutator createReplica() {
   [junit4]   2>   "operation":"ADDREPLICA",
   [junit4]   2>   "collection":"withShardField",
   [junit4]   2>   "shard":"c",
   [junit4]   2>   "core":"withShardField_c_replica_n22",
   [junit4]   2>   "state":"down",
   [junit4]   2>   "base_url":"https://127.0.0.1:54068/solr",
   [junit4]   2>   "type":"NRT",
   [junit4]   2>   "waitForFinalState":"false"} 
   [junit4]   2> 965693 INFO  (OverseerStateUpdate-98855781666193416-127.0.0.1:54068_solr-n_0000000000) [n:127.0.0.1:54068_solr    ] o.a.s.c.o.SliceMutator createReplica() {
   [junit4]   2>   "operation":"ADDREPLICA",
   [junit4]   2>   "collection":"withShardField",
   [junit4]   2>   "shard":"c",
   [junit4]   2>   "core":"withShardField_c_replica_n24",
   [junit4]   2>   "state":"down",
   [junit4]   2>   "base_url":"https://127.0.0.1:54066/solr",
   [junit4]   2>   "type":"NRT",
   [junit4]   2>   "waitForFinalState":"false"} 
   [junit4]   2> 965696 INFO  (OverseerStateUpdate-98855781666193416-127.0.0.1:54068_solr-n_0000000000) [n:127.0.0.1:54068_solr    ] o.a.s.c.o.SliceMutator createReplica() {
   [junit4]   2>   "operation":"ADDREPLICA",
   [junit4]   2>   "collection":"withShardField",
   [junit4]   2>   "shard":"c",
   [junit4]   2>   "core":"withShardField_c_replica_n26",
   [junit4]   2>   "state":"down",
   [junit4]   2>   "base_url":"https://127.0.0.1:54069/solr",
   [junit4]   2>   "type":"NRT",
   [junit4]   2>   "waitForFinalState":"false"} 
   [junit4]   2> 965700 INFO  (OverseerStateUpdate-98855781666193416-127.0.0.1:54068_solr-n_0000000000) [n:127.0.0.1:54068_solr    ] o.a.s.c.o.SliceMutator createReplica() {
   [junit4]   2>   "operation":"ADDREPLICA",
   [junit4]   2>   "collection":"withShardField",
   [junit4]   2>   "shard":"c",
   [junit4]   2>   "core":"withShardField_c_replica_n28",
   [junit4]   2>   "state":"down",
   [junit4]   2>   "base_url":"https://127.0.0.1:54067/solr",
   [junit4]   2>   "type":"NRT",
   [junit4]   2>   "waitForFinalState":"false"} 
   [junit4]   2> 965703 INFO  (OverseerStateUpdate-98855781666193416-127.0.0.1:54068_solr-n_0000000000) [n:127.0.0.1:54068_solr    ] o.a.s.c.o.SliceMutator createReplica() {
   [junit4]   2>   "operation":"ADDREPLICA",
   [junit4]   2>   "collection":"withShardField",
   [junit4]   2>   "shard":"d",
   [junit4]   2>   "core":"withShardField_d_replica_n30",
   [junit4]   2>   "state":"down",
   [junit4]   2>   "base_url":"https://127.0.0.1:54068/solr",
   [junit4]   2>   "type":"NRT",
   [junit4]   2>   "waitForFinalState":"false"} 
   [junit4]   2> 965706 INFO  (OverseerStateUpdate-98855781666193416-127.0.0.1:54068_solr-n_0000000000) [n:127.0.0.1:54068_solr    ] o.a.s.c.o.SliceMutator createReplica() {
   [junit4]   2>   "operation":"ADDREPLICA",
   [junit4]   2>   "collection":"withShardField",
   [junit4]   2>   "shard":"d",
   [junit4]   2>   "core":"withShardField_d_replica_n32",
   [junit4]   2>   "state":"down",
   [junit4]   2>   "base_url":"https://127.0.0.1:54066/solr",
   [junit4]   2>   "type":"NRT",
   [junit4]   2>   "waitForFinalState":"false"} 
   [junit4]   2> 965709 INFO  (OverseerStateUpdate-98855781666193416-127.0.0.1:54068_solr-n_0000000000) [n:127.0.0.1:54068_solr    ] o.a.s.c.o.SliceMutator createReplica() {
   [junit4]   2>   "operation":"ADDREPLICA",
   [junit4]   2>   "collection":"withShardField",
   [junit4]   2>   "shard":"d",
   [junit4]   2>   "core":"withShardField_d_replica_n34",
   [junit4]   2>   "state":"down",
   [junit4]   2>   "base_url":"https://127.0.0.1:54069/solr",
   [junit4]   2>   "type":"NRT",
   [junit4]   2>   "waitForFinalState":"false"} 
   [junit4]   2> 965713 INFO  (OverseerStateUpdate-98855781666193416-127.0.0.1:54068_solr-n_0000000000) [n:127.0.0.1:54068_solr    ] o.a.s.c.o.SliceMutator createReplica() {
   [junit4]   2>   "operation":"ADDREPLICA",
   [junit4]   2>   "collection":"withShardField",
   [junit4]   2>   "shard":"d",
   [junit4]   2>   "core":"withShardField_d_replica_n36",
   [junit4]   2>   "state":"down",
   [junit4]   2>   "base_url":"https://127.0.0.1:54067/solr",
   [junit4]   2>   "type":"NRT",
   [junit4]   2>   "waitForFinalState":"false"} 
   [junit4]   2> 965716 INFO  (OverseerStateUpdate-98855781666193416-127.0.0.1:54068_solr-n_0000000000) [n:127.0.0.1:54068_solr    ] o.a.s.c.o.SliceMutator createReplica() {
   [junit4]   2>   "operation":"ADDREPLICA",
   [junit4]   2>   "collection":"withShardField",
   [junit4]   2>   "shard":"d",
   [junit4]   2>   "core":"withShardField_d_replica_n38",
   [junit4]   2>   "state":"down",
   [junit4]   2>   "base_url":"https://127.0.0.1:54068/solr",
   [junit4]   2>   "type":"NRT",
   [junit4]   2>   "waitForFinalState":"false"} 
   [junit4]   2> 965961 INFO  (qtp1383434849-11410) [n:127.0.0.1:54068_solr    ] o.a.s.h.a.CoreAdminOperation core create command qt=/admin/cores&coreNodeName=core_node25&collection.configName=conf&newCollection=true&name=withShardField_c_replica_n22&action=CREATE&numShards=4&collection=withShardField&shard=c&wt=javabin&version=2&replicaType=NRT
   [junit4]   2> 965961 INFO  (qtp1383434849-11410) [n:127.0.0.1:54068_solr    ] o.a.s.c.TransientSolrCoreCacheDefault Allocating transient cache for 2147483647 transient cores
   [junit4]   2> 965962 INFO  (qtp1383434849-11405) [n:127.0.0.1:54068_solr    ] o.a.s.h.a.CoreAdminOperation core create command qt=/admin/cores&coreNodeName=core_node17&collection.configName=conf&newCollection=true&name=withShardField_b_replica_n14&action=CREATE&numShards=4&collection=withShardField&shard=b&wt=javabin&version=2&replicaType=NRT
   [junit4]   2> 965962 INFO  (qtp1383434849-11407) [n:127.0.0.1:54068_solr    ] o.a.s.h.a.CoreAdminOperation core create command qt=/admin/cores&coreNodeName=core_node33&collection.configName=conf&newCollection=true&name=withShardField_d_replica_n30&action=CREATE&numShards=4&collection=withShardField&shard=d&wt=javabin&version=2&replicaType=NRT
   [junit4]   2> 965963 INFO  (qtp1383434849-11408) [n:127.0.0.1:54068_solr    ] o.a.s.h.a.CoreAdminOperation core create command qt=/admin/cores&coreNodeName=core_node9&collection.configName=conf&newCollection=true&name=withShardField_a_replica_n6&action=CREATE&numShards=4&collection=withShardField&shard=a&wt=javabin&version=2&replicaType=NRT
   [junit4]   2> 965963 INFO  (qtp1383434849-11417) [n:127.0.0.1:54068_solr    ] o.a.s.h.a.CoreAdminOperation core create command qt=/admin/cores&coreNodeName=core_node40&collection.configName=conf&newCollection=true&name=withShardField_d_replica_n38&action=CREATE&numShards=4&collection=withShardField&shard=d&wt=javabin&version=2&replicaType=NRT
   [junit4]   2> 965987 INFO  (qtp1003439269-11423) [n:127.0.0.1:54066_solr    ] o.a.s.h.a.CoreAdminOperation core create command qt=/admin/cores&coreNodeName=core_node19&collection.configName=conf&newCollection=true&name=withShardField_b_replica_n16&action=CREATE&numShards=4&collection=withShardField&shard=b&wt=javabin&version=2&replicaType=NRT
   [junit4]   2> 965987 INFO  (qtp1003439269-11423) [n:127.0.0.1:54066_solr    ] o.a.s.c.TransientSolrCoreCacheDefault Allocating transient cache for 2147483647 transient cores
   [junit4]   2> 965988 INFO  (qtp1003439269-11419) [n:127.0.0.1:54066_solr    ] o.a.s.h.a.CoreAdminOperation core create command qt=/admin/cores&coreNodeName=core_node11&collection.configName=conf&newCollection=true&name=withShardField_a_replica_n8&action=CREATE&numShards=4&collection=withShardField&shard=a&wt=javabin&version=2&replicaType=NRT
   [junit4]   2> 966001 INFO  (qtp1281695138-11430) [n:127.0.0.1:54067_solr    ] o.a.s.h.a.CoreAdminOperation core create command qt=/admin/cores&coreNodeName=core_node39&collection.configName=conf&newCollection=true&name=withShardField_d_replica_n36&action=CREATE&numShards=4&collection=withShardField&shard=d&wt=javabin&version=2&replicaType=NRT
   [junit4]   2> 966002 INFO  (qtp1281695138-11430) [n:127.0.0.1:54067_solr    ] o.a.s.c.TransientSolrCoreCacheDefault Allocating transient cache for 2147483647 transient cores
   [junit4]   2> 966008 INFO  (qtp1003439269-11421) [n:127.0.0.1:54066_solr    ] o.a.s.h.a.CoreAdminOperation core create command qt=/admin/cores&coreNodeName=core_node27&collection.configName=conf&newCollection=true&name=withShardField_c_replica_n24&action=CREATE&numShards=4&collection=withShardField&shard=c&wt=javabin&version=2&replicaType=NRT
   [junit4]   2> 966008 INFO  (qtp1003439269-11424) [n:127.0.0.1:54066_solr    ] o.a.s.h.a.CoreAdminOperation core create command qt=/admin/cores&coreNodeName=core_node35&collection.configName=conf&newCollection=true&name=withShardField_d_replica_n32&action=CREATE&numShards=4&collection=withShardField&shard=d&wt=javabin&version=2&replicaType=NRT
   [junit4]   2> 966008 INFO  (qtp1003439269-11420) [n:127.0.0.1:54066_solr    ] o.a.s.h.a.CoreAdminOperation core create command qt=/admin/cores&coreNodeName=core_node3&collection.configName=conf&newCollection=true&name=withShardField_a_replica_n1&action=CREATE&numShards=4&collection=withShardField&shard=a&wt=javabin&version=2&replicaType=NRT
   [junit4]   2> 966009 INFO  (qtp877438250-11437) [n:127.0.0.1:54069_solr    ] o.a.s.h.a.CoreAdminOperation core create command qt=/admin/cores&coreNodeName=core_node29&collection.configName=conf&newCollection=true&name=withShardField_c_replica_n26&action=CREATE&numShards=4&collection=withShardField&shard=c&wt=javabin&version=2&replicaType=NRT
   [junit4]   2> 966009 INFO  (qtp877438250-11437) [n:127.0.0.1:54069_solr    ] o.a.s.c.TransientSolrCoreCacheDefault Allocating transient cache for 2147483647 transient cores
   [junit4]   2> 966015 INFO  (qtp877438250-11438) [n:127.0.0.1:54069_solr    ] o.a.s.h.a.CoreAdminOperation core create command qt=/admin/cores&coreNodeName=core_node37&collection.configName=conf&newCollection=true&name=withShardField_d_replica_n34&action=CREATE&numShards=4&collection=withShardField&shard=d&wt=javabin&version=2&replicaType=NRT
   [junit4]   2> 966021 INFO  (qtp877438250-11433) [n:127.0.0.1:54069_solr    ] o.a.s.h.a.CoreAdminOperation core create command qt=/admin/cores&coreNodeName=core_node21&collection.configName=conf&newCollection=true&name=withShardField_b_replica_n18&action=CREATE&numShards=4&collection=withShardField&shard=b&wt=javabin&version=2&replicaType=NRT
   [junit4]   2> 966021 INFO  (qtp877438250-11436) [n:127.0.0.1:54069_solr    ] o.a.s.h.a.CoreAdminOperation core create command qt=/admin/cores&coreNodeName=core_node5&collection.configName=conf&newCollection=true&name=withShardField_a_replica_n2&action=CREATE&numShards=4&collection=withShardField&shard=a&wt=javabin&version=2&replicaType=NRT
   [junit4]   2> 966021 INFO  (qtp877438250-11434) [n:127.0.0.1:54069_solr    ] o.a.s.h.a.CoreAdminOperation core create command qt=/admin/cores&coreNodeName=core_node13&collection.configName=conf&newCollection=true&name=withShardField_b_replica_n10&action=CREATE&numShards=4&collection=withShardField&shard=b&wt=javabin&version=2&replicaType=NRT
   [junit4]   2> 966031 INFO  (qtp1281695138-11428) [n:127.0.0.1:54067_solr    ] o.a.s.h.a.CoreAdminOperation core create command qt=/admin/cores&coreNodeName=core_node31&collection.configName=conf&newCollection=true&name=withShardField_c_replica_n28&action=CREATE&numShards=4&collection=withShardField&shard=c&wt=javabin&version=2&replicaType=NRT
   [junit4]   2> 966031 INFO  (qtp1281695138-11425) [n:127.0.0.1:54067_solr    ] o.a.s.h.a.CoreAdminOperation core create command qt=/admin/cores&coreNodeName=core_node23&collection.configName=conf&newCollection=true&name=withShardField_c_replica_n20&action=CREATE&numShards=4&collection=withShardField&shard=c&wt=javabin&version=2&replicaType=NRT
   [junit4]   2> 966033 INFO  (qtp1281695138-11412) [n:127.0.0.1:54067_solr    ] o.a.s.h.a.CoreAdminOperation core create command qt=/admin/cores&coreNodeName=core_node15&collection.configName=conf&newCollection=true&name=withShardField_b_replica_n12&action=CREATE&numShards=4&collection=withShardField&shard=b&wt=javabin&version=2&replicaType=NRT
   [junit4]   2> 966036 INFO  (qtp1281695138-11431) [n:127.0.0.1:54067_solr    ] o.a.s.h.a.CoreAdminOperation core create command qt=/admin/cores&coreNodeName=core_node7&collection.configName=conf&newCollection=true&name=withShardField_a_replica_n4&action=CREATE&numShards=4&collection=withShardField&shard=a&wt=javabin&version=2&replicaType=NRT
   [junit4]   2> 966159 INFO  (zkCallback-3539-thread-1-processing-n:127.0.0.1:54069_solr) [n:127.0.0.1:54069_solr    ] o.a.s.c.c.ZkStateReader A cluster state change: [WatchedEvent state:SyncConnected type:NodeDataChanged path:/collections/withShardField/state.json] for collection [withShardField] has occurred - updating... (live nodes size: [4])
   [junit4]   2> 966159 INFO  (zkCallback-3538-thread-1-processing-n:127.0.0.1:54067_solr) [n:127.0.0.1:54067_solr    ] o.a.s.c.c.ZkStateReader A cluster state change: [WatchedEvent state:SyncConnected type:NodeDataChanged path:/collections/withShardField/state.json] for collection [withShardField] has occurred - updating... (live nodes size: [4])
   [junit4]   2> 966159 INFO  (zkCallback-3536-thread-1-processing-n:127.0.0.1:54066_solr) [n:127.0.0.1:54066_solr    ] o.a.s.c.c.ZkStateReader A cluster state change: [WatchedEvent state:SyncConnected type:NodeDataChanged path:/collections/withShardField/state.json] for collection [withShardField] has occurred - updating... (live nodes size: [4])
   [junit4]   2> 966159 INFO  (zkCallback-3534-thread-1-processing-n:127.0.0.1:54068_solr) [n:127.0.0.1:54068_solr    ] o.a.s.c.c.ZkStateReader A cluster state change: [WatchedEvent state:SyncConnected type:NodeDataChanged path:/collections/withShardField/state.json] for collection [withShardField] has occurred - updating... (live nodes size: [4])
   [junit4]   2> 966159 INFO  (zkCallback-3538-thread-2-processing-n:127.0.0.1:54067_solr) [n:127.0.0.1:54067_solr    ] o.a.s.c.c.ZkStateReader A cluster state change: [WatchedEvent state:SyncConnected type:NodeDataChanged path:/collections/withShardField/state.json] for collection [withShardField] has occurred - updating... (live nodes size: [4])
   [junit4]   2> 966160 INFO  (zkCallback-3536-thread-2-processing-n:127.0.0.1:54066_solr) [n:127.0.0.1:54066_solr    ] o.a.s.c.c.ZkStateReader A cluster state change: [WatchedEvent state:SyncConnected type:NodeDataChanged path:/collections/withShardField/state.json] for collection [withShardField] has occurred - updating... (live nodes size: [4])
   [junit4]   2> 966160 INFO  (zkCallback-3534-thread-2-processing-n:127.0.0.1:54068_solr) [n:127.0.0.1:54068_solr    ] o.a.s.c.c.ZkStateReader A cluster state change: [WatchedEvent state:SyncConnected type:NodeDataChanged path:/collections/withShardField/state.json] for collection [withShardField] has occurred - updating... (live nodes size: [4])
   [junit4]   2> 966161 INFO  (zkCallback-3534-thread-3-processing-n:127.0.0.1:54068_solr) [n:127.0.0.1:54068_solr    ] o.a.s.c.c.ZkStateReader A cluster state change: [WatchedEvent state:SyncConnected type:NodeDataChanged path:/collections/withShardField/state.json] for collection [withShardField] has occurred - updating... (live nodes size: [4])
   [junit4]   2> 966161 INFO  (zkCallback-3539-thread-1-processing-n:127.0.0.1:54069_solr) [n:127.0.0.1:54069_solr    ] o.a.s.c.c.ZkStateReader A cluster state change: [WatchedEvent state:SyncConnected type:NodeDataChanged path:/collections/withShardField/state.json] for collection [withShardField] has occurred - updating... (live nodes size: [4])
   [junit4]   2> 966161 INFO  (zkCallback-3539-thread-2-processing-n:127.0.0.1:54069_solr) [n:127.0.0.1:54069_solr    ] o.a.s.c.c.ZkStateReader A cluster state change: [WatchedEvent state:SyncConnected type:NodeDataChanged path:/collections/withShardField/state.json] for collection [withShardField] has occurred - updating... (live nodes size: [4])
   [junit4]   2> 967056 INFO  (qtp1281695138-11430) [n:127.0.0.1:54067_solr c:withShardField s:d r:core_node39 x:withShardField_d_replica_n36] o.a.s.c.SolrConfig Using Lucene MatchVersion: 8.0.0
   [junit4]   2> 967057 INFO  (qtp877438250-11434) [n:127.0.0.1:54069_solr c:withShardField s:b r:core_node13 x:withShardField_b_replica_n10] o.a.s.c.SolrConfig Using Lucene MatchVersion: 8.0.0
   [junit4]   2> 967057 INFO  (qtp877438250-11438) [n:127.0.0.1:54069_solr c:withShardField s:d r:core_node37 x:withShardField_d_replica_n34] o.a.s.c.SolrConfig Using Lucene MatchVersion: 8.0.0
   [junit4]   2> 967077 INFO  (qtp877438250-11437) [n:127.0.0.1:54069_solr c:withShardField s:c r:core_node29 x:withShardField_c_replica_n26] o.a.s.c.SolrConfig Using Lucene MatchVersion: 8.0.0
   [junit4]   2> 967079 INFO  (qtp1003439269-11421) [n:127.0.0.1:54066_solr c:withShardField s:c r:core_node27 x:withShardField_c_replica_n24] o.a.s.c.SolrConfig Using Lucene MatchVersion: 8.0.0
   [junit4]   2> 967079 INFO  (qtp1003439269-11420) [n:127.0.0.1:54066_solr c:withShardField s:a r:core_node3 x:withShardField_a_replica_n1] o.a.s.c.SolrConfig Using Lucene MatchVersion: 8.0.0
   [junit4]   2> 967082 INFO  (qtp877438250-11436) [n:127.0.0.1:54069_solr c:withShardField s:a r:core_node5 x:withShardField_a_replica_n2] o.a.s.c.SolrConfig Using Lucene MatchVersion: 8.0.0
   [junit4]   2> 967084 INFO  (qtp1003439269-11419) [n:127.0.0.1:54066_solr c:withShardField s:a r:core_node11 x:withShardField_a_replica_n8] o.a.s.c.SolrConfig Using Lucene MatchVersion: 8.0.0
   [junit4]   2> 967103 INFO  (qtp1003439269-11423) [n:127.0.0.1:54066_solr c:withShardField s:b r:core_node19 x:withShardField_b_replica_n16] o.a.s.c.SolrConfig Using Lucene MatchVersion: 8.0.0
   [junit4]   2> 967104 INFO  (qtp1003439269-11424) [n:127.0.0.1:54066_solr c:withShardField s:d r:core_node35 x:withShardField_d_replica_n32] o.a.s.c.SolrConfig Using Lucene MatchVersion: 8.0.0
   [junit4]   2> 967109 INFO  (qtp877438250-11438) [n:127.0.0.1:54069_solr c:withShardField s:d r:core_node37 x:withShardField_d_replica_n34] o.a.s.s.IndexSchema [withShardField_d_replica_n34] Schema name=cloud-dynamic
   [junit4]   2> 967109 INFO  (qtp877438250-11437) [n:127.0.0.1:54069_solr c:withShardField s:c r:core_node29 x:withShardField_c_replica_n26] o.a.s.s.IndexSchema [withShardField_c_replica_n26] Schema name=cloud-dynamic
   [junit4]   2> 967110 INFO  (qtp877438250-11434) [n:127.0.0.1:54069_solr c:withShardField s:b r:core_node13 x:withShardField_b_replica_n10] o.a.s.s.IndexSchema [withShardField_b_replica_n10] Schema name=cloud-dynamic
   [junit4]   2> 967139 INFO  (qtp877438250-11438) [n:127.0.0.1:54069_solr c:withShardField s:d r:core_node37 x:withShardField_d_replica_n34] o.a.s.s.IndexSchema Loaded schema cloud-dynamic/1.6 with uniqueid field id
   [junit4]   2> 967139 INFO  (qtp877438250-11438) [n:127.0.0.1:54069_solr c:withShardField s:d r:core_node37 x:withShardField_d_replica_n34] o.a.s.c.CoreContainer Creating SolrCore 'withShardField_d_replica_n34' using configuration from collection withShardField, trusted=true
   [junit4]   2> 967140 INFO  (qtp877438250-11438) [n:127.0.0.1:54069_solr c:withShardField s:d r:core_node37 x:withShardField_d_replica_n34] o.a.s.m.r.SolrJmxReporter JMX monitoring for 'solr_54069.solr.core.withShardField.d.replica_n34' (registry 'solr.core.withShardField.d.replica_n34') enabled at server: com.sun.jmx.mbeanserver.JmxMBeanServer@44aab74c
   [junit4]   2> 967140 INFO  (qtp877438250-11438) [n:127.0.0.1:54069_solr c:withShardField s:d r:core_node37 x:withShardField_d_replica_n34] o.a.s.c.SolrCore solr.RecoveryStrategy.Builder
   [junit4]   2> 967140 INFO  (qtp877438250-11438) [n:127.0.0.1:54069_solr c:withShardField s:d r:core_node37 x:withShardField_d_replica_n34] o.a.s.c.SolrCore [[withShardField_d_replica_n34] ] Opening new SolrCore at [/Users/jenkins/workspace/Lucene-Solr-master-MacOSX/solr/build/solr-core/test/J1/temp/solr.cloud.CustomCollectionTest_5CD9CF70E73B6407-001/tempDir-001/node3/withShardField_d_replica_n34], dataDir=[/Users/jenkins/workspace/Lucene-Solr-master-MacOSX/solr/build/solr-core/test/J1/temp/solr.cloud.CustomCollectionTest_5CD9CF70E73B6407-001/tempDir-001/node3/./withShardField_d_replica_n34/data/]
   [junit4]   2> 967142 INFO  (qtp1281695138-11430) [n:127.0.0.1:54067_solr c:withShardField s:d r:core_node39 x:withShardField_d_replica_n36] o.a.s.s.IndexSchema [withShardField_d_replica_n36] Schema name=cloud-dynamic
   [junit4]   2> 967142 INFO  (qtp877438250-11434) [n:127.0.0.1:54069_solr c:withShardField s:b r:core_node13 x:withShardField_b_replica_n10] o.a.s.s.IndexSchema Loaded schema cloud-dynamic/1.6 with uniqueid field id
   [junit4]   2> 967142 INFO  (qtp877438250-11434) [n:127.0.0.1:54069_solr c:withShardField s:b r:core_node13 x:withShardField_b_replica_n10] o.a.s.c.CoreContainer Creating SolrCore 'withShardField_b_replica_n10' using configuration from collection withShardField, trusted=true
   [junit4]   2> 967143 INFO  (qtp877438250-11434) [n:127.0.0.1:54069_solr c:withShardField s:b r:core_node13 x:withShardField_b_replica_n10] o.a.s.m.r.SolrJmxReporter JMX monitoring for 'solr_54069.solr.core.withShardField.b.replica_n10' (registry 'solr.core.withShardField.b.replica_n10') enabled at server: com.sun.jmx.mbeanserver.JmxMBeanServer@44aab74c
   [junit4]   2> 967143 INFO  (qtp877438250-11434) [n:127.0.0.1:54069_solr c:withShardField s:b r:core_node13 x:withShardField_b_replica_n10] o.a.s.c.SolrCore solr.RecoveryStrategy.Builder
   [junit4]   2> 967143 INFO  (qtp877438250-11434) [n:127.0.0.1:54069_solr c:withShardField s:b r:core_node13 x:withShardField_b_replica_n10] o.a.s.c.SolrCore [[withShardField_b_replica_n10] ] Opening new SolrCore at [/Users/jenkins/workspace/Lucene-Solr-master-MacOSX/solr/build/solr-core/test/J1/temp/solr.cloud.CustomCollectionTest_5CD9CF70E73B6407-001/tempDir-001/node3/withShardField_b_replica_n10], dataDir=[/Users/jenkins/workspace/Lucene-Solr-master-MacOSX/solr/build/solr-core/test/J1/temp/solr.cloud.CustomCollectionTest_5CD9CF70E73B6407-001/tempDir-001/node3/./withShardField_b_replica_n10/data/]
   [junit4]   2> 967143 INFO  (qtp1003439269-11421) [n:127.0.0.1:54066_solr c:withShardField s:c r:core_node27 x:withShardField_c_replica_n24] o.a.s.s.IndexSchema [withShardField_c_replica_n24] Schema name=cloud-dynamic
   [junit4]   2> 967145 INFO  (qtp877438250-11436) [n:127.0.0.1:54069_solr c:withShardField s:a r:core_node5 x:withShardField_a_replica_n2] o.a.s.s.IndexSchema [withShardField_a_replica_n2] Schema name=cloud-dynamic
   [junit4]   2> 967165 INFO  (qtp1003439269-11420) [n:127.0.0.1:54066_solr c:withShardField s:a r:core_node3 x:withShardField_a_replica_n1] o.a.s.s.IndexSchema [withShardField_a_replica_n1] Schema name=cloud-dynamic
   [junit4]   2> 967167 INFO  (qtp877438250-11437) [n:127.0.0.1:54069_solr c:withShardField s:c r:core_node29 x:withShardField_c_replica_n26] o.a.s.s.IndexSchema Loaded schema cloud-dynamic/1.6 with uniqueid field id
   [junit4]   2> 967167 INFO  (qtp877438250-11437) [n:127.0.0.1:54069_solr c:withShardField s:c r:core_node29 x:withShardField_c_replica_n26] o.a.s.c.CoreContainer Creating SolrCore 'withShardField_c_replica_n26' using configuration from collection withShardField, trusted=true
   [junit4]   2> 967168 INFO  (qtp877438250-11437) [n:127.0.0.1:54069_solr c:withShardField s:c r:core_node29 x:withShardField_c_replica_n26] o.a.s.m.r.SolrJmxReporter JMX monitoring for 'solr_54069.solr.core.withShardField.c.replica_n26' (registry 'solr.core.withShardField.c.replica_n26') enabled at server: com.sun.jmx.mbeanserver.JmxMBeanServer@44aab74c
   [junit4]   2> 967168 INFO  (qtp877438250-11437) [n:127.0.0.1:54069_solr c:withShardField s:c r:core_node29 x:withShardField_c_replica_n26] o.a.s.c.SolrCore solr.RecoveryStrategy.Builder
   [junit4]   2> 967168 INFO  (qtp877438250-11437) [n:127.0.0.1:54069_solr c:withShardField s:c r:core_node29 x:withShardField_c_replica_n26] o.a.s.c.SolrCore [[withShardField_c_replica_n26] ] Opening new SolrCore at [/Users/jenkins/workspace/Lucene-Solr-master-MacOSX/solr/build/solr-core/test/J1/temp/solr.cloud.CustomCollectionTest_5CD9CF70E73B6407-001/tempDir-001/node3/withShardField_c_replica_n26], dataDir=[/Users/jenkins/workspace/Lucene-Solr-master-MacOSX/solr/build/solr-core/test/J1/temp/solr.cloud.CustomCollectionTest_5CD9CF70E73B6407-001/tempDir-001/node3/./withShardField_c_replica_n26/data/]
   [junit4]   2> 967170 INFO  (qtp1003439269-11421) [n:127.0.0.1:54066_solr c:withShardField s:c r:core_node27 x:withShardField_c_replica_n24] o.a.s.s.IndexSchema Loaded schema cloud-dynamic/1.6 with uniqueid field id
   [junit4]   2> 967170 INFO  (qtp1003439269-11421) [n:127.0.0.1:54066_solr c:withShardField s:c r:core_node27 x:withShardField_c_replica_n24] o.a.s.c.CoreContainer Creating SolrCore 'withShardField_c_replica_n24' using configuration from collection withShardField, trusted=true
   [junit4]   2> 967171 INFO  (qtp1003439269-11421) [n:127.0.0.1:54066_solr c:withShardField s:c r:core_node27 x:withShardField_c_replica_n24] o.a.s.m.r.SolrJmxReporter JMX monitoring for 'solr_54066.solr.core.withShardField.c.replica_n24' (registry 'solr.core.withShardField.c.replica_n24') enabled at server: com.sun.jmx.mbeanserver.JmxMBeanServer@44aab74c
   [junit4]   2> 967171 INFO  (qtp1003439269-11421) [n:127.0.0.1:54066_solr c:withShardField s:c r:core_node27 x:withShardField_c_replica_n24] o.a.s.c.SolrCore solr.RecoveryStrategy.Builder
   [junit4]   2> 967171 INFO  (qtp1003439269-11421) [n:127.0.0.1:54066_solr c:withShardField s:c r:core_node27 x:withShardField_c_replica_n24] o.a.s.c.SolrCore [[withShardField_c_replica_n24] ] Opening new SolrCore at [/Users/jenkins/workspace/Lucene-Solr-master-MacOSX/solr/build/solr-core/test/J1/temp/solr.cloud.CustomCollectionTest_5CD9CF70E73B6407-001/tempDir-001/node1/withShardField_c_replica_n24], dataDir=[/Users/jenkins/workspace/Lucene-Solr-master-MacOSX/solr/build/solr-core/test/J1/temp/solr.cloud.CustomCollectionTest_5CD9CF70E73B6407-001/tempDir-001/node1/./withShardField_c_replica_n24/data/]
   [junit4]   2> 967194 INFO  (qtp877438250-11436) [n:127.0.0.1:54069_solr c:withShardField s:a r:core_node5 x:withShardField_a_replica_n2] o.a.s.s.IndexSchema Loaded schema cloud-dynamic/1.6 with uniqueid field id
   [junit4]   2> 967194 INFO  (qtp877438250-11436) [n:127.0.0.1:54069_solr c:withShardField s:a r:core_node5 x:withShardField_a_replica_n2] o.a.s.c.CoreContainer Creating SolrCore 'withShardField_a_replica_n2' using configuration from collection withShardField, trusted=true
   [junit4]   2> 967194 INFO  (qtp1003439269-11420) [n:127.0.0.1:54066_solr c:withShardField s:a r:core_node3 x:withShardField_a_replica_n1] o.a.s.s.IndexSchema Loaded schema cloud-dynamic/1.6 with uniqueid field id
   [junit4]   2> 967194 INFO  (qtp1003439269-11420) [n:127.0.0.1:54066_solr c:withShardField s:a r:core_node3 x:withShardField_a_replica_n1] o.a.s.c.CoreContainer Creating SolrCore 'withShardField_a_replica_n1' using configuration from collection withShardField, trusted=true
   [junit4]   2> 967194 INFO  (qtp877438250-11436) [n:127.0.0.1:54069_solr c:withShardField s:a r:core_node5 x:withShardField_a_replica_n2] o.a.s.m.r.SolrJmxReporter JMX monitoring for 'solr_54069.solr.core.withShardField.a.replica_n2' (registry 'solr.core.withShardField.a.replica_n2') enabled at server: com.sun.jmx.mbeanserver.JmxMBeanServer@44aab74c
   [junit4]   2> 967195 INFO  (qtp877438250-11436) [n:127.0.0.1:54069_solr c:withShardField s:a r:core_node5 x:withShardField_a_replica_n2] o.a.s.c.SolrCore solr.RecoveryStrategy.Builder
   [junit4]   2> 967195 INFO  (qtp877438250-11436) [n:127.0.0.1:54069_solr c:withShardField s:a r:core_node5 x:withShardField_a_replica_n2] o.a.s.c.SolrCore [[withShardField_a_replica_n2] ] Opening new SolrCore at [/Users/jenkins/workspace/Lucene-Solr-master-MacOSX/solr/build/solr-core/test/J1/temp/solr.cloud.CustomCollectionTest_5CD9CF70E73B6407-001/tempDir-001/node3/withShardField_a_replica_n2], dataDir=[/Users/jenkins/workspace/Lucene-Solr-master-MacOSX/solr/build/solr-core/test/J1/temp/solr.cloud.CustomCollectionTest_5CD9CF70E73B6407-001/tempDir-001/node3/./withShardField_a_replica_n2/data/]
   [junit4]   2> 967195 INFO  (qtp1003439269-11420) [n:127.0.0.1:54066_solr c:withShardField s:a r:core_node3 x:withShardField_a_replica_n1] o.a.s.m.r.SolrJmxReporter JMX monitoring for 'solr_54066.solr.core.withShardField.a.replica_n1' (registry 'solr.core.withShardField.a.replica_n1') enabled at server: com.sun.jmx.mbeanserver.JmxMBeanServer@44aab74c
   [junit4]   2> 967195 INFO  (qtp1003439269-11420) [n:127.0.0.1:54066_solr c:withShardField s:a r:core_node3 x:withShardField_a_replica_n1] o.a.s.c.SolrCore solr.RecoveryStrategy.Builder
   [junit4]   2> 967195 INFO  (qtp1003439269-11420) [n:127.0.0.1:54066_solr c:withShardField s:a r:core_node3 x:withShardField_a_replica_n1] o.a.s.c.SolrCore [[withShardField_a_replica_n1] ] Opening new SolrCore at [/Users/jenkins/workspace/Lucene-Solr-master-MacOSX/solr/build/solr-core/test/J1/temp/solr.cloud.CustomCollectionTest_5CD9CF70E73B6407-001/tempDir-001/node1/withShardField_a_replica_n1], dataDir=[/Users/jenkins/workspace/Lucene-Solr-master-MacOSX/solr/build/solr-core/test/J1/temp/solr.cloud.CustomCollectionTest_5CD9CF70E73B6407-001/tempDir-001/node1/./withShardField_a_replica_n1/data/]
   [junit4]   2> 967195 INFO  (qtp1281695138-11430) [n:127.0.0.1:54067_solr c:withShardField s:d r:core_node39 x:withShardField_d_replica_n36] o.a.s.s.IndexSchema Loaded schema cloud-dynamic/1.6 with uniqueid field id
   [junit4]   2> 967195 INFO  (qtp1281695138-11430) [n:127.0.0.1:54067_solr c:withShardField s:d r:core_node39 x:withShardField_d_replica_n36] o.a.s.c.CoreContainer Creating SolrCore 'withShardField_d_replica_n36' using configuration from collection withShardField, trusted=true
   [junit4]   2> 967196 INFO  (qtp1281695138-11430) [n:127.0.0.1:54067_solr c:withShardField s:d r:core_node39 x:withShardField_d_replica_n36] o.a.s.m.r.SolrJmxReporter JMX monitoring for 'solr_54067.solr.core.withShardField.d.replica_n36' (registry 'solr.core.withShardField.d.replica_n36') enabled at server: com.sun.jmx.mbeanserver.JmxMBeanServer@44aab74c
   [junit4]   2> 967196 INFO  (qtp1281695138-11430) [n:127.0.0.1:54067_solr c:withShardField s:d r:core_node39 x:withShardField_d_replica_n36] o.a.s.c.SolrCore solr.RecoveryStrategy.Builder
   [junit4]   2> 967196 INFO  (qtp1281695138-11430) [n:127.0.0.1:54067_solr c:withShardField s:d r:core_node39 x:withShardField_d_replica_n36] o.a.s.c.SolrCore [[withShardField_d_replica_n36] ] Opening new SolrCore at [/Users/jenkins/workspace/Lucene-Solr-master-MacOSX/solr/build/solr-core/test/J1/temp/solr.cloud.CustomCollectionTest_5CD9CF70E73B6407-001/tempDir-001/node4/withShardField_d_replica_n36], dataDir=[/Users/jenkins/workspace/Lucene-Solr-master-MacOSX/solr/build/solr-core/test/J1/temp/solr.cloud.CustomCollectionTest_5CD9CF70E73B6407-001/tempDir-001/node4/./withShardField_d_replica_n36/data/]
   [junit4]   2> 967204 INFO  (qtp1281695138-11425) [n:127.0.0.1:54067_solr c:withShardField s:c r:core_node23 x:withShardField_c_replica_n20] o.a.s.c.SolrConfig Using Lucene MatchVersion: 8.0.0
   [junit4]   2> 967204 INFO  (qtp1281695138-11431) [n:127.0.0.1:54067_solr c:withShardField s:a r:core_node7 x:withShardField_a_replica_n4] o.a.s.c.SolrConfig Using Lucene MatchVersion: 8.0.0
   [junit4]   2> 967205 INFO  (qtp1281695138-11428) [n:127.0.0.1:54067_solr c:withShardField s:c r:core_node31 x:withShardField_c_replica_n28] o.a.s.c.SolrConfig Using Lucene MatchVersion: 8.0.0
   [junit4]   2> 967209 INFO  (qtp1281695138-11412) [n:127.0.0.1:54067_solr c:withShardField s:b r:core_node15 x:withShardField_b_replica_n12] o.a.s.c.SolrConfig Using Lucene MatchVersion: 8.0.0
   [junit4]   2> 967209 INFO  (qtp877438250-11433) [n:127.0.0.1:54069_solr c:withShardField s:b r:core_node21 x:withShardField_b_replica_n18] o.a.s.c.SolrConfig Using Lucene MatchVersion: 8.0.0
   [junit4]   2> 967210 INFO  (qtp1383434849-11405) [n:127.0.0.1:54068_solr c:withShardField s:b r:core_node17 x:withShardField_b_replica_n14] o.a.s.c.SolrConfig Using Lucene MatchVersion: 8.0.0
   [junit4]   2> 967224 INFO  (qtp1383434849-11408) [n:127.0.0.1:54068_solr c:withShardField s:a r:core_node9 x:withShardField_a_replica_n6] o.a.s.c.SolrConfig Using Lucene MatchVersion: 8.0.0
   [junit4]   2> 967228 INFO  (qtp1281695138-11431) [n:127.0.0.1:54067_solr c:withShardField s:a r:core_node7 x:withShardField_a_replica_n4] o.a.s.s.IndexSchema [withShardField_a_replica_n4] Schema name=cloud-dynamic
   [junit4]   2> 967228 INFO  (qtp1281695138-11425) [n:127.0.0.1:54067_solr c:withShardField s:c r:core_node23 x:withShardField_c_replica_n20] o.a.s.s.IndexSchema [withShardField_c_replica_n20] Schema name=cloud-dynamic
   [junit4]   2> 967229 INFO  (qtp1281695138-11428) [n:127.0.0.1:54067_solr c:withShardField s:c r:core_node31 x:withShardField_c_replica_n28] o.a.s.s.IndexSchema [withShardField_c_replica_n28] Schema name=cloud-dynamic
   [junit4]   2> 967234 INFO  (qtp1281695138-11412) [n:127.0.0.1:54067_solr c:withShardField s:b r:core_node15 x:withShardField_b_replica_n12] o.a.s.s.IndexSchema [withShardField_b_replica_n12] Schema name=cloud-dynamic
   [junit4]   2> 967234 INFO  (qtp1383434849-11405) [n:127.0.0.1:54068_solr c:withShardField s:b r:core_node17 x:withShardField_b_replica_n14] o.a.s.s.IndexSchema [withShardField_b_replica_n14] Schema name=cloud-dynamic
   [junit4]   2> 967251 INFO  (qtp1383434849-11410) [n:127.0.0.1:54068_solr c:withShardField s:c r:core_node25 x:withShardField_c_replica_n22] o.a.s.c.SolrConfig Using Lucene MatchVersion: 8.0.0
   [junit4]   2> 967251 INFO  (qtp1383434849-11417) [n:127.0.0.1:54068_solr c:withShardField s:d r:core_node40 x:withShardField_d_replica_n38] o.a.s.c.SolrConfig Using Lucene MatchVersion: 8.0.0
   [junit4]   2> 967255 INFO  (qtp1383434849-11407) [n:127.0.0.1:54068_solr c:withShardField s:d r:core_node33 x:withShardField_d_replica_n30] o.a.s.c.SolrConfig Using Lucene MatchVersion: 8.0.0
   [junit4]   2> 967261 INFO  (qtp877438250-11433) [n:127.0.0.1:54069_solr c:withShardField s:b r:core_node21 x:withShardField_b_replica_n18] o.a.s.s.IndexSchema [withShardField_b_replica_n18] Schema name=cloud-dynamic
   [junit4]   2> 967261 INFO  (qtp1383434849-11407) [n:127.0.0.1:54068_solr c:withShardField s:d r:core_node33 x:withShardField_d_replica_n30] o.a.s.s.IndexSchema [withShardField_d_replica_n30] Schema name=cloud-dynamic
   [junit4]   2> 967313 INFO  (qtp1383434849-11417) [n:127.0.0.1:54068_solr c:withShardField s:d r:core_node40 x:withShardField_d_replica_n38] o.a.s.s.IndexSchema [withShardField_d_replica_n38] Schema name=cloud-dynamic
   [junit4]   2> 967313 INFO  (qtp1383434849-11410) [n:127.0.0.1:54068_solr c:withShardField s:c r:core_node25 x:withShardField_c_replica_n22] o.a.s.s.IndexSchema [withShardField_c_replica_n22] Schema name=cloud-dynamic
   [junit4]   2> 967318 INFO  (qtp1383434849-11408) [n:127.0.0.1:54068_solr c:withShardField s:a r:core_node9 x:withShardField_a_replica_n6] o.a.s.s.IndexSchema [withShardField_a_replica_n6] Schema name=cloud-dynamic
   [junit4]   2> 967323 INFO  (qtp1281695138-11431) [n:127.0.0.1:54067_solr c:withShardField s:a r:core_node7 x:withShardField_a_replica_n4] o.a.s.s.IndexSchema Loaded schema cloud-dynamic/1.6 with uniqueid field id
   [junit4]   2> 967323 INFO  (qtp1281695138-11431) [n:127.0.0.1:54067_solr c:withShardField s:a r:core_node7 x:withShardField_a_replica_n4] o.a.s.c.CoreContainer Creating SolrCore 'withShardField_a_replica_n4' using configuration from collection withShardField, trusted=true
   [junit4]   2> 967323 INFO  (qtp877438250-11433) [n:127.0.0.1:54069_solr c:withShardField s:b r:core_node21 x:withShardField_b_replica_n18] o.a.s.s.IndexSchema Loaded schema cloud-dynamic/1.6 with uniqueid field id
   [junit4]   2> 967323 INFO  (qtp877438250-11433) [n:127.0.0.1:54069_solr c:withShardField s:b r:core_node21 x:withShardField_b_replica_n18] o.a.s.c.CoreContainer Creating SolrCore 'withShardField_b_replica_n18' using configuration from collection withShardField, trusted=true
   [junit4]   2> 967323 INFO  (qtp1281695138-11431) [n:127.0.0.1:54067_solr c:withShardField s:a r:core_node7 x:withShardField_a_replica_n4] o.a.s.m.r.SolrJmxReporter JMX monitoring for 'solr_54067.solr.core.withShardField.a.replica_n4' (registry 'solr.core.withShardField.a.replica_n4') ena

[...truncated too long message...]

 registered, so ZooKeeper server won't take any action on ERROR or SHUTDOWN server state changes
   [junit4]   2> 2947782 INFO  (SUITE-AutoscalingHistoryHandlerTest-seed#[5CD9CF70E73B6407]-worker) [    ] o.a.s.c.ZkTestServer connecting to 127.0.0.1:62105 62105
   [junit4]   2> 2947799 INFO  (Thread-4989) [    ] o.a.s.c.ZkTestServer connecting to 127.0.0.1:62105 62105
   [junit4]   2> 2947991 WARN  (Thread-4989) [    ] o.a.s.c.ZkTestServer Watch limit violations: 
   [junit4]   2> Maximum concurrent create/delete watches above limit:
   [junit4]   2> 
   [junit4]   2> 	17	/solr/aliases.json
   [junit4]   2> 	6	/solr/configs/.system/managed-schema
   [junit4]   2> 	5	/solr/configs/.system
   [junit4]   2> 	4	/solr/security.json
   [junit4]   2> 	3	/solr/configs/AutoscalingHistoryHandlerTest_collection
   [junit4]   2> 	3	/solr/configs/AutoscalingHistoryHandlerTest_collection/managed-schema
   [junit4]   2> 
   [junit4]   2> Maximum concurrent data watches above limit:
   [junit4]   2> 
   [junit4]   2> 	138	/solr/collections/.system/state.json
   [junit4]   2> 	25	/solr/collections/AutoscalingHistoryHandlerTest_collection/state.json
   [junit4]   2> 	17	/solr/clusterprops.json
   [junit4]   2> 	17	/solr/clusterstate.json
   [junit4]   2> 	2	/solr/overseer_elect/election/98855905764704264-127.0.0.1:62107_solr-n_0000000001
   [junit4]   2> 	2	/solr/overseer_elect/election/98855905764704263-127.0.0.1:62108_solr-n_0000000000
   [junit4]   2> 
   [junit4]   2> Maximum concurrent children watches above limit:
   [junit4]   2> 
   [junit4]   2> 	17	/solr/live_nodes
   [junit4]   2> 	17	/solr/collections
   [junit4]   2> 
   [junit4]   2> NOTE: leaving temporary files on disk at: /Users/jenkins/workspace/Lucene-Solr-master-MacOSX/solr/build/solr-core/test/J0/temp/solr.handler.admin.AutoscalingHistoryHandlerTest_5CD9CF70E73B6407-001
   [junit4]   2> NOTE: test params are: codec=Asserting(Lucene70): {action_s=PostingsFormat(name=LuceneVarGapFixedInterval), event.source_s=BlockTreeOrds(blocksize=128), type=PostingsFormat(name=Memory), before.actions_ss=Lucene50(blocksize=128), event.property._enqueue_time__ss=PostingsFormat(name=LuceneVarGapFixedInterval), after.actions_ss=PostingsFormat(name=LuceneVarGapFixedInterval), stage_s=PostingsFormat(name=LuceneVarGapFixedInterval), event.id_s=BlockTreeOrds(blocksize=128), event.property.eventTimes_ss=PostingsFormat(name=Memory), source_s=BlockTreeOrds(blocksize=128), event.type_s=PostingsFormat(name=Memory), responses_ts=PostingsFormat(name=LuceneVarGapFixedInterval), id=BlockTreeOrds(blocksize=128), collections_ss=PostingsFormat(name=Memory), operations.params_ts=PostingsFormat(name=LuceneVarGapFixedInterval), event.property.nodeNames_ss=PostingsFormat(name=Memory)}, docValues:{_version_=DocValuesFormat(name=Lucene70), event.time_l=DocValuesFormat(name=Lucene70), timestamp=DocValuesFormat(name=Lucene70)}, maxPointsInLeafNode=907, maxMBSortInHeap=6.720522260333071, sim=RandomSimilarity(queryNorm=true): {}, locale=zh-SG, timezone=Australia/LHI
   [junit4]   2> NOTE: Mac OS X 10.11.6 x86_64/Oracle Corporation 1.8.0_144 (64-bit)/cpus=3,threads=1,free=296294432,total=513859584
   [junit4]   2> NOTE: All tests run in this JVM: [CleanupOldIndexTest, TestMultiValuedNumericRangeQuery, ShufflingReplicaListTransformerTest, TestSubQueryTransformerDistrib, TestSweetSpotSimilarityFactory, SolrCmdDistributorTest, RAMDirectoryFactoryTest, TestRandomDVFaceting, TestSolrQueryResponse, CollectionReloadTest, BlockJoinFacetRandomTest, XmlUpdateRequestHandlerTest, ClusterStateTest, DistributedTermsComponentTest, TestStressInPlaceUpdates, CursorPagingTest, TestZkAclsWithHadoopAuth, ReturnFieldsTest, BasicDistributedZkTest, SolrMetricsIntegrationTest, ShowFileRequestHandlerTest, AssignBackwardCompatibilityTest, SharedFSAutoReplicaFailoverTest, TestDistributedStatsComponentCardinality, DistributedFacetExistsSmallTest, CollectionsAPISolrJTest, InfixSuggestersTest, TestManagedResourceStorage, TestCursorMarkWithoutUniqueKey, BinaryUpdateRequestHandlerTest, BadIndexSchemaTest, TestManagedStopFilterFactory, SolrInfoBeanTest, TestLMDirichletSimilarityFactory, TestMacroExpander, CdcrBootstrapTest, SuggestComponentContextFilterQueryTest, TestIndexingPerformance, TestPKIAuthenticationPlugin, TestConfigsApi, TestCloudPseudoReturnFields, SolrCLIZkUtilsTest, CoreAdminRequestStatusTest, TestCustomStream, TestCloudDeleteByQuery, RegexBoostProcessorTest, TestLegacyField, TestNonDefinedSimilarityFactory, ClassificationUpdateProcessorTest, TestConfigReload, TestSolrCoreParser, DocValuesMissingTest, TestSubQueryTransformer, OutputWriterTest, TestBinaryResponseWriter, SolrXmlInZkTest, SuggesterTest, TestHdfsUpdateLog, ZkFailoverTest, BufferStoreTest, TestFieldCache, TestExportWriter, TestTrieFacet, TestNoOpRegenerator, TestCoreDiscovery, TestSimpleTextCodec, TestPrepRecovery, HttpPartitionTest, DistribJoinFromCollectionTest, TestDistributedSearch, BasicAuthIntegrationTest, TestDeleteCollectionOnDownNodes, ChaosMonkeyNothingIsSafeTest, OverseerTest, TestFiltering, TestClassicSimilarityFactory, AlternateDirectoryTest, HdfsThreadLeakTest, ConfigureRecoveryStrategyTest, TestDynamicFieldCollectionResource, TestPointFields, TestRTimerTree, TestCloudJSONFacetJoinDomain, TestDocBasedVersionConstraints, TestImplicitCoreProperties, TestSerializedLuceneMatchVersion, JSONWriterTest, PropertiesRequestHandlerTest, OverriddenZkACLAndCredentialsProvidersTest, HighlighterConfigTest, DistributedQueryElevationComponentTest, LeaderElectionTest, MigrateRouteKeyTest, DeleteNodeTest, SignatureUpdateProcessorFactoryTest, HdfsBasicDistributedZk2Test, SolrCloudReportersTest, TestMiniSolrCloudClusterSSL, TestTestInjection, TestSha256AuthenticationProvider, PrimitiveFieldTypeTest, RemoteQueryErrorTest, TestConfigSetsAPIZkFailure, TestQuerySenderNoQuery, AutoAddReplicasPlanActionTest, TestMissingGroups, HdfsRestartWhileUpdatingTest, PeerSyncWithIndexFingerprintCachingTest, DistributedSuggestComponentTest, TestComplexPhraseLeadingWildcard, SuggesterTSTTest, TestUseDocValuesAsStored2, TestHdfsCloudBackupRestore, TestNumericTerms64, DirectoryFactoryTest, DocExpirationUpdateProcessorFactoryTest, SyncSliceTest, TestHighlightDedupGrouping, TestSolr4Spatial, MetricsConfigTest, TestConfigSets, LeaderFailoverAfterPartitionTest, RecoveryZkTest, AddReplicaTest, SegmentsInfoRequestHandlerTest, TestLFUCache, StressHdfsTest, TestPushWriter, SaslZkACLProviderTest, TestTrackingShardHandlerFactory, ResourceLoaderTest, TestLegacyNumericUtils, DistributedSpellCheckComponentTest, UnloadDistributedZkTest, AtomicUpdateProcessorFactoryTest, TestLazyCores, TestSchemalessBufferedUpdates, TestStressRecovery, SliceStateTest, DistribCursorPagingTest, LargeFieldTest, CdcrReplicationHandlerTest, TestRealTimeGet, ChaosMonkeySafeLeaderWithPullReplicasTest, TestReloadAndDeleteDocs, UUIDFieldTest, TestSolrDeletionPolicy2, XsltUpdateRequestHandlerTest, TestRecoveryHdfs, OverseerStatusTest, TestAddFieldRealTimeGet, HdfsChaosMonkeyNothingIsSafeTest, AsyncCallRequestStatusResponseTest, SpatialFilterTest, DistributedQueryComponentCustomSortTest, TestEmbeddedSolrServerAdminHandler, TestJoin, TestJsonFacets, ExplicitHLLTest, TestBinaryField, TestSmileRequest, TestFilteredDocIdSet, TestLeaderElectionZkExpiry, SpellCheckCollatorTest, AnalyticsQueryTest, FieldAnalysisRequestHandlerTest, TestOrdValues, MoveReplicaTest, TestSolrCloudWithDelegationTokens, UUIDUpdateProcessorFallbackTest, NumericFieldsTest, ShardRoutingTest, TestSchemaSimilarityResource, CircularListTest, HdfsLockFactoryTest, TestNamedUpdateProcessors, CdcrVersionReplicationTest, TestXIncludeConfig, TestJmxIntegration, TestScoreJoinQPScore, BasicZkTest, FullSolrCloudDistribCmdsTest, ClusterStateUpdateTest, TestRandomFaceting, TestZkChroot, ZkCLITest, TestRecovery, TestCoreContainer, StatsComponentTest, PeerSyncTest, SolrRequestParserTest, TestFoldingMultitermQuery, SuggesterWFSTTest, SchemaVersionSpecificBehaviorTest, TestUpdate, TestWordDelimiterFilterFactory, DefaultValueUpdateProcessorTest, SortByFunctionTest, DocValuesMultiTest, DistanceFunctionTest, IndexBasedSpellCheckerTest, DisMaxRequestHandlerTest, DirectSolrSpellCheckerTest, TestReversedWildcardFilterFactory, DocumentAnalysisRequestHandlerTest, TermsComponentTest, TermVectorComponentTest, RequiredFieldsTest, SolrPluginUtilsTest, MBeansHandlerTest, TestTolerantSearch, TestEmbeddedSolrServerSchemaAPI, ConnectionReuseTest, AssignTest, CloudExitableDirectoryReaderTest, CollectionTooManyReplicasTest, ConnectionManagerTest, DeleteInactiveReplicaTest, DeleteReplicaTest, DocValuesNotIndexedTest, ForceLeaderTest, ReplaceNodeTest, ReplicationFactorTest, RollingRestartTest, SimpleCollectionCreateDeleteTest, TestCloudSearcherWarming, TestCollectionsAPIViaSolrCloudCluster, TestConfigSetsAPIExclusivity, TestCryptoKeys, TestDownShardTolerantSearch, TestLeaderInitiatedRecoveryThread, TestLockTree, TestPullReplicaErrorHandling, TestReplicaProperties, TestSSLRandomization, TestSegmentSorting, TestSolrCloudWithKerberosAlt, TestSolrCloudWithSecureImpersonation, TestStressCloudBlindAtomicUpdates, TestTlogReplica, ComputePlanActionTest, ExecutePlanActionTest, SystemLogListenerTest, TestPolicyCloud, HdfsBasicDistributedZkTest, HdfsChaosMonkeySafeLeaderTest, HdfsCollectionsAPIDistributedZkTest, HdfsNNFailoverTest, HdfsRecoverLeaseTest, HdfsRecoveryZkTest, HdfsUnloadDistributedZkTest, HdfsWriteToMultipleCollectionsTest, TestClusterStateMutator, ZkStateReaderTest, ZkStateWriterTest, ImplicitSnitchTest, RulesTest, BlobRepositoryCloudTest, CoreSorterTest, ExitableDirectoryReaderTest, HdfsDirectoryFactoryTest, TestBackupRepositoryFactory, TestConfigSetImmutable, TestCorePropertiesReload, TestDynamicLoading, TestSolrCoreSnapshots, RequestLoggingTest, SearchHandlerTest, TestReplicationHandlerBackup, TestRestoreCore, V2ApiIntegrationTest, V2StandaloneTest, AutoscalingHistoryHandlerTest]
   [junit4] Completed [651/745 (4!)] on J0 in 89.56s, 1 test, 1 failure <<< FAILURES!

[...truncated 47527 lines...]

Mime
View raw message