lucene-dev mailing list archives

Site index · List index
Message view « Date » · « Thread »
Top « Date » · « Thread »
From Policeman Jenkins Server <jenk...@thetaphi.de>
Subject [JENKINS] Lucene-Solr-master-Linux (64bit/jdk-9) - Build # 20621 - Still Failing!
Date Sat, 07 Oct 2017 03:47:59 GMT
Build: https://jenkins.thetaphi.de/job/Lucene-Solr-master-Linux/20621/
Java: 64bit/jdk-9 -XX:-UseCompressedOops -XX:+UseSerialGC --illegal-access=deny

1 tests failed.
FAILED:  org.apache.solr.handler.admin.AutoscalingHistoryHandlerTest.testHistory

Error Message:
replica never fully recovered

Stack Trace:
java.lang.AssertionError: replica never fully recovered
	at __randomizedtesting.SeedInfo.seed([1657712D937E3CD7:7BABD5D02936C3D0]:0)
	at org.junit.Assert.fail(Assert.java:93)
	at org.junit.Assert.assertTrue(Assert.java:43)
	at org.apache.solr.handler.admin.AutoscalingHistoryHandlerTest.waitForRecovery(AutoscalingHistoryHandlerTest.java:303)
	at org.apache.solr.handler.admin.AutoscalingHistoryHandlerTest.testHistory(AutoscalingHistoryHandlerTest.java:255)
	at java.base/jdk.internal.reflect.NativeMethodAccessorImpl.invoke0(Native Method)
	at java.base/jdk.internal.reflect.NativeMethodAccessorImpl.invoke(NativeMethodAccessorImpl.java:62)
	at java.base/jdk.internal.reflect.DelegatingMethodAccessorImpl.invoke(DelegatingMethodAccessorImpl.java:43)
	at java.base/java.lang.reflect.Method.invoke(Method.java:564)
	at com.carrotsearch.randomizedtesting.RandomizedRunner.invoke(RandomizedRunner.java:1737)
	at com.carrotsearch.randomizedtesting.RandomizedRunner$8.evaluate(RandomizedRunner.java:934)
	at com.carrotsearch.randomizedtesting.RandomizedRunner$9.evaluate(RandomizedRunner.java:970)
	at com.carrotsearch.randomizedtesting.RandomizedRunner$10.evaluate(RandomizedRunner.java:984)
	at com.carrotsearch.randomizedtesting.rules.SystemPropertiesRestoreRule$1.evaluate(SystemPropertiesRestoreRule.java:57)
	at org.apache.lucene.util.TestRuleSetupTeardownChained$1.evaluate(TestRuleSetupTeardownChained.java:49)
	at org.apache.lucene.util.AbstractBeforeAfterRule$1.evaluate(AbstractBeforeAfterRule.java:45)
	at org.apache.lucene.util.TestRuleThreadAndTestName$1.evaluate(TestRuleThreadAndTestName.java:48)
	at org.apache.lucene.util.TestRuleIgnoreAfterMaxFailures$1.evaluate(TestRuleIgnoreAfterMaxFailures.java:64)
	at org.apache.lucene.util.TestRuleMarkFailure$1.evaluate(TestRuleMarkFailure.java:47)
	at com.carrotsearch.randomizedtesting.rules.StatementAdapter.evaluate(StatementAdapter.java:36)
	at com.carrotsearch.randomizedtesting.ThreadLeakControl$StatementRunner.run(ThreadLeakControl.java:368)
	at com.carrotsearch.randomizedtesting.ThreadLeakControl.forkTimeoutingTask(ThreadLeakControl.java:817)
	at com.carrotsearch.randomizedtesting.ThreadLeakControl$3.evaluate(ThreadLeakControl.java:468)
	at com.carrotsearch.randomizedtesting.RandomizedRunner.runSingleTest(RandomizedRunner.java:943)
	at com.carrotsearch.randomizedtesting.RandomizedRunner$5.evaluate(RandomizedRunner.java:829)
	at com.carrotsearch.randomizedtesting.RandomizedRunner$6.evaluate(RandomizedRunner.java:879)
	at com.carrotsearch.randomizedtesting.RandomizedRunner$7.evaluate(RandomizedRunner.java:890)
	at com.carrotsearch.randomizedtesting.rules.StatementAdapter.evaluate(StatementAdapter.java:36)
	at com.carrotsearch.randomizedtesting.rules.SystemPropertiesRestoreRule$1.evaluate(SystemPropertiesRestoreRule.java:57)
	at org.apache.lucene.util.AbstractBeforeAfterRule$1.evaluate(AbstractBeforeAfterRule.java:45)
	at com.carrotsearch.randomizedtesting.rules.StatementAdapter.evaluate(StatementAdapter.java:36)
	at org.apache.lucene.util.TestRuleStoreClassName$1.evaluate(TestRuleStoreClassName.java:41)
	at com.carrotsearch.randomizedtesting.rules.NoShadowingOrOverridesOnMethodsRule$1.evaluate(NoShadowingOrOverridesOnMethodsRule.java:40)
	at com.carrotsearch.randomizedtesting.rules.NoShadowingOrOverridesOnMethodsRule$1.evaluate(NoShadowingOrOverridesOnMethodsRule.java:40)
	at com.carrotsearch.randomizedtesting.rules.StatementAdapter.evaluate(StatementAdapter.java:36)
	at com.carrotsearch.randomizedtesting.rules.StatementAdapter.evaluate(StatementAdapter.java:36)
	at org.apache.lucene.util.TestRuleAssertionsRequired$1.evaluate(TestRuleAssertionsRequired.java:53)
	at org.apache.lucene.util.TestRuleMarkFailure$1.evaluate(TestRuleMarkFailure.java:47)
	at org.apache.lucene.util.TestRuleIgnoreAfterMaxFailures$1.evaluate(TestRuleIgnoreAfterMaxFailures.java:64)
	at org.apache.lucene.util.TestRuleIgnoreTestSuites$1.evaluate(TestRuleIgnoreTestSuites.java:54)
	at com.carrotsearch.randomizedtesting.rules.StatementAdapter.evaluate(StatementAdapter.java:36)
	at com.carrotsearch.randomizedtesting.ThreadLeakControl$StatementRunner.run(ThreadLeakControl.java:368)
	at java.base/java.lang.Thread.run(Thread.java:844)




Build Log:
[...truncated 14036 lines...]
   [junit4] Suite: org.apache.solr.handler.admin.AutoscalingHistoryHandlerTest
   [junit4]   2> Creating dataDir: /home/jenkins/workspace/Lucene-Solr-master-Linux/solr/build/solr-core/test/J0/temp/solr.handler.admin.AutoscalingHistoryHandlerTest_1657712D937E3CD7-001/init-core-data-001
   [junit4]   2> 2879394 WARN  (SUITE-AutoscalingHistoryHandlerTest-seed#[1657712D937E3CD7]-worker) [    ] o.a.s.SolrTestCaseJ4 startTrackingSearchers: numOpens=236 numCloses=236
   [junit4]   2> 2879394 INFO  (SUITE-AutoscalingHistoryHandlerTest-seed#[1657712D937E3CD7]-worker) [    ] o.a.s.SolrTestCaseJ4 Using PointFields (NUMERIC_POINTS_SYSPROP=true) w/NUMERIC_DOCVALUES_SYSPROP=true
   [junit4]   2> 2879394 INFO  (SUITE-AutoscalingHistoryHandlerTest-seed#[1657712D937E3CD7]-worker) [    ] o.a.s.SolrTestCaseJ4 Randomized ssl (false) and clientAuth (true) via: @org.apache.solr.util.RandomizeSSL(reason="", ssl=0.0/0.0, value=0.0/0.0, clientAuth=0.0/0.0)
   [junit4]   2> 2879395 INFO  (SUITE-AutoscalingHistoryHandlerTest-seed#[1657712D937E3CD7]-worker) [    ] o.a.s.SolrTestCaseJ4 SecureRandom sanity checks: test.solr.allowed.securerandom=null & java.security.egd=file:/dev/./urandom
   [junit4]   2> 2879395 INFO  (SUITE-AutoscalingHistoryHandlerTest-seed#[1657712D937E3CD7]-worker) [    ] o.a.s.c.MiniSolrCloudCluster Starting cluster of 3 servers in /home/jenkins/workspace/Lucene-Solr-master-Linux/solr/build/solr-core/test/J0/temp/solr.handler.admin.AutoscalingHistoryHandlerTest_1657712D937E3CD7-001/tempDir-001
   [junit4]   2> 2879395 INFO  (SUITE-AutoscalingHistoryHandlerTest-seed#[1657712D937E3CD7]-worker) [    ] o.a.s.c.ZkTestServer STARTING ZK TEST SERVER
   [junit4]   2> 2879395 INFO  (Thread-4473) [    ] o.a.s.c.ZkTestServer client port:0.0.0.0/0.0.0.0:0
   [junit4]   2> 2879395 INFO  (Thread-4473) [    ] o.a.s.c.ZkTestServer Starting server
   [junit4]   2> 2879396 ERROR (Thread-4473) [    ] o.a.z.s.ZooKeeperServer ZKShutdownHandler is not registered, so ZooKeeper server won't take any action on ERROR or SHUTDOWN server state changes
   [junit4]   2> 2879495 INFO  (SUITE-AutoscalingHistoryHandlerTest-seed#[1657712D937E3CD7]-worker) [    ] o.a.s.c.ZkTestServer start zk server on port:39575
   [junit4]   2> 2879501 INFO  (jetty-launcher-3301-thread-1) [    ] o.e.j.s.Server jetty-9.3.20.v20170531
   [junit4]   2> 2879501 INFO  (jetty-launcher-3301-thread-3) [    ] o.e.j.s.Server jetty-9.3.20.v20170531
   [junit4]   2> 2879501 INFO  (jetty-launcher-3301-thread-2) [    ] o.e.j.s.Server jetty-9.3.20.v20170531
   [junit4]   2> 2879503 INFO  (jetty-launcher-3301-thread-1) [    ] o.e.j.s.h.ContextHandler Started o.e.j.s.ServletContextHandler@8454c70{/solr,null,AVAILABLE}
   [junit4]   2> 2879503 INFO  (jetty-launcher-3301-thread-2) [    ] o.e.j.s.h.ContextHandler Started o.e.j.s.ServletContextHandler@2b7d2b0a{/solr,null,AVAILABLE}
   [junit4]   2> 2879503 INFO  (jetty-launcher-3301-thread-3) [    ] o.e.j.s.h.ContextHandler Started o.e.j.s.ServletContextHandler@71ae6431{/solr,null,AVAILABLE}
   [junit4]   2> 2879505 INFO  (jetty-launcher-3301-thread-1) [    ] o.e.j.s.AbstractConnector Started ServerConnector@7659f4c5{HTTP/1.1,[http/1.1]}{127.0.0.1:46621}
   [junit4]   2> 2879505 INFO  (jetty-launcher-3301-thread-2) [    ] o.e.j.s.AbstractConnector Started ServerConnector@1522a40c{HTTP/1.1,[http/1.1]}{127.0.0.1:34327}
   [junit4]   2> 2879506 INFO  (jetty-launcher-3301-thread-3) [    ] o.e.j.s.AbstractConnector Started ServerConnector@5923e287{HTTP/1.1,[http/1.1]}{127.0.0.1:34287}
   [junit4]   2> 2879506 INFO  (jetty-launcher-3301-thread-2) [    ] o.e.j.s.Server Started @2881038ms
   [junit4]   2> 2879506 INFO  (jetty-launcher-3301-thread-3) [    ] o.e.j.s.Server Started @2881038ms
   [junit4]   2> 2879506 INFO  (jetty-launcher-3301-thread-2) [    ] o.a.s.c.s.e.JettySolrRunner Jetty properties: {hostContext=/solr, hostPort=34327}
   [junit4]   2> 2879506 INFO  (jetty-launcher-3301-thread-3) [    ] o.a.s.c.s.e.JettySolrRunner Jetty properties: {hostContext=/solr, hostPort=34287}
   [junit4]   2> 2879506 INFO  (jetty-launcher-3301-thread-1) [    ] o.e.j.s.Server Started @2881038ms
   [junit4]   2> 2879506 INFO  (jetty-launcher-3301-thread-1) [    ] o.a.s.c.s.e.JettySolrRunner Jetty properties: {hostContext=/solr, hostPort=46621}
   [junit4]   2> 2879506 ERROR (jetty-launcher-3301-thread-2) [    ] o.a.s.u.StartupLoggingUtils Missing Java Option solr.log.dir. Logging may be missing or incomplete.
   [junit4]   2> 2879506 ERROR (jetty-launcher-3301-thread-3) [    ] o.a.s.u.StartupLoggingUtils Missing Java Option solr.log.dir. Logging may be missing or incomplete.
   [junit4]   2> 2879506 INFO  (jetty-launcher-3301-thread-2) [    ] o.a.s.s.SolrDispatchFilter  ___      _       Welcome to Apache Solr™ version 8.0.0
   [junit4]   2> 2879506 INFO  (jetty-launcher-3301-thread-3) [    ] o.a.s.s.SolrDispatchFilter  ___      _       Welcome to Apache Solr™ version 8.0.0
   [junit4]   2> 2879506 INFO  (jetty-launcher-3301-thread-2) [    ] o.a.s.s.SolrDispatchFilter / __| ___| |_ _   Starting in cloud mode on port null
   [junit4]   2> 2879506 INFO  (jetty-launcher-3301-thread-3) [    ] o.a.s.s.SolrDispatchFilter / __| ___| |_ _   Starting in cloud mode on port null
   [junit4]   2> 2879507 INFO  (jetty-launcher-3301-thread-2) [    ] o.a.s.s.SolrDispatchFilter \__ \/ _ \ | '_|  Install dir: null, Default config dir: null
   [junit4]   2> 2879507 INFO  (jetty-launcher-3301-thread-3) [    ] o.a.s.s.SolrDispatchFilter \__ \/ _ \ | '_|  Install dir: null, Default config dir: null
   [junit4]   2> 2879507 INFO  (jetty-launcher-3301-thread-2) [    ] o.a.s.s.SolrDispatchFilter |___/\___/_|_|    Start time: 2017-10-07T03:35:45.321129Z
   [junit4]   2> 2879507 INFO  (jetty-launcher-3301-thread-3) [    ] o.a.s.s.SolrDispatchFilter |___/\___/_|_|    Start time: 2017-10-07T03:35:45.321194Z
   [junit4]   2> 2879506 ERROR (jetty-launcher-3301-thread-1) [    ] o.a.s.u.StartupLoggingUtils Missing Java Option solr.log.dir. Logging may be missing or incomplete.
   [junit4]   2> 2879507 INFO  (jetty-launcher-3301-thread-1) [    ] o.a.s.s.SolrDispatchFilter  ___      _       Welcome to Apache Solr™ version 8.0.0
   [junit4]   2> 2879507 INFO  (jetty-launcher-3301-thread-1) [    ] o.a.s.s.SolrDispatchFilter / __| ___| |_ _   Starting in cloud mode on port null
   [junit4]   2> 2879507 INFO  (jetty-launcher-3301-thread-1) [    ] o.a.s.s.SolrDispatchFilter \__ \/ _ \ | '_|  Install dir: null, Default config dir: null
   [junit4]   2> 2879507 INFO  (jetty-launcher-3301-thread-1) [    ] o.a.s.s.SolrDispatchFilter |___/\___/_|_|    Start time: 2017-10-07T03:35:45.321708Z
   [junit4]   2> 2879508 INFO  (jetty-launcher-3301-thread-2) [    ] o.a.s.s.SolrDispatchFilter solr.xml found in ZooKeeper. Loading...
   [junit4]   2> 2879508 INFO  (jetty-launcher-3301-thread-3) [    ] o.a.s.s.SolrDispatchFilter solr.xml found in ZooKeeper. Loading...
   [junit4]   2> 2879508 INFO  (jetty-launcher-3301-thread-1) [    ] o.a.s.s.SolrDispatchFilter solr.xml found in ZooKeeper. Loading...
   [junit4]   2> 2879513 WARN  (NIOServerCxn.Factory:0.0.0.0/0.0.0.0:0) [    ] o.a.z.s.NIOServerCnxn caught end of stream exception
   [junit4]   2> EndOfStreamException: Unable to read additional data from client sessionid 0x15ef4e72f3a0003, likely client has closed socket
   [junit4]   2> 	at org.apache.zookeeper.server.NIOServerCnxn.doIO(NIOServerCnxn.java:239)
   [junit4]   2> 	at org.apache.zookeeper.server.NIOServerCnxnFactory.run(NIOServerCnxnFactory.java:203)
   [junit4]   2> 	at java.base/java.lang.Thread.run(Thread.java:844)
   [junit4]   2> 2879515 INFO  (jetty-launcher-3301-thread-3) [    ] o.a.s.c.ZkContainer Zookeeper client=127.0.0.1:39575/solr
   [junit4]   2> 2879515 INFO  (jetty-launcher-3301-thread-2) [    ] o.a.s.c.ZkContainer Zookeeper client=127.0.0.1:39575/solr
   [junit4]   2> 2879516 INFO  (jetty-launcher-3301-thread-1) [    ] o.a.s.c.ZkContainer Zookeeper client=127.0.0.1:39575/solr
   [junit4]   2> 2879560 INFO  (jetty-launcher-3301-thread-1) [    ] o.a.s.c.Overseer Overseer (id=null) closing
   [junit4]   2> 2879560 INFO  (jetty-launcher-3301-thread-3) [    ] o.a.s.c.Overseer Overseer (id=null) closing
   [junit4]   2> 2879561 INFO  (jetty-launcher-3301-thread-2) [    ] o.a.s.c.Overseer Overseer (id=null) closing
   [junit4]   2> 2879561 INFO  (jetty-launcher-3301-thread-1) [    ] o.a.s.c.OverseerElectionContext I am going to be the leader 127.0.0.1:46621_solr
   [junit4]   2> 2879561 INFO  (jetty-launcher-3301-thread-3) [    ] o.a.s.c.ZkController Register node as live in ZooKeeper:/live_nodes/127.0.0.1:34287_solr
   [junit4]   2> 2879561 INFO  (jetty-launcher-3301-thread-2) [    ] o.a.s.c.ZkController Register node as live in ZooKeeper:/live_nodes/127.0.0.1:34327_solr
   [junit4]   2> 2879561 INFO  (jetty-launcher-3301-thread-1) [    ] o.a.s.c.Overseer Overseer (id=98785515615682569-127.0.0.1:46621_solr-n_0000000000) starting
   [junit4]   2> 2879561 INFO  (zkCallback-3317-thread-1) [    ] o.a.s.c.c.ZkStateReader Updated live nodes from ZooKeeper... (0) -> (1)
   [junit4]   2> 2879561 INFO  (zkCallback-3318-thread-1) [    ] o.a.s.c.c.ZkStateReader Updated live nodes from ZooKeeper... (0) -> (1)
   [junit4]   2> 2879561 INFO  (zkCallback-3316-thread-1) [    ] o.a.s.c.c.ZkStateReader Updated live nodes from ZooKeeper... (0) -> (1)
   [junit4]   2> 2879562 INFO  (zkCallback-3318-thread-2) [    ] o.a.s.c.c.ZkStateReader Updated live nodes from ZooKeeper... (1) -> (2)
   [junit4]   2> 2879562 INFO  (zkCallback-3316-thread-2) [    ] o.a.s.c.c.ZkStateReader Updated live nodes from ZooKeeper... (1) -> (2)
   [junit4]   2> 2879562 INFO  (zkCallback-3317-thread-2) [    ] o.a.s.c.c.ZkStateReader Updated live nodes from ZooKeeper... (1) -> (2)
   [junit4]   2> 2879563 DEBUG (OverseerStateUpdate-98785515615682569-127.0.0.1:46621_solr-n_0000000000) [    ] o.a.s.c.Overseer Starting to work on the main queue
   [junit4]   2> 2879563 DEBUG (OverseerAutoScalingTriggerThread-98785515615682569-127.0.0.1:46621_solr-n_0000000000) [    ] o.a.s.c.a.OverseerTriggerThread Adding .autoAddReplicas trigger
   [junit4]   2> 2879563 DEBUG (OverseerAutoScalingTriggerThread-98785515615682569-127.0.0.1:46621_solr-n_0000000000) [    ] o.a.s.c.a.OverseerTriggerThread Refreshing /autoscaling.json with znode version 1
   [junit4]   2> 2879563 INFO  (jetty-launcher-3301-thread-1) [    ] o.a.s.c.ZkController Register node as live in ZooKeeper:/live_nodes/127.0.0.1:46621_solr
   [junit4]   2> 2879563 DEBUG (OverseerStateUpdate-98785515615682569-127.0.0.1:46621_solr-n_0000000000) [    ] o.a.s.c.Overseer processMessage: queueSize: 1, message = {
   [junit4]   2>   "operation":"downnode",
   [junit4]   2>   "node_name":"127.0.0.1:46621_solr"} current state version: 0
   [junit4]   2> 2879564 DEBUG (OverseerStateUpdate-98785515615682569-127.0.0.1:46621_solr-n_0000000000) [    ] o.a.s.c.o.NodeMutator DownNode state invoked for node: 127.0.0.1:46621_solr
   [junit4]   2> 2879564 INFO  (zkCallback-3316-thread-2) [    ] o.a.s.c.c.ZkStateReader Updated live nodes from ZooKeeper... (2) -> (3)
   [junit4]   2> 2879564 INFO  (zkCallback-3317-thread-2) [    ] o.a.s.c.c.ZkStateReader Updated live nodes from ZooKeeper... (2) -> (3)
   [junit4]   2> 2879564 INFO  (zkCallback-3318-thread-2) [    ] o.a.s.c.c.ZkStateReader Updated live nodes from ZooKeeper... (2) -> (3)
   [junit4]   2> 2879564 DEBUG (OverseerAutoScalingTriggerThread-98785515615682569-127.0.0.1:46621_solr-n_0000000000) [    ] o.a.s.c.a.NodeLostTrigger Initial livenodes: [127.0.0.1:34327_solr, 127.0.0.1:34287_solr, 127.0.0.1:46621_solr]
   [junit4]   2> 2879564 DEBUG (OverseerAutoScalingTriggerThread-98785515615682569-127.0.0.1:46621_solr-n_0000000000) [    ] o.a.s.c.a.OverseerTriggerThread Current znodeVersion 1, lastZnodeVersion -1
   [junit4]   2> 2879564 DEBUG (OverseerAutoScalingTriggerThread-98785515615682569-127.0.0.1:46621_solr-n_0000000000) [    ] o.a.s.c.a.OverseerTriggerThread Processed trigger updates upto znodeVersion 1
   [junit4]   2> 2879564 DEBUG (OverseerAutoScalingTriggerThread-98785515615682569-127.0.0.1:46621_solr-n_0000000000) [    ] o.a.s.c.a.OverseerTriggerThread -- clean old nodeAdded markers
   [junit4]   2> 2879565 DEBUG (OverseerAutoScalingTriggerThread-98785515615682569-127.0.0.1:46621_solr-n_0000000000) [    ] o.a.s.c.a.OverseerTriggerThread Current znodeVersion 1, lastZnodeVersion 1
   [junit4]   2> 2879565 DEBUG (ScheduledTrigger-8250-thread-1) [    ] o.a.s.c.a.NodeLostTrigger Running NodeLostTrigger: .auto_add_replicas with currently live nodes: [127.0.0.1:34287_solr, 127.0.0.1:34327_solr, 127.0.0.1:46621_solr]
   [junit4]   2> 2879609 INFO  (jetty-launcher-3301-thread-1) [    ] o.a.s.m.r.SolrJmxReporter JMX monitoring for 'solr_46621.solr.node' (registry 'solr.node') enabled at server: com.sun.jmx.mbeanserver.JmxMBeanServer@716502b2
   [junit4]   2> 2879609 INFO  (jetty-launcher-3301-thread-3) [    ] o.a.s.m.r.SolrJmxReporter JMX monitoring for 'solr_34287.solr.node' (registry 'solr.node') enabled at server: com.sun.jmx.mbeanserver.JmxMBeanServer@716502b2
   [junit4]   2> 2879613 INFO  (jetty-launcher-3301-thread-1) [    ] o.a.s.m.r.SolrJmxReporter JMX monitoring for 'solr_46621.solr.jvm' (registry 'solr.jvm') enabled at server: com.sun.jmx.mbeanserver.JmxMBeanServer@716502b2
   [junit4]   2> 2879613 INFO  (jetty-launcher-3301-thread-1) [    ] o.a.s.m.r.SolrJmxReporter JMX monitoring for 'solr_46621.solr.jetty' (registry 'solr.jetty') enabled at server: com.sun.jmx.mbeanserver.JmxMBeanServer@716502b2
   [junit4]   2> 2879614 INFO  (jetty-launcher-3301-thread-1) [    ] o.a.s.c.CorePropertiesLocator Found 0 core definitions underneath /home/jenkins/workspace/Lucene-Solr-master-Linux/solr/build/solr-core/test/J0/temp/solr.handler.admin.AutoscalingHistoryHandlerTest_1657712D937E3CD7-001/tempDir-001/node1/.
   [junit4]   2> 2879617 INFO  (jetty-launcher-3301-thread-3) [    ] o.a.s.m.r.SolrJmxReporter JMX monitoring for 'solr_34287.solr.jvm' (registry 'solr.jvm') enabled at server: com.sun.jmx.mbeanserver.JmxMBeanServer@716502b2
   [junit4]   2> 2879617 INFO  (jetty-launcher-3301-thread-3) [    ] o.a.s.m.r.SolrJmxReporter JMX monitoring for 'solr_34287.solr.jetty' (registry 'solr.jetty') enabled at server: com.sun.jmx.mbeanserver.JmxMBeanServer@716502b2
   [junit4]   2> 2879618 INFO  (jetty-launcher-3301-thread-3) [    ] o.a.s.c.CorePropertiesLocator Found 0 core definitions underneath /home/jenkins/workspace/Lucene-Solr-master-Linux/solr/build/solr-core/test/J0/temp/solr.handler.admin.AutoscalingHistoryHandlerTest_1657712D937E3CD7-001/tempDir-001/node3/.
   [junit4]   2> 2879627 INFO  (jetty-launcher-3301-thread-2) [    ] o.a.s.m.r.SolrJmxReporter JMX monitoring for 'solr_34327.solr.node' (registry 'solr.node') enabled at server: com.sun.jmx.mbeanserver.JmxMBeanServer@716502b2
   [junit4]   2> 2879631 INFO  (jetty-launcher-3301-thread-2) [    ] o.a.s.m.r.SolrJmxReporter JMX monitoring for 'solr_34327.solr.jvm' (registry 'solr.jvm') enabled at server: com.sun.jmx.mbeanserver.JmxMBeanServer@716502b2
   [junit4]   2> 2879632 INFO  (jetty-launcher-3301-thread-2) [    ] o.a.s.m.r.SolrJmxReporter JMX monitoring for 'solr_34327.solr.jetty' (registry 'solr.jetty') enabled at server: com.sun.jmx.mbeanserver.JmxMBeanServer@716502b2
   [junit4]   2> 2879632 INFO  (jetty-launcher-3301-thread-2) [    ] o.a.s.c.CorePropertiesLocator Found 0 core definitions underneath /home/jenkins/workspace/Lucene-Solr-master-Linux/solr/build/solr-core/test/J0/temp/solr.handler.admin.AutoscalingHistoryHandlerTest_1657712D937E3CD7-001/tempDir-001/node2/.
   [junit4]   2> 2879668 INFO  (SUITE-AutoscalingHistoryHandlerTest-seed#[1657712D937E3CD7]-worker) [    ] o.a.s.c.c.ZkStateReader Updated live nodes from ZooKeeper... (0) -> (3)
   [junit4]   2> 2879668 INFO  (SUITE-AutoscalingHistoryHandlerTest-seed#[1657712D937E3CD7]-worker) [    ] o.a.s.c.s.i.ZkClientClusterStateProvider Cluster at 127.0.0.1:39575/solr ready
   [junit4]   2> 2879669 INFO  (qtp337664537-21511) [    ] o.a.s.h.a.CollectionsHandler Invoked Collection Action :create with params replicationFactor=3&name=AutoscalingHistoryHandlerTest_collection&nrtReplicas=3&action=CREATE&numShards=1&wt=javabin&version=2 and sendToOCPQueue=true
   [junit4]   2> 2879670 INFO  (OverseerThreadFactory-8252-thread-1) [    ] o.a.s.c.CreateCollectionCmd Create collection AutoscalingHistoryHandlerTest_collection
   [junit4]   2> 2879670 INFO  (OverseerThreadFactory-8252-thread-1) [    ] o.a.s.c.CreateCollectionCmd Only _default config set found, using it.
   [junit4]   2> 2879671 INFO  (OverseerThreadFactory-8252-thread-1) [    ] o.a.s.c.c.ZkConfigManager Copying zk node /configs/_default/protwords.txt to /configs/AutoscalingHistoryHandlerTest_collection/protwords.txt
   [junit4]   2> 2879671 INFO  (OverseerThreadFactory-8252-thread-1) [    ] o.a.s.c.c.ZkConfigManager Copying zk node /configs/_default/managed-schema to /configs/AutoscalingHistoryHandlerTest_collection/managed-schema
   [junit4]   2> 2879671 INFO  (OverseerThreadFactory-8252-thread-1) [    ] o.a.s.c.c.ZkConfigManager Copying zk node /configs/_default/solrconfig.xml to /configs/AutoscalingHistoryHandlerTest_collection/solrconfig.xml
   [junit4]   2> 2879672 INFO  (OverseerThreadFactory-8252-thread-1) [    ] o.a.s.c.c.ZkConfigManager Copying zk node /configs/_default/synonyms.txt to /configs/AutoscalingHistoryHandlerTest_collection/synonyms.txt
   [junit4]   2> 2879672 INFO  (OverseerThreadFactory-8252-thread-1) [    ] o.a.s.c.c.ZkConfigManager Copying zk node /configs/_default/stopwords.txt to /configs/AutoscalingHistoryHandlerTest_collection/stopwords.txt
   [junit4]   2> 2879673 INFO  (OverseerThreadFactory-8252-thread-1) [    ] o.a.s.c.c.ZkConfigManager Copying zk node /configs/_default/lang/contractions_it.txt to /configs/AutoscalingHistoryHandlerTest_collection/lang/contractions_it.txt
   [junit4]   2> 2879673 INFO  (OverseerThreadFactory-8252-thread-1) [    ] o.a.s.c.c.ZkConfigManager Copying zk node /configs/_default/lang/stemdict_nl.txt to /configs/AutoscalingHistoryHandlerTest_collection/lang/stemdict_nl.txt
   [junit4]   2> 2879673 INFO  (OverseerThreadFactory-8252-thread-1) [    ] o.a.s.c.c.ZkConfigManager Copying zk node /configs/_default/lang/stopwords_hy.txt to /configs/AutoscalingHistoryHandlerTest_collection/lang/stopwords_hy.txt
   [junit4]   2> 2879674 INFO  (OverseerThreadFactory-8252-thread-1) [    ] o.a.s.c.c.ZkConfigManager Copying zk node /configs/_default/lang/stopwords_no.txt to /configs/AutoscalingHistoryHandlerTest_collection/lang/stopwords_no.txt
   [junit4]   2> 2879674 INFO  (OverseerThreadFactory-8252-thread-1) [    ] o.a.s.c.c.ZkConfigManager Copying zk node /configs/_default/lang/contractions_ca.txt to /configs/AutoscalingHistoryHandlerTest_collection/lang/contractions_ca.txt
   [junit4]   2> 2879675 INFO  (OverseerThreadFactory-8252-thread-1) [    ] o.a.s.c.c.ZkConfigManager Copying zk node /configs/_default/lang/stopwords_id.txt to /configs/AutoscalingHistoryHandlerTest_collection/lang/stopwords_id.txt
   [junit4]   2> 2879675 INFO  (OverseerThreadFactory-8252-thread-1) [    ] o.a.s.c.c.ZkConfigManager Copying zk node /configs/_default/lang/stopwords_ga.txt to /configs/AutoscalingHistoryHandlerTest_collection/lang/stopwords_ga.txt
   [junit4]   2> 2879675 INFO  (OverseerThreadFactory-8252-thread-1) [    ] o.a.s.c.c.ZkConfigManager Copying zk node /configs/_default/lang/stopwords_hi.txt to /configs/AutoscalingHistoryHandlerTest_collection/lang/stopwords_hi.txt
   [junit4]   2> 2879676 INFO  (OverseerThreadFactory-8252-thread-1) [    ] o.a.s.c.c.ZkConfigManager Copying zk node /configs/_default/lang/stopwords_da.txt to /configs/AutoscalingHistoryHandlerTest_collection/lang/stopwords_da.txt
   [junit4]   2> 2879676 INFO  (OverseerThreadFactory-8252-thread-1) [    ] o.a.s.c.c.ZkConfigManager Copying zk node /configs/_default/lang/stopwords_ja.txt to /configs/AutoscalingHistoryHandlerTest_collection/lang/stopwords_ja.txt
   [junit4]   2> 2879676 INFO  (OverseerThreadFactory-8252-thread-1) [    ] o.a.s.c.c.ZkConfigManager Copying zk node /configs/_default/lang/stopwords_pt.txt to /configs/AutoscalingHistoryHandlerTest_collection/lang/stopwords_pt.txt
   [junit4]   2> 2879677 INFO  (OverseerThreadFactory-8252-thread-1) [    ] o.a.s.c.c.ZkConfigManager Copying zk node /configs/_default/lang/stopwords_hu.txt to /configs/AutoscalingHistoryHandlerTest_collection/lang/stopwords_hu.txt
   [junit4]   2> 2879677 INFO  (OverseerThreadFactory-8252-thread-1) [    ] o.a.s.c.c.ZkConfigManager Copying zk node /configs/_default/lang/stopwords_el.txt to /configs/AutoscalingHistoryHandlerTest_collection/lang/stopwords_el.txt
   [junit4]   2> 2879677 INFO  (OverseerThreadFactory-8252-thread-1) [    ] o.a.s.c.c.ZkConfigManager Copying zk node /configs/_default/lang/stopwords_ru.txt to /configs/AutoscalingHistoryHandlerTest_collection/lang/stopwords_ru.txt
   [junit4]   2> 2879678 INFO  (OverseerThreadFactory-8252-thread-1) [    ] o.a.s.c.c.ZkConfigManager Copying zk node /configs/_default/lang/stopwords_tr.txt to /configs/AutoscalingHistoryHandlerTest_collection/lang/stopwords_tr.txt
   [junit4]   2> 2879678 INFO  (OverseerThreadFactory-8252-thread-1) [    ] o.a.s.c.c.ZkConfigManager Copying zk node /configs/_default/lang/stopwords_ar.txt to /configs/AutoscalingHistoryHandlerTest_collection/lang/stopwords_ar.txt
   [junit4]   2> 2879678 INFO  (OverseerThreadFactory-8252-thread-1) [    ] o.a.s.c.c.ZkConfigManager Copying zk node /configs/_default/lang/userdict_ja.txt to /configs/AutoscalingHistoryHandlerTest_collection/lang/userdict_ja.txt
   [junit4]   2> 2879679 INFO  (OverseerThreadFactory-8252-thread-1) [    ] o.a.s.c.c.ZkConfigManager Copying zk node /configs/_default/lang/stopwords_eu.txt to /configs/AutoscalingHistoryHandlerTest_collection/lang/stopwords_eu.txt
   [junit4]   2> 2879679 INFO  (OverseerThreadFactory-8252-thread-1) [    ] o.a.s.c.c.ZkConfigManager Copying zk node /configs/_default/lang/stopwords_it.txt to /configs/AutoscalingHistoryHandlerTest_collection/lang/stopwords_it.txt
   [junit4]   2> 2879680 INFO  (OverseerThreadFactory-8252-thread-1) [    ] o.a.s.c.c.ZkConfigManager Copying zk node /configs/_default/lang/stopwords_cz.txt to /configs/AutoscalingHistoryHandlerTest_collection/lang/stopwords_cz.txt
   [junit4]   2> 2879680 INFO  (OverseerThreadFactory-8252-thread-1) [    ] o.a.s.c.c.ZkConfigManager Copying zk node /configs/_default/lang/stoptags_ja.txt to /configs/AutoscalingHistoryHandlerTest_collection/lang/stoptags_ja.txt
   [junit4]   2> 2879680 INFO  (OverseerThreadFactory-8252-thread-1) [    ] o.a.s.c.c.ZkConfigManager Copying zk node /configs/_default/lang/contractions_fr.txt to /configs/AutoscalingHistoryHandlerTest_collection/lang/contractions_fr.txt
   [junit4]   2> 2879681 INFO  (OverseerThreadFactory-8252-thread-1) [    ] o.a.s.c.c.ZkConfigManager Copying zk node /configs/_default/lang/stopwords_de.txt to /configs/AutoscalingHistoryHandlerTest_collection/lang/stopwords_de.txt
   [junit4]   2> 2879681 INFO  (OverseerThreadFactory-8252-thread-1) [    ] o.a.s.c.c.ZkConfigManager Copying zk node /configs/_default/lang/stopwords_fa.txt to /configs/AutoscalingHistoryHandlerTest_collection/lang/stopwords_fa.txt
   [junit4]   2> 2879682 INFO  (OverseerThreadFactory-8252-thread-1) [    ] o.a.s.c.c.ZkConfigManager Copying zk node /configs/_default/lang/contractions_ga.txt to /configs/AutoscalingHistoryHandlerTest_collection/lang/contractions_ga.txt
   [junit4]   2> 2879682 INFO  (OverseerThreadFactory-8252-thread-1) [    ] o.a.s.c.c.ZkConfigManager Copying zk node /configs/_default/lang/stopwords_ca.txt to /configs/AutoscalingHistoryHandlerTest_collection/lang/stopwords_ca.txt
   [junit4]   2> 2879682 INFO  (OverseerThreadFactory-8252-thread-1) [    ] o.a.s.c.c.ZkConfigManager Copying zk node /configs/_default/lang/stopwords_nl.txt to /configs/AutoscalingHistoryHandlerTest_collection/lang/stopwords_nl.txt
   [junit4]   2> 2879683 INFO  (OverseerThreadFactory-8252-thread-1) [    ] o.a.s.c.c.ZkConfigManager Copying zk node /configs/_default/lang/stopwords_bg.txt to /configs/AutoscalingHistoryHandlerTest_collection/lang/stopwords_bg.txt
   [junit4]   2> 2879683 INFO  (OverseerThreadFactory-8252-thread-1) [    ] o.a.s.c.c.ZkConfigManager Copying zk node /configs/_default/lang/stopwords_lv.txt to /configs/AutoscalingHistoryHandlerTest_collection/lang/stopwords_lv.txt
   [junit4]   2> 2879684 INFO  (OverseerThreadFactory-8252-thread-1) [    ] o.a.s.c.c.ZkConfigManager Copying zk node /configs/_default/lang/stopwords_en.txt to /configs/AutoscalingHistoryHandlerTest_collection/lang/stopwords_en.txt
   [junit4]   2> 2879684 INFO  (OverseerThreadFactory-8252-thread-1) [    ] o.a.s.c.c.ZkConfigManager Copying zk node /configs/_default/lang/stopwords_es.txt to /configs/AutoscalingHistoryHandlerTest_collection/lang/stopwords_es.txt
   [junit4]   2> 2879684 INFO  (OverseerThreadFactory-8252-thread-1) [    ] o.a.s.c.c.ZkConfigManager Copying zk node /configs/_default/lang/stopwords_th.txt to /configs/AutoscalingHistoryHandlerTest_collection/lang/stopwords_th.txt
   [junit4]   2> 2879685 INFO  (OverseerThreadFactory-8252-thread-1) [    ] o.a.s.c.c.ZkConfigManager Copying zk node /configs/_default/lang/stopwords_ro.txt to /configs/AutoscalingHistoryHandlerTest_collection/lang/stopwords_ro.txt
   [junit4]   2> 2879685 INFO  (OverseerThreadFactory-8252-thread-1) [    ] o.a.s.c.c.ZkConfigManager Copying zk node /configs/_default/lang/stopwords_fr.txt to /configs/AutoscalingHistoryHandlerTest_collection/lang/stopwords_fr.txt
   [junit4]   2> 2879686 INFO  (OverseerThreadFactory-8252-thread-1) [    ] o.a.s.c.c.ZkConfigManager Copying zk node /configs/_default/lang/stopwords_sv.txt to /configs/AutoscalingHistoryHandlerTest_collection/lang/stopwords_sv.txt
   [junit4]   2> 2879686 INFO  (OverseerThreadFactory-8252-thread-1) [    ] o.a.s.c.c.ZkConfigManager Copying zk node /configs/_default/lang/stopwords_fi.txt to /configs/AutoscalingHistoryHandlerTest_collection/lang/stopwords_fi.txt
   [junit4]   2> 2879687 INFO  (OverseerThreadFactory-8252-thread-1) [    ] o.a.s.c.c.ZkConfigManager Copying zk node /configs/_default/lang/hyphenations_ga.txt to /configs/AutoscalingHistoryHandlerTest_collection/lang/hyphenations_ga.txt
   [junit4]   2> 2879687 INFO  (OverseerThreadFactory-8252-thread-1) [    ] o.a.s.c.c.ZkConfigManager Copying zk node /configs/_default/lang/stopwords_gl.txt to /configs/AutoscalingHistoryHandlerTest_collection/lang/stopwords_gl.txt
   [junit4]   2> 2879688 INFO  (OverseerThreadFactory-8252-thread-1) [    ] o.a.s.c.c.ZkConfigManager Copying zk node /configs/_default/params.json to /configs/AutoscalingHistoryHandlerTest_collection/params.json
   [junit4]   2> 2879689 DEBUG (OverseerStateUpdate-98785515615682569-127.0.0.1:46621_solr-n_0000000000) [    ] o.a.s.c.Overseer processMessage: queueSize: 1, message = {
   [junit4]   2>   "name":"AutoscalingHistoryHandlerTest_collection",
   [junit4]   2>   "fromApi":"true",
   [junit4]   2>   "replicationFactor":"3",
   [junit4]   2>   "numShards":"1",
   [junit4]   2>   "nrtReplicas":"3",
   [junit4]   2>   "stateFormat":"2",
   [junit4]   2>   "operation":"create"} current state version: 0
   [junit4]   2> 2879689 DEBUG (OverseerStateUpdate-98785515615682569-127.0.0.1:46621_solr-n_0000000000) [    ] o.a.s.c.o.ClusterStateMutator building a new cName: AutoscalingHistoryHandlerTest_collection
   [junit4]   2> 2879690 DEBUG (OverseerStateUpdate-98785515615682569-127.0.0.1:46621_solr-n_0000000000) [    ] o.a.s.c.o.ZkStateWriter going to create_collection /collections/AutoscalingHistoryHandlerTest_collection/state.json
   [junit4]   2> 2879793 DEBUG (OverseerStateUpdate-98785515615682569-127.0.0.1:46621_solr-n_0000000000) [    ] o.a.s.c.Overseer processMessage: queueSize: 1, message = {
   [junit4]   2>   "operation":"ADDREPLICA",
   [junit4]   2>   "collection":"AutoscalingHistoryHandlerTest_collection",
   [junit4]   2>   "shard":"shard1",
   [junit4]   2>   "core":"AutoscalingHistoryHandlerTest_collection_shard1_replica_n1",
   [junit4]   2>   "state":"down",
   [junit4]   2>   "base_url":"http://127.0.0.1:46621/solr",
   [junit4]   2>   "type":"NRT"} current state version: 0
   [junit4]   2> 2879793 INFO  (OverseerStateUpdate-98785515615682569-127.0.0.1:46621_solr-n_0000000000) [    ] o.a.s.c.o.SliceMutator createReplica() {
   [junit4]   2>   "operation":"ADDREPLICA",
   [junit4]   2>   "collection":"AutoscalingHistoryHandlerTest_collection",
   [junit4]   2>   "shard":"shard1",
   [junit4]   2>   "core":"AutoscalingHistoryHandlerTest_collection_shard1_replica_n1",
   [junit4]   2>   "state":"down",
   [junit4]   2>   "base_url":"http://127.0.0.1:46621/solr",
   [junit4]   2>   "type":"NRT"} 
   [junit4]   2> 2879794 DEBUG (OverseerStateUpdate-98785515615682569-127.0.0.1:46621_solr-n_0000000000) [    ] o.a.s.c.o.SliceMutator Old Slice: shard1:{
   [junit4]   2>   "range":"80000000-7fffffff",
   [junit4]   2>   "state":"active",
   [junit4]   2>   "replicas":{}}
   [junit4]   2> 2879794 DEBUG (OverseerStateUpdate-98785515615682569-127.0.0.1:46621_solr-n_0000000000) [    ] o.a.s.c.o.SliceMutator New Slice: shard1:{
   [junit4]   2>   "range":"80000000-7fffffff",
   [junit4]   2>   "state":"active",
   [junit4]   2>   "replicas":{"core_node3":{
   [junit4]   2>       "core":"AutoscalingHistoryHandlerTest_collection_shard1_replica_n1",
   [junit4]   2>       "base_url":"http://127.0.0.1:46621/solr",
   [junit4]   2>       "state":"down",
   [junit4]   2>       "node_name":null,
   [junit4]   2>       "type":"NRT"}}}
   [junit4]   2> 2879795 DEBUG (OverseerStateUpdate-98785515615682569-127.0.0.1:46621_solr-n_0000000000) [    ] o.a.s.c.Overseer processMessage: queueSize: 1, message = {
   [junit4]   2>   "operation":"ADDREPLICA",
   [junit4]   2>   "collection":"AutoscalingHistoryHandlerTest_collection",
   [junit4]   2>   "shard":"shard1",
   [junit4]   2>   "core":"AutoscalingHistoryHandlerTest_collection_shard1_replica_n2",
   [junit4]   2>   "state":"down",
   [junit4]   2>   "base_url":"http://127.0.0.1:34327/solr",
   [junit4]   2>   "type":"NRT"} current state version: 0
   [junit4]   2> 2879795 INFO  (OverseerStateUpdate-98785515615682569-127.0.0.1:46621_solr-n_0000000000) [    ] o.a.s.c.o.SliceMutator createReplica() {
   [junit4]   2>   "operation":"ADDREPLICA",
   [junit4]   2>   "collection":"AutoscalingHistoryHandlerTest_collection",
   [junit4]   2>   "shard":"shard1",
   [junit4]   2>   "core":"AutoscalingHistoryHandlerTest_collection_shard1_replica_n2",
   [junit4]   2>   "state":"down",
   [junit4]   2>   "base_url":"http://127.0.0.1:34327/solr",
   [junit4]   2>   "type":"NRT"} 
   [junit4]   2> 2879796 DEBUG (OverseerStateUpdate-98785515615682569-127.0.0.1:46621_solr-n_0000000000) [    ] o.a.s.c.o.SliceMutator Old Slice: shard1:{
   [junit4]   2>   "range":"80000000-7fffffff",
   [junit4]   2>   "state":"active",
   [junit4]   2>   "replicas":{"core_node3":{
   [junit4]   2>       "core":"AutoscalingHistoryHandlerTest_collection_shard1_replica_n1",
   [junit4]   2>       "base_url":"http://127.0.0.1:46621/solr",
   [junit4]   2>       "state":"down",
   [junit4]   2>       "node_name":null,
   [junit4]   2>       "type":"NRT"}}}
   [junit4]   2> 2879796 DEBUG (OverseerStateUpdate-98785515615682569-127.0.0.1:46621_solr-n_0000000000) [    ] o.a.s.c.o.SliceMutator New Slice: shard1:{
   [junit4]   2>   "range":"80000000-7fffffff",
   [junit4]   2>   "state":"active",
   [junit4]   2>   "replicas":{
   [junit4]   2>     "core_node3":{
   [junit4]   2>       "core":"AutoscalingHistoryHandlerTest_collection_shard1_replica_n1",
   [junit4]   2>       "base_url":"http://127.0.0.1:46621/solr",
   [junit4]   2>       "state":"down",
   [junit4]   2>       "node_name":null,
   [junit4]   2>       "type":"NRT"},
   [junit4]   2>     "core_node5":{
   [junit4]   2>       "core":"AutoscalingHistoryHandlerTest_collection_shard1_replica_n2",
   [junit4]   2>       "base_url":"http://127.0.0.1:34327/solr",
   [junit4]   2>       "state":"down",
   [junit4]   2>       "node_name":null,
   [junit4]   2>       "type":"NRT"}}}
   [junit4]   2> 2879797 DEBUG (OverseerStateUpdate-98785515615682569-127.0.0.1:46621_solr-n_0000000000) [    ] o.a.s.c.Overseer processMessage: queueSize: 1, message = {
   [junit4]   2>   "operation":"ADDREPLICA",
   [junit4]   2>   "collection":"AutoscalingHistoryHandlerTest_collection",
   [junit4]   2>   "shard":"shard1",
   [junit4]   2>   "core":"AutoscalingHistoryHandlerTest_collection_shard1_replica_n4",
   [junit4]   2>   "state":"down",
   [junit4]   2>   "base_url":"http://127.0.0.1:34287/solr",
   [junit4]   2>   "type":"NRT"} current state version: 0
   [junit4]   2> 2879797 INFO  (OverseerStateUpdate-98785515615682569-127.0.0.1:46621_solr-n_0000000000) [    ] o.a.s.c.o.SliceMutator createReplica() {
   [junit4]   2>   "operation":"ADDREPLICA",
   [junit4]   2>   "collection":"AutoscalingHistoryHandlerTest_collection",
   [junit4]   2>   "shard":"shard1",
   [junit4]   2>   "core":"AutoscalingHistoryHandlerTest_collection_shard1_replica_n4",
   [junit4]   2>   "state":"down",
   [junit4]   2>   "base_url":"http://127.0.0.1:34287/solr",
   [junit4]   2>   "type":"NRT"} 
   [junit4]   2> 2879797 DEBUG (OverseerStateUpdate-98785515615682569-127.0.0.1:46621_solr-n_0000000000) [    ] o.a.s.c.o.SliceMutator Old Slice: shard1:{
   [junit4]   2>   "range":"80000000-7fffffff",
   [junit4]   2>   "state":"active",
   [junit4]   2>   "replicas":{
   [junit4]   2>     "core_node3":{
   [junit4]   2>       "core":"AutoscalingHistoryHandlerTest_collection_shard1_replica_n1",
   [junit4]   2>       "base_url":"http://127.0.0.1:46621/solr",
   [junit4]   2>       "state":"down",
   [junit4]   2>       "node_name":null,
   [junit4]   2>       "type":"NRT"},
   [junit4]   2>     "core_node5":{
   [junit4]   2>       "core":"AutoscalingHistoryHandlerTest_collection_shard1_replica_n2",
   [junit4]   2>       "base_url":"http://127.0.0.1:34327/solr",
   [junit4]   2>       "state":"down",
   [junit4]   2>       "node_name":null,
   [junit4]   2>       "type":"NRT"}}}
   [junit4]   2> 2879797 DEBUG (OverseerStateUpdate-98785515615682569-127.0.0.1:46621_solr-n_0000000000) [    ] o.a.s.c.o.SliceMutator New Slice: shard1:{
   [junit4]   2>   "range":"80000000-7fffffff",
   [junit4]   2>   "state":"active",
   [junit4]   2>   "replicas":{
   [junit4]   2>     "core_node3":{
   [junit4]   2>       "core":"AutoscalingHistoryHandlerTest_collection_shard1_replica_n1",
   [junit4]   2>       "base_url":"http://127.0.0.1:46621/solr",
   [junit4]   2>       "state":"down",
   [junit4]   2>       "node_name":null,
   [junit4]   2>       "type":"NRT"},
   [junit4]   2>     "core_node5":{
   [junit4]   2>       "core":"AutoscalingHistoryHandlerTest_collection_shard1_replica_n2",
   [junit4]   2>       "base_url":"http://127.0.0.1:34327/solr",
   [junit4]   2>       "state":"down",
   [junit4]   2>       "node_name":null,
   [junit4]   2>       "type":"NRT"},
   [junit4]   2>     "core_node6":{
   [junit4]   2>       "core":"AutoscalingHistoryHandlerTest_collection_shard1_replica_n4",
   [junit4]   2>       "base_url":"http://127.0.0.1:34287/solr",
   [junit4]   2>       "state":"down",
   [junit4]   2>       "node_name":null,
   [junit4]   2>       "type":"NRT"}}}
   [junit4]   2> 2879899 DEBUG (OverseerStateUpdate-98785515615682569-127.0.0.1:46621_solr-n_0000000000) [    ] o.a.s.c.o.ZkStateWriter going to update_collection /collections/AutoscalingHistoryHandlerTest_collection/state.json version: 0
   [junit4]   2> 2879998 INFO  (qtp337664537-21495) [    ] o.a.s.h.a.CoreAdminOperation core create command qt=/admin/cores&coreNodeName=core_node6&collection.configName=AutoscalingHistoryHandlerTest_collection&newCollection=true&name=AutoscalingHistoryHandlerTest_collection_shard1_replica_n4&action=CREATE&numShards=1&collection=AutoscalingHistoryHandlerTest_collection&shard=shard1&wt=javabin&version=2&replicaType=NRT
   [junit4]   2> 2879998 INFO  (qtp337664537-21495) [    ] o.a.s.c.TransientSolrCoreCacheDefault Allocating transient cache for 2147483647 transient cores
   [junit4]   2> 2879999 INFO  (qtp166447852-21505) [    ] o.a.s.h.a.CoreAdminOperation core create command qt=/admin/cores&coreNodeName=core_node5&collection.configName=AutoscalingHistoryHandlerTest_collection&newCollection=true&name=AutoscalingHistoryHandlerTest_collection_shard1_replica_n2&action=CREATE&numShards=1&collection=AutoscalingHistoryHandlerTest_collection&shard=shard1&wt=javabin&version=2&replicaType=NRT
   [junit4]   2> 2879999 INFO  (qtp1319805478-21499) [    ] o.a.s.h.a.CoreAdminOperation core create command qt=/admin/cores&coreNodeName=core_node3&collection.configName=AutoscalingHistoryHandlerTest_collection&newCollection=true&name=AutoscalingHistoryHandlerTest_collection_shard1_replica_n1&action=CREATE&numShards=1&collection=AutoscalingHistoryHandlerTest_collection&shard=shard1&wt=javabin&version=2&replicaType=NRT
   [junit4]   2> 2879999 INFO  (qtp166447852-21505) [    ] o.a.s.c.TransientSolrCoreCacheDefault Allocating transient cache for 2147483647 transient cores
   [junit4]   2> 2879999 INFO  (qtp1319805478-21499) [    ] o.a.s.c.TransientSolrCoreCacheDefault Allocating transient cache for 2147483647 transient cores
   [junit4]   2> 2880001 DEBUG (OverseerStateUpdate-98785515615682569-127.0.0.1:46621_solr-n_0000000000) [    ] o.a.s.c.Overseer processMessage: queueSize: 1, message = {
   [junit4]   2>   "core":"AutoscalingHistoryHandlerTest_collection_shard1_replica_n4",
   [junit4]   2>   "core_node_name":"core_node6",
   [junit4]   2>   "roles":null,
   [junit4]   2>   "base_url":"http://127.0.0.1:34287/solr",
   [junit4]   2>   "node_name":"127.0.0.1:34287_solr",
   [junit4]   2>   "numShards":"1",
   [junit4]   2>   "state":"down",
   [junit4]   2>   "shard":"shard1",
   [junit4]   2>   "collection":"AutoscalingHistoryHandlerTest_collection",
   [junit4]   2>   "type":"NRT",
   [junit4]   2>   "operation":"state"} current state version: 0
   [junit4]   2> 2880001 DEBUG (OverseerStateUpdate-98785515615682569-127.0.0.1:46621_solr-n_0000000000) [    ] o.a.s.c.o.ReplicaMutator Update state numShards=1 message={
   [junit4]   2>   "core":"AutoscalingHistoryHandlerTest_collection_shard1_replica_n4",
   [junit4]   2>   "core_node_name":"core_node6",
   [junit4]   2>   "roles":null,
   [junit4]   2>   "base_url":"http://127.0.0.1:34287/solr",
   [junit4]   2>   "node_name":"127.0.0.1:34287_solr",
   [junit4]   2>   "numShards":"1",
   [junit4]   2>   "state":"down",
   [junit4]   2>   "shard":"shard1",
   [junit4]   2>   "collection":"AutoscalingHistoryHandlerTest_collection",
   [junit4]   2>   "type":"NRT",
   [junit4]   2>   "operation":"state"}
   [junit4]   2> 2880001 DEBUG (OverseerStateUpdate-98785515615682569-127.0.0.1:46621_solr-n_0000000000) [    ] o.a.s.c.o.ReplicaMutator Will update state for replica: core_node6:{"core":"AutoscalingHistoryHandlerTest_collection_shard1_replica_n4","base_url":"http://127.0.0.1:34287/solr","node_name":"127.0.0.1:34287_solr","state":"down","type":"NRT"}
   [junit4]   2> 2880001 DEBUG (OverseerStateUpdate-98785515615682569-127.0.0.1:46621_solr-n_0000000000) [    ] o.a.s.c.o.ReplicaMutator Collection is now: DocCollection(AutoscalingHistoryHandlerTest_collection//collections/AutoscalingHistoryHandlerTest_collection/state.json/1)={
   [junit4]   2>   "pullReplicas":"0",
   [junit4]   2>   "replicationFactor":"3",
   [junit4]   2>   "router":{"name":"compositeId"},
   [junit4]   2>   "maxShardsPerNode":"1",
   [junit4]   2>   "autoAddReplicas":"false",
   [junit4]   2>   "nrtReplicas":"3",
   [junit4]   2>   "tlogReplicas":"0",
   [junit4]   2>   "shards":{"shard1":{
   [junit4]   2>       "range":"80000000-7fffffff",
   [junit4]   2>       "state":"active",
   [junit4]   2>       "replicas":{
   [junit4]   2>         "core_node3":{
   [junit4]   2>           "core":"AutoscalingHistoryHandlerTest_collection_shard1_replica_n1",
   [junit4]   2>           "base_url":"http://127.0.0.1:46621/solr",
   [junit4]   2>           "state":"down",
   [junit4]   2>           "node_name":null,
   [junit4]   2>           "type":"NRT"},
   [junit4]   2>         "core_node5":{
   [junit4]   2>           "core":"AutoscalingHistoryHandlerTest_collection_shard1_replica_n2",
   [junit4]   2>           "base_url":"http://127.0.0.1:34327/solr",
   [junit4]   2>           "state":"down",
   [junit4]   2>           "node_name":null,
   [junit4]   2>           "type":"NRT"},
   [junit4]   2>         "core_node6":{
   [junit4]   2>           "core":"AutoscalingHistoryHandlerTest_collection_shard1_replica_n4",
   [junit4]   2>           "base_url":"http://127.0.0.1:34287/solr",
   [junit4]   2>           "node_name":"127.0.0.1:34287_solr",
   [junit4]   2>           "state":"down",
   [junit4]   2>           "type":"NRT"}}}}}
   [junit4]   2> 2880002 DEBUG (OverseerStateUpdate-98785515615682569-127.0.0.1:46621_solr-n_0000000000) [    ] o.a.s.c.Overseer processMessage: queueSize: 2, message = {
   [junit4]   2>   "core":"AutoscalingHistoryHandlerTest_collection_shard1_replica_n1",
   [junit4]   2>   "core_node_name":"core_node3",
   [junit4]   2>   "roles":null,
   [junit4]   2>   "base_url":"http://127.0.0.1:46621/solr",
   [junit4]   2>   "node_name":"127.0.0.1:46621_solr",
   [junit4]   2>   "numShards":"1",
   [junit4]   2>   "state":"down",
   [junit4]   2>   "shard":"shard1",
   [junit4]   2>   "collection":"AutoscalingHistoryHandlerTest_collection",
   [junit4]   2>   "type":"NRT",
   [junit4]   2>   "operation":"state"} current state version: 0
   [junit4]   2> 2880002 DEBUG (OverseerStateUpdate-98785515615682569-127.0.0.1:46621_solr-n_0000000000) [    ] o.a.s.c.o.ReplicaMutator Update state numShards=1 message={
   [junit4]   2>   "core":"AutoscalingHistoryHandlerTest_collection_shard1_replica_n1",
   [junit4]   2>   "core_node_name":"core_node3",
   [junit4]   2>   "roles":null,
   [junit4]   2>   "base_url":"http://127.0.0.1:46621/solr",
   [junit4]   2>   "node_name":"127.0.0.1:46621_solr",
   [junit4]   2>   "numShards":"1",
   [junit4]   2>   "state":"down",
   [junit4]   2>   "shard":"shard1",
   [junit4]   2>   "collection":"AutoscalingHistoryHandlerTest_collection",
   [junit4]   2>   "type":"NRT",
   [junit4]   2>   "operation":"state"}
   [junit4]   2> 2880002 DEBUG (OverseerStateUpdate-98785515615682569-127.0.0.1:46621_solr-n_0000000000) [    ] o.a.s.c.o.ReplicaMutator Will update state for replica: core_node3:{"core":"AutoscalingHistoryHandlerTest_collection_shard1_replica_n1","base_url":"http://127.0.0.1:46621/solr","node_name":"127.0.0.1:46621_solr","state":"down","type":"NRT"}
   [junit4]   2> 2880002 DEBUG (OverseerStateUpdate-98785515615682569-127.0.0.1:46621_solr-n_0000000000) [    ] o.a.s.c.o.ReplicaMutator Collection is now: DocCollection(AutoscalingHistoryHandlerTest_collection//collections/AutoscalingHistoryHandlerTest_collection/state.json/1)={
   [junit4]   2>   "pullReplicas":"0",
   [junit4]   2>   "replicationFactor":"3",
   [junit4]   2>   "router":{"name":"compositeId"},
   [junit4]   2>   "maxShardsPerNode":"1",
   [junit4]   2>   "autoAddReplicas":"false",
   [junit4]   2>   "nrtReplicas":"3",
   [junit4]   2>   "tlogReplicas":"0",
   [junit4]   2>   "shards":{"shard1":{
   [junit4]   2>       "range":"80000000-7fffffff",
   [junit4]   2>       "state":"active",
   [junit4]   2>       "replicas":{
   [junit4]   2>         "core_node3":{
   [junit4]   2>           "core":"AutoscalingHistoryHandlerTest_collection_shard1_replica_n1",
   [junit4]   2>           "base_url":"http://127.0.0.1:46621/solr",
   [junit4]   2>           "node_name":"127.0.0.1:46621_solr",
   [junit4]   2>           "state":"down",
   [junit4]   2>           "type":"NRT"},
   [junit4]   2>         "core_node5":{
   [junit4]   2>           "core":"AutoscalingHistoryHandlerTest_collection_shard1_replica_n2",
   [junit4]   2>           "base_url":"http://127.0.0.1:34327/solr",
   [junit4]   2>           "state":"down",
   [junit4]   2>           "node_name":null,
   [junit4]   2>           "type":"NRT"},
   [junit4]   2>         "core_node6":{
   [junit4]   2>           "core":"AutoscalingHistoryHandlerTest_collection_shard1_replica_n4",
   [junit4]   2>           "base_url":"http://127.0.0.1:34287/solr",
   [junit4]   2>           "node_name":"127.0.0.1:34287_solr",
   [junit4]   2>           "state":"down",
   [junit4]   2>           "type":"NRT"}}}}}
   [junit4]   2> 2880003 DEBUG (OverseerStateUpdate-98785515615682569-127.0.0.1:46621_solr-n_0000000000) [    ] o.a.s.c.Overseer processMessage: queueSize: 1, message = {
   [junit4]   2>   "core":"AutoscalingHistoryHandlerTest_collection_shard1_replica_n2",
   [junit4]   2>   "core_node_name":"core_node5",
   [junit4]   2>   "roles":null,
   [junit4]   2>   "base_url":"http://127.0.0.1:34327/solr",
   [junit4]   2>   "node_name":"127.0.0.1:34327_solr",
   [junit4]   2>   "numShards":"1",
   [junit4]   2>   "state":"down",
   [junit4]   2>   "shard":"shard1",
   [junit4]   2>   "collection":"AutoscalingHistoryHandlerTest_collection",
   [junit4]   2>   "type":"NRT",
   [junit4]   2>   "operation":"state"} current state version: 0
   [junit4]   2> 2880003 DEBUG (OverseerStateUpdate-98785515615682569-127.0.0.1:46621_solr-n_0000000000) [    ] o.a.s.c.o.ReplicaMutator Update state numShards=1 message={
   [junit4]   2>   "core":"AutoscalingHistoryHandlerTest_collection_shard1_replica_n2",
   [junit4]   2>   "core_node_name":"core_node5",
   [junit4]   2>   "roles":null,
   [junit4]   2>   "base_url":"http://127.0.0.1:34327/solr",
   [junit4]   2>   "node_name":"127.0.0.1:34327_solr",
   [junit4]   2>   "numShards":"1",
   [junit4]   2>   "state":"down",
   [junit4]   2>   "shard":"shard1",
   [junit4]   2>   "collection":"AutoscalingHistoryHandlerTest_collection",
   [junit4]   2>   "type":"NRT",
   [junit4]   2>   "operation":"state"}
   [junit4]   2> 2880003 DEBUG (OverseerStateUpdate-98785515615682569-127.0.0.1:46621_solr-n_0000000000) [    ] o.a.s.c.o.ReplicaMutator Will update state for replica: core_node5:{"core":"AutoscalingHistoryHandlerTest_collection_shard1_replica_n2","base_url":"http://127.0.0.1:34327/solr","node_name":"127.0.0.1:34327_solr","state":"down","type":"NRT"}
   [junit4]   2> 2880004 DEBUG (OverseerStateUpdate-98785515615682569-127.0.0.1:46621_solr-n_0000000000) [    ] o.a.s.c.o.ReplicaMutator Collection is now: DocCollection(AutoscalingHistoryHandlerTest_collection//collections/AutoscalingHistoryHandlerTest_collection/state.json/1)={
   [junit4]   2>   "pullReplicas":"0",
   [junit4]   2>   "replicationFactor":"3",
   [junit4]   2>   "router":{"name":"compositeId"},
   [junit4]   2>   "maxShardsPerNode":"1",
   [junit4]   2>   "autoAddReplicas":"false",
   [junit4]   2>   "nrtReplicas":"3",
   [junit4]   2>   "tlogReplicas":"0",
   [junit4]   2>   "shards":{"shard1":{
   [junit4]   2>       "range":"80000000-7fffffff",
   [junit4]   2>       "state":"active",
   [junit4]   2>       "replicas":{
   [junit4]   2>         "core_node3":{
   [junit4]   2>           "core":"AutoscalingHistoryHandlerTest_collection_shard1_replica_n1",
   [junit4]   2>           "base_url":"http://127.0.0.1:46621/solr",
   [junit4]   2>           "node_name":"127.0.0.1:46621_solr",
   [junit4]   2>           "state":"down",
   [junit4]   2>           "type":"NRT"},
   [junit4]   2>         "core_node5":{
   [junit4]   2>           "core":"AutoscalingHistoryHandlerTest_collection_shard1_replica_n2",
   [junit4]   2>           "base_url":"http://127.0.0.1:34327/solr",
   [junit4]   2>           "node_name":"127.0.0.1:34327_solr",
   [junit4]   2>           "state":"down",
   [junit4]   2>           "type":"NRT"},
   [junit4]   2>         "core_node6":{
   [junit4]   2>           "core":"AutoscalingHistoryHandlerTest_collection_shard1_replica_n4",
   [junit4]   2>           "base_url":"http://127.0.0.1:34287/solr",
   [junit4]   2>           "node_name":"127.0.0.1:34287_solr",
   [junit4]   2>           "state":"down",
   [junit4]   2>           "type":"NRT"}}}}}
   [junit4]   2> 2880105 DEBUG (OverseerStateUpdate-98785515615682569-127.0.0.1:46621_solr-n_0000000000) [    ] o.a.s.c.o.ZkStateWriter going to update_collection /collections/AutoscalingHistoryHandlerTest_collection/state.json version: 1
   [junit4]   2> 2880105 INFO  (zkCallback-3318-thread-2) [    ] o.a.s.c.c.ZkStateReader A cluster state change: [WatchedEvent state:SyncConnected type:NodeDataChanged path:/collections/AutoscalingHistoryHandlerTest_collection/state.json] for collection [AutoscalingHistoryHandlerTest_collection] has occurred - updating... (live nodes size: [3])
   [junit4]   2> 2880105 INFO  (zkCallback-3318-thread-1) [    ] o.a.s.c.c.ZkStateReader A cluster state change: [WatchedEvent state:SyncConnected type:NodeDataChanged path:/collections/AutoscalingHistoryHandlerTest_collection/state.json] for collection [AutoscalingHistoryHandlerTest_collection] has occurred - updating... (live nodes size: [3])
   [junit4]   2> 2880105 INFO  (zkCallback-3316-thread-1) [    ] o.a.s.c.c.ZkStateReader A cluster state change: [WatchedEvent state:SyncConnected type:NodeDataChanged path:/collections/AutoscalingHistoryHandlerTest_collection/state.json] for collection [AutoscalingHistoryHandlerTest_collection] has occurred - updating... (live nodes size: [3])
   [junit4]   2> 2880105 INFO  (zkCallback-3316-thread-2) [    ] o.a.s.c.c.ZkStateReader A cluster state change: [WatchedEvent state:SyncConnected type:NodeDataChanged path:/collections/AutoscalingHistoryHandlerTest_collection/state.json] for collection [AutoscalingHistoryHandlerTest_collection] has occurred - updating... (live nodes size: [3])
   [junit4]   2> 2880105 INFO  (zkCallback-3317-thread-1) [    ] o.a.s.c.c.ZkStateReader A cluster state change: [WatchedEvent state:SyncConnected type:NodeDataChanged path:/collections/AutoscalingHistoryHandlerTest_collection/state.json] for collection [AutoscalingHistoryHandlerTest_collection] has occurred - updating... (live nodes size: [3])
   [junit4]   2> 2880105 INFO  (zkCallback-3317-thread-2) [    ] o.a.s.c.c.ZkStateReader A cluster state change: [WatchedEvent state:SyncConnected type:NodeDataChanged path:/collections/AutoscalingHistoryHandlerTest_collection/state.json] for collection [AutoscalingHistoryHandlerTest_collection] has occurred - updating... (live nodes size: [3])
   [junit4]   2> 2880565 DEBUG (ScheduledTrigger-8250-thread-1) [    ] o.a.s.c.a.NodeLostTrigger Running NodeLostTrigger: .auto_add_replicas with currently live nodes: [127.0.0.1:34287_solr, 127.0.0.1:34327_solr, 127.0.0.1:46621_solr]
   [junit4]   2> 2881004 INFO  (qtp337664537-21495) [    ] o.a.s.c.RequestParams conf resource params.json loaded . version : 0 
   [junit4]   2> 2881004 INFO  (qtp1319805478-21499) [    ] o.a.s.c.RequestParams conf resource params.json loaded . version : 0 
   [junit4]   2> 2881004 INFO  (qtp337664537-21495) [    ] o.a.s.c.RequestParams request params refreshed to version 0
   [junit4]   2> 2881004 INFO  (qtp1319805478-21499) [    ] o.a.s.c.RequestParams request params refreshed to version 0
   [junit4]   2> 2881004 INFO  (qtp166447852-21505) [    ] o.a.s.c.RequestParams conf resource params.json loaded . version : 0 
   [junit4]   2> 2881004 INFO  (qtp166447852-21505) [    ] o.a.s.c.RequestParams request params refreshed to version 0
   [junit4]   2> 2881004 WARN  (qtp337664537-21495) [    ] o.a.s.c.SolrConfig Couldn't add files from /home/jenkins/workspace/Lucene-Solr-master-Linux/solr/build/solr-core/test/J0/temp/solr.handler.admin.AutoscalingHistoryHandlerTest_1657712D937E3CD7-001/tempDir-001/node3/AutoscalingHistoryHandlerTest_collection_shard1_replica_n4/../../../../contrib/extraction/lib filtered by .*\.jar to classpath: /home/jenkins/workspace/Lucene-Solr-master-Linux/solr/build/solr-core/test/J0/temp/solr.handler.admin.AutoscalingHistoryHandlerTest_1657712D937E3CD7-001/tempDir-001/node3/AutoscalingHistoryHandlerTest_collection_shard1_replica_n4/../../../../contrib/extraction/lib
   [junit4]   2> 2881004 WARN  (qtp1319805478-21499) [    ] o.a.s.c.SolrConfig Couldn't add files from /home/jenkins/workspace/Lucene-Solr-master-Linux/solr/build/solr-core/test/J0/temp/solr.handler.admin.AutoscalingHistoryHandlerTest_1657712D937E3CD7-001/tempDir-001/node1/AutoscalingHistoryHandlerTest_collection_shard1_replica_n1/../../../../contrib/extraction/lib filtered by .*\.jar to classpath: /home/jenkins/workspace/Lucene-Solr-master-Linux/solr/build/solr-core/test/J0/temp/solr.handler.admin.AutoscalingHistoryHandlerTest_1657712D937E3CD7-001/tempDir-001/node1/AutoscalingHistoryHandlerTest_collection_shard1_replica_n1/../../../../contrib/extraction/lib
   [junit4]   2> 2881004 WARN  (qtp337664537-21495) [    ] o.a.s.c.SolrConfig Couldn't add files from /home/jenkins/workspace/Lucene-Solr-master-Linux/solr/build/solr-core/test/J0/temp/solr.handler.admin.AutoscalingHistoryHandlerTest_1657712D937E3CD7-001/tempDir-001/node3/AutoscalingHistoryHandlerTest_collection_shard1_replica_n4/../../../../dist filtered by solr-cell-\d.*\.jar to classpath: /home/jenkins/workspace/Lucene-Solr-master-Linux/solr/build/solr-core/test/J0/temp/solr.handler.admin.AutoscalingHistoryHandlerTest_1657712D937E3CD7-001/tempDir-001/node3/AutoscalingHistoryHandlerTest_collection_shard1_replica_n4/../../../../dist
   [junit4]   2> 2881004 WARN  (qtp166447852-21505) [    ] o.a.s.c.SolrConfig Couldn't add files from /home/jenkins/workspace/Lucene-Solr-master-Linux/solr/build/solr-core/test/J0/temp/solr.handler.admin.AutoscalingHistoryHandlerTest_1657712D937E3CD7-001/tempDir-001/node2/AutoscalingHistoryHandlerTest_collection_shard1_replica_n2/../../../../contrib/extraction/lib filtered by .*\.jar to classpath: /home/jenkins/workspace/Lucene-Solr-master-Linux/solr/build/solr-core/test/J0/temp/solr.handler.admin.AutoscalingHistoryHandlerTest_1657712D937E3CD7-001/tempDir-001/node2/AutoscalingHistoryHandlerTest_collection_shard1_replica_n2/../../../../contrib/extraction/lib
   [junit4]   2> 2881004 WARN  (qtp337664537-21495) [    ] o.a.s.c.SolrConfig Couldn't add files from /home/jenkins/workspace/Lucene-Solr-master-Linux/solr/build/solr-core/test/J0/temp/solr.handler.admin.AutoscalingHistoryHandlerTest_1657712D937E3CD7-001/tempDir-001/node3/AutoscalingHistoryHandlerTest_collection_shard1_replica_n4/../../../../contrib/clustering/lib filtered by .*\.jar to classpath: /home/jenkins/workspace/Lucene-Solr-master-Linux/solr/build/solr-core/test/J0/temp/solr.handler.admin.AutoscalingHistoryHandlerTest_1657712D937E3CD7-001/tempDir-001/node3/AutoscalingHistoryHandlerTest_collection_shard1_replica_n4/../../../../contrib/clustering/lib
   [junit4]   2> 2881004 WARN  (qtp166447852-21505) [    ] o.a.s.c.SolrConfig Couldn't add files from /home/jenkins/workspace/Lucene-Solr-master-Linux/solr/build/solr-core/test/J0/temp/solr.handler.admin.AutoscalingHistoryHandlerTest_1657712D937E3CD7-001/tempDir-001/node2/AutoscalingHistoryHandlerTest_collection_shard1_replica_n2/../../../../dist filtered by solr-cell-\d.*\.jar to classpath: /home/jenkins/workspace/Lucene-Solr-master-Linux/solr/build/solr-core/test/J0/temp/solr.handler.admin.AutoscalingHistoryHandlerTest_1657712D937E3CD7-001/tempDir-001/node2/AutoscalingHistoryHandlerTest_collection_shard1_replica_n2/../../../../dist
   [junit4]   2> 2881004 WARN  (qtp337664537-21495) [    ] o.a.s.c.SolrConfig Couldn't add files from /home/jenkins/workspace/Lucene-Solr-master-Linux/solr/build/solr-core/test/J0/temp/solr.handler.admin.AutoscalingHistoryHandlerTest_1657712D937E3CD7-001/tempDir-001/node3/AutoscalingHistoryHandlerTest_collection_shard1_replica_n4/../../../../dist filtered by solr-clustering-\d.*\.jar to classpath: /home/jenkins/workspace/Lucene-Solr-master-Linux/solr/build/solr-core/test/J0/temp/solr.handler.admin.AutoscalingHistoryHandlerTest_1657712D937E3CD7-001/tempDir-001/node3/AutoscalingHistoryHandlerTest_collection_shard1_replica_n4/../../../../dist
   [junit4]   2> 2881005 WARN  (qtp166447852-21505) [    ] o.a.s.c.SolrConfig Couldn't add files from /home/jenkins/workspace/Lucene-Solr-master-Linux/solr/build/solr-core/test/J0/temp/solr.handler.admin.AutoscalingHistoryHandlerTest_1657712D937E3CD7-001/tempDir-001/node2/AutoscalingHistoryHandlerTest_collection_shard1_replica_n2/../../../../contrib/clustering/lib filtered by .*\.jar to classpath: /home/jenkins/workspace/Lucene-Solr-master-Linux/solr/build/solr-core/test/J0/temp/solr.handler.admin.AutoscalingHistoryHandlerTest_1657712D937E3CD7-001/tempDir-001/node2/AutoscalingHistoryHandlerTest_collection_shard1_replica_n2/../../../../contrib/clustering/lib
   [junit4]   2> 2881005 WARN  (qtp337664537-21495) [    ] o.a.s.c.SolrConfig Couldn't add files from /home/jenkins/workspace/Lucene-Solr-master-Linux/solr/build/solr-core/test/J0/temp/solr.handler.admin.AutoscalingHistoryHandlerTest_1657712D937E3CD7-001/tempDir-001/node3/AutoscalingHistoryHandlerTest_collection_shard1_replica_n4/../../../../contrib/langid/lib filtered by .*\.jar to classpath: /home/jenkins/workspace/Lucene-Solr-master-Linux/solr/build/solr-core/test/J0/temp/solr.handler.admin.AutoscalingHistoryHandlerTest_1657712D937E3CD7-001/tempDir-001/node3/AutoscalingHistoryHandlerTest_collection_shard1_replica_n4/../../../../contrib/langid/lib
   [junit4]   2> 2881005 WARN  (qtp166447852-21505) [    ] o.a.s.c.SolrConfig Couldn't add files from /home/jenkins/workspace/Lucene-Solr-master-Linux/solr/build/solr-core/test/J0/temp/solr.handler.admin.AutoscalingHistoryHandlerTest_1657712D937E3CD7-001/tempDir-001/node2/AutoscalingHistoryHandlerTest_collection_shard1_replica_n2/../../../../dist filtered by solr-clustering-\d.*\.jar to classpath: /home/jenkins/workspace/Lucene-Solr-master-Linux/solr/build/solr-core/test/J0/temp/solr.handler.admin.AutoscalingHistoryHandlerTest_1657712D937E3CD7-001/tempDir-001/node2/AutoscalingHistoryHandlerTest_collection_shard1_replica_n2/../../../../dist
   [junit4]   2> 2881005 WARN  (qtp337664537-21495) [    ] o.a.s.c.SolrConfig Couldn't add files from /home/jenkins/workspace/Lucene-Solr-master-Linux/solr/build/solr-core/test/J0/temp/solr.handler.admin.AutoscalingHistoryHandlerTest_1657712D937E3CD7-001/tempDir-001/node3/AutoscalingHistoryHandlerTest_collection_shard1_replica_n4/../../../../dist filtered by solr-langid-\d.*\.jar to classpath: /home/jenkins/workspace/Lucene-Solr-master-Linux/solr/build/solr-core/test/J0/temp/solr.handler.admin.AutoscalingHistoryHandlerTest_1657712D937E3CD7-001/tempDir-001/node3/AutoscalingHistoryHandlerTest_collection_shard1_replica_n4/../../../../dist
   [junit4]   2> 2881005 WARN  (qtp166447852-21505) [    ] o.a.s.c.SolrConfig Couldn't add files from /home/jenkins/workspace/Lucene-Solr-master-Linux/solr/build/solr-core/test/J0/temp/solr.handler.admin.AutoscalingHistoryHandlerTest_1657712D937E3CD7-001/tempDir-001/node2/AutoscalingHistoryHandlerTest_collection_shard1_replica_n2/../../../../contrib/langid/lib filtered by .*\.jar to classpath: /home/jenkins/workspace/Lucene-Solr-master-Linux/solr/build/solr-core/test/J0/temp/solr.handler.admin.AutoscalingHistoryHandlerTest_1657712D937E3CD7-001/tempDir-001/node2/AutoscalingHistoryHandlerTest_collection_shard1_replica_n2/../../../../contrib/langid/lib
   [junit4]   2> 2881005 WARN  (qtp337664537-21495) [    ] o.a.s.c.SolrConfig Couldn't add files from /home/jenkins/workspace/Lucene-Solr-master-Linux/solr/build/solr-core/test/J0/temp/solr.handler.admin.AutoscalingHistoryHandlerTest_1657712D937E3CD7-001/tempDir-001/node3/AutoscalingHistoryHandlerTest_collection_shard1_replica_n4/../../../../contrib/velocity/lib filtered by .*\.jar to classpath: /home/jenkins/workspace/Lucene-Solr-master-Linux/solr/build/solr-core/test/J0/temp/solr.handler.admin.AutoscalingHistoryHandlerTest_1657712D937E3CD7-001/tempDir-001/node3/AutoscalingHistoryHandlerTest_collection_shard1_replica_n4/../../../../contrib/velocity/lib
   [junit4]   2> 2881005 WARN  (qtp166447852-21505) [    ] o.a.s.c.SolrConfig Couldn't add files from /home/jenkins/workspace/Lucene-Solr-master-Linux/solr/build/solr-core/test/J0/temp/solr.handler.admin.AutoscalingHistoryHandlerTest_1657712D937E3CD7-001/tempDir-001/node2/AutoscalingHistoryHandlerTest_collection_shard1_replica_n2/../../../../dist filtered by solr-langid-\d.*\.jar to classpath: /home/jenkins/workspace/Lucene-Solr-master-Linux/solr/build/solr-core/test/J0/temp/solr.handler.admin.AutoscalingHistoryHandlerTest_1657712D937E3CD7-001/tempDir-001/node2/AutoscalingHistoryHandlerTest_collection_shard1_replica_n2/../../../../dist
   [junit4]   2> 2881005 WARN  (qtp337664537-21495) [    ] o.a.s.c.SolrConfig Couldn't add files from /home/jenkins/workspace/Lucene-Solr-master-Linux/solr/build/solr-core/test/J0/temp/solr.handler.admin.AutoscalingHistoryHandlerTest_1657712D937E3CD7-001/tempDir-001/node3/AutoscalingHistoryHandlerTest_collection_shard1_replica_n4/../../../../dist filtered by solr-velocity-\d.*\.jar to classpath: /home/jenkins/workspace/Lucene-Solr-master-Linux/solr/build/solr-core/test/J0/temp/solr.handler.admin.AutoscalingHistoryHandlerTest_1657712D937E3CD7-001/tempDir-001/node3/AutoscalingHistoryHandlerTest_collection_shard1_replica_n4/../../../../dist
   [junit4]   2> 2881005 WARN  (qtp166447852-21505) [    ] o.a.s.c.SolrConfig Couldn't add files from /home/jenkins/workspace/Lucene-Solr-master-Linux/solr/build/solr-core/test/J0/temp/solr.handler.admin.AutoscalingHistoryHandlerTest_1657712D937E3CD7-001/tempDir-001/node2/AutoscalingHistoryHandlerTest_collection_shard1_replica_n2/../../../../contrib/velocity/lib filtered by .*\.jar to classpath: /home/jenkins/workspace/Lucene-Solr-master-Linux/solr/build/solr-core/test/J0/temp/solr.handler.admin.AutoscalingHistoryHandlerTest_1657712D937E3CD7-001/tempDir-001/node2/AutoscalingHistoryHandlerTest_collection_shard1_replica_n2/../../../../contrib/velocity/lib
   [junit4]   2> 2881004 WARN  (qtp1319805478-21499) [    ] o.a.s.c.SolrConfig Couldn't add files from /home/jenkins/workspace/Lucene-Solr-master-Linux/solr/build/solr-core/test/J0/temp/solr.handler.admin.AutoscalingHistoryHandlerTest_1657712D937E3CD7-001/tempDir-001/node1/AutoscalingHistoryHandlerTest_collection_shard1_replica_n1/../../../../dist filtered by solr-cell-\d.*\.jar to classpath: /home/jenkins/workspace/Lucene-Solr-master-Linux/solr/build/solr-core/test/J0/temp/solr.handler.admin.AutoscalingHistoryHandlerTest_1657712D937E3CD7-001/tempDir-001/node1/AutoscalingHistoryHandlerTest_collection_shard1_replica_n1/../../../../dist
   [junit4]   2> 2881005 WARN  (qtp166447852-21505) [    ] o.a.s.c.SolrConfig Couldn't add files from /home/jenkins/workspace/Lucene-Solr-master-Linux/solr/build/solr-core/test/J0/temp/solr.handler.admin.AutoscalingHistoryHandlerTest_1657712D937E3CD7-001/tempDir-001/node2/AutoscalingHistoryHandlerTest_collection_shard1_replica_n2/../../../../dist filtered by solr-velocity-\d.*\.jar to classpath: /home/jenkins/workspace/Lucene-Solr-master-Linux/solr/build/solr-core/test/J0/temp/solr.handler.admin.AutoscalingHistoryHandlerTest_1657712D937E3CD7-001/tempDir-001/node2/AutoscalingHistoryHandlerTest_collection_shard1_replica_n2/../../../../dist
   [junit4]   2> 2881005 WARN  (qtp1319805478-21499) [    ] o.a.s.c.SolrConfig Couldn't add files from /home/jenkins/workspace/Lucene-Solr-master-Linux/solr/build/solr-core/test/J0/temp/solr.handler.admin.AutoscalingHistoryHandlerTest_1657712D937E3CD7-001/tempDir-001/node1/AutoscalingHistoryHandlerTest_collection_shard1_replica_n1/../../../../contrib/clustering/lib filtered by .*\.jar to classpath: /home/jenkins/workspace/Lucene-Solr-master-Linux/solr/build/solr-core/test/J0/temp/solr.handler.admin.AutoscalingHistoryHandlerTest_1657712D937E3CD7-001/tempDir-001/node1/AutoscalingHistoryHandlerTest_collection_shard1_replica_n1/../../../../contrib/clustering/lib
   [junit4]   2> 2881005 WARN  (qtp1319805478-21499) [    ] o.a.s.c.SolrConfig Couldn't add files from /home/jenkins/workspace/Lucene-Solr-master-Linux/solr/build/solr-core/test/J0/temp/solr.handler.admin.AutoscalingHistoryHandlerTest_1657712D937E3CD7-001/tempDir-001/node1/AutoscalingHistoryHandlerTest_collection_shard1_replica_n1/../../../../dist filtered by solr-clustering-\d.*\.jar to classpath: /home/jenkins/workspace/Lucene-Solr-master-Linux/solr/build/solr-core/test/J0/temp/solr.handler.admin.AutoscalingHistoryHandlerTest_1657712D937E3CD7-001/tempDir-001/node1/AutoscalingHistoryHandlerTest_collection_shard1_replica_n1/../../../../dist
   [junit4]   2> 2881005 WARN  (qtp1319805478-21499) [    ] o.a.s.c.SolrConfig Couldn't add files from /home/jenkins/workspace/Lucene-Solr-master-Linux/solr/build/solr-core/test/J0/temp/solr.handler.admin.AutoscalingHistoryHandlerTest_1657712D937E3CD7-001/tempDir-001/node1/AutoscalingHistoryHandlerTest_collection_shard1_replica_n1/../../../../contrib/langid/lib filtered by .*\.jar to classpath: /home/jenkins/workspace/Lucene-Solr-master-Linux/solr/build/solr-core/test/J0/temp/solr.handler.admin.AutoscalingHistoryHandlerTest_1657712D937E3CD7-001/tempDir-001/node1/AutoscalingHistoryHandlerTest_collection_shard1_replica_n1/../../../../contrib/langid/lib
   [junit4]   2> 2881005 WARN  (qtp1319805478-21499) [    ] o.a.s.c.SolrConfig Couldn't add files from /home/jenkins/workspace/Lucene-Solr-master-Linux/solr/build/solr-core/test/J0/temp/solr.handler.admin.AutoscalingHistoryHandlerTest_1657712D937E3CD7-001/tempDir-001/node1/AutoscalingHistoryHandlerTest_collection_shard1_replica_n1/../../../../dist filtered by solr-langid-\d.*\.jar to classpath: /home/jenkins/workspace/Lucene-Solr-master-Linux/solr/build/solr-core/test/J0/temp/solr.handler.admin.AutoscalingHistoryHandlerTest_1657712D937E3CD7-001/tempDir-001/node1/AutoscalingHistoryHandlerTest_collection_shard1_replica_n1/../../../../dist
   [junit4]   2> 2881006 WARN  (qtp1319805478-21499) [    ] o.a.s.c.SolrConfig Couldn't add files from /home/jenkins/workspace/Lucene-Solr-master-Linux/solr/build/solr-core/test/J0/temp/solr.handler.admin.AutoscalingHistoryHandlerTest_1657712D937E3CD7-001/tempDir-001/node1/AutoscalingHistoryHandlerTest_collection_shard1_replica_n1/../../../../contrib/velocity/lib filtered by .*\.jar to classpath: /home/jenkins/workspace/Lucene-Solr-master-Linux/solr/build/solr-core/test/J0/temp/solr.handler.admin.AutoscalingHistoryHandlerTest_1657712D937E3CD7-001/tempDir-001/node1/AutoscalingHistoryHandlerTest_collection_shard1_replica_n1/../../../../contrib/velocity/lib
   [junit4]   2> 2881006 WARN  (qtp1319805478-21499) [    ] o.a.s.c.SolrConfig Couldn't add files from /home/jenkins/workspace/Lucene-Solr-master-Linux/solr/build/solr-core/test/J0/temp/solr.handler.admin.AutoscalingHistoryHandlerTest_1657712D937E3CD7-001/tempDir-001/node1/AutoscalingHistoryHandlerTest_collection_shard1_replica_n1/../../../../dist filtered by solr-velocity-\d.*\.jar to classpath: /home/jenkins/workspace/Lucene-Solr-master-Linux/solr/build/solr-core/test/J0/temp/solr.handler.admin.AutoscalingHistoryHandlerTest_1657712D937E3CD7-001/tempDir-001/node1/AutoscalingHistoryHandlerTest_collection_shard1_replica_n1/../../../../dist
   [junit4]   2> 2881010 INFO  (qtp166447852-21505) [    ] o.a.s.c.SolrConfig Using Lucene MatchVersion: 8.0.0
   [junit4]   2> 2881010 INFO  (qtp1319805478-21499) [    ] o.a.s.c.SolrConfig Using Lucene MatchVersion: 8.0.0
   [junit4]   2> 2881010 INFO  (qtp337664537-21495) [    ] o.a.s.c.SolrConfig Using Lucene MatchVersion: 8.0.0
   [junit4]   2> 2881035 INFO  (qtp1319805478-21499) [    ] o.a.s.s.IndexSchema [AutoscalingHistoryHandlerTest_collection_shard1_replica_n1] Schema name=default-config
   [junit4]   2> 2881035 INFO  (qtp166447852-21505) [    ] o.a.s.s.IndexSchema [AutoscalingHistoryHandlerTest_collection_shard1_replica_n2] Schema name=default-config
   [junit4]   2> 2881043 INFO  (qtp337664537-21495) [    ] o.a.s.s.IndexSchema [AutoscalingHistoryHandlerTest_collection_shard1_replica_n4] Schema name=default-config
   [junit4]   2> 2881177 INFO  (qtp1319805478-21499) [    ] o.a.s.s.IndexSchema Loaded schema default-config/1.6 with uniqueid field id
   [junit4]   2> 2881177 INFO  (qtp166447852-21505) [    ] o.a.s.s.IndexSchema Loaded schema default-config/1.6 with uniqueid field id
   [junit4]   2> 2881187 INFO  (qtp1319805478-21499) [    ] o.a.s.c.CoreContainer Creating SolrCore 'AutoscalingHistoryHandlerTest_collection_shard1_replica_n1' using configuration from collection AutoscalingHistoryHandlerTest_collection, trusted=true
   [junit4]   2> 2881188 INFO  (qtp1319805478-21499) [    ] o.a.s.m.r.SolrJmxReporter JMX monitoring for 'solr_46621.solr.core.AutoscalingHistoryHandlerTest_collection.shard1.replica_n1' (registry 'solr.core.AutoscalingHistoryHandlerTest_collection.shard1.replica_n1') enabled at server: com.sun.jmx.mbeanserver.JmxMBeanServer@716502b2
   [junit4]   2> 2881188 INFO  (qtp1319805478-21499) [    ] o.a.s.c.SolrCore solr.RecoveryStrategy.Builder
   [junit4]   2> 2881188 INFO  (qtp1319805478-21499) [    ] o.a.s.c.SolrCore [[AutoscalingHistoryHandlerTest_collection_shard1_replica_n1] ] Opening new SolrCore at [/home/jenkins/workspace/Lucene-Solr-master-Linux/solr/build/solr-core/test/J0/temp/solr.handler.admin.AutoscalingHistoryHandlerTest_1657712D937E3CD7-001/tempDir-001/node1/AutoscalingHistoryHandlerTest_collection_shard1_replica_n1], dataDir=[/home/jenkins/workspace/Lucene-Solr-master-Linux/solr/build/solr-core/test/J0/temp/solr.handler.admin.AutoscalingHistoryHandlerTest_1657712D937E3CD7-001/tempDir-001/node1/./AutoscalingHistoryHandlerTest_collection_shard1_replica_n1/data/]
   [junit4]   2> 2881190 INFO  (qtp1319805478-21499) [    ] o.a.s.r.XSLTResponseWriter xsltCacheLifetimeSeconds=5
   [junit4]   2> 2881191 INFO  (qtp166447852-21505) [    ] o.a.s.c.CoreContainer Creating SolrCore 'AutoscalingHistoryHandlerTest_collection_shard1_replica_n2' using configuration from collection AutoscalingHistoryHandlerTest_collection, trusted=true
   [junit4]   2> 2881191 INFO  (qtp166447852-21505) [    ] o.a.s.m.r.SolrJmxReporter JMX monitoring for 'solr_34327.solr.core.AutoscalingHistoryHandlerTest_collection.shard1.replica_n2' (registry 'solr.core.AutoscalingHistoryHandlerTest_collection.shard1.replica_n2') enabled at server: com.sun.jmx.mbeanserver.JmxMBeanServer@716502b2
   [junit4]   2> 2881192 INFO  (qtp166447852-21505) [    ] o.a.s.c.SolrCore solr.RecoveryStrategy.Builder
   [junit4]   2> 2881192 INFO  (qtp166447852-21505) [    ] o.a.s.c.SolrCore [[AutoscalingHistoryHandlerTest_collection_shard1_replica_n2] ] Opening new SolrCore at [/home/jenkins/workspace/Lucene-Solr-master-Linux/solr/build/solr-core/test/J0/temp/solr.handler.admin.AutoscalingHistoryHandlerTest_1657712D937E3CD7-001/tempDir-001/node2/AutoscalingHistoryHandlerTest_collection_shard1_replica_n2], dataDir=[/home/jenkins/workspace/Lucene-Solr-master-Linux/solr/build/solr-core/test/J0/temp/solr.handler.admin.AutoscalingHistoryHandlerTest_1657712D937E3CD7-001/tempDir-001/node2/./AutoscalingHistoryHandlerTest_collection_shard1_replica_n2/data/]
   [junit4]   2> 2881194 INFO  (qtp166447852-21505) [    ] o.a.s.r.XSLTResponseWriter xsltCacheLifetimeSeconds=5
   [junit4]   2> 2881208 INFO  (qtp337664537-21495) [    ] o.a.s.s.IndexSchema Loaded schema default-config/1.6 with uniqueid field id
   [junit4]   2> 2881220 INFO  (qtp337664537-21495) [    ] o.a.s.c.CoreContainer Creating SolrCore 'AutoscalingHistoryHandlerTest_collection_shard1_replica_n4' using configuration from collection AutoscalingHistoryHandlerTest_collection, trusted=true
   [junit4]   2> 2881220 INFO  (qtp337664537-21495) [    ] o.a.s.m.r.SolrJmxReporter JMX monitoring for 'solr_34287.solr.core.AutoscalingHistoryHandlerTest_collection.shard1.replica_n4' (registry 'solr.core.AutoscalingHistoryHandlerTest_collection.shard1.replica_n4') enabled at server: com.sun.jmx.mbeanserver.JmxMBeanServer@716502b2
   [junit4]   2> 2881220 INFO  (qtp337664537-21495) [    ] o.a.s.c.SolrCore solr.RecoveryStrategy.Builder
   [junit4]   2> 2881220 INFO  (qtp337664537-21495) [    ] o.a.s.c.SolrCore [[AutoscalingHistoryHandlerTest_collection_shard1_replica_n4] ] Opening new SolrCore at [/home/jenkins/workspace/Lucene-Solr-master-Linux/solr/build/solr-core/test/J0/temp/solr.handler.admin.AutoscalingHistoryHandlerTest_1657712D937E3CD7-001/tempDir-001/node3/AutoscalingHistoryHandlerTest_collection_shard1_replica_n4], dataDir=[/home/jenkins/workspace/Lucene-Solr-master-Linux/solr/build/solr-core/test/J0/temp/solr.handler.admin.AutoscalingHistoryHandlerTest_1657712D937E3CD7-001/tempDir-001/node3/./AutoscalingHistoryHandlerTest_collection_shard1_replica_n4/data/]
   [junit4]   2> 2881223 INFO  (qtp337664537-21495) [    ] o.a.s.r.XSLTResponseWriter xsltCacheLifetimeSeconds=5
   [junit4]   2> 2881224 INFO  (qtp1319805478-21499) [    ] o.a.s.u.UpdateHandler Using UpdateLog implementation: org.apache.solr.update.UpdateLog
   [junit4]   2> 2881224 INFO  (qtp1319805478-21499) [    ] o.a.s.u.UpdateLog Initializing UpdateLog: dataDir= defaultSyncLevel=FLUSH numRecordsToKeep=100 maxNumLogsToKeep=10 numVersionBuckets=65536
   [junit4]   2> 2881225 INFO  (qtp1319805478-21499) [    ] o.a.s.u.CommitTracker Hard AutoCommit: if uncommited for 15000ms; 
   [junit4]   2> 2881225 INFO  (qtp1319805478-21499) [    ] o.a.s.u.CommitTracker Soft AutoCommit: disabled
   [junit4]   2> 2881226 INFO  (qtp1319805478-21499) [    ] o.a.s.s.SolrIndexSearcher Opening [Searcher@39c687f6[AutoscalingHistoryHandlerTest_collection_shard1_replica_n1] main]
   [junit4]   2> 2881226 INFO  (qtp1319805478-21499) [    ] o.a.s.r.ManagedResourceStorage Configured ZooKeeperStorageIO with znodeBase: /configs/AutoscalingHistoryHandlerTest_collection
   [junit4]   2> 2881226 INFO  (qtp1319805478-21499) [    ] o.a.s.r.ManagedResourceStorage Loaded null at path _rest_managed.json using ZooKeeperStorageIO:path=/configs/AutoscalingHistoryHandlerTest_collection
   [junit4]   2> 2881226 INFO  (qtp1319805478-21499) [    ] o.a.s.s.ZkIndexSchemaReader Creating ZooKeeper watch for the managed schema at /configs/AutoscalingHistoryHandlerTest_collection/managed-schema
   [junit4]   2> 2881226 INFO  (qtp1319805478-21499) [    ] o.a.s.s.ZkIndexSchemaReader Current schema version 0 is already the latest
   [junit4]   2> 2881227 INFO  (qtp1319805478-21499) [    ] o.a.s.h.c.SpellCheckComponent Initializing spell checkers
   [junit4]   2> 2881227 INFO  (qtp1319805478-21499) [    ] o.a.s.s.DirectSolrSpellChecker init: {name=default,field=_text_,classname=solr.DirectSolrSpellChecker,distanceMeasure=internal,accuracy=0.5,maxEdits=2,minPrefix=1,maxInspections=5,minQueryLength=4,maxQueryFrequency=0.01}
   [junit4]   2> 2881228 INFO  (qtp1319805478-21499) [    ] o.a.s.h.ReplicationHandler Commits will be reserved for 10000ms.
   [junit4]   2> 2881228 INFO  (searcherExecutor-8259-thread-1) [    ] o.a.s.c.QuerySenderListener QuerySenderListener sending requests to Searcher@39c687f6[AutoscalingHistoryHandlerTest_collection_shard1_replica_n1] main{ExitableDirectoryReader(UninvertingDirectoryReader())}
   [junit4]   2> 2881228 INFO  (qtp1319805478-21499) [    ] o.a.s.u.UpdateLog Could not find max version in index or recent updates, using new clock 1580568251771912192
   [junit4]   2> 2881228 INFO  (searcherExecutor-8259-thread-1) [    ] o.a.s.c.QuerySenderListener QuerySenderListener done.
   [junit4]   2> 2881228 INFO  (searcherExecutor-8259-thread-1) [    ] o.a.s.h.c.SpellCheckComponent Loading spell index for spellchecker: default
   [junit4]   2> 2881229 INFO  (searcherExecutor-8259-thread-1) [    ] o.a.s.c.SolrCore [AutoscalingHistoryHandlerTest_collection_shard1_replica_n1] Registered new searcher Searcher@39c687f6[AutoscalingHistoryHandlerTest_collection_shard1_replica_n1] main{ExitableDirectoryReader(UninvertingDirectoryReader())}
   [junit4]   2> 2881231 INFO  (qtp1319805478-21499) [    ] o.a.s.c.ShardLeaderElectionContext Waiting until we see more replicas up for shard shard1: total=3 found=1 timeoutin=9999ms
   [junit4]   2> 2881231 DEBUG (OverseerStateUpdate-98785515615682569-127.0.0.1:46621_solr-n_0000000000) [    ] o.a.s.c.Overseer processMessage: queueSize: 1, message = {
   [junit4]   2>   "operation":"leader",
   [junit4]   2>   "shard":"shard1",
   [junit4]   2>   "collection":"AutoscalingHistoryHandlerTest_collection"} current state version: 0
   [junit4]   2> 2881231 INFO  (qtp166447852-21505) [    ] o.a.s.u.UpdateHandler Using UpdateLog implementation: org.apache.solr.update.UpdateLog
   [junit4]   2> 2881231 INFO  (qtp166447852-21505) [    ] o.a.s.u.UpdateLog Initializing UpdateLog: dataDir= defaultSyncLevel=FLUSH numRecordsToKeep=100 maxNumLogsToKeep=10 numVersionBuckets=65536
   [junit4]   2> 2881232 INFO  (qtp166447852-21505) [    ] o.a.s.u.CommitTracker Hard AutoCommit: if uncommited for 15000ms; 
   [junit4]   2> 2881232 INFO  (qtp166447852-21505) [    ] o.a.s.u.CommitTracker Soft AutoCommit: disabled
   [junit4]   2> 2881232 INFO  (qtp166447852-21505) [    ] o.a.s.s.SolrIndexSearcher Opening [Searcher@4b08f313[AutoscalingHistoryHandlerTest_collection_shard1_replica_n2] main]
   [junit4]   2> 2881233 INFO  (qtp166447852-21505) [    ] o.a.s.r.ManagedResourceStorage Configured ZooKeeperStorageIO with znodeBase: /configs/AutoscalingHistoryHandlerTest_collection
   [junit4]   2> 2881233 INFO  (qtp166447852-21505) [    ] o.a.s.r.ManagedResourceStorage Loaded null at path _rest_managed.json using ZooKeeperStorageIO:path=/configs/AutoscalingHistoryHandlerTest_collection
   [junit4]   2> 2881233 INFO  (qtp166447852-21505) [    ] o.a.s.s.ZkIndexSchemaReader Creating ZooKeeper watch for the managed schema at /configs/AutoscalingHistoryHandlerTest_collection/managed-schema
   [junit4]   2> 2881233 INFO  (qtp166447852-21505) [    ] o.a.s.s.ZkIndexSchemaReader Current schema version 0 is already the latest
   [junit4]   2> 2881234 INFO  (qtp166447852-21505) [    ] o.a.s.h.c.SpellCheckComponent Initializing spell checkers
   [junit4]   2> 2881234 INFO  (qtp166447852-21505) [    ] o.a.s.s.DirectSolrSpellChecker init: {name=default,field=_text_,classname=solr.DirectSolrSpellChecker,distanceMeasure=internal,accuracy=0.5,maxEdits=2,minPrefix=1,maxInspections=5,minQueryLength=4,maxQueryFrequency=0.01}
   [junit4]   2> 2881235 INFO  (qtp166447852-21505) [    ] o.a.s.h.ReplicationHandler Commits will be reserved for 10000ms.
   [junit4]   2> 2881235 INFO  (searcherExecutor-8260-thread-1) [    ] o.a.s.c.QuerySenderListener QuerySenderListener sending requests to Searcher@4b08f313[AutoscalingHistoryHandlerTest_collection_shard1_replica_n2] main{ExitableDirectoryReader(UninvertingDirectoryReader())}
   [junit4]   2> 2881235 INFO  (qtp166447852-21505) [    ] o.a.s.u.UpdateLog Could not find max version in index or recent updates, using new clock 1580568251779252224
   [junit4]   2> 2881235 INFO  (searcherExecutor-8260-thread-1) [    ] o.a.s.c.QuerySenderListener QuerySenderListener done.
   [junit4]   2> 2881235 INFO  (searcherExecutor-8260-thread-1) [    ] o.a.s.h.c.SpellCheckComponent Loading spell index for spellchecker: default
   [junit4]   2> 2881236 INFO  (searcherExecutor-8260-thread-1) [    ] o.a.s.c.SolrCore [AutoscalingHistoryHandlerTest_collection_shard1_replica_n2] Registered new searcher Searcher@4b08f313[AutoscalingHistoryHandlerTest_collection_shard1_replica_n2] main{ExitableDirectoryReader(UninvertingDirectoryReader())}
   [junit4]   2> 2881250 INFO  (qtp337664537-21495) [    ] o.a.s.u.UpdateHandler Using UpdateLog implementation: org.apache.solr.update.UpdateLog
   [junit4]   2> 2881250 INFO  (qtp337664537-21495) [    ] o.a.s.u.UpdateLog Initializing UpdateLog: dataDir= defaultSyncLevel=FLUSH numRecordsToKeep=100 maxNumLogsToKeep=10 numVersionBuckets=65536
   [junit4]   2> 2881251 INFO  (qtp337664537-21495) [    ] o.a.s.u.CommitTracker Hard AutoCommit: if uncommited for 15000ms; 
   [junit4]   2> 2881251 INFO  (qtp337664537-21495) [    ] o.a.s.u.CommitTracker Soft AutoCommit: disabled
   [junit4]   2> 2881252 INFO  (qtp337664537-21495) [    ] o.a.s.s.SolrIndexSearcher Opening [Searcher@5661fd22[AutoscalingHistoryHandlerTest_collection_shard1_replica_n4] main]
   [junit4]   2> 2881252 INFO  (qtp337664537-21495) [    ] o.a.s.r.ManagedResourceStorage Configured ZooKeeperStorageIO with znodeBase: /configs/AutoscalingHistoryHandlerTest_collection
   [junit4]   2> 2881252 INFO  (qtp337664537-21495) [    ] o.a.s.r.ManagedResourceStorage Loaded null at path _rest_managed.json using ZooKeeperStorageIO:path=/configs/AutoscalingHistoryHandlerTest_collection
   [junit4]   2> 2881252 INFO  (qtp337664537-21495) [    ] o.a.s.s.ZkIndexSchemaReader Creating ZooKeeper watch for the managed schema at /configs/AutoscalingHistoryHandlerTest_collection/managed-schema
   [junit4]   2> 2881253 INFO  (qtp337664537-21495) [    ] o.a.s.s.ZkIndexSchemaReader Current schema version 0 is already the latest
   [junit4]   2> 2881253 INFO  (qtp337664537-21495) [    ] o.a.s.h.c.SpellCheckComponent Initializing spell checkers
   [junit4]   2> 2881253 INFO  (qtp337664537-21495) [    ] o.a.s.s.DirectSolrSpellChecker init: {name=default,field=_text_,classname=solr.DirectSolrSpellChecker,distanceMeasure=internal,accuracy=0.5,maxEdits=2,minPrefix=1,maxInspections=5,minQueryLength=4,maxQueryFrequency=0.01}
   [junit4]   2> 2881254 INFO  (qtp337664537-21495) [    ] o.a.s.h.ReplicationHandler Commits will be reserved for 10000ms.
   [junit4]   2> 2881254 INFO  (searcherExecutor-8262-thread-1) [    ] o.a.s.c.QuerySenderListener QuerySenderListener sending requests to Searcher@5661fd22[AutoscalingHistoryHandlerTest_collection_shard1_replica_n4] main{ExitableDirectoryReader(UninvertingDirectoryReader())}
   [junit4]   2> 2881254 INFO  (qtp337664537-21495) [    ] o.a.s.u.UpdateLog Could not find max version in index or recent updates, using new clock 1580568251799175168
   [junit4]   2> 2881254 INFO  (searcherExecutor-8262-thread-1) [    ] o.a.s.c.QuerySenderListener QuerySenderListener done.
   [junit4]   2> 2881254 INFO  (searcherExecutor-8262-thread-1) [    ] o.a.s.h.c.SpellCheckComponent Loading spell index for spellchecker: default
   [junit4]   2> 2881255 INFO  (searcherExecutor-8262-thread-1) [    ] o.a.s.c.SolrCore [AutoscalingHistoryHandlerTest_collection_shard1_replica_n4] Registered new searcher Searcher@5661fd22[AutoscalingHistoryHandlerTest_collection_shard1_replica_n4] main{ExitableDirectoryReader(UninvertingDirectoryReader())}
   [junit4]   2> 2881332 DEBUG (OverseerStateUpdate-98785515615682569-127.0.0.1:46621_solr-n_0000000000) [    ] o.a.s.c.o.ZkStateWriter going to update_collection /collections/AutoscalingHistoryHandlerTest_collection/state.json version: 2
   [junit4]   2> 2881332 INFO  (zkCallback-3318-thread-2) [    ] o.a.s.c.c.ZkStateReader A cluster state change: [WatchedEvent state:SyncConnected type:NodeDataChanged path:/collections/AutoscalingHistoryHandlerTest_collection/state.json] for collection [AutoscalingHistoryHandlerTest_collection] has occurred - updating... (live nodes size: [3])
   [junit4]   2> 2881332 INFO  (zkCallback-3317-thread-1) [    ] o.a.s.c.c.ZkStateReader A cluster state change: [WatchedEvent state:SyncConnected type:NodeDataChanged path:/collections/AutoscalingHistoryHandlerTest_collection/state.json] for collection [AutoscalingHistoryHandlerTest_collection] has occurred - updating... (live nodes size: [3])
   [junit4]   2> 2881332 INFO  (zkCallback-3318-thread-1) [    ] o.a.s.c.c.ZkStateReader A cluster state change: [WatchedEvent state:SyncConnected type:NodeDataChanged path:/collections/AutoscalingHistoryHandlerTest_collection/state.json] for collection [AutoscalingHistoryHandlerTest_collection] has occurred - updating... (live nodes size: [3])
   [junit4]   2> 2881332 INFO  (zkCallback-3316-thread-1) [    ] o.a.s.c.c.ZkStateReader A cluster state change: [WatchedEvent state:SyncConnected type:NodeDataChanged path:/collections/AutoscalingHistoryHandlerTest_collection/state.json] for collection [AutoscalingHistoryHandlerTest_collection] has occurred - updating... (live nodes size: [3])
   [junit4]   2> 2881332 INFO  (zkCallback-3316-thread-2) [    ] o.a.s.c.c.ZkStateReader A cluster state change: [WatchedEvent state:SyncConnected type:NodeDataChanged path:/collections/AutoscalingHistoryHandlerTest_collection/state.json] for collection [AutoscalingHistoryHandlerTest_collection] has occurred - updating... (live nodes size: [3])
   [junit4]   2> 2881332 INFO  (zkCallback-3317-thread-2) [    ] o.a.s.c.c.ZkStateReader A cluster state change: [WatchedEvent state:SyncConnected type:NodeDataChanged path:/collections/AutoscalingHistoryHandlerTest_collection/state.json] for collection [AutoscalingHistoryHandlerTest_collection] has occurred - updating... (live nodes size: [3])
   [junit4]   2> 2881566 DEBUG (ScheduledTrigger-8250-thread-2) [    ] o.a.s.c.a.NodeLostTrigger Running NodeLostTrigger: .auto_add_replicas with currently live nodes: [127.0.0.1:34287_solr, 127.0.0.1:34327_solr, 127.0.0.1:46621_solr]
   [junit4]   2> 2881731 INFO  (qtp1319805478-21499) [    ] o.a.s.c.ShardLeaderElectionContext Enough replicas found to continue.
   [junit4]   2> 2881731 INFO  (qtp1319805478-21499) [    ] o.a.s.c.ShardLeaderElectionContext I may be the new leader - try and sync
   [junit4]   2> 2881731 INFO  (qtp1319805478-21499) [    ] o.a.s.c.SyncStrategy Sync replicas to http://127.0.0.1:46621/solr/AutoscalingHistoryHandlerTest_collection_shard1_replica_n1/
   [junit4]   2> 2881731 INFO  (qt

[...truncated too long message...]

unit4]   2> 3266195 INFO  (recoveryExecutor-3346-thread-2) [    ] o.a.s.m.r.SolrJmxReporter Closing reporter [org.apache.solr.metrics.reporters.SolrJmxReporter@186eec5d: rootName = solr_40561, domain = solr.core..system.shard1.replica_n9, service url = null, agent id = null] for registry solr.core..system.shard1.replica_n9 / com.codahale.metrics.MetricRegistry@2e9b3433
   [junit4]   2> 3266195 WARN  (updateExecutor-3345-thread-2) [    ] o.a.s.u.DefaultSolrCoreState Skipping recovery because Solr is shutdown
   [junit4]   2> 3266200 INFO  (recoveryExecutor-3346-thread-2) [    ] o.a.s.m.SolrMetricManager Closing metric reporters for registry=solr.collection..system.shard1.leader, tag=1977422219
   [junit4]   2> 3266200 WARN  (recoveryExecutor-3346-thread-2) [    ] o.a.s.c.RecoveryStrategy Stopping recovery for core=[.system_shard1_replica_n9] coreNodeName=[core_node10]
   [junit4]   2> 3266201 WARN  (updateExecutor-3345-thread-4) [    ] o.a.s.u.DefaultSolrCoreState Skipping recovery because Solr is shutdown
   [junit4]   2> 3266201 WARN  (NIOServerCxn.Factory:0.0.0.0/0.0.0.0:0) [    ] o.a.z.s.NIOServerCnxn caught end of stream exception
   [junit4]   2> EndOfStreamException: Unable to read additional data from client sessionid 0x15ef4e72f3a0014, likely client has closed socket
   [junit4]   2> 	at org.apache.zookeeper.server.NIOServerCnxn.doIO(NIOServerCnxn.java:239)
   [junit4]   2> 	at org.apache.zookeeper.server.NIOServerCnxnFactory.run(NIOServerCnxnFactory.java:203)
   [junit4]   2> 	at java.base/java.lang.Thread.run(Thread.java:844)
   [junit4]   2> 3266201 WARN  (zkCallback-3348-thread-3) [    ] o.a.s.c.c.ZkStateReader ZooKeeper watch triggered, but Solr cannot talk to ZK: [KeeperErrorCode = Session expired for /live_nodes]
   [junit4]   2> 3266201 INFO  (jetty-closer-3302-thread-3) [    ] o.e.j.s.h.ContextHandler Stopped o.e.j.s.ServletContextHandler@f732d1f{/solr,null,UNAVAILABLE}
   [junit4]   2> 3266202 ERROR (SUITE-AutoscalingHistoryHandlerTest-seed#[1657712D937E3CD7]-worker) [    ] o.a.z.s.ZooKeeperServer ZKShutdownHandler is not registered, so ZooKeeper server won't take any action on ERROR or SHUTDOWN server state changes
   [junit4]   2> 3266202 INFO  (SUITE-AutoscalingHistoryHandlerTest-seed#[1657712D937E3CD7]-worker) [    ] o.a.s.c.ZkTestServer connecting to 127.0.0.1:39575 39575
   [junit4]   2> 3270742 INFO  (Thread-4473) [    ] o.a.s.c.ZkTestServer connecting to 127.0.0.1:39575 39575
   [junit4]   2> 3270742 WARN  (Thread-4473) [    ] o.a.s.c.ZkTestServer Watch limit violations: 
   [junit4]   2> Maximum concurrent create/delete watches above limit:
   [junit4]   2> 
   [junit4]   2> 	33	/solr/aliases.json
   [junit4]   2> 	33	/solr/clusterprops.json
   [junit4]   2> 	6	/solr/configs/.system/managed-schema
   [junit4]   2> 	5	/solr/configs/.system
   [junit4]   2> 	4	/solr/security.json
   [junit4]   2> 	3	/solr/configs/AutoscalingHistoryHandlerTest_collection
   [junit4]   2> 	3	/solr/configs/AutoscalingHistoryHandlerTest_collection/managed-schema
   [junit4]   2> 
   [junit4]   2> Maximum concurrent data watches above limit:
   [junit4]   2> 
   [junit4]   2> 	489	/solr/collections/.system/state.json
   [junit4]   2> 	33	/solr/clusterstate.json
   [junit4]   2> 	30	/solr/collections/AutoscalingHistoryHandlerTest_collection/state.json
   [junit4]   2> 	2	/solr/autoscaling.json
   [junit4]   2> 
   [junit4]   2> Maximum concurrent children watches above limit:
   [junit4]   2> 
   [junit4]   2> 	33	/solr/collections
   [junit4]   2> 	32	/solr/live_nodes
   [junit4]   2> 	2	/solr/overseer/queue
   [junit4]   2> 	2	/solr/autoscaling/events/.auto_add_replicas
   [junit4]   2> 	2	/solr/autoscaling/events/AutoscalingHistoryHandlerTest_node_lost_trigger
   [junit4]   2> 	2	/solr/overseer/collection-queue-work
   [junit4]   2> 	2	/solr/overseer/queue-work
   [junit4]   2> 
   [junit4]   2> NOTE: leaving temporary files on disk at: /home/jenkins/workspace/Lucene-Solr-master-Linux/solr/build/solr-core/test/J0/temp/solr.handler.admin.AutoscalingHistoryHandlerTest_1657712D937E3CD7-001
   [junit4]   2> NOTE: test params are: codec=CheapBastard, sim=RandomSimilarity(queryNorm=false): {}, locale=se-FI, timezone=America/Cuiaba
   [junit4]   2> NOTE: Linux 4.10.0-33-generic amd64/Oracle Corporation 9 (64-bit)/cpus=8,threads=1,free=214814584,total=518979584
   [junit4]   2> NOTE: All tests run in this JVM: [FieldAnalysisRequestHandlerTest, TestFieldTypeCollectionResource, TestLazyCores, TestBadConfig, OpenExchangeRatesOrgProviderTest, SpatialRPTFieldTypeTest, HdfsUnloadDistributedZkTest, DateRangeFieldTest, SolrIndexConfigTest, HighlighterMaxOffsetTest, TestCollectionAPIs, HdfsChaosMonkeySafeLeaderTest, TestRandomFlRTGCloud, TestSolr4Spatial, HdfsRecoverLeaseTest, ExplicitHLLTest, CdcrBootstrapTest, TestPointFields, TestFieldCacheSort, TestSchemaResource, QueryElevationComponentTest, RequestHandlersTest, TestFastOutputStream, TestFaceting, TemplateUpdateProcessorTest, TestJsonFacets, TestSearcherReuse, TestManagedResource, TestNumericTerms64, ManagedSchemaRoundRobinCloudTest, UUIDFieldTest, OverriddenZkACLAndCredentialsProvidersTest, TestDefaultStatsCache, TestMacros, DistributedFacetPivotLargeTest, TestBlobHandler, CreateCollectionCleanupTest, ImplicitSnitchTest, TestManagedSynonymFilterFactory, SolrPluginUtilsTest, SyncSliceTest, TestDocSet, TestOverriddenPrefixQueryForCustomFieldType, TestSubQueryTransformer, TestSolrCloudWithKerberosAlt, PluginInfoTest, ConcurrentDeleteAndCreateCollectionTest, CursorPagingTest, SolrMetricManagerTest, AddSchemaFieldsUpdateProcessorFactoryTest, CoreAdminRequestStatusTest, AssignTest, TestExceedMaxTermLength, TestCollationField, TestBinaryField, TestIndexingPerformance, TestCloudSchemaless, TestInfoStreamLogging, SolrShardReporterTest, TriLevelCompositeIdRoutingTest, OverseerRolesTest, TestSSLRandomization, TestCustomStream, TestCollectionAPI, MBeansHandlerTest, FieldMutatingUpdateProcessorTest, TestXmlQParser, ExternalFileFieldSortTest, TestSolrCoreSnapshots, ZkNodePropsTest, TestMergePolicyConfig, DistribDocExpirationUpdateProcessorTest, MoveReplicaHDFSFailoverTest, TestManagedSchema, TestSerializedLuceneMatchVersion, TestReRankQParserPlugin, TestLuceneMatchVersion, BufferStoreTest, DeleteLastCustomShardedReplicaTest, BasicZkTest, TestSolrConfigHandler, TestFunctionQuery, SynonymTokenizerTest, TestIntervalFaceting, PeerSyncReplicationTest, TestHighFrequencyDictionaryFactory, BinaryUpdateRequestHandlerTest, ConjunctionSolrSpellCheckerTest, TestDelegationWithHadoopAuth, TestZkAclsWithHadoopAuth, TestPivotHelperCode, TestInitQParser, LeaderFailoverAfterPartitionTest, AnalyticsQueryTest, SimpleMLTQParserTest, TestDistributedSearch, ChaosMonkeyNothingIsSafeTest, TestWriterPerf, WordBreakSolrSpellCheckerTest, TestComplexPhraseQParserPlugin, TestCSVResponseWriter, TestPrepRecovery, RAMDirectoryFactoryTest, TestPHPSerializedResponseWriter, TestMissingGroups, SpellCheckCollatorTest, XmlUpdateRequestHandlerTest, TestExclusionRuleCollectionAccess, TestDynamicFieldResource, CollectionTooManyReplicasTest, TestPKIAuthenticationPlugin, TestLMDirichletSimilarityFactory, BooleanFieldTest, ExitableDirectoryReaderTest, UUIDUpdateProcessorFallbackTest, V2StandaloneTest, TestScoreJoinQPScore, TestSolrConfigHandlerConcurrent, TestSolrQueryParser, TestStressInPlaceUpdates, TestAuthenticationFramework, ChaosMonkeySafeLeaderTest, BasicDistributedZk2Test, FullSolrCloudDistribCmdsTest, ClusterStateUpdateTest, TestRandomFaceting, LeaderElectionTest, TestRandomDVFaceting, AutoCommitTest, TestRealTimeGet, TestJoin, SimpleFacetsTest, SolrCoreTest, StatsComponentTest, PeerSyncTest, DefaultValueUpdateProcessorTest, TestSolrDeletionPolicy1, DebugComponentTest, LukeRequestHandlerTest, DirectSolrSpellCheckerTest, DocumentAnalysisRequestHandlerTest, FileBasedSpellCheckerTest, DocumentBuilderTest, PathHierarchyTokenizerFactoryTest, TermVectorComponentTest, FastVectorHighlighterTest, LoggingHandlerTest, IndexSchemaTest, JsonLoaderTest, TestLFUCache, AliasIntegrationTest, AsyncCallRequestStatusResponseTest, BaseCdcrDistributedZkTest, CdcrReplicationDistributedZkTest, CdcrRequestHandlerTest, CdcrVersionReplicationTest, ChaosMonkeyNothingIsSafeWithPullReplicasTest, ConnectionManagerTest, DeleteShardTest, HealthCheckHandlerTest, LeaderFailureAfterFreshStartTest, LeaderInitiatedRecoveryOnShardRestartTest, MigrateRouteKeyTest, NodeMutatorTest, OutOfBoxZkACLAndCredentialsProvidersTest, OverseerCollectionConfigSetProcessorTest, OverseerTaskQueueTest, SaslZkACLProviderTest, ShardSplitTest, TestOnReconnectListenerSupport, TestPullReplicaErrorHandling, TestReplicaProperties, TestShortCircuitedRequests, TestStressCloudBlindAtomicUpdates, TestPolicyCloud, HdfsTlogReplayBufferedWhileIndexingTest, HdfsWriteToMultipleCollectionsTest, TestClusterStateMutator, ZkStateReaderTest, ZkStateWriterTest, RuleEngineTest, BlobRepositoryCloudTest, ConfigureRecoveryStrategyTest, CoreSorterTest, TestBackupRepositoryFactory, TestConfigSets, TestImplicitCoreProperties, TestNRTOpen, TestShardHandlerFactory, TestSolrXml, TestHdfsBackupRestoreCore, TestSolrConfigHandlerCloud, AutoscalingHistoryHandlerTest]
   [junit4] Completed [744/745 (1!)] on J0 in 391.36s, 1 test, 1 failure <<< FAILURES!

[...truncated 39732 lines...]
BUILD FAILED
/home/jenkins/workspace/Lucene-Solr-master-Linux/build.xml:826: The following error occurred while executing this line:
/home/jenkins/workspace/Lucene-Solr-master-Linux/build.xml:706: The following error occurred while executing this line:
/home/jenkins/workspace/Lucene-Solr-master-Linux/build.xml:693: Source checkout is dirty (unversioned/missing files) after running tests!!! Offending files:
* lucene/licenses/morfologik-ukrainian-search-3.7.5.jar.sha1

Total time: 76 minutes 51 seconds
Build step 'Invoke Ant' marked build as failure
Archiving artifacts
[WARNINGS] Skipping publisher since build result is FAILURE
Recording test results
Email was triggered for: Failure - Any
Sending email for trigger: Failure - Any

Mime
View raw message