lucene-dev mailing list archives

Site index · List index
Message view « Date » · « Thread »
Top « Date » · « Thread »
From Policeman Jenkins Server <jenk...@thetaphi.de>
Subject [JENKINS] Lucene-Solr-master-Windows (64bit/jdk1.8.0_144) - Build # 6954 - Unstable!
Date Wed, 11 Oct 2017 18:49:04 GMT
Build: https://jenkins.thetaphi.de/job/Lucene-Solr-master-Windows/6954/
Java: 64bit/jdk1.8.0_144 -XX:+UseCompressedOops -XX:+UseG1GC

5 tests failed.
FAILED:  junit.framework.TestSuite.org.apache.lucene.store.TestNIOFSDirectory

Error Message:
Could not remove the following files (in the order of attempts):    C:\Users\jenkins\workspace\Lucene-Solr-master-Windows\lucene\build\core\test\J1\temp\lucene.store.TestNIOFSDirectory_BBEC1310C2AF9B08-001\testThreadSafety-001: java.nio.file.AccessDeniedException: C:\Users\jenkins\workspace\Lucene-Solr-master-Windows\lucene\build\core\test\J1\temp\lucene.store.TestNIOFSDirectory_BBEC1310C2AF9B08-001\testThreadSafety-001    C:\Users\jenkins\workspace\Lucene-Solr-master-Windows\lucene\build\core\test\J1\temp\lucene.store.TestNIOFSDirectory_BBEC1310C2AF9B08-001: java.nio.file.DirectoryNotEmptyException: C:\Users\jenkins\workspace\Lucene-Solr-master-Windows\lucene\build\core\test\J1\temp\lucene.store.TestNIOFSDirectory_BBEC1310C2AF9B08-001 

Stack Trace:
java.io.IOException: Could not remove the following files (in the order of attempts):
   C:\Users\jenkins\workspace\Lucene-Solr-master-Windows\lucene\build\core\test\J1\temp\lucene.store.TestNIOFSDirectory_BBEC1310C2AF9B08-001\testThreadSafety-001: java.nio.file.AccessDeniedException: C:\Users\jenkins\workspace\Lucene-Solr-master-Windows\lucene\build\core\test\J1\temp\lucene.store.TestNIOFSDirectory_BBEC1310C2AF9B08-001\testThreadSafety-001
   C:\Users\jenkins\workspace\Lucene-Solr-master-Windows\lucene\build\core\test\J1\temp\lucene.store.TestNIOFSDirectory_BBEC1310C2AF9B08-001: java.nio.file.DirectoryNotEmptyException: C:\Users\jenkins\workspace\Lucene-Solr-master-Windows\lucene\build\core\test\J1\temp\lucene.store.TestNIOFSDirectory_BBEC1310C2AF9B08-001

	at __randomizedtesting.SeedInfo.seed([BBEC1310C2AF9B08]:0)
	at org.apache.lucene.util.IOUtils.rm(IOUtils.java:329)
	at org.apache.lucene.util.TestRuleTemporaryFilesCleanup.afterAlways(TestRuleTemporaryFilesCleanup.java:216)
	at com.carrotsearch.randomizedtesting.rules.TestRuleAdapter$1.afterAlways(TestRuleAdapter.java:31)
	at com.carrotsearch.randomizedtesting.rules.StatementAdapter.evaluate(StatementAdapter.java:43)
	at com.carrotsearch.randomizedtesting.rules.StatementAdapter.evaluate(StatementAdapter.java:36)
	at org.apache.lucene.util.TestRuleAssertionsRequired$1.evaluate(TestRuleAssertionsRequired.java:53)
	at org.apache.lucene.util.TestRuleMarkFailure$1.evaluate(TestRuleMarkFailure.java:47)
	at org.apache.lucene.util.TestRuleIgnoreAfterMaxFailures$1.evaluate(TestRuleIgnoreAfterMaxFailures.java:64)
	at org.apache.lucene.util.TestRuleIgnoreTestSuites$1.evaluate(TestRuleIgnoreTestSuites.java:54)
	at com.carrotsearch.randomizedtesting.rules.StatementAdapter.evaluate(StatementAdapter.java:36)
	at com.carrotsearch.randomizedtesting.ThreadLeakControl$StatementRunner.run(ThreadLeakControl.java:368)
	at java.lang.Thread.run(Thread.java:748)


FAILED:  org.apache.solr.cloud.CollectionsAPIDistributedZkTest.testCollectionsAPI

Error Message:
Error from server at http://127.0.0.1:57637/solr/awhollynewcollection_0_shard1_replica_n1: ClusterState says we are the leader (http://127.0.0.1:57637/solr/awhollynewcollection_0_shard1_replica_n1), but locally we don't think so. Request came from null

Stack Trace:
org.apache.solr.client.solrj.impl.CloudSolrClient$RouteException: Error from server at http://127.0.0.1:57637/solr/awhollynewcollection_0_shard1_replica_n1: ClusterState says we are the leader (http://127.0.0.1:57637/solr/awhollynewcollection_0_shard1_replica_n1), but locally we don't think so. Request came from null
	at __randomizedtesting.SeedInfo.seed([5273222CF93A20D5:1A065698FF090F40]:0)
	at org.apache.solr.client.solrj.impl.CloudSolrClient.directUpdate(CloudSolrClient.java:539)
	at org.apache.solr.client.solrj.impl.CloudSolrClient.sendRequest(CloudSolrClient.java:993)
	at org.apache.solr.client.solrj.impl.CloudSolrClient.requestWithRetryOnStaleState(CloudSolrClient.java:862)
	at org.apache.solr.client.solrj.impl.CloudSolrClient.request(CloudSolrClient.java:793)
	at org.apache.solr.client.solrj.SolrRequest.process(SolrRequest.java:178)
	at org.apache.solr.client.solrj.request.UpdateRequest.commit(UpdateRequest.java:233)
	at org.apache.solr.cloud.CollectionsAPIDistributedZkTest.testCollectionsAPI(CollectionsAPIDistributedZkTest.java:459)
	at sun.reflect.NativeMethodAccessorImpl.invoke0(Native Method)
	at sun.reflect.NativeMethodAccessorImpl.invoke(NativeMethodAccessorImpl.java:62)
	at sun.reflect.DelegatingMethodAccessorImpl.invoke(DelegatingMethodAccessorImpl.java:43)
	at java.lang.reflect.Method.invoke(Method.java:498)
	at com.carrotsearch.randomizedtesting.RandomizedRunner.invoke(RandomizedRunner.java:1737)
	at com.carrotsearch.randomizedtesting.RandomizedRunner$8.evaluate(RandomizedRunner.java:934)
	at com.carrotsearch.randomizedtesting.RandomizedRunner$9.evaluate(RandomizedRunner.java:970)
	at com.carrotsearch.randomizedtesting.RandomizedRunner$10.evaluate(RandomizedRunner.java:984)
	at com.carrotsearch.randomizedtesting.rules.SystemPropertiesRestoreRule$1.evaluate(SystemPropertiesRestoreRule.java:57)
	at org.apache.lucene.util.TestRuleSetupTeardownChained$1.evaluate(TestRuleSetupTeardownChained.java:49)
	at org.apache.lucene.util.AbstractBeforeAfterRule$1.evaluate(AbstractBeforeAfterRule.java:45)
	at org.apache.lucene.util.TestRuleThreadAndTestName$1.evaluate(TestRuleThreadAndTestName.java:48)
	at org.apache.lucene.util.TestRuleIgnoreAfterMaxFailures$1.evaluate(TestRuleIgnoreAfterMaxFailures.java:64)
	at org.apache.lucene.util.TestRuleMarkFailure$1.evaluate(TestRuleMarkFailure.java:47)
	at com.carrotsearch.randomizedtesting.rules.StatementAdapter.evaluate(StatementAdapter.java:36)
	at com.carrotsearch.randomizedtesting.ThreadLeakControl$StatementRunner.run(ThreadLeakControl.java:368)
	at com.carrotsearch.randomizedtesting.ThreadLeakControl.forkTimeoutingTask(ThreadLeakControl.java:817)
	at com.carrotsearch.randomizedtesting.ThreadLeakControl$3.evaluate(ThreadLeakControl.java:468)
	at com.carrotsearch.randomizedtesting.RandomizedRunner.runSingleTest(RandomizedRunner.java:943)
	at com.carrotsearch.randomizedtesting.RandomizedRunner$5.evaluate(RandomizedRunner.java:829)
	at com.carrotsearch.randomizedtesting.RandomizedRunner$6.evaluate(RandomizedRunner.java:879)
	at com.carrotsearch.randomizedtesting.RandomizedRunner$7.evaluate(RandomizedRunner.java:890)
	at com.carrotsearch.randomizedtesting.rules.StatementAdapter.evaluate(StatementAdapter.java:36)
	at com.carrotsearch.randomizedtesting.rules.SystemPropertiesRestoreRule$1.evaluate(SystemPropertiesRestoreRule.java:57)
	at org.apache.lucene.util.AbstractBeforeAfterRule$1.evaluate(AbstractBeforeAfterRule.java:45)
	at com.carrotsearch.randomizedtesting.rules.StatementAdapter.evaluate(StatementAdapter.java:36)
	at org.apache.lucene.util.TestRuleStoreClassName$1.evaluate(TestRuleStoreClassName.java:41)
	at com.carrotsearch.randomizedtesting.rules.NoShadowingOrOverridesOnMethodsRule$1.evaluate(NoShadowingOrOverridesOnMethodsRule.java:40)
	at com.carrotsearch.randomizedtesting.rules.NoShadowingOrOverridesOnMethodsRule$1.evaluate(NoShadowingOrOverridesOnMethodsRule.java:40)
	at com.carrotsearch.randomizedtesting.rules.StatementAdapter.evaluate(StatementAdapter.java:36)
	at com.carrotsearch.randomizedtesting.rules.StatementAdapter.evaluate(StatementAdapter.java:36)
	at com.carrotsearch.randomizedtesting.rules.StatementAdapter.evaluate(StatementAdapter.java:36)
	at org.apache.lucene.util.TestRuleAssertionsRequired$1.evaluate(TestRuleAssertionsRequired.java:53)
	at org.apache.lucene.util.TestRuleMarkFailure$1.evaluate(TestRuleMarkFailure.java:47)
	at org.apache.lucene.util.TestRuleIgnoreAfterMaxFailures$1.evaluate(TestRuleIgnoreAfterMaxFailures.java:64)
	at org.apache.lucene.util.TestRuleIgnoreTestSuites$1.evaluate(TestRuleIgnoreTestSuites.java:54)
	at com.carrotsearch.randomizedtesting.rules.StatementAdapter.evaluate(StatementAdapter.java:36)
	at com.carrotsearch.randomizedtesting.ThreadLeakControl$StatementRunner.run(ThreadLeakControl.java:368)
	at java.lang.Thread.run(Thread.java:748)
Caused by: org.apache.solr.client.solrj.impl.HttpSolrClient$RemoteSolrException: Error from server at http://127.0.0.1:57637/solr/awhollynewcollection_0_shard1_replica_n1: ClusterState says we are the leader (http://127.0.0.1:57637/solr/awhollynewcollection_0_shard1_replica_n1), but locally we don't think so. Request came from null
	at org.apache.solr.client.solrj.impl.HttpSolrClient.executeMethod(HttpSolrClient.java:626)
	at org.apache.solr.client.solrj.impl.HttpSolrClient.request(HttpSolrClient.java:253)
	at org.apache.solr.client.solrj.impl.HttpSolrClient.request(HttpSolrClient.java:242)
	at org.apache.solr.client.solrj.impl.LBHttpSolrClient.doRequest(LBHttpSolrClient.java:483)
	at org.apache.solr.client.solrj.impl.LBHttpSolrClient.request(LBHttpSolrClient.java:413)
	at org.apache.solr.client.solrj.impl.CloudSolrClient.lambda$directUpdate$0(CloudSolrClient.java:516)
	at java.util.concurrent.FutureTask.run(FutureTask.java:266)
	at org.apache.solr.common.util.ExecutorUtil$MDCAwareThreadPoolExecutor.lambda$execute$0(ExecutorUtil.java:188)
	at java.util.concurrent.ThreadPoolExecutor.runWorker(ThreadPoolExecutor.java:1149)
	at java.util.concurrent.ThreadPoolExecutor$Worker.run(ThreadPoolExecutor.java:624)
	... 1 more


FAILED:  junit.framework.TestSuite.org.apache.solr.handler.component.InfixSuggestersTest

Error Message:
Could not remove the following files (in the order of attempts):    C:\Users\jenkins\workspace\Lucene-Solr-master-Windows\solr\build\solr-core\test\J0\temp\solr.handler.component.InfixSuggestersTest_5273222CF93A20D5-001\init-core-data-001: java.nio.file.AccessDeniedException: C:\Users\jenkins\workspace\Lucene-Solr-master-Windows\solr\build\solr-core\test\J0\temp\solr.handler.component.InfixSuggestersTest_5273222CF93A20D5-001\init-core-data-001    C:\Users\jenkins\workspace\Lucene-Solr-master-Windows\solr\build\solr-core\test\J0\temp\solr.handler.component.InfixSuggestersTest_5273222CF93A20D5-001: java.nio.file.DirectoryNotEmptyException: C:\Users\jenkins\workspace\Lucene-Solr-master-Windows\solr\build\solr-core\test\J0\temp\solr.handler.component.InfixSuggestersTest_5273222CF93A20D5-001 

Stack Trace:
java.io.IOException: Could not remove the following files (in the order of attempts):
   C:\Users\jenkins\workspace\Lucene-Solr-master-Windows\solr\build\solr-core\test\J0\temp\solr.handler.component.InfixSuggestersTest_5273222CF93A20D5-001\init-core-data-001: java.nio.file.AccessDeniedException: C:\Users\jenkins\workspace\Lucene-Solr-master-Windows\solr\build\solr-core\test\J0\temp\solr.handler.component.InfixSuggestersTest_5273222CF93A20D5-001\init-core-data-001
   C:\Users\jenkins\workspace\Lucene-Solr-master-Windows\solr\build\solr-core\test\J0\temp\solr.handler.component.InfixSuggestersTest_5273222CF93A20D5-001: java.nio.file.DirectoryNotEmptyException: C:\Users\jenkins\workspace\Lucene-Solr-master-Windows\solr\build\solr-core\test\J0\temp\solr.handler.component.InfixSuggestersTest_5273222CF93A20D5-001

	at __randomizedtesting.SeedInfo.seed([5273222CF93A20D5]:0)
	at org.apache.lucene.util.IOUtils.rm(IOUtils.java:329)
	at org.apache.lucene.util.TestRuleTemporaryFilesCleanup.afterAlways(TestRuleTemporaryFilesCleanup.java:216)
	at com.carrotsearch.randomizedtesting.rules.TestRuleAdapter$1.afterAlways(TestRuleAdapter.java:31)
	at com.carrotsearch.randomizedtesting.rules.StatementAdapter.evaluate(StatementAdapter.java:43)
	at com.carrotsearch.randomizedtesting.rules.StatementAdapter.evaluate(StatementAdapter.java:36)
	at org.apache.lucene.util.TestRuleAssertionsRequired$1.evaluate(TestRuleAssertionsRequired.java:53)
	at org.apache.lucene.util.TestRuleMarkFailure$1.evaluate(TestRuleMarkFailure.java:47)
	at org.apache.lucene.util.TestRuleIgnoreAfterMaxFailures$1.evaluate(TestRuleIgnoreAfterMaxFailures.java:64)
	at org.apache.lucene.util.TestRuleIgnoreTestSuites$1.evaluate(TestRuleIgnoreTestSuites.java:54)
	at com.carrotsearch.randomizedtesting.rules.StatementAdapter.evaluate(StatementAdapter.java:36)
	at com.carrotsearch.randomizedtesting.ThreadLeakControl$StatementRunner.run(ThreadLeakControl.java:368)
	at java.lang.Thread.run(Thread.java:748)


FAILED:  org.apache.solr.client.solrj.io.stream.StreamExpressionTest.testParallelDaemonUpdateStream

Error Message:
Test abandoned because suite timeout was reached.

Stack Trace:
java.lang.Exception: Test abandoned because suite timeout was reached.
	at __randomizedtesting.SeedInfo.seed([2AEA13FFF5648378]:0)


FAILED:  junit.framework.TestSuite.org.apache.solr.client.solrj.io.stream.StreamExpressionTest

Error Message:
Suite timeout exceeded (>= 7200000 msec).

Stack Trace:
java.lang.Exception: Suite timeout exceeded (>= 7200000 msec).
	at __randomizedtesting.SeedInfo.seed([2AEA13FFF5648378]:0)




Build Log:
[...truncated 1640 lines...]
   [junit4] Suite: org.apache.lucene.store.TestNIOFSDirectory
   [junit4]   2> NOTE: test params are: codec=Asserting(Lucene70), sim=RandomSimilarity(queryNorm=true): {}, locale=es-DO, timezone=Africa/Douala
   [junit4]   2> NOTE: Windows 10 10.0 amd64/Oracle Corporation 1.8.0_144 (64-bit)/cpus=3,threads=1,free=316631216,total=536870912
   [junit4]   2> NOTE: All tests run in this JVM: [TestIndexWriterThreadsToSegments, TestMultiCollector, TestAxiomaticSimilarity, TestMergePolicyWrapper, TestNRTReaderWithThreads, TestSimpleExplanationsWithFillerDocs, TestIntroSorter, Test2BPostingsBytes, TestPayloads, TestIndexWriterOnJRECrash, Test2BSortedDocValuesFixedSorted, TestBooleanSimilarity, TestMultiFields, TestTermQuery, TestSpanNearQuery, TestNoMergeScheduler, TestFilterWeight, TestAutomatonQueryUnicode, TestBoolean2, TestPostingsOffsets, TestOfflineSorter, TestComplexExplanationsOfNonMatches, TestTotalHitCountCollector, TestMutableValues, TestStressIndexing2, TestFieldMaskingSpanQuery, TestIndexWriterFromReader, TestNRTReaderCleanup, TestSearcherManager, TestTopFieldCollector, TestConstantScoreQuery, Test2BDocs, TestIndexWriterForceMerge, TestLucene50StoredFieldsFormatHighCompression, TestAllFilesCheckIndexHeader, TestMultiset, TestStressIndexing, TestDocValuesScoring, TestIndexedDISI, TestSpanFirstQuery, TestFastCompressionMode, TestBasics, TestDemo, TestFilterDirectoryReader, TestFilterDirectory, TestNot, TestIndexCommit, Test2BNumericDocValues, TestCustomTermFreq, TestField, TestPerFieldPostingsFormat, TestConcurrentMergeScheduler, TestSegmentTermDocs, TestFlex, TestDuelingCodecsAtNight, TestCharsRefBuilder, TestSpanCollection, TestNGramPhraseQuery, TestDeletionPolicy, TestCompiledAutomaton, TestGeoUtils, TestSizeBoundedForceMerge, TestBoolean2ScorerSupplier, Test2BBinaryDocValues, TestFastDecompressionMode, TestFuzzyQuery, TestTermRangeQuery, TestIndexWriterReader, TestCharTermAttributeImpl, TestRegExp, TestDoubleValuesSource, TestFileSwitchDirectory, TestDirectoryReaderReopen, TestIntRangeFieldQueries, TestDisjunctionMaxQuery, TestPackedInts, TestBytesRefHash, TestIndexWriterOnVMError, TestMultiTermConstantScore, TestIndexWriterNRTIsCurrent, TestSmallFloat, TestForTooMuchCloning, TestIndexWriterOnDiskFull, TestLongRangeFieldQueries, TestSpansEnum, TestNativeFSLockFactory, TestFilterSpans, TestTermsEnum, TestSearchAfter, TestFixedBitSet, TestLucene70NormsFormat, TestTransactionRollback, TestVersion, TestMixedDocValuesUpdates, TestStopFilter, TestTimSorter, TestDelegatingAnalyzerWrapper, TestTermsEnum2, TestMultiPhraseQuery, TestSegmentMerger, TestOneMergeWrappingMergePolicy, TestDocumentsWriterStallControl, TestSimpleFSDirectory, TestAutomaton, TestBKD, TestTransactions, TestCachingCollector, TestShardSearching, TestCustomSearcherSort, TestPointValues, TestSentinelIntSet, TestDocumentWriter, TestIndexReaderClose, TestIndexWriter, TestPerFieldDocValuesFormat, TestFlushByRamOrCountsPolicy, TestIndexWriterMergePolicy, TestNRTThreads, TestDuelingCodecs, TestIndexWriterCommit, TestTopDocsMerge, TestLongPostings, TestRollingUpdates, TestIndexWriterUnicode, TestByteSlices, TestSimpleExplanations, TestLockFactory, TestPhraseQuery, TestRegexpRandom2, TestNRTCachingDirectory, TestCrash, TestPerFieldPostingsFormat2, TestMultiDocValues, TestToken, TestFieldsReader, TestSimpleSearchEquivalence, TestDocValuesIndexing, TestSimilarityBase, TestBooleanMinShouldMatch, TestSpans, TestMixedCodecs, TestRAMDirectory, TestLazyProxSkipping, TestDeterminism, TestMergeSchedulerExternal, TestTermVectorsWriter, TestCodecs, TestStressNRT, TestForceMergeForever, TestDocumentsWriterDeleteQueue, TestScorerPerf, TestSpanSearchEquivalence, TestWildcard, TestExternalCodecs, TestSimpleExplanationsOfNonMatches, TestPerSegmentDeletes, TestPrefixInBooleanQuery, TestSortRandom, TestAutomatonQuery, TestSumDocFreq, TestDirectory, TestPayloadsOnVectors, TestSpanMultiTermQueryWrapper, TestIndexFileDeleter, TestElevationComparator, TestSubScorerFreqs, TestConjunctions, TestPositionIncrement, TestVirtualMethod, TestSimilarityProvider, TestFilterLeafReader, TestDateTools, TestPriorityQueue, TestBooleanScorer, TestByteBlockPool, TestCodecHoldsOpenFiles, MultiCollectorTest, TestSimpleAttributeImpl, Test2BPositions, TestPositiveScoresOnlyCollector, TestByteArrayDataInput, TestCharArraySet, TestReusableStringReader, TestPackedTokenAttributeImpl, TestBlockPostingsFormat, TestLucene60FieldInfoFormat, TestLucene70SegmentInfoFormat, TestFieldType, TestPolygon2D, TestDocIDMerger, TestDocValues, TestExitableDirectoryReader, TestFieldReuse, TestIndexManyDocuments, TestIndexSorting, TestIndexingSequenceNumbers, TestControlledRealTimeReopenThread, TestDocValuesRewriteMethod, TestEarlyTerminatingSortingCollector, TestNormsFieldExistsQuery, TestQueryRescorer, TestReqExclBulkScorer, TestSortedNumericSortField, TestSortedSetSelector, TestSortedSetSortField, TestSynonymQuery, TestUsageTrackingFilterCachingPolicy, TestBM25Similarity, TestClassicSimilarity, TestSpanBoostQuery, TestSpanNotQuery, TestSpanOrQuery, TestGrowableByteArrayDataOutput, TestNIOFSDirectory]
   [junit4]   2> NOTE: reproduce with: ant test  -Dtestcase=TestNIOFSDirectory -Dtests.seed=BBEC1310C2AF9B08 -Dtests.slow=true -Dtests.locale=es-DO -Dtests.timezone=Africa/Douala -Dtests.asserts=true -Dtests.file.encoding=ISO-8859-1
   [junit4] ERROR   0.00s J1 | TestNIOFSDirectory (suite) <<<
   [junit4]    > Throwable #1: java.io.IOException: Could not remove the following files (in the order of attempts):
   [junit4]    >    C:\Users\jenkins\workspace\Lucene-Solr-master-Windows\lucene\build\core\test\J1\temp\lucene.store.TestNIOFSDirectory_BBEC1310C2AF9B08-001\testThreadSafety-001: java.nio.file.AccessDeniedException: C:\Users\jenkins\workspace\Lucene-Solr-master-Windows\lucene\build\core\test\J1\temp\lucene.store.TestNIOFSDirectory_BBEC1310C2AF9B08-001\testThreadSafety-001
   [junit4]    >    C:\Users\jenkins\workspace\Lucene-Solr-master-Windows\lucene\build\core\test\J1\temp\lucene.store.TestNIOFSDirectory_BBEC1310C2AF9B08-001: java.nio.file.DirectoryNotEmptyException: C:\Users\jenkins\workspace\Lucene-Solr-master-Windows\lucene\build\core\test\J1\temp\lucene.store.TestNIOFSDirectory_BBEC1310C2AF9B08-001
   [junit4]    > 	at __randomizedtesting.SeedInfo.seed([BBEC1310C2AF9B08]:0)
   [junit4]    > 	at org.apache.lucene.util.IOUtils.rm(IOUtils.java:329)
   [junit4]    > 	at java.lang.Thread.run(Thread.java:748)
   [junit4] Completed [428/455 (1!)] on J1 in 2.43s, 42 tests, 1 error <<< FAILURES!

[...truncated 10065 lines...]
   [junit4] Suite: org.apache.solr.handler.component.InfixSuggestersTest
   [junit4]   2> 200369 INFO  (SUITE-InfixSuggestersTest-seed#[5273222CF93A20D5]-worker) [    ] o.a.s.SolrTestCaseJ4 SecureRandom sanity checks: test.solr.allowed.securerandom=null & java.security.egd=file:/dev/./urandom
   [junit4]   2> Creating dataDir: C:\Users\jenkins\workspace\Lucene-Solr-master-Windows\solr\build\solr-core\test\J0\temp\solr.handler.component.InfixSuggestersTest_5273222CF93A20D5-001\init-core-data-001
   [junit4]   2> 200370 INFO  (SUITE-InfixSuggestersTest-seed#[5273222CF93A20D5]-worker) [    ] o.a.s.SolrTestCaseJ4 Using PointFields (NUMERIC_POINTS_SYSPROP=true) w/NUMERIC_DOCVALUES_SYSPROP=true
   [junit4]   2> 200372 INFO  (SUITE-InfixSuggestersTest-seed#[5273222CF93A20D5]-worker) [    ] o.a.s.SolrTestCaseJ4 Randomized ssl (false) and clientAuth (false) via: @org.apache.solr.util.RandomizeSSL(reason=, value=NaN, ssl=NaN, clientAuth=NaN)
   [junit4]   2> 200372 INFO  (SUITE-InfixSuggestersTest-seed#[5273222CF93A20D5]-worker) [    ] o.a.s.SolrTestCaseJ4 ####initCore
   [junit4]   2> 200373 INFO  (SUITE-InfixSuggestersTest-seed#[5273222CF93A20D5]-worker) [    ] o.a.s.c.SolrResourceLoader [null] Added 2 libs to classloader, from paths: [/C:/Users/jenkins/workspace/Lucene-Solr-master-Windows/solr/core/src/test-files/solr/collection1/lib, /C:/Users/jenkins/workspace/Lucene-Solr-master-Windows/solr/core/src/test-files/solr/collection1/lib/classes]
   [junit4]   2> 200411 INFO  (SUITE-InfixSuggestersTest-seed#[5273222CF93A20D5]-worker) [    ] o.a.s.c.SolrConfig Using Lucene MatchVersion: 8.0.0
   [junit4]   2> 200418 INFO  (SUITE-InfixSuggestersTest-seed#[5273222CF93A20D5]-worker) [    ] o.a.s.s.IndexSchema [null] Schema name=test
   [junit4]   2> 200483 INFO  (SUITE-InfixSuggestersTest-seed#[5273222CF93A20D5]-worker) [    ] o.a.s.s.IndexSchema Loaded schema test/1.0 with uniqueid field id
   [junit4]   2> 200550 INFO  (SUITE-InfixSuggestersTest-seed#[5273222CF93A20D5]-worker) [    ] o.a.s.m.r.SolrJmxReporter JMX monitoring for 'solr.node' (registry 'solr.node') enabled at server: com.sun.jmx.mbeanserver.JmxMBeanServer@40e935f0
   [junit4]   2> 200555 INFO  (SUITE-InfixSuggestersTest-seed#[5273222CF93A20D5]-worker) [    ] o.a.s.m.r.SolrJmxReporter JMX monitoring for 'solr.jvm' (registry 'solr.jvm') enabled at server: com.sun.jmx.mbeanserver.JmxMBeanServer@40e935f0
   [junit4]   2> 200555 INFO  (SUITE-InfixSuggestersTest-seed#[5273222CF93A20D5]-worker) [    ] o.a.s.m.r.SolrJmxReporter JMX monitoring for 'solr.jetty' (registry 'solr.jetty') enabled at server: com.sun.jmx.mbeanserver.JmxMBeanServer@40e935f0
   [junit4]   2> 200556 INFO  (coreLoadExecutor-580-thread-1) [    ] o.a.s.c.TransientSolrCoreCacheDefault Allocating transient cache for 2147483647 transient cores
   [junit4]   2> 200557 INFO  (coreLoadExecutor-580-thread-1) [    x:collection1] o.a.s.c.SolrResourceLoader [null] Added 2 libs to classloader, from paths: [/C:/Users/jenkins/workspace/Lucene-Solr-master-Windows/solr/core/src/test-files/solr/collection1/lib, /C:/Users/jenkins/workspace/Lucene-Solr-master-Windows/solr/core/src/test-files/solr/collection1/lib/classes]
   [junit4]   2> 200596 INFO  (coreLoadExecutor-580-thread-1) [    x:collection1] o.a.s.c.SolrConfig Using Lucene MatchVersion: 8.0.0
   [junit4]   2> 200602 INFO  (coreLoadExecutor-580-thread-1) [    x:collection1] o.a.s.s.IndexSchema [collection1] Schema name=test
   [junit4]   2> 200654 INFO  (coreLoadExecutor-580-thread-1) [    x:collection1] o.a.s.s.IndexSchema Loaded schema test/1.0 with uniqueid field id
   [junit4]   2> 200663 INFO  (coreLoadExecutor-580-thread-1) [    x:collection1] o.a.s.c.CoreContainer Creating SolrCore 'collection1' using configuration from instancedir C:\Users\jenkins\workspace\Lucene-Solr-master-Windows\solr\core\src\test-files\solr\collection1, trusted=true
   [junit4]   2> 200663 INFO  (coreLoadExecutor-580-thread-1) [    x:collection1] o.a.s.m.r.SolrJmxReporter JMX monitoring for 'solr.core.collection1' (registry 'solr.core.collection1') enabled at server: com.sun.jmx.mbeanserver.JmxMBeanServer@40e935f0
   [junit4]   2> 200681 INFO  (coreLoadExecutor-580-thread-1) [    x:collection1] o.a.s.c.SolrCore solr.RecoveryStrategy.Builder
   [junit4]   2> 200682 INFO  (coreLoadExecutor-580-thread-1) [    x:collection1] o.a.s.c.SolrCore [[collection1] ] Opening new SolrCore at [C:\Users\jenkins\workspace\Lucene-Solr-master-Windows\solr\core\src\test-files\solr\collection1], dataDir=[C:\Users\jenkins\workspace\Lucene-Solr-master-Windows\solr\build\solr-core\test\J0\temp\solr.handler.component.InfixSuggestersTest_5273222CF93A20D5-001\init-core-data-001\]
   [junit4]   2> 200685 INFO  (coreLoadExecutor-580-thread-1) [    x:collection1] o.a.s.u.RandomMergePolicy RandomMergePolicy wrapping class org.apache.lucene.index.TieredMergePolicy: [TieredMergePolicy: maxMergeAtOnce=24, maxMergeAtOnceExplicit=20, maxMergedSegmentMB=39.2724609375, floorSegmentMB=2.0068359375, forceMergeDeletesPctAllowed=11.312336032641578, segmentsPerTier=19.0, maxCFSSegmentSizeMB=8.796093022207999E12, noCFSRatio=0.24377662392982993
   [junit4]   2> 200785 INFO  (coreLoadExecutor-580-thread-1) [    x:collection1] o.a.s.u.CommitTracker Hard AutoCommit: disabled
   [junit4]   2> 200785 INFO  (coreLoadExecutor-580-thread-1) [    x:collection1] o.a.s.u.CommitTracker Soft AutoCommit: disabled
   [junit4]   2> 200787 INFO  (coreLoadExecutor-580-thread-1) [    x:collection1] o.a.s.u.RandomMergePolicy RandomMergePolicy wrapping class org.apache.lucene.index.LogDocMergePolicy: [LogDocMergePolicy: minMergeSize=1000, mergeFactor=32, maxMergeSize=9223372036854775807, maxMergeSizeForForcedMerge=9223372036854775807, calibrateSizeByDeletes=false, maxMergeDocs=2147483647, maxCFSSegmentSizeMB=8.796093022207999E12, noCFSRatio=0.3732053269958546]
   [junit4]   2> 200788 INFO  (coreLoadExecutor-580-thread-1) [    x:collection1] o.a.s.s.SolrIndexSearcher Opening [Searcher@283eca58[collection1] main]
   [junit4]   2> 200788 WARN  (coreLoadExecutor-580-thread-1) [    x:collection1] o.a.s.r.ManagedResourceStorage Cannot write to config directory C:\Users\jenkins\workspace\Lucene-Solr-master-Windows\solr\core\src\test-files\solr\collection1\conf; switching to use InMemory storage instead.
   [junit4]   2> 200788 INFO  (coreLoadExecutor-580-thread-1) [    x:collection1] o.a.s.h.c.SuggestComponent Initializing SuggestComponent
   [junit4]   2> 200797 INFO  (coreLoadExecutor-580-thread-1) [    x:collection1] o.a.s.s.s.SolrSuggester init: {name=shortRandomAnalyzingInfixSuggester,lookupImpl=AnalyzingInfixLookupFactory,dictionaryImpl=RandomTestDictionaryFactory,randDictMaxItems=100,indexPath=short_random_analyzing_infix_suggester,suggestAnalyzerFieldType=text,buildOnCommit=false,buildOnStartup=false}
   [junit4]   2> 200903 INFO  (coreLoadExecutor-580-thread-1) [    x:collection1] o.a.s.s.s.SolrSuggester Dictionary loaded with params: {name=shortRandomAnalyzingInfixSuggester,lookupImpl=AnalyzingInfixLookupFactory,dictionaryImpl=RandomTestDictionaryFactory,randDictMaxItems=100,indexPath=short_random_analyzing_infix_suggester,suggestAnalyzerFieldType=text,buildOnCommit=false,buildOnStartup=false}
   [junit4]   2> 200903 INFO  (coreLoadExecutor-580-thread-1) [    x:collection1] o.a.s.h.c.SuggestComponent Initializing SuggestComponent
   [junit4]   2> 200903 INFO  (coreLoadExecutor-580-thread-1) [    x:collection1] o.a.s.s.s.SolrSuggester init: {name=longRandomAnalyzingInfixSuggester,lookupImpl=AnalyzingInfixLookupFactory,dictionaryImpl=RandomTestDictionaryFactory,randDictMaxItems=100000,indexPath=long_random_analyzing_infix_suggester,suggestAnalyzerFieldType=text,buildOnCommit=false,buildOnStartup=false}
   [junit4]   2> 200905 INFO  (coreLoadExecutor-580-thread-1) [    x:collection1] o.a.s.s.s.SolrSuggester Dictionary loaded with params: {name=longRandomAnalyzingInfixSuggester,lookupImpl=AnalyzingInfixLookupFactory,dictionaryImpl=RandomTestDictionaryFactory,randDictMaxItems=100000,indexPath=long_random_analyzing_infix_suggester,suggestAnalyzerFieldType=text,buildOnCommit=false,buildOnStartup=false}
   [junit4]   2> 200905 INFO  (coreLoadExecutor-580-thread-1) [    x:collection1] o.a.s.h.c.SuggestComponent Initializing SuggestComponent
   [junit4]   2> 200905 INFO  (coreLoadExecutor-580-thread-1) [    x:collection1] o.a.s.s.s.SolrSuggester init: {name=shortRandomBlendedInfixSuggester,lookupImpl=BlendedInfixLookupFactory,dictionaryImpl=RandomTestDictionaryFactory,randDictMaxItems=100,blenderType=position_linear,suggestAnalyzerFieldType=text,indexPath=short_random_blended_infix_suggester,highlight=true,buildOnStartup=false,buildOnCommit=false}
   [junit4]   2> 200981 INFO  (coreLoadExecutor-580-thread-1) [    x:collection1] o.a.s.s.s.SolrSuggester Dictionary loaded with params: {name=shortRandomBlendedInfixSuggester,lookupImpl=BlendedInfixLookupFactory,dictionaryImpl=RandomTestDictionaryFactory,randDictMaxItems=100,blenderType=position_linear,suggestAnalyzerFieldType=text,indexPath=short_random_blended_infix_suggester,highlight=true,buildOnStartup=false,buildOnCommit=false}
   [junit4]   2> 200981 INFO  (coreLoadExecutor-580-thread-1) [    x:collection1] o.a.s.h.ReplicationHandler Commits will be reserved for 10000ms.
   [junit4]   2> 200983 INFO  (searcherExecutor-581-thread-1-processing-x:collection1) [    x:collection1] o.a.s.c.SolrCore [collection1] Registered new searcher Searcher@283eca58[collection1] main{ExitableDirectoryReader(UninvertingDirectoryReader())}
   [junit4]   2> 200985 INFO  (SUITE-InfixSuggestersTest-seed#[5273222CF93A20D5]-worker) [    ] o.a.s.SolrTestCaseJ4 ####initCore end
   [junit4]   2> 200985 INFO  (TEST-InfixSuggestersTest.testAnalyzingInfixSuggesterBuildThenReload-seed#[5273222CF93A20D5]) [    ] o.a.s.SolrTestCaseJ4 ###Starting testAnalyzingInfixSuggesterBuildThenReload
   [junit4]   2> 200990 INFO  (TEST-InfixSuggestersTest.testAnalyzingInfixSuggesterBuildThenReload-seed#[5273222CF93A20D5]) [    ] o.a.s.h.c.SuggestComponent SuggestComponent prepare with : qt=/suggest_analyzing_infix_short_dictionary&suggest=true&suggest.buildAll=true&wt=xml&indent=off
   [junit4]   2> 200990 INFO  (TEST-InfixSuggestersTest.testAnalyzingInfixSuggesterBuildThenReload-seed#[5273222CF93A20D5]) [    ] o.a.s.s.s.SolrSuggester SolrSuggester.build(shortRandomAnalyzingInfixSuggester)
   [junit4]   2> 201076 INFO  (TEST-InfixSuggestersTest.testAnalyzingInfixSuggesterBuildThenReload-seed#[5273222CF93A20D5]) [    ] o.a.s.s.s.RandomTestDictionaryFactory org.apache.solr.spelling.suggest.RandomTestDictionaryFactory$RandomTestDictionary.enabled.shortRandomAnalyzingInfixSuggester disabled after emitting 100 items.
   [junit4]   2> 201149 INFO  (TEST-InfixSuggestersTest.testAnalyzingInfixSuggesterBuildThenReload-seed#[5273222CF93A20D5]) [    ] o.a.s.h.c.SuggestComponent SuggestComponent process with : qt=/suggest_analyzing_infix_short_dictionary&suggest=true&suggest.buildAll=true&wt=xml&indent=off
   [junit4]   2> 201149 INFO  (TEST-InfixSuggestersTest.testAnalyzingInfixSuggesterBuildThenReload-seed#[5273222CF93A20D5]) [    ] o.a.s.c.S.Request [collection1]  webapp=null path=null params={qt=/suggest_analyzing_infix_short_dictionary&suggest.buildAll=true&wt=xml} status=0 QTime=159
   [junit4]   2> 201154 ERROR (TEST-InfixSuggestersTest.testAnalyzingInfixSuggesterBuildThenReload-seed#[5273222CF93A20D5]) [    ] o.a.s.c.CorePropertiesLocator Couldn't load core descriptor from C:\Users\jenkins\workspace\Lucene-Solr-master-Windows\solr\core\src\test-files\solr\collection1\core.properties:java.nio.file.NoSuchFileException: C:\Users\jenkins\workspace\Lucene-Solr-master-Windows\solr\core\src\test-files\solr\collection1\core.properties
   [junit4]   2> 201155 INFO  (TEST-InfixSuggestersTest.testAnalyzingInfixSuggesterBuildThenReload-seed#[5273222CF93A20D5]) [    ] o.a.s.c.SolrResourceLoader [null] Added 2 libs to classloader, from paths: [/C:/Users/jenkins/workspace/Lucene-Solr-master-Windows/solr/core/src/test-files/solr/collection1/lib, /C:/Users/jenkins/workspace/Lucene-Solr-master-Windows/solr/core/src/test-files/solr/collection1/lib/classes]
   [junit4]   2> 201203 INFO  (TEST-InfixSuggestersTest.testAnalyzingInfixSuggesterBuildThenReload-seed#[5273222CF93A20D5]) [    ] o.a.s.c.SolrConfig Using Lucene MatchVersion: 8.0.0
   [junit4]   2> 201222 INFO  (TEST-InfixSuggestersTest.testAnalyzingInfixSuggesterBuildThenReload-seed#[5273222CF93A20D5]) [    ] o.a.s.s.IndexSchema [collection1] Schema name=test
   [junit4]   2> 201278 INFO  (TEST-InfixSuggestersTest.testAnalyzingInfixSuggesterBuildThenReload-seed#[5273222CF93A20D5]) [    ] o.a.s.s.IndexSchema Loaded schema test/1.0 with uniqueid field id
   [junit4]   2> 201288 INFO  (TEST-InfixSuggestersTest.testAnalyzingInfixSuggesterBuildThenReload-seed#[5273222CF93A20D5]) [    ] o.a.s.c.CoreContainer Reloading SolrCore 'collection1' using configuration from instancedir C:\Users\jenkins\workspace\Lucene-Solr-master-Windows\solr\core\src\test-files\solr\collection1
   [junit4]   2> 201307 INFO  (TEST-InfixSuggestersTest.testAnalyzingInfixSuggesterBuildThenReload-seed#[5273222CF93A20D5]) [    x:collection1] o.a.s.m.r.SolrJmxReporter JMX monitoring for 'solr.core.collection1' (registry 'solr.core.collection1') enabled at server: com.sun.jmx.mbeanserver.JmxMBeanServer@40e935f0
   [junit4]   2> 201307 INFO  (TEST-InfixSuggestersTest.testAnalyzingInfixSuggesterBuildThenReload-seed#[5273222CF93A20D5]) [    x:collection1] o.a.s.c.SolrCore [[collection1] ] Opening new SolrCore at [C:\Users\jenkins\workspace\Lucene-Solr-master-Windows\solr\core\src\test-files\solr\collection1], dataDir=[C:\Users\jenkins\workspace\Lucene-Solr-master-Windows\solr\build\solr-core\test\J0\temp\solr.handler.component.InfixSuggestersTest_5273222CF93A20D5-001\init-core-data-001\]
   [junit4]   2> 201375 INFO  (TEST-InfixSuggestersTest.testAnalyzingInfixSuggesterBuildThenReload-seed#[5273222CF93A20D5]) [    x:collection1] o.a.s.u.CommitTracker Hard AutoCommit: disabled
   [junit4]   2> 201376 INFO  (TEST-InfixSuggestersTest.testAnalyzingInfixSuggesterBuildThenReload-seed#[5273222CF93A20D5]) [    x:collection1] o.a.s.u.CommitTracker Soft AutoCommit: disabled
   [junit4]   2> 201378 INFO  (TEST-InfixSuggestersTest.testAnalyzingInfixSuggesterBuildThenReload-seed#[5273222CF93A20D5]) [    x:collection1] o.a.s.s.SolrIndexSearcher Opening [Searcher@6a11994e[collection1] main]
   [junit4]   2> 201379 WARN  (TEST-InfixSuggestersTest.testAnalyzingInfixSuggesterBuildThenReload-seed#[5273222CF93A20D5]) [    x:collection1] o.a.s.r.ManagedResourceStorage Cannot write to config directory C:\Users\jenkins\workspace\Lucene-Solr-master-Windows\solr\core\src\test-files\solr\collection1\conf; switching to use InMemory storage instead.
   [junit4]   2> 201379 INFO  (TEST-InfixSuggestersTest.testAnalyzingInfixSuggesterBuildThenReload-seed#[5273222CF93A20D5]) [    x:collection1] o.a.s.h.c.SuggestComponent Initializing SuggestComponent
   [junit4]   2> 201379 INFO  (TEST-InfixSuggestersTest.testAnalyzingInfixSuggesterBuildThenReload-seed#[5273222CF93A20D5]) [    x:collection1] o.a.s.s.s.SolrSuggester init: {name=shortRandomAnalyzingInfixSuggester,lookupImpl=AnalyzingInfixLookupFactory,dictionaryImpl=RandomTestDictionaryFactory,randDictMaxItems=100,indexPath=short_random_analyzing_infix_suggester,suggestAnalyzerFieldType=text,buildOnCommit=false,buildOnStartup=false}
   [junit4]   2> 201382 INFO  (TEST-InfixSuggestersTest.testAnalyzingInfixSuggesterBuildThenReload-seed#[5273222CF93A20D5]) [    x:collection1] o.a.s.s.s.SolrSuggester Dictionary loaded with params: {name=shortRandomAnalyzingInfixSuggester,lookupImpl=AnalyzingInfixLookupFactory,dictionaryImpl=RandomTestDictionaryFactory,randDictMaxItems=100,indexPath=short_random_analyzing_infix_suggester,suggestAnalyzerFieldType=text,buildOnCommit=false,buildOnStartup=false}
   [junit4]   2> 201382 INFO  (TEST-InfixSuggestersTest.testAnalyzingInfixSuggesterBuildThenReload-seed#[5273222CF93A20D5]) [    x:collection1] o.a.s.h.c.SuggestComponent Initializing SuggestComponent
   [junit4]   2> 201382 INFO  (TEST-InfixSuggestersTest.testAnalyzingInfixSuggesterBuildThenReload-seed#[5273222CF93A20D5]) [    x:collection1] o.a.s.s.s.SolrSuggester init: {name=longRandomAnalyzingInfixSuggester,lookupImpl=AnalyzingInfixLookupFactory,dictionaryImpl=RandomTestDictionaryFactory,randDictMaxItems=100000,indexPath=long_random_analyzing_infix_suggester,suggestAnalyzerFieldType=text,buildOnCommit=false,buildOnStartup=false}
   [junit4]   2> 201383 INFO  (TEST-InfixSuggestersTest.testAnalyzingInfixSuggesterBuildThenReload-seed#[5273222CF93A20D5]) [    x:collection1] o.a.s.s.s.SolrSuggester Dictionary loaded with params: {name=longRandomAnalyzingInfixSuggester,lookupImpl=AnalyzingInfixLookupFactory,dictionaryImpl=RandomTestDictionaryFactory,randDictMaxItems=100000,indexPath=long_random_analyzing_infix_suggester,suggestAnalyzerFieldType=text,buildOnCommit=false,buildOnStartup=false}
   [junit4]   2> 201383 INFO  (TEST-InfixSuggestersTest.testAnalyzingInfixSuggesterBuildThenReload-seed#[5273222CF93A20D5]) [    x:collection1] o.a.s.h.c.SuggestComponent Initializing SuggestComponent
   [junit4]   2> 201383 INFO  (TEST-InfixSuggestersTest.testAnalyzingInfixSuggesterBuildThenReload-seed#[5273222CF93A20D5]) [    x:collection1] o.a.s.s.s.SolrSuggester init: {name=shortRandomBlendedInfixSuggester,lookupImpl=BlendedInfixLookupFactory,dictionaryImpl=RandomTestDictionaryFactory,randDictMaxItems=100,blenderType=position_linear,suggestAnalyzerFieldType=text,indexPath=short_random_blended_infix_suggester,highlight=true,buildOnStartup=false,buildOnCommit=false}
   [junit4]   2> 201383 INFO  (TEST-InfixSuggestersTest.testAnalyzingInfixSuggesterBuildThenReload-seed#[5273222CF93A20D5]) [    x:collection1] o.a.s.s.s.SolrSuggester Dictionary loaded with params: {name=shortRandomBlendedInfixSuggester,lookupImpl=BlendedInfixLookupFactory,dictionaryImpl=RandomTestDictionaryFactory,randDictMaxItems=100,blenderType=position_linear,suggestAnalyzerFieldType=text,indexPath=short_random_blended_infix_suggester,highlight=true,buildOnStartup=false,buildOnCommit=false}
   [junit4]   2> 201383 INFO  (TEST-InfixSuggestersTest.testAnalyzingInfixSuggesterBuildThenReload-seed#[5273222CF93A20D5]) [    x:collection1] o.a.s.h.ReplicationHandler Commits will be reserved for 10000ms.
   [junit4]   2> 201385 INFO  (searcherExecutor-585-thread-1-processing-x:collection1) [    x:collection1] o.a.s.c.SolrCore [collection1] Registered new searcher Searcher@6a11994e[collection1] main{ExitableDirectoryReader(UninvertingDirectoryReader())}
   [junit4]   2> 201385 INFO  (TEST-InfixSuggestersTest.testAnalyzingInfixSuggesterBuildThenReload-seed#[5273222CF93A20D5]) [    x:collection1] o.a.s.u.RandomMergePolicy RandomMergePolicy wrapping class org.apache.lucene.index.TieredMergePolicy: [TieredMergePolicy: maxMergeAtOnce=34, maxMergeAtOnceExplicit=10, maxMergedSegmentMB=86.3955078125, floorSegmentMB=1.732421875, forceMergeDeletesPctAllowed=9.749691368340306, segmentsPerTier=49.0, maxCFSSegmentSizeMB=8.796093022207999E12, noCFSRatio=1.0
   [junit4]   2> 201387 INFO  (TEST-InfixSuggestersTest.testAnalyzingInfixSuggesterBuildThenReload-seed#[5273222CF93A20D5]) [    x:collection1] o.a.s.u.DefaultSolrCoreState New IndexWriter is ready to be used.
   [junit4]   2> 201387 INFO  (TEST-InfixSuggestersTest.testAnalyzingInfixSuggesterBuildThenReload-seed#[5273222CF93A20D5]) [    x:collection1] o.a.s.s.SolrIndexSearcher Opening [Searcher@2131fc53[collection1] main]
   [junit4]   2> 201388 INFO  (TEST-InfixSuggestersTest.testAnalyzingInfixSuggesterBuildThenReload-seed#[5273222CF93A20D5]) [    x:collection1] o.a.s.c.SolrCore [collection1]  CLOSING SolrCore org.apache.solr.core.SolrCore@1ec8974c
   [junit4]   2> 201388 INFO  (TEST-InfixSuggestersTest.testAnalyzingInfixSuggesterBuildThenReload-seed#[5273222CF93A20D5]) [    x:collection1] o.a.s.m.SolrMetricManager Closing metric reporters for registry=solr.core.collection1, tag=516462412
   [junit4]   2> 201388 INFO  (TEST-InfixSuggestersTest.testAnalyzingInfixSuggesterBuildThenReload-seed#[5273222CF93A20D5]) [    x:collection1] o.a.s.m.r.SolrJmxReporter Closing reporter [org.apache.solr.metrics.reporters.SolrJmxReporter@64241cb7: rootName = null, domain = solr.core.collection1, service url = null, agent id = null] for registry solr.core.collection1 / com.codahale.metrics.MetricRegistry@2e656fbb
   [junit4]   2> 201388 INFO  (searcherExecutor-585-thread-1-processing-x:collection1) [    x:collection1] o.a.s.c.SolrCore [collection1] Registered new searcher Searcher@2131fc53[collection1] main{ExitableDirectoryReader(UninvertingDirectoryReader())}
   [junit4]   2> 201393 INFO  (TEST-InfixSuggestersTest.testAnalyzingInfixSuggesterBuildThenReload-seed#[5273222CF93A20D5]) [    x:collection1] o.a.s.SolrTestCaseJ4 ###Ending testAnalyzingInfixSuggesterBuildThenReload
   [junit4]   2> 201393 INFO  (TEST-InfixSuggestersTest.testBlendedInfixSuggesterBuildThenReload-seed#[5273222CF93A20D5]) [    x:collection1] o.a.s.SolrTestCaseJ4 ###Starting testBlendedInfixSuggesterBuildThenReload
   [junit4]   2> 201393 INFO  (TEST-InfixSuggestersTest.testBlendedInfixSuggesterBuildThenReload-seed#[5273222CF93A20D5]) [    x:collection1] o.a.s.h.c.SuggestComponent SuggestComponent prepare with : qt=/suggest_blended_infix_short_dictionary&suggest.onlyMorePopular=true&indent=off&suggest.count=10&suggest=true&suggest.collate=true&suggest.buildAll=true&suggest.dictionary=shortRandomBlendedInfixSuggester&wt=xml
   [junit4]   2> 201393 INFO  (TEST-InfixSuggestersTest.testBlendedInfixSuggesterBuildThenReload-seed#[5273222CF93A20D5]) [    x:collection1] o.a.s.s.s.SolrSuggester SolrSuggester.build(shortRandomBlendedInfixSuggester)
   [junit4]   2> 201425 INFO  (TEST-InfixSuggestersTest.testBlendedInfixSuggesterBuildThenReload-seed#[5273222CF93A20D5]) [    x:collection1] o.a.s.s.s.RandomTestDictionaryFactory org.apache.solr.spelling.suggest.RandomTestDictionaryFactory$RandomTestDictionary.enabled.shortRandomBlendedInfixSuggester disabled after emitting 100 items.
   [junit4]   2> 201459 INFO  (TEST-InfixSuggestersTest.testBlendedInfixSuggesterBuildThenReload-seed#[5273222CF93A20D5]) [    x:collection1] o.a.s.h.c.SuggestComponent SuggestComponent process with : qt=/suggest_blended_infix_short_dictionary&suggest.onlyMorePopular=true&indent=off&suggest.count=10&suggest=true&suggest.collate=true&suggest.buildAll=true&suggest.dictionary=shortRandomBlendedInfixSuggester&wt=xml
   [junit4]   2> 201459 INFO  (TEST-InfixSuggestersTest.testBlendedInfixSuggesterBuildThenReload-seed#[5273222CF93A20D5]) [    x:collection1] o.a.s.c.S.Request [collection1]  webapp=null path=null params={qt=/suggest_blended_infix_short_dictionary&suggest.buildAll=true&wt=xml} status=0 QTime=63
   [junit4]   2> 201460 ERROR (TEST-InfixSuggestersTest.testBlendedInfixSuggesterBuildThenReload-seed#[5273222CF93A20D5]) [    x:collection1] o.a.s.c.CorePropertiesLocator Couldn't load core descriptor from C:\Users\jenkins\workspace\Lucene-Solr-master-Windows\solr\core\src\test-files\solr\collection1\core.properties:java.nio.file.NoSuchFileException: C:\Users\jenkins\workspace\Lucene-Solr-master-Windows\solr\core\src\test-files\solr\collection1\core.properties
   [junit4]   2> 201461 INFO  (TEST-InfixSuggestersTest.testBlendedInfixSuggesterBuildThenReload-seed#[5273222CF93A20D5]) [    x:collection1] o.a.s.c.SolrResourceLoader [null] Added 2 libs to classloader, from paths: [/C:/Users/jenkins/workspace/Lucene-Solr-master-Windows/solr/core/src/test-files/solr/collection1/lib, /C:/Users/jenkins/workspace/Lucene-Solr-master-Windows/solr/core/src/test-files/solr/collection1/lib/classes]
   [junit4]   2> 201510 INFO  (TEST-InfixSuggestersTest.testBlendedInfixSuggesterBuildThenReload-seed#[5273222CF93A20D5]) [    x:collection1] o.a.s.c.SolrConfig Using Lucene MatchVersion: 8.0.0
   [junit4]   2> 201518 INFO  (TEST-InfixSuggestersTest.testBlendedInfixSuggesterBuildThenReload-seed#[5273222CF93A20D5]) [    x:collection1] o.a.s.s.IndexSchema [collection1] Schema name=test
   [junit4]   2> 201581 INFO  (TEST-InfixSuggestersTest.testBlendedInfixSuggesterBuildThenReload-seed#[5273222CF93A20D5]) [    x:collection1] o.a.s.s.IndexSchema Loaded schema test/1.0 with uniqueid field id
   [junit4]   2> 201590 INFO  (TEST-InfixSuggestersTest.testBlendedInfixSuggesterBuildThenReload-seed#[5273222CF93A20D5]) [    x:collection1] o.a.s.c.CoreContainer Reloading SolrCore 'collection1' using configuration from instancedir C:\Users\jenkins\workspace\Lucene-Solr-master-Windows\solr\core\src\test-files\solr\collection1
   [junit4]   2> 201607 INFO  (TEST-InfixSuggestersTest.testBlendedInfixSuggesterBuildThenReload-seed#[5273222CF93A20D5]) [    x:collection1] o.a.s.m.r.SolrJmxReporter JMX monitoring for 'solr.core.collection1' (registry 'solr.core.collection1') enabled at server: com.sun.jmx.mbeanserver.JmxMBeanServer@40e935f0
   [junit4]   2> 201607 INFO  (TEST-InfixSuggestersTest.testBlendedInfixSuggesterBuildThenReload-seed#[5273222CF93A20D5]) [    x:collection1] o.a.s.c.SolrCore [[collection1] ] Opening new SolrCore at [C:\Users\jenkins\workspace\Lucene-Solr-master-Windows\solr\core\src\test-files\solr\collection1], dataDir=[C:\Users\jenkins\workspace\Lucene-Solr-master-Windows\solr\build\solr-core\test\J0\temp\solr.handler.component.InfixSuggestersTest_5273222CF93A20D5-001\init-core-data-001\]
   [junit4]   2> 201673 INFO  (TEST-InfixSuggestersTest.testBlendedInfixSuggesterBuildThenReload-seed#[5273222CF93A20D5]) [    x:collection1] o.a.s.u.CommitTracker Hard AutoCommit: disabled
   [junit4]   2> 201673 INFO  (TEST-InfixSuggestersTest.testBlendedInfixSuggesterBuildThenReload-seed#[5273222CF93A20D5]) [    x:collection1] o.a.s.u.CommitTracker Soft AutoCommit: disabled
   [junit4]   2> 201674 INFO  (TEST-InfixSuggestersTest.testBlendedInfixSuggesterBuildThenReload-seed#[5273222CF93A20D5]) [    x:collection1] o.a.s.s.SolrIndexSearcher Opening [Searcher@7d508c09[collection1] main]
   [junit4]   2> 201674 WARN  (TEST-InfixSuggestersTest.testBlendedInfixSuggesterBuildThenReload-seed#[5273222CF93A20D5]) [    x:collection1] o.a.s.r.ManagedResourceStorage Cannot write to config directory C:\Users\jenkins\workspace\Lucene-Solr-master-Windows\solr\core\src\test-files\solr\collection1\conf; switching to use InMemory storage instead.
   [junit4]   2> 201675 INFO  (TEST-InfixSuggestersTest.testBlendedInfixSuggesterBuildThenReload-seed#[5273222CF93A20D5]) [    x:collection1] o.a.s.h.c.SuggestComponent Initializing SuggestComponent
   [junit4]   2> 201675 INFO  (TEST-InfixSuggestersTest.testBlendedInfixSuggesterBuildThenReload-seed#[5273222CF93A20D5]) [    x:collection1] o.a.s.s.s.SolrSuggester init: {name=shortRandomAnalyzingInfixSuggester,lookupImpl=AnalyzingInfixLookupFactory,dictionaryImpl=RandomTestDictionaryFactory,randDictMaxItems=100,indexPath=short_random_analyzing_infix_suggester,suggestAnalyzerFieldType=text,buildOnCommit=false,buildOnStartup=false}
   [junit4]   2> 201677 INFO  (TEST-InfixSuggestersTest.testBlendedInfixSuggesterBuildThenReload-seed#[5273222CF93A20D5]) [    x:collection1] o.a.s.s.s.SolrSuggester Dictionary loaded with params: {name=shortRandomAnalyzingInfixSuggester,lookupImpl=AnalyzingInfixLookupFactory,dictionaryImpl=RandomTestDictionaryFactory,randDictMaxItems=100,indexPath=short_random_analyzing_infix_suggester,suggestAnalyzerFieldType=text,buildOnCommit=false,buildOnStartup=false}
   [junit4]   2> 201677 INFO  (TEST-InfixSuggestersTest.testBlendedInfixSuggesterBuildThenReload-seed#[5273222CF93A20D5]) [    x:collection1] o.a.s.h.c.SuggestComponent Initializing SuggestComponent
   [junit4]   2> 201677 INFO  (TEST-InfixSuggestersTest.testBlendedInfixSuggesterBuildThenReload-seed#[5273222CF93A20D5]) [    x:collection1] o.a.s.s.s.SolrSuggester init: {name=longRandomAnalyzingInfixSuggester,lookupImpl=AnalyzingInfixLookupFactory,dictionaryImpl=RandomTestDictionaryFactory,randDictMaxItems=100000,indexPath=long_random_analyzing_infix_suggester,suggestAnalyzerFieldType=text,buildOnCommit=false,buildOnStartup=false}
   [junit4]   2> 201678 INFO  (TEST-InfixSuggestersTest.testBlendedInfixSuggesterBuildThenReload-seed#[5273222CF93A20D5]) [    x:collection1] o.a.s.s.s.SolrSuggester Dictionary loaded with params: {name=longRandomAnalyzingInfixSuggester,lookupImpl=AnalyzingInfixLookupFactory,dictionaryImpl=RandomTestDictionaryFactory,randDictMaxItems=100000,indexPath=long_random_analyzing_infix_suggester,suggestAnalyzerFieldType=text,buildOnCommit=false,buildOnStartup=false}
   [junit4]   2> 201678 INFO  (TEST-InfixSuggestersTest.testBlendedInfixSuggesterBuildThenReload-seed#[5273222CF93A20D5]) [    x:collection1] o.a.s.h.c.SuggestComponent Initializing SuggestComponent
   [junit4]   2> 201678 INFO  (TEST-InfixSuggestersTest.testBlendedInfixSuggesterBuildThenReload-seed#[5273222CF93A20D5]) [    x:collection1] o.a.s.s.s.SolrSuggester init: {name=shortRandomBlendedInfixSuggester,lookupImpl=BlendedInfixLookupFactory,dictionaryImpl=RandomTestDictionaryFactory,randDictMaxItems=100,blenderType=position_linear,suggestAnalyzerFieldType=text,indexPath=short_random_blended_infix_suggester,highlight=true,buildOnStartup=false,buildOnCommit=false}
   [junit4]   2> 201681 INFO  (TEST-InfixSuggestersTest.testBlendedInfixSuggesterBuildThenReload-seed#[5273222CF93A20D5]) [    x:collection1] o.a.s.s.s.SolrSuggester Dictionary loaded with params: {name=shortRandomBlendedInfixSuggester,lookupImpl=BlendedInfixLookupFactory,dictionaryImpl=RandomTestDictionaryFactory,randDictMaxItems=100,blenderType=position_linear,suggestAnalyzerFieldType=text,indexPath=short_random_blended_infix_suggester,highlight=true,buildOnStartup=false,buildOnCommit=false}
   [junit4]   2> 201681 INFO  (TEST-InfixSuggestersTest.testBlendedInfixSuggesterBuildThenReload-seed#[5273222CF93A20D5]) [    x:collection1] o.a.s.h.ReplicationHandler Commits will be reserved for 10000ms.
   [junit4]   2> 201682 INFO  (TEST-InfixSuggestersTest.testBlendedInfixSuggesterBuildThenReload-seed#[5273222CF93A20D5]) [    x:collection1] o.a.s.u.RandomMergePolicy RandomMergePolicy wrapping class org.apache.lucene.index.LogDocMergePolicy: [LogDocMergePolicy: minMergeSize=1000, mergeFactor=22, maxMergeSize=9223372036854775807, maxMergeSizeForForcedMerge=9223372036854775807, calibrateSizeByDeletes=false, maxMergeDocs=2147483647, maxCFSSegmentSizeMB=8.796093022207999E12, noCFSRatio=0.0]
   [junit4]   2> 201683 INFO  (searcherExecutor-589-thread-1-processing-x:collection1) [    x:collection1] o.a.s.c.SolrCore [collection1] Registered new searcher Searcher@7d508c09[collection1] main{ExitableDirectoryReader(UninvertingDirectoryReader())}
   [junit4]   2> 201684 INFO  (TEST-InfixSuggestersTest.testBlendedInfixSuggesterBuildThenReload-seed#[5273222CF93A20D5]) [    x:collection1] o.a.s.u.DefaultSolrCoreState New IndexWriter is ready to be used.
   [junit4]   2> 201684 INFO  (TEST-InfixSuggestersTest.testBlendedInfixSuggesterBuildThenReload-seed#[5273222CF93A20D5]) [    x:collection1] o.a.s.s.SolrIndexSearcher Opening [Searcher@3cb6353b[collection1] main]
   [junit4]   2> 201684 INFO  (TEST-InfixSuggestersTest.testBlendedInfixSuggesterBuildThenReload-seed#[5273222CF93A20D5]) [    x:collection1] o.a.s.c.SolrCore [collection1]  CLOSING SolrCore org.apache.solr.core.SolrCore@325c5b12
   [junit4]   2> 201684 INFO  (TEST-InfixSuggestersTest.testBlendedInfixSuggesterBuildThenReload-seed#[5273222CF93A20D5]) [    x:collection1] o.a.s.m.SolrMetricManager Closing metric reporters for registry=solr.core.collection1, tag=844913426
   [junit4]   2> 201684 INFO  (TEST-InfixSuggestersTest.testBlendedInfixSuggesterBuildThenReload-seed#[5273222CF93A20D5]) [    x:collection1] o.a.s.m.r.SolrJmxReporter Closing reporter [org.apache.solr.metrics.reporters.SolrJmxReporter@1410d8e6: rootName = null, domain = solr.core.collection1, service url = null, agent id = null] for registry solr.core.collection1 / com.codahale.metrics.MetricRegistry@2e656fbb
   [junit4]   2> 201686 INFO  (searcherExecutor-589-thread-1-processing-x:collection1) [    x:collection1] o.a.s.c.SolrCore [collection1] Registered new searcher Searcher@3cb6353b[collection1] main{ExitableDirectoryReader(UninvertingDirectoryReader())}
   [junit4]   2> 201690 INFO  (TEST-InfixSuggestersTest.testBlendedInfixSuggesterBuildThenReload-seed#[5273222CF93A20D5]) [    x:collection1] o.a.s.SolrTestCaseJ4 ###Ending testBlendedInfixSuggesterBuildThenReload
   [junit4]   2> 201692 INFO  (TEST-InfixSuggestersTest.testTwoSuggestersBuildThenReload-seed#[5273222CF93A20D5]) [    x:collection1] o.a.s.SolrTestCaseJ4 ###Starting testTwoSuggestersBuildThenReload
   [junit4]   2> 201692 INFO  (TEST-InfixSuggestersTest.testTwoSuggestersBuildThenReload-seed#[5273222CF93A20D5]) [    x:collection1] o.a.s.h.c.SuggestComponent SuggestComponent prepare with : qt=/suggest_analyzing_infix_short_dictionary&suggest=true&suggest.buildAll=true&wt=xml&indent=off
   [junit4]   2> 201692 INFO  (TEST-InfixSuggestersTest.testTwoSuggestersBuildThenReload-seed#[5273222CF93A20D5]) [    x:collection1] o.a.s.s.s.SolrSuggester SolrSuggester.build(shortRandomAnalyzingInfixSuggester)
   [junit4]   2> 201701 INFO  (TEST-InfixSuggestersTest.testTwoSuggestersBuildThenReload-seed#[5273222CF93A20D5]) [    x:collection1] o.a.s.s.s.RandomTestDictionaryFactory org.apache.solr.spelling.suggest.RandomTestDictionaryFactory$RandomTestDictionary.enabled.shortRandomAnalyzingInfixSuggester disabled after emitting 100 items.
   [junit4]   2> 201725 INFO  (TEST-InfixSuggestersTest.testTwoSuggestersBuildThenReload-seed#[5273222CF93A20D5]) [    x:collection1] o.a.s.h.c.SuggestComponent SuggestComponent process with : qt=/suggest_analyzing_infix_short_dictionary&suggest=true&suggest.buildAll=true&wt=xml&indent=off
   [junit4]   2> 201725 INFO  (TEST-InfixSuggestersTest.testTwoSuggestersBuildThenReload-seed#[5273222CF93A20D5]) [    x:collection1] o.a.s.c.S.Request [collection1]  webapp=null path=null params={qt=/suggest_analyzing_infix_short_dictionary&suggest.buildAll=true&wt=xml} status=0 QTime=33
   [junit4]   2> 201726 ERROR (TEST-InfixSuggestersTest.testTwoSuggestersBuildThenReload-seed#[5273222CF93A20D5]) [    x:collection1] o.a.s.c.CorePropertiesLocator Couldn't load core descriptor from C:\Users\jenkins\workspace\Lucene-Solr-master-Windows\solr\core\src\test-files\solr\collection1\core.properties:java.nio.file.NoSuchFileException: C:\Users\jenkins\workspace\Lucene-Solr-master-Windows\solr\core\src\test-files\solr\collection1\core.properties
   [junit4]   2> 201727 INFO  (TEST-InfixSuggestersTest.testTwoSuggestersBuildThenReload-seed#[5273222CF93A20D5]) [    x:collection1] o.a.s.c.SolrResourceLoader [null] Added 2 libs to classloader, from paths: [/C:/Users/jenkins/workspace/Lucene-Solr-master-Windows/solr/core/src/test-files/solr/collection1/lib, /C:/Users/jenkins/workspace/Lucene-Solr-master-Windows/solr/core/src/test-files/solr/collection1/lib/classes]
   [junit4]   2> 201768 INFO  (TEST-InfixSuggestersTest.testTwoSuggestersBuildThenReload-seed#[5273222CF93A20D5]) [    x:collection1] o.a.s.c.SolrConfig Using Lucene MatchVersion: 8.0.0
   [junit4]   2> 201775 INFO  (TEST-InfixSuggestersTest.testTwoSuggestersBuildThenReload-seed#[5273222CF93A20D5]) [    x:collection1] o.a.s.s.IndexSchema [collection1] Schema name=test
   [junit4]   2> 201837 INFO  (TEST-InfixSuggestersTest.testTwoSuggestersBuildThenReload-seed#[5273222CF93A20D5]) [    x:collection1] o.a.s.s.IndexSchema Loaded schema test/1.0 with uniqueid field id
   [junit4]   2> 201847 INFO  (TEST-InfixSuggestersTest.testTwoSuggestersBuildThenReload-seed#[5273222CF93A20D5]) [    x:collection1] o.a.s.c.CoreContainer Reloading SolrCore 'collection1' using configuration from instancedir C:\Users\jenkins\workspace\Lucene-Solr-master-Windows\solr\core\src\test-files\solr\collection1
   [junit4]   2> 201865 INFO  (TEST-InfixSuggestersTest.testTwoSuggestersBuildThenReload-seed#[5273222CF93A20D5]) [    x:collection1] o.a.s.m.r.SolrJmxReporter JMX monitoring for 'solr.core.collection1' (registry 'solr.core.collection1') enabled at server: com.sun.jmx.mbeanserver.JmxMBeanServer@40e935f0
   [junit4]   2> 201865 INFO  (TEST-InfixSuggestersTest.testTwoSuggestersBuildThenReload-seed#[5273222CF93A20D5]) [    x:collection1] o.a.s.c.SolrCore [[collection1] ] Opening new SolrCore at [C:\Users\jenkins\workspace\Lucene-Solr-master-Windows\solr\core\src\test-files\solr\collection1], dataDir=[C:\Users\jenkins\workspace\Lucene-Solr-master-Windows\solr\build\solr-core\test\J0\temp\solr.handler.component.InfixSuggestersTest_5273222CF93A20D5-001\init-core-data-001\]
   [junit4]   2> 201930 INFO  (TEST-InfixSuggestersTest.testTwoSuggestersBuildThenReload-seed#[5273222CF93A20D5]) [    x:collection1] o.a.s.u.CommitTracker Hard AutoCommit: disabled
   [junit4]   2> 201930 INFO  (TEST-InfixSuggestersTest.testTwoSuggestersBuildThenReload-seed#[5273222CF93A20D5]) [    x:collection1] o.a.s.u.CommitTracker Soft AutoCommit: disabled
   [junit4]   2> 201931 INFO  (TEST-InfixSuggestersTest.testTwoSuggestersBuildThenReload-seed#[5273222CF93A20D5]) [    x:collection1] o.a.s.s.SolrIndexSearcher Opening [Searcher@10e2fd11[collection1] main]
   [junit4]   2> 201931 WARN  (TEST-InfixSuggestersTest.testTwoSuggestersBuildThenReload-seed#[5273222CF93A20D5]) [    x:collection1] o.a.s.r.ManagedResourceStorage Cannot write to config directory C:\Users\jenkins\workspace\Lucene-Solr-master-Windows\solr\core\src\test-files\solr\collection1\conf; switching to use InMemory storage instead.
   [junit4]   2> 201931 INFO  (TEST-InfixSuggestersTest.testTwoSuggestersBuildThenReload-seed#[5273222CF93A20D5]) [    x:collection1] o.a.s.h.c.SuggestComponent Initializing SuggestComponent
   [junit4]   2> 201931 INFO  (TEST-InfixSuggestersTest.testTwoSuggestersBuildThenReload-seed#[5273222CF93A20D5]) [    x:collection1] o.a.s.s.s.SolrSuggester init: {name=shortRandomAnalyzingInfixSuggester,lookupImpl=AnalyzingInfixLookupFactory,dictionaryImpl=RandomTestDictionaryFactory,randDictMaxItems=100,indexPath=short_random_analyzing_infix_suggester,suggestAnalyzerFieldType=text,buildOnCommit=false,buildOnStartup=false}
   [junit4]   2> 201934 INFO  (TEST-InfixSuggestersTest.testTwoSuggestersBuildThenReload-seed#[5273222CF93A20D5]) [    x:collection1] o.a.s.s.s.SolrSuggester Dictionary loaded with params: {name=shortRandomAnalyzingInfixSuggester,lookupImpl=AnalyzingInfixLookupFactory,dictionaryImpl=RandomTestDictionaryFactory,randDictMaxItems=100,indexPath=short_random_analyzing_infix_suggester,suggestAnalyzerFieldType=text,buildOnCommit=false,buildOnStartup=false}
   [junit4]   2> 201934 INFO  (TEST-InfixSuggestersTest.testTwoSuggestersBuildThenReload-seed#[5273222CF93A20D5]) [    x:collection1] o.a.s.h.c.SuggestComponent Initializing SuggestComponent
   [junit4]   2> 201934 INFO  (TEST-InfixSuggestersTest.testTwoSuggestersBuildThenReload-seed#[5273222CF93A20D5]) [    x:collection1] o.a.s.s.s.SolrSuggester init: {name=longRandomAnalyzingInfixSuggester,lookupImpl=AnalyzingInfixLookupFactory,dictionaryImpl=RandomTestDictionaryFactory,randDictMaxItems=100000,indexPath=long_random_analyzing_infix_suggester,suggestAnalyzerFieldType=text,buildOnCommit=false,buildOnStartup=false}
   [junit4]   2> 201934 INFO  (TEST-InfixSuggestersTest.testTwoSuggestersBuildThenReload-seed#[5273222CF93A20D5]) [    x:collection1] o.a.s.s.s.SolrSuggester Dictionary loaded with params: {name=longRandomAnalyzingInfixSuggester,lookupImpl=AnalyzingInfixLookupFactory,dictionaryImpl=RandomTestDictionaryFactory,randDictMaxItems=100000,indexPath=long_random_analyzing_infix_suggester,suggestAnalyzerFieldType=text,buildOnCommit=false,buildOnStartup=false}
   [junit4]   2> 201934 INFO  (TEST-InfixSuggestersTest.testTwoSuggestersBuildThenReload-seed#[5273222CF93A20D5]) [    x:collection1] o.a.s.h.c.SuggestComponent Initializing SuggestComponent
   [junit4]   2> 201934 INFO  (TEST-InfixSuggestersTest.testTwoSuggestersBuildThenReload-seed#[5273222CF93A20D5]) [    x:collection1] o.a.s.s.s.SolrSuggester init: {name=shortRandomBlendedInfixSuggester,lookupImpl=BlendedInfixLookupFactory,dictionaryImpl=RandomTestDictionaryFactory,randDictMaxItems=100,blenderType=position_linear,suggestAnalyzerFieldType=text,indexPath=short_random_blended_infix_suggester,highlight=true,buildOnStartup=false,buildOnCommit=false}
   [junit4]   2> 201937 INFO  (TEST-InfixSuggestersTest.testTwoSuggestersBuildThenReload-seed#[5273222CF93A20D5]) [    x:collection1] o.a.s.s.s.SolrSuggester Dictionary loaded with params: {name=shortRandomBlendedInfixSuggester,lookupImpl=BlendedInfixLookupFactory,dictionaryImpl=RandomTestDictionaryFactory,randDictMaxItems=100,blenderType=position_linear,suggestAnalyzerFieldType=text,indexPath=short_random_blended_infix_suggester,highlight=true,buildOnStartup=false,buildOnCommit=false}
   [junit4]   2> 201937 INFO  (TEST-InfixSuggestersTest.testTwoSuggestersBuildThenReload-seed#[5273222CF93A20D5]) [    x:collection1] o.a.s.h.ReplicationHandler Commits will be reserved for 10000ms.
   [junit4]   2> 201940 INFO  (searcherExecutor-593-thread-1-processing-x:collection1) [    x:collection1] o.a.s.c.SolrCore [collection1] Registered new searcher Searcher@10e2fd11[collection1] main{ExitableDirectoryReader(UninvertingDirectoryReader())}
   [junit4]   2> 201940 INFO  (TEST-InfixSuggestersTest.testTwoSuggestersBuildThenReload-seed#[5273222CF93A20D5]) [    x:collection1] o.a.s.u.RandomMergePolicy RandomMergePolicy wrapping class org.apache.lucene.index.TieredMergePolicy: [TieredMergePolicy: maxMergeAtOnce=10, maxMergeAtOnceExplicit=37, maxMergedSegmentMB=10.5126953125, floorSegmentMB=0.52734375, forceMergeDeletesPctAllowed=12.18236679924149, segmentsPerTier=20.0, maxCFSSegmentSizeMB=8.796093022207999E12, noCFSRatio=0.0
   [junit4]   2> 201941 INFO  (TEST-InfixSuggestersTest.testTwoSuggestersBuildThenReload-seed#[5273222CF93A20D5]) [    x:collection1] o.a.s.u.DefaultSolrCoreState New IndexWriter is ready to be used.
   [junit4]   2> 201941 INFO  (TEST-InfixSuggestersTest.testTwoSuggestersBuildThenReload-seed#[5273222CF93A20D5]) [    x:collection1] o.a.s.s.SolrIndexSearcher Opening [Searcher@4b58383[collection1] main]
   [junit4]   2> 201941 INFO  (TEST-InfixSuggestersTest.testTwoSuggestersBuildThenReload-seed#[5273222CF93A20D5]) [    x:collection1] o.a.s.c.SolrCore [collection1]  CLOSING SolrCore org.apache.solr.core.SolrCore@4aee4829
   [junit4]   2> 201941 INFO  (TEST-InfixSuggestersTest.testTwoSuggestersBuildThenReload-seed#[5273222CF93A20D5]) [    x:collection1] o.a.s.m.SolrMetricManager Closing metric reporters for registry=solr.core.collection1, tag=1257130025
   [junit4]   2> 201941 INFO  (TEST-InfixSuggestersTest.testTwoSuggestersBuildThenReload-seed#[5273222CF93A20D5]) [    x:collection1] o.a.s.m.r.SolrJmxReporter Closing reporter [org.apache.solr.metrics.reporters.SolrJmxReporter@126dfac5: rootName = null, domain = solr.core.collection1, service url = null, agent id = null] for registry solr.core.collection1 / com.codahale.metrics.MetricRegistry@2e656fbb
   [junit4]   2> 201946 INFO  (searcherExecutor-593-thread-1-processing-x:collection1) [    x:collection1] o.a.s.c.SolrCore [collection1] Registered new searcher Searcher@4b58383[collection1] main{ExitableDirectoryReader(UninvertingDirectoryReader())}
   [junit4]   2> 201948 INFO  (TEST-InfixSuggestersTest.testTwoSuggestersBuildThenReload-seed#[5273222CF93A20D5]) [    x:collection1] o.a.s.h.c.SuggestComponent SuggestComponent prepare with : qt=/suggest_blended_infix_short_dictionary&suggest.onlyMorePopular=true&indent=off&suggest.count=10&suggest=true&suggest.collate=true&suggest.buildAll=true&suggest.dictionary=shortRandomBlendedInfixSuggester&wt=xml
   [junit4]   2> 201948 INFO  (TEST-InfixSuggestersTest.testTwoSuggestersBuildThenReload-seed#[5273222CF93A20D5]) [    x:collection1] o.a.s.s.s.SolrSuggester SolrSuggester.build(shortRandomBlendedInfixSuggester)
   [junit4]   2> 201964 INFO  (TEST-InfixSuggestersTest.testTwoSuggestersBuildThenReload-seed#[5273222CF93A20D5]) [    x:collection1] o.a.s.s.s.RandomTestDictionaryFactory org.apache.solr.spelling.suggest.RandomTestDictionaryFactory$RandomTestDictionary.enabled.shortRandomBlendedInfixSuggester disabled after emitting 100 items.
   [junit4]   2> 201989 INFO  (TEST-InfixSuggestersTest.testTwoSuggestersBuildThenReload-seed#[5273222CF93A20D5]) [    x:collection1] o.a.s.h.c.SuggestComponent SuggestComponent process with : qt=/suggest_blended_infix_short_dictionary&suggest.onlyMorePopular=true&indent=off&suggest.count=10&suggest=true&suggest.collate=true&suggest.buildAll=true&suggest.dictionary=shortRandomBlendedInfixSuggester&wt=xml
   [junit4]   2> 201989 INFO  (TEST-InfixSuggestersTest.testTwoSuggestersBuildThenReload-seed#[5273222CF93A20D5]) [    x:collection1] o.a.s.c.S.Request [collection1]  webapp=null path=null params={qt=/suggest_blended_infix_short_dictionary&suggest.buildAll=true&wt=xml} status=0 QTime=41
   [junit4]   2> 201990 ERROR (TEST-InfixSuggestersTest.testTwoSuggestersBuildThenReload-seed#[5273222CF93A20D5]) [    x:collection1] o.a.s.c.CorePropertiesLocator Couldn't load core descriptor from C:\Users\jenkins\workspace\Lucene-Solr-master-Windows\solr\core\src\test-files\solr\collection1\core.properties:java.nio.file.NoSuchFileException: C:\Users\jenkins\workspace\Lucene-Solr-master-Windows\solr\core\src\test-files\solr\collection1\core.properties
   [junit4]   2> 201991 INFO  (TEST-InfixSuggestersTest.testTwoSuggestersBuildThenReload-seed#[5273222CF93A20D5]) [    x:collection1] o.a.s.c.SolrResourceLoader [null] Added 2 libs to classloader, from paths: [/C:/Users/jenkins/workspace/Lucene-Solr-master-Windows/solr/core/src/test-files/solr/collection1/lib, /C:/Users/jenkins/workspace/Lucene-Solr-master-Windows/solr/core/src/test-files/solr/collection1/lib/classes]
   [junit4]   2> 202032 INFO  (TEST-InfixSuggestersTest.testTwoSuggestersBuildThenReload-seed#[5273222CF93A20D5]) [    x:collection1] o.a.s.c.SolrConfig Using Lucene MatchVersion: 8.0.0
   [junit4]   2> 202040 INFO  (TEST-InfixSuggestersTest.testTwoSuggestersBuildThenReload-seed#[5273222CF93A20D5]) [    x:collection1] o.a.s.s.IndexSchema [collection1] Schema name=test
   [junit4]   2> 202090 INFO  (TEST-InfixSuggestersTest.testTwoSuggestersBuildThenReload-seed#[5273222CF93A20D5]) [    x:collection1] o.a.s.s.IndexSchema Loaded schema test/1.0 with uniqueid field id
   [junit4]   2> 202099 INFO  (TEST-InfixSuggestersTest.testTwoSuggestersBuildThenReload-seed#[5273222CF93A20D5]) [    x:collection1] o.a.s.c.CoreContainer Reloading SolrCore 'collection1' using configuration from instancedir C:\Users\jenkins\workspace\Lucene-Solr-master-Windows\solr\core\src\test-files\solr\collection1
   [junit4]   2> 202116 INFO  (TEST-InfixSuggestersTest.testTwoSuggestersBuildThenReload-seed#[5273222CF93A20D5]) [    x:collection1] o.a.s.m.r.SolrJmxReporter JMX monitoring for 'solr.core.collection1' (registry 'solr.core.collection1') enabled at server: com.sun.jmx.mbeanserver.JmxMBeanServer@40e935f0
   [junit4]   2> 202116 INFO  (TEST-InfixSuggestersTest.testTwoSuggestersBuildThenReload-seed#[5273222CF93A20D5]) [    x:collection1] o.a.s.c.SolrCore [[collection1] ] Opening new SolrCore at [C:\Users\jenkins\workspace\Lucene-Solr-master-Windows\solr\core\src\test-files\solr\collection1], dataDir=[C:\Users\jenkins\workspace\Lucene-Solr-master-Windows\solr\build\solr-core\test\J0\temp\solr.handler.component.InfixSuggestersTest_5273222CF93A20D5-001\init-core-data-001\]
   [junit4]   2> 202182 INFO  (TEST-InfixSuggestersTest.testTwoSuggestersBuildThenReload-seed#[5273222CF93A20D5]) [    x:collection1] o.a.s.u.CommitTracker Hard AutoCommit: disabled
   [junit4]   2> 202182 INFO  (TEST-InfixSuggestersTest.testTwoSuggestersBuildThenReload-seed#[5273222CF93A20D5]) [    x:collection1] o.a.s.u.CommitTracker Soft AutoCommit: disabled
   [junit4]   2> 202183 INFO  (TEST-InfixSuggestersTest.testTwoSuggestersBuildThenReload-seed#[5273222CF93A20D5]) [    x:collection1] o.a.s.s.SolrIndexSearcher Opening [Searcher@35154eca[collection1] main]
   [junit4]   2> 202183 WARN  (TEST-InfixSuggestersTest.testTwoSuggestersBuildThenReload-seed#[5273222CF93A20D5]) [    x:collection1] o.a.s.r.ManagedResourceStorage Cannot write to config directory C:\Users\jenkins\workspace\Lucene-Solr-master-Windows\solr\core\src\test-files\solr\collection1\conf; switching to use InMemory storage instead.
   [junit4]   2> 202184 INFO  (TEST-InfixSuggestersTest.testTwoSuggestersBuildThenReload-seed#[5273222CF93A20D5]) [    x:collection1] o.a.s.h.c.SuggestComponent Initializing SuggestComponent
   [junit4]   2> 202184 INFO  (TEST-InfixSuggestersTest.testTwoSuggestersBuildThenReload-seed#[5273222CF93A20D5]) [    x:collection1] o.a.s.s.s.SolrSuggester init: {name=shortRandomAnalyzingInfixSuggester,lookupImpl=AnalyzingInfixLookupFactory,dictionaryImpl=RandomTestDictionaryFactory,randDictMaxItems=100,indexPath=short_random_analyzing_infix_suggester,suggestAnalyzerFieldType=text,buildOnCommit=false,buildOnStartup=false}
   [junit4]   2> 202187 INFO  (TEST-InfixSuggestersTest.testTwoSuggestersBuildThenReload-seed#[5273222CF93A20D5]) [    x:collection1] o.a.s.s.s.SolrSuggester Dictionary loaded with params: {name=shortRandomAnalyzingInfixSuggester,lookupImpl=AnalyzingInfixLookupFactory,dictionaryImpl=RandomTestDictionaryFactory,randDictMaxItems=100,indexPath=short_random_analyzing_infix_suggester,suggestAnalyzerFieldType=text,buildOnCommit=false,buildOnStartup=false}
   [junit4]   2> 202187 INFO  (TEST-InfixSuggestersTest.testTwoSuggestersBuildThenReload-seed#[5273222CF93A20D5]) [    x:collection1] o.a.s.h.c.SuggestComponent Initializing SuggestComponent
   [junit4]   2> 202187 INFO  (TEST-InfixSuggestersTest.testTwoSuggestersBuildThenReload-seed#[5273222CF93A20D5]) [    x:collection1] o.a.s.s.s.SolrSuggester init: {name=longRandomAnalyzingInfixSuggester,lookupImpl=AnalyzingInfixLookupFactory,dictionaryImpl=RandomTestDictionaryFactory,randDictMaxItems=100000,indexPath=long_random_analyzing_infix_suggester,suggestAnalyzerFieldType=text,buildOnCommit=false,buildOnStartup=false}
   [junit4]   2> 202189 INFO  (TEST-InfixSuggestersTest.testTwoSuggestersBuildThenReload-seed#[5273222CF93A20D5]) [    x:collection1] o.a.s.s.s.SolrSuggester Dictionary loaded with params: {name=longRandomAnalyzingInfixSuggester,lookupImpl=AnalyzingInfixLookupFactory,dictionaryImpl=RandomTestDictionaryFactory,randDictMaxItems=100000,indexPath=long_random_analyzing_infix_suggester,suggestAnalyzerFieldType=text,buildOnCommit=false,buildOnStartup=false}
   [junit4]   2> 202189 INFO  (TEST-InfixSuggestersTest.testTwoSuggestersBuildThenReload-seed#[5273222CF93A20D5]) [    x:collection1] o.a.s.h.c.SuggestComponent Initializing SuggestComponent
   [junit4]   2> 202189 INFO  (TEST-InfixSuggestersTest.testTwoSuggestersBuildThenReload-seed#[5273222CF93A20D5]) [    x:collection1] o.a.s.s.s.SolrSuggester init: {name=shortRandomBlendedInfixSuggester,lookupImpl=BlendedInfixLookupFactory,dictionaryImpl=RandomTestDictionaryFactory,randDictMaxItems=100,blenderType=position_linear,suggestAnalyzerFieldType=text,indexPath=short_random_blended_infix_suggester,highlight=true,buildOnStartup=false,buildOnCommit=false}
   [junit4]   2> 202191 INFO  (TEST-InfixSuggestersTest.testTwoSuggestersBuildThenReload-seed#[5273222CF93A20D5]) [    x:collection1] o.a.s.s.s.SolrSuggester Dictionary loaded with params: {name=shortRandomBlendedInfixSuggester,lookupImpl=BlendedInfixLookupFactory,dictionaryImpl=RandomTestDictionaryFactory,randDictMaxItems=100,blenderType=position_linear,suggestAnalyzerFieldType=text,indexPath=short_random_blended_infix_suggester,highlight=true,buildOnStartup=false,buildOnCommit=false}
   [junit4]   2> 202191 INFO  (TEST-InfixSuggestersTest.testTwoSuggestersBuildThenReload-seed#[5273222CF93A20D5]) [    x:collection1] o.a.s.h.ReplicationHandler Commits will be reserved for 10000ms.
   [junit4]   2> 202192 INFO  (TEST-InfixSuggestersTest.testTwoSuggestersBuildThenReload-seed#[5273222CF93A20D5]) [    x:collection1] o.a.s.u.RandomMergePolicy RandomMergePolicy wrapping class org.apache.lucene.index.LogDocMergePolicy: [LogDocMergePolicy: minMergeSize=1000, mergeFactor=10, maxMergeSize=9223372036854775807, maxMergeSizeForForcedMerge=9223372036854775807, calibrateSizeByDeletes=true, maxMergeDocs=2147483647, maxCFSSegmentSizeMB=8.796093022207999E12, noCFSRatio=0.0]
   [junit4]   2> 202192 INFO  (TEST-InfixSuggestersTest.testTwoSuggestersBuildThenReload-seed#[5273222CF93A20D5]) [    x:collection1] o.a.s.u.DefaultSolrCoreState New IndexWriter is ready to be used.
   [junit4]   2> 202192 INFO  (searcherExecutor-597-thread-1-processing-x:collection1) [    x:collection1] o.a.s.c.SolrCore [collection1] Registered new searcher Searcher@35154eca[collection1] main{ExitableDirectoryReader(UninvertingDirectoryReader())}
   [junit4]   2> 202192 INFO  (TEST-InfixSuggestersTest.testTwoSuggestersBuildThenReload-seed#[5273222CF93A20D5]) [    x:collection1] o.a.s.s.SolrIndexSearcher Opening [Searcher@62754f3d[collection1] main]
   [junit4]   2> 202193 INFO  (TEST-InfixSuggestersTest.testTwoSuggestersBuildThenReload-seed#[5273222CF93A20D5]) [    x:collection1] o.a.s.c.SolrCore [collection1]  CLOSING SolrCore org.apache.solr.core.SolrCore@159383f
   [junit4]   2> 202193 INFO  (TEST-InfixSuggestersTest.testTwoSuggestersBuildThenReload-seed#[5273222CF93A20D5]) [    x:collection1] o.a.s.m.SolrMetricManager Closing metric reporters for registry=solr.core.collection1, tag=22624319
   [junit4]   2> 202193 INFO  (TEST-InfixSuggestersTest.testTwoSuggestersBuildThenReload-seed#[5273222CF93A20D5]) [    x:collection1] o.a.s.m.r.SolrJmxReporter Closing reporter [org.apache.solr.metrics.reporters.SolrJmxReporter@36006ab6: rootName = null, domain = solr.core.collection1, service url = null, agent id = null] for registry solr.core.collection1 / com.codahale.metrics.MetricRegistry@2e656fbb
   [junit4]   2> 202193 INFO  (searcherExecutor-597-thread-1-processing-x:collection1) [    x:collection1] o.a.s.c.SolrCore [collection1] Registered new searcher Searcher@62754f3d[collection1] main{ExitableDirectoryReader(UninvertingDirectoryReader())}
   [junit4]   2> 202213 INFO  (TEST-InfixSuggestersTest.testTwoSuggestersBuildThenReload-seed#[5273222CF93A20D5]) [    x:collection1] o.a.s.SolrTestCaseJ4 ###Ending testTwoSuggestersBuildThenReload
   [junit4]   2> 202214 INFO  (TEST-InfixSuggestersTest.testBuildThen2xReload-seed#[5273222CF93A20D5]) [    x:collection1] o.a.s.SolrTestCaseJ4 ###Starting testBuildThen2xReload
   [junit4]   2> 202215 INFO  (TEST-InfixSuggestersTest.testBuildThen2xReload-seed#[5273222CF93A20D5]) [    x:collection1] o.a.s.h.c.SuggestComponent SuggestComponent prepare with : qt=/suggest_analyzing_infix_short_dictionary&suggest=true&suggest.buildAll=true&wt=xml&indent=off
   [junit4]   2> 202215 INFO  (TEST-InfixSuggestersTest.testBuildThen2xReload-seed#[5273222CF93A20D5]) [    x:collection1] o.a.s.s.s.SolrSuggester SolrSuggester.build(shortRandomAnalyzingInfixSuggester)
   [junit4]   2> 202223 INFO  (TEST-InfixSuggestersTest.testBuildThen2xReload-seed#[5273222CF93A20D5]) [    x:collection1] o.a.s.s.s.RandomTestDictionaryFactory org.apache.solr.spelling.suggest.RandomTestDictionaryFactory$RandomTestDictionary.enabled.shortRandomAnalyzingInfixSuggester disabled after emitting 100 items.
   [junit4]   2> 202249 INFO  (TEST-InfixSuggestersTest.testBuildThen2xReload-seed#[5273222CF93A20D5]) [    x:collection1] o.a.s.h.c.SuggestComponent SuggestComponent process with : qt=/suggest_analyzing_infix_short_dictionary&suggest=true&suggest.buildAll=true&wt=xml&indent=off
   [junit4]   2> 202249 INFO  (TEST-InfixSuggestersTest.testBuildThen2xReload-seed#[5273222CF93A20D5]) [    x:collection1] o.a.s.c.S.Request [collection1]  webapp=null path=null params={qt=/suggest_analyzing_infix_short_dictionary&suggest.buildAll=true&wt=xml} status=0 QTime=33
   [junit4]   2> 202249 ERROR (TEST-InfixSuggestersTest.testBuildThen2xReload-seed#[5273222CF93A20D5]) [    x:collection1] o.a.s.c.CorePropertiesLocator Couldn't load core descriptor from C:\Users\jenkins\workspace\Lucene-Solr-master-Windows\solr\core\src\test-files\solr\collection1\core.properties:java.nio.file.NoSuchFileException: C:\Users\jenkins\workspace\Lucene-Solr-master-Windows\solr\core\src\test-files\solr\collection1\core.properties
   [junit4]   2> 202250 INFO  (TEST-InfixSuggestersTest.testBuildThen2xReload-seed#[5273222CF93A20D5]) [    x:collection1] o.a.s.c.SolrResourceLoader [null] Added 2 libs to classloader, from paths: [/C:/Users/jenkins/workspace/Lucene-Solr-master-Windows/solr/core/src/test-files/solr/collection1/lib, /C:/Users/jenkins/workspace/Lucene-Solr-master-Windows/solr/core/src/test-files/solr/collection1/lib/classes]
   [junit4]   2> 202292 INFO  (TEST-InfixSuggestersTest.testBuildThen2xReload-seed#[5273222CF93A20D5]) [    x:collection1] o.a.s.c.SolrConfig Using Lucene MatchVersion: 8.0.0
   [junit4]   2> 202300 INFO  (TEST-InfixSuggestersTest.testBuildThen2xReload-seed#[5273222CF93A20D5]) [    x:collection1] o.a.s.s.IndexSchema [collection1] Schema name=test
   [junit4]   2> 202351 INFO  (TEST-InfixSuggestersTest.testBuildThen2xReload-seed#[5273222CF93A20D5]) [    x:collection1] o.a.s.s.IndexSchema Loaded schema test/1.0 with uniqueid field id
   [junit4]   2> 202361 INFO  (TEST-InfixSuggestersTest.testBuildThen2xReload-seed#[5273222CF93A20D5]) [    x:collection1] o.a.s.c.CoreContainer Reloading SolrCore 'collection1' using configuration from instancedir C:\Users\jenkins\workspace\Lucene-Solr-master-Windows\solr\core\src\test-files\solr\collection1
   [junit4]   2> 202379 INFO  (TEST-InfixSuggestersTest.testBuildThen2xReload-seed#[5273222CF93A20D5]) [    x:collection1] o.a.s.m.r.SolrJmxReporter JMX monitoring for 'solr.core.collection1' (registry 'solr.core.collection1') enabled at server: com.sun.jmx.mbeanserver.JmxMBeanServer@40e935f0
   [junit4]   2> 202379 INFO  (TEST-InfixSuggestersTest.testBuildThen2xReload-seed#[5273222CF93A20D5]) [    x:collection1] o.a.s.c.SolrCore [[collection1] ] Opening new SolrCore at [C:\Users\jenkins\workspace\Lucene-Solr-master-Windows\solr\core\src\test-files\solr\collection1], dataDir=[C:\Users\jenkins\workspace\Lucene-Solr-master-Windows\solr\build\solr-core\test\J0\temp\solr.handler.component.InfixSuggestersTest_5273222CF93A20D5-001\init-core-data-001\]
   [junit4]   2> 202445 INFO  (TEST-InfixSuggestersTest.testBuildThen2xReload-seed#[5273222CF93A20D5]) [    x:collection1] o.a.s.u.CommitTracker Hard AutoCommit: disabled
   [junit4]   2> 202445 INFO  (TEST-InfixSuggestersTest.testBuildThen2xReload-seed#[5273222CF93A20D5]) [    x:collection1] o.a.s.u.CommitTracker Soft AutoCommit: disabled
   [junit4]   2> 202446 INFO  (TEST-InfixSuggestersTest.testBuildThen2xReload-seed#[5273222CF93A20D5]) [    x:collection1] o.a.s.s.SolrIndexSearcher Opening [Searcher@1ce49cf3[collection1] main]
   [junit4]   2> 202447 WARN  (TEST-InfixSuggestersTest.testBuildThen2xReload-seed#[5273222CF93A20D5]) [    x:collection1] o.a.s.r.ManagedResourceStorage Cannot write to config directory C:\Users\jenkins\workspace\Lucene-Solr-master-Windows\solr\core\src\test-files\solr\collection1\conf; switching to use InMemory storage instead.
   [junit4]   2> 202447 INFO  (TEST-InfixSuggestersTest.testBuildThen2xReload-seed#[5273222CF93A20D5]) [    x:collection1] o.a.s.h.c.SuggestComponent Initializing SuggestComponent
   [junit4]   2> 202447 INFO  (TEST-InfixSuggestersTest.testBuildThen2xReload-seed#[5273222CF93A20D5]) [    x:collection1] o.a.s.s.s.SolrSuggester init: {name=shortRandomAnalyzingInfixSuggester,lookupImpl=AnalyzingInfixLookupFactory,dictionaryImpl=RandomTestDictionaryFactory,randDictMaxItems=100,indexPath=short_random_analyzing_infix_suggester,suggestAnalyzerFieldType=text,buildOnCommit=false,buildOnStartup=false}
   [junit4]   2> 202449 INFO  (TEST-InfixSuggestersTest.testBuildThen2xReload-seed#[5273222CF93A20D5]) [    x:collection1] o.a.s.s.s.SolrSuggester Dictionary loaded with params: {name=shortRandomAnalyzingInfixSuggester,lookupImpl=AnalyzingInfixLookupFactory,dictionaryImpl=RandomTestDictionaryFactory,randDictMaxItems=100,indexPath=short_random_analyzing_infix_suggester,suggestAnalyzerFieldType=text,buildOnCommit=false,buildOnStartup=false}
   [junit4]   2> 202449 INFO  (TEST-InfixSuggestersTest.testBuildThen2xReload-seed#[5273222CF93A20D5]) [    x:collection1] o.a.s.h.c.SuggestComponent Initializing SuggestComponent
   [junit4]   2> 202449 INFO  (TEST-InfixSuggestersTest.testBuildThen2xReload-seed#[5273222CF93A20D5]) [    x:collection1] o.a.s.s.s.SolrSuggester init: {name=longRandomAnalyzingInfixSuggester,lookupImpl=AnalyzingInfixLookupFactory,dictionaryImpl=RandomTestDictionaryFactory,randDictMaxItems=100000,indexPath=long_random_analyzing_infix_suggester,suggestAnalyzerFieldType=text,buildOnCommit=false,buildOnStartup=false}
   [junit4]   2> 202449 INFO  (TEST-InfixSuggestersTest.testBuildThen2xReload-seed#[5273222CF93A20D5]) [    x:collection1] o.a.s.s.s.SolrSuggester Dictionary loaded with params: {name=longRandomAnalyzingInfixSuggester,lookupImpl=AnalyzingInfixLookupFactory,dictionaryImpl=RandomTestDictionaryFactory,randDictMaxItems=100000,indexPath=long_random_analyzing_infix_suggester,suggestAnalyzerFieldType=text,buildOnCommit=false,buildOnStartup=false}
   [junit4]   2> 202449 INFO  (TEST-InfixSuggestersTest.testBuildThen2xReload-seed#[5273222CF93A20D5]) [    x:collection1] o.a.s.h.c.SuggestComponent Initializing SuggestComponent
   [junit4]   2> 202449 INFO  (TEST-InfixSuggestersTest.testBuildThen2xReload-seed#[5273222CF93A20D5]) [    x:collection1] o.a.s.s.s.SolrSuggester init: {name=shortRandomBlendedInfixSuggester,lookupImpl=BlendedInfixLookupFactory,dictionaryImpl=RandomTestDictionaryFactory,randDictMaxItems=100,blenderType=position_linear,suggestAnalyzerFieldType=text,indexPath=short_random_blended_infix_suggester,highlight=true,buildOnStartup=false,buildOnCommit=false}
   [junit4]   2> 202455 INFO  (TEST-InfixSuggestersTest.testBuildThen2xReload-seed#[5273222CF93A20D5]) [    x:collection1] o.a.s.s.s.SolrSuggester Dictionary loaded with params: {name=shortRandomBlendedInfixSuggester,lookupImpl=BlendedInfixLookupFactory,dictionaryImpl=RandomTestDictionaryFactory,randDictMaxItems=100,blenderType=position_linear,suggestAnalyzerFieldType=text,indexPath=short_random_blended_infix_suggester,highlight=true,buildOnStartup=false,buildOnCommit=false}
   [junit4]   2> 202455 INFO  (TEST-InfixSuggestersTest.testBuildThen2xReload-seed#[5273222CF93A20D5]) [    x:collection1] o.a.s.h.ReplicationHandler Commits will be reserved for 10000ms.
   [junit4]   2> 202455 INFO  (TEST-InfixSuggestersTest.testBuildThen2xReload-seed#[5273222CF93A20D5]) [    x:collection1] o.a.s.u.RandomMergePolicy RandomMergePolicy wrapping class org.apache.lucene.index.LogDocMergePolicy: [LogDocMergePolicy: minMergeSize=1000, mergeFactor=34, maxMergeSize=9223372036854775807, maxMergeSizeForForcedMerge=9223372036854775807, calibrateSizeByDeletes=false, maxMergeDocs=2147483647, maxCFSSegmentSizeMB=8.796093022207999E12, noCFSRatio=1.0]
   [junit4]   2> 202456 INFO  (TEST-InfixSuggestersTest.testBuildThen2xReload-seed#[5273222CF93A20D5]) [    x:collection1] o.a.s.u.DefaultSolrCoreState New IndexWriter is ready to be used.
   [junit4]   2> 202456 INFO  (searcherExecutor-601-thread-1-processing-x:collection1) [    x:collection1] o.a.s.c.SolrCore [collection1] Registered new searcher Searcher@1ce49cf3[collection1] main{ExitableDirectoryReader(UninvertingDirectoryReader())}
   [junit4]   2> 202456 INFO  (TEST-InfixSuggestersTest.testBuildThen2xReload-seed#[5273222CF93A20D5]) [    x:collection1] o.a.s.s.SolrIndexSearcher Opening [Searcher@4f54f851[collection1] main]
   [junit4]   2> 202457 INFO  (TEST-InfixSuggestersTest.testBuildThen2xReload-seed#[5273222CF93A20D5]) [    x:collection1] o.a.s.c.SolrCore [collection1]  CLOSING SolrCore org.apache.solr.core.SolrCore@217aaf5
   [junit4]   2> 202457 INFO  (TEST-InfixSuggestersTest.testBuildThen2xReload-seed#[5273222CF93A20D5]) [    x:collection1] o.a.s.m.SolrMetricManager Closing metric reporters for registry=solr.core.collection1, tag=35105525
   [junit4]   2> 202457 INFO  (TEST-InfixSuggestersTest.testBuildThen2xReload-seed#[5273222CF93A20D5]) [    x:collection1] o.a.s.m.r.SolrJmxReporter Closing reporter [org.apache.solr.metrics.reporters.SolrJmxReporter@6f84c76f: rootName = null, domain = solr.core.collection1, service url = null, agent id = null] for registry solr.core.collection1 / com.codahale.metrics.MetricRegistry@2e656fbb
   [junit4]   2> 202457 INFO  (searcherExecutor-601-thread-1-processing-x:collection1) [    x:collection1] o.a.s.c.SolrCore [collection1] Registered new searcher Searcher@4f54f851[collection1] main{ExitableDirectoryReader(UninvertingDirectoryReader())}
   [junit4]   2> 202462 ERROR (TEST-InfixSuggestersTest.testBuildThen2xReload-seed#[5273222CF93A20D5]) [    x:collection1] o.a.s.c.CorePropertiesLocator Couldn't load core descriptor from C:\Users\jenkins\workspace\Lucene-Solr-master-Windows\solr\core\src\test-files\solr\collection1\core.properties:java.nio.file.NoSuchFileException: C:\Users\jenkins\workspace\Lucene-Solr-master-Windows\solr\core\src\test-files\solr\collection1\core.properties
   [junit4]   2> 202464 INFO  (TEST-InfixSuggestersTest.testBuildThen2xReload-seed#[5273222CF93A20D5]) [    x:collection1] o.a.s.c.SolrResourceLoader [null] Added 2 libs to classloader, from paths: [/C:/Users/jenkins/workspace/Lucene-Solr-master-Windows/solr/core/src/test-files/solr/collection1/lib, /C:/Users/jenkins/workspace/Lucene-Solr-master-Windows/solr/core/src/test-files/solr/collection1/lib/classes]
   [junit4]   2> 202505 INFO  (TEST-InfixSuggestersTest.testBuildThen2xReload-seed#[5273222CF93A20D5]) [    x:collection1] o.a.s.c.SolrConfig Using Lucene MatchVersion: 8.0.0
   [junit4]   2> 202512 INFO  (TEST-InfixSuggestersTest.testBuildThen2xReload-seed#[5273222CF93A20D5]) [    x:collection1] o.a.s.s.IndexSchema [collection1] Schema name=test
   [junit4]   2> 202571 INFO  (TEST-InfixSuggestersTest.testBuildThen2xReload-seed#[5273222CF93A20D5]) [    x:collection1] o.a.s.s.IndexSchema Loaded schema test/1.0 with uniqueid field id
   [junit4]   2> 202580 INFO  (TEST-InfixSuggestersTest.testBuildThen2xReload-seed#[5273222CF93A20D5]) [    x:collection1] o.a.s.c.CoreContainer Reloading SolrCore 'collection1' using configuration from instancedir C:\Users\jenkins\workspace\Lucene-Solr-master-Windows\solr\core\src\test-files\solr\collection1
   [junit4]   2> 202596 INFO  (TEST-InfixSuggestersTest.testBuildThen2xReload-seed#[5273222CF93A20D5]) [    x:collection1] o.a.s.m.r.SolrJmxReporter JMX monitoring for 'solr.core.collection1' (registry 'solr.core.collection1') enabled at server: com.sun.jmx.mbeanserver.JmxMBeanServer@40e935f0
   [junit4]   2> 202596 INFO  (TEST-InfixSuggestersTest.testBuildThen2xReload-seed#[5273222CF93A20D5]) [    x:collection1] o.a.s.c.SolrCore [[collection1] ] Opening new SolrCore at [C:\Users\jenkins\workspace\Lucene-Solr-master-Windows\solr\core\src\test-files\solr\collection1], dataDir=[C:\Users\jenkins\workspace\Lucene-Solr-master-Windows\solr\build\solr-core\test\J0\temp\solr.handler.component.InfixSuggestersTest_5273222CF93A20D5-001\init-core-data-001\]
   [junit4]   2> 202659 INFO  (TEST-InfixSuggestersTest.testBuildThen2xReload-seed#[5273222CF93A20D5]) [    x:collection1] o.a.s.u.CommitTracker Hard AutoCommit: disabled
   [junit4]   2> 202659 INFO  (TEST-InfixSuggestersTest.testBuildThen2xReload-seed#[5273222CF93A20D5]) [    x:collection1] o.a.s.u.CommitTracker Soft AutoCommit: disabled
   [junit4]   2> 202660 INFO  (TEST-InfixSuggestersTest.testBuildThen2xReload-seed#[5273222CF93A20D5]) [    x:collection1] o.a.s.s.SolrIndexSearcher Opening [Searcher@73e9e5ac[collection1] main]
   [junit4]   2> 202660 WARN  (TEST-InfixSuggestersTest.testBuildThen2xReload-seed#[5273222CF93A20D5]) [    x:collection1] o.a.s.r.ManagedResourceStorage Cannot write to config directory C:\Users\jenkins\workspace\Lucene-Solr-master-Windows\solr\core\src\test-files\solr\collection1\conf; switching to use InMemory storage instead.
   [junit4]   2> 202661 INFO  (TEST-InfixSuggestersTest.testBuildThen2xReload-seed#[5273222CF93A20D5]) [    x:collection1] o.a.s.h.c.SuggestComponent Initializing SuggestComponent
   [junit4]   2> 202661 INFO  (TEST-InfixSuggestersTest.testBuildThen2xReload-seed#[5273222CF93A20D5]) [    x:collection1] o.a.s.s.s.SolrSuggester init: {name=shortRandomAnalyzingInfixSuggester,lookupImpl=AnalyzingInfixLookupFactory,dictionaryImpl=RandomTestDictionaryFactory,randDictMaxItems=100,indexPath=short_random_analyzing_infix_suggester,suggestAnalyzerFieldType=text,buildOnCommit=false,buildOnStartup=false}
   [junit4]   2> 202664 INFO  (TEST-InfixSuggestersTest.testBuildThen2xReload-seed#[5273222CF93A20D5]) [    x:collection1] o.a.s.s.s.SolrSuggester Dictionary loaded with params: {name=shortRandomAnalyzingInfixSuggester,lookupImpl=AnalyzingInfixLookupFactory,dictionaryImpl=RandomTestDictionaryFactory,randDictMaxItems=100,indexPath=short_random_analyzing_infix_suggester,suggestAnalyzerFieldType=text,buildOnCommit=false,buildOnStartup=false}
   [junit4]   2> 202664 INFO  (TEST-InfixSuggestersTest.testBuildThen2xReload-seed#[5273222CF93A20D5]) [    x:collection1] o.a.s.h.c.SuggestComponent Initializing SuggestComponent
   [junit4]   2> 202664 INFO  (TEST-InfixSuggestersTest.testBuildThen2xReload-seed#[5273222CF93A20D5]) [    x:collection1] o.a.s.s.s.SolrSuggester init: {name=longRandomAnalyzingInfixSuggester,lookupImpl=AnalyzingInfixLookupFactory,dictionaryImpl=RandomTestDictionaryFactory,randDictMaxItems=100000,indexPath=long_random_analyzing_infix_suggester,suggestAnalyzerFieldType=text,buildOnCommit=false,buildOnStartup=false}
   [junit4]   2> 202664 INFO  (TEST-InfixSuggestersTest.testBuildThen2xReload-seed#[5273222CF93A20D5]) [    x:collection1] o.a.s.s.s.SolrSuggester Dictionary loaded with params: {name=longRandomAnalyzingInfixSuggester,lookupImpl=AnalyzingInfixLookupFactory,dictionaryImpl=RandomTestDictionaryFactory,randDictMaxItems=100000,indexPath=long_random_analyzing_infix_suggester,suggestAnalyzerFieldType=text,buildOnCommit=false,buildOnStartup=false}
   [junit4]   2> 202664 INFO  (TEST-InfixSuggestersT

[...truncated too long message...]

ess$400(WindowsSelectorImpl.java:278)
   [junit4]   2>         at sun.nio.ch.WindowsSelectorImpl.doSelect(WindowsSelectorImpl.java:159)
   [junit4]   2>         at sun.nio.ch.SelectorImpl.lockAndDoSelect(SelectorImpl.java:86)
   [junit4]   2>         at sun.nio.ch.SelectorImpl.select(SelectorImpl.java:97)
   [junit4]   2>         at org.apache.zookeeper.ClientCnxnSocketNIO.doTransport(ClientCnxnSocketNIO.java:349)
   [junit4]   2>         at org.apache.zookeeper.ClientCnxn$SendThread.run(ClientCnxn.java:1141)
   [junit4]   2>   32) Thread[id=3125, name=searcherExecutor-651-thread-1, state=WAITING, group=TGRP-StreamExpressionTest]
   [junit4]   2>         at sun.misc.Unsafe.park(Native Method)
   [junit4]   2>         at java.util.concurrent.locks.LockSupport.park(LockSupport.java:175)
   [junit4]   2>         at java.util.concurrent.locks.AbstractQueuedSynchronizer$ConditionObject.await(AbstractQueuedSynchronizer.java:2039)
   [junit4]   2>         at java.util.concurrent.LinkedBlockingQueue.take(LinkedBlockingQueue.java:442)
   [junit4]   2>         at java.util.concurrent.ThreadPoolExecutor.getTask(ThreadPoolExecutor.java:1074)
   [junit4]   2>         at java.util.concurrent.ThreadPoolExecutor.runWorker(ThreadPoolExecutor.java:1134)
   [junit4]   2>         at java.util.concurrent.ThreadPoolExecutor$Worker.run(ThreadPoolExecutor.java:624)
   [junit4]   2>         at java.lang.Thread.run(Thread.java:748)
   [junit4]   2>   33) Thread[id=3114, name=Scheduler-235288832, state=WAITING, group=TGRP-StreamExpressionTest]
   [junit4]   2>         at sun.misc.Unsafe.park(Native Method)
   [junit4]   2>         at java.util.concurrent.locks.LockSupport.park(LockSupport.java:175)
   [junit4]   2>         at java.util.concurrent.locks.AbstractQueuedSynchronizer$ConditionObject.await(AbstractQueuedSynchronizer.java:2039)
   [junit4]   2>         at java.util.concurrent.ScheduledThreadPoolExecutor$DelayedWorkQueue.take(ScheduledThreadPoolExecutor.java:1081)
   [junit4]   2>         at java.util.concurrent.ScheduledThreadPoolExecutor$DelayedWorkQueue.take(ScheduledThreadPoolExecutor.java:809)
   [junit4]   2>         at java.util.concurrent.ThreadPoolExecutor.getTask(ThreadPoolExecutor.java:1074)
   [junit4]   2>         at java.util.concurrent.ThreadPoolExecutor.runWorker(ThreadPoolExecutor.java:1134)
   [junit4]   2>         at java.util.concurrent.ThreadPoolExecutor$Worker.run(ThreadPoolExecutor.java:624)
   [junit4]   2>         at java.lang.Thread.run(Thread.java:748)
   [junit4]   2>   34) Thread[id=3124, name=searcherExecutor-650-thread-1, state=WAITING, group=TGRP-StreamExpressionTest]
   [junit4]   2>         at sun.misc.Unsafe.park(Native Method)
   [junit4]   2>         at java.util.concurrent.locks.LockSupport.park(LockSupport.java:175)
   [junit4]   2>         at java.util.concurrent.locks.AbstractQueuedSynchronizer$ConditionObject.await(AbstractQueuedSynchronizer.java:2039)
   [junit4]   2>         at java.util.concurrent.LinkedBlockingQueue.take(LinkedBlockingQueue.java:442)
   [junit4]   2>         at java.util.concurrent.ThreadPoolExecutor.getTask(ThreadPoolExecutor.java:1074)
   [junit4]   2>         at java.util.concurrent.ThreadPoolExecutor.runWorker(ThreadPoolExecutor.java:1134)
   [junit4]   2>         at java.util.concurrent.ThreadPoolExecutor$Worker.run(ThreadPoolExecutor.java:624)
   [junit4]   2>         at java.lang.Thread.run(Thread.java:748)
   [junit4]   2>   35) Thread[id=3126, name=ScheduledTrigger-639-thread-4, state=WAITING, group=TGRP-StreamExpressionTest]
   [junit4]   2>         at sun.misc.Unsafe.park(Native Method)
   [junit4]   2>         at java.util.concurrent.locks.LockSupport.park(LockSupport.java:175)
   [junit4]   2>         at java.util.concurrent.locks.AbstractQueuedSynchronizer$ConditionObject.await(AbstractQueuedSynchronizer.java:2039)
   [junit4]   2>         at java.util.concurrent.ScheduledThreadPoolExecutor$DelayedWorkQueue.take(ScheduledThreadPoolExecutor.java:1088)
   [junit4]   2>         at java.util.concurrent.ScheduledThreadPoolExecutor$DelayedWorkQueue.take(ScheduledThreadPoolExecutor.java:809)
   [junit4]   2>         at java.util.concurrent.ThreadPoolExecutor.getTask(ThreadPoolExecutor.java:1074)
   [junit4]   2>         at java.util.concurrent.ThreadPoolExecutor.runWorker(ThreadPoolExecutor.java:1134)
   [junit4]   2>         at java.util.concurrent.ThreadPoolExecutor$Worker.run(ThreadPoolExecutor.java:624)
   [junit4]   2>         at java.lang.Thread.run(Thread.java:748)
   [junit4]   2>   36) Thread[id=3094, name=Thread-551, state=WAITING, group=TGRP-StreamExpressionTest]
   [junit4]   2>         at java.lang.Object.wait(Native Method)
   [junit4]   2>         at java.lang.Object.wait(Object.java:502)
   [junit4]   2>         at org.apache.solr.core.CloserThread.run(CoreContainer.java:1675)
   [junit4]   2>   37) Thread[id=3106, name=SUITE-StreamExpressionTest-seed#[2AEA13FFF5648378]-worker-SendThread(127.0.0.1:51495), state=RUNNABLE, group=TGRP-StreamExpressionTest]
   [junit4]   2>         at sun.nio.ch.WindowsSelectorImpl$SubSelector.poll0(Native Method)
   [junit4]   2>         at sun.nio.ch.WindowsSelectorImpl$SubSelector.poll(WindowsSelectorImpl.java:296)
   [junit4]   2>         at sun.nio.ch.WindowsSelectorImpl$SubSelector.access$400(WindowsSelectorImpl.java:278)
   [junit4]   2>         at sun.nio.ch.WindowsSelectorImpl.doSelect(WindowsSelectorImpl.java:159)
   [junit4]   2>         at sun.nio.ch.SelectorImpl.lockAndDoSelect(SelectorImpl.java:86)
   [junit4]   2>         at sun.nio.ch.SelectorImpl.select(SelectorImpl.java:97)
   [junit4]   2>         at org.apache.zookeeper.ClientCnxnSocketNIO.doTransport(ClientCnxnSocketNIO.java:349)
   [junit4]   2>         at org.apache.zookeeper.ClientCnxn$SendThread.run(ClientCnxn.java:1141)
   [junit4]   2>   38) Thread[id=3096, name=Thread-552, state=WAITING, group=TGRP-StreamExpressionTest]
   [junit4]   2>         at java.lang.Object.wait(Native Method)
   [junit4]   2>         at java.lang.Object.wait(Object.java:502)
   [junit4]   2>         at org.apache.solr.core.CloserThread.run(CoreContainer.java:1675)
   [junit4]   2> NOTE: test params are: codec=Asserting(Lucene70): {expr_s=BlockTreeOrds(blocksize=128), featureSet_s=Lucene50(blocksize=128), join2_s=PostingsFormat(name=Memory), multiDefault=PostingsFormat(name=Memory), checkpoint_ss=FSTOrd50, test_t=FSTOrd50, level1_s=BlockTreeOrds(blocksize=128), body_t=FSTOrd50, ident_s=Lucene50(blocksize=128), s_multi=BlockTreeOrds(blocksize=128), col_s=Lucene50(blocksize=128), level2_s=Lucene50(blocksize=128), whitetok=FSTOrd50, a_s=BlockTreeOrds(blocksize=128), term_s=PostingsFormat(name=Memory), a_t=PostingsFormat(name=Memory), side_s=FSTOrd50, id=FSTOrd50, text=BlockTreeOrds(blocksize=128)}, docValues:{expr_s=DocValuesFormat(name=Asserting), join2_s=DocValuesFormat(name=Lucene70), multiDefault=DocValuesFormat(name=Lucene70), price_f=DocValuesFormat(name=Lucene70), intDefault=DocValuesFormat(name=Direct), a_f=DocValuesFormat(name=Direct), join1_i=DocValuesFormat(name=Asserting), a_i=DocValuesFormat(name=Lucene70), join3_i=DocValuesFormat(name=Lucene70), test_i=DocValuesFormat(name=Lucene70), field_i=DocValuesFormat(name=Lucene70), level1_s=DocValuesFormat(name=Asserting), s_multi=DocValuesFormat(name=Asserting), col_s=DocValuesFormat(name=Direct), level2_s=DocValuesFormat(name=Direct), score_f=DocValuesFormat(name=Asserting), a_s=DocValuesFormat(name=Asserting), term_s=DocValuesFormat(name=Lucene70), id=DocValuesFormat(name=Lucene70), timestamp=DocValuesFormat(name=Lucene70), i_multi=DocValuesFormat(name=Lucene70), featureSet_s=DocValuesFormat(name=Direct), index_i=DocValuesFormat(name=Direct), test_dt=DocValuesFormat(name=Asserting), out_i=DocValuesFormat(name=Direct), checkpoint_ss=DocValuesFormat(name=Lucene70), ident_s=DocValuesFormat(name=Direct), order_i=DocValuesFormat(name=Lucene70), _version_=DocValuesFormat(name=Direct), side_s=DocValuesFormat(name=Lucene70), miles_i=DocValuesFormat(name=Direct)}, maxPointsInLeafNode=721, maxMBSortInHeap=7.4395499445361395, sim=RandomSimilarity(queryNorm=false): {}, locale=el, timezone=Canada/East-Saskatchewan
   [junit4]   2> NOTE: Windows 10 10.0 amd64/Oracle Corporation 1.8.0_144 (64-bit)/cpus=3,threads=85,free=161526280,total=313524224
   [junit4]   2> NOTE: All tests run in this JVM: [MultiplyEvaluatorTest, HttpSolrClientSSLAuthConPoolTest, ShardParamsTest, CosineEvaluatorTest, HttpSolrClientBuilderTest, SolrExampleJettyTest, MergeIndexesEmbeddedTest, JdbcTest, UuidEvaluatorTest, TestPolicy, ConcatOperationTest, GetByIdTest, ReverseEvaluatorTest, StreamingTest, CommonAdminParamsTest, LessThanEvaluatorTest, FacetFieldTest, TestToleratedUpdateError, ExclusiveOrEvaluatorTest, NotEvaluatorTest, TestDelegationTokenRequest, TestCloudSolrClientConnections, RecursiveEvaluatorTest, TestV1toV2ApiMapper, HyperbolicSineEvaluatorTest, TestCollectionStateWatchers, ArcSineEvaluatorTest, LargeVolumeJettyTest, CumulativeProbabilityEvaluatorTest, GraphTest, AppendEvaluatorTest, SolrQueryTest, PowerEvaluatorTest, TestLBHttpSolrClient, TestCollectionAdminRequest, SolrExceptionTest, FieldAnalysisResponseTest, NamedListTest, BasicHttpSolrClientTest, ConcurrentUpdateSolrClientBuilderTest, LBHttpSolrClientBuilderTest, JDBCStreamTest, SelectWithEvaluatorsTest, StreamExpressionTest]
   [junit4]   2> NOTE: reproduce with: ant test  -Dtestcase=StreamExpressionTest -Dtests.seed=2AEA13FFF5648378 -Dtests.slow=true -Dtests.locale=el -Dtests.timezone=Canada/East-Saskatchewan -Dtests.asserts=true -Dtests.file.encoding=ISO-8859-1
   [junit4] ERROR   0.00s J1 | StreamExpressionTest (suite) <<<
   [junit4]    > Throwable #1: java.lang.Exception: Suite timeout exceeded (>= 7200000 msec).
   [junit4]    > 	at __randomizedtesting.SeedInfo.seed([2AEA13FFF5648378]:0)
   [junit4] Completed [145/145 (1!)] on J1 in 7223.87s, 43 tests, 2 errors <<< FAILURES!

[...truncated 45989 lines...]

Mime
View raw message