lucene-dev mailing list archives

Site index · List index
Message view « Date » · « Thread »
Top « Date » · « Thread »
From Policeman Jenkins Server <jenk...@thetaphi.de>
Subject [JENKINS] Lucene-Solr-master-MacOSX (64bit/jdk1.8.0) - Build # 4236 - Still Unstable!
Date Wed, 18 Oct 2017 14:50:45 GMT
Build: https://jenkins.thetaphi.de/job/Lucene-Solr-master-MacOSX/4236/
Java: 64bit/jdk1.8.0 -XX:+UseCompressedOops -XX:+UseParallelGC

5 tests failed.
FAILED:  org.apache.solr.cloud.CustomCollectionTest.testCustomCollectionsAPI

Error Message:
Could not find collection : implicitcoll

Stack Trace:
org.apache.solr.common.SolrException: Could not find collection : implicitcoll
	at __randomizedtesting.SeedInfo.seed([8004907CC82B7714:EAE51E17F5B1C16C]:0)
	at org.apache.solr.common.cloud.ClusterState.getCollection(ClusterState.java:111)
	at org.apache.solr.cloud.SolrCloudTestCase.getCollectionState(SolrCloudTestCase.java:247)
	at org.apache.solr.cloud.CustomCollectionTest.testCustomCollectionsAPI(CustomCollectionTest.java:68)
	at sun.reflect.NativeMethodAccessorImpl.invoke0(Native Method)
	at sun.reflect.NativeMethodAccessorImpl.invoke(NativeMethodAccessorImpl.java:62)
	at sun.reflect.DelegatingMethodAccessorImpl.invoke(DelegatingMethodAccessorImpl.java:43)
	at java.lang.reflect.Method.invoke(Method.java:498)
	at com.carrotsearch.randomizedtesting.RandomizedRunner.invoke(RandomizedRunner.java:1737)
	at com.carrotsearch.randomizedtesting.RandomizedRunner$8.evaluate(RandomizedRunner.java:934)
	at com.carrotsearch.randomizedtesting.RandomizedRunner$9.evaluate(RandomizedRunner.java:970)
	at com.carrotsearch.randomizedtesting.RandomizedRunner$10.evaluate(RandomizedRunner.java:984)
	at com.carrotsearch.randomizedtesting.rules.SystemPropertiesRestoreRule$1.evaluate(SystemPropertiesRestoreRule.java:57)
	at org.apache.lucene.util.TestRuleSetupTeardownChained$1.evaluate(TestRuleSetupTeardownChained.java:49)
	at org.apache.lucene.util.AbstractBeforeAfterRule$1.evaluate(AbstractBeforeAfterRule.java:45)
	at org.apache.lucene.util.TestRuleThreadAndTestName$1.evaluate(TestRuleThreadAndTestName.java:48)
	at org.apache.lucene.util.TestRuleIgnoreAfterMaxFailures$1.evaluate(TestRuleIgnoreAfterMaxFailures.java:64)
	at org.apache.lucene.util.TestRuleMarkFailure$1.evaluate(TestRuleMarkFailure.java:47)
	at com.carrotsearch.randomizedtesting.rules.StatementAdapter.evaluate(StatementAdapter.java:36)
	at com.carrotsearch.randomizedtesting.ThreadLeakControl$StatementRunner.run(ThreadLeakControl.java:368)
	at com.carrotsearch.randomizedtesting.ThreadLeakControl.forkTimeoutingTask(ThreadLeakControl.java:817)
	at com.carrotsearch.randomizedtesting.ThreadLeakControl$3.evaluate(ThreadLeakControl.java:468)
	at com.carrotsearch.randomizedtesting.RandomizedRunner.runSingleTest(RandomizedRunner.java:943)
	at com.carrotsearch.randomizedtesting.RandomizedRunner$5.evaluate(RandomizedRunner.java:829)
	at com.carrotsearch.randomizedtesting.RandomizedRunner$6.evaluate(RandomizedRunner.java:879)
	at com.carrotsearch.randomizedtesting.RandomizedRunner$7.evaluate(RandomizedRunner.java:890)
	at com.carrotsearch.randomizedtesting.rules.StatementAdapter.evaluate(StatementAdapter.java:36)
	at com.carrotsearch.randomizedtesting.rules.SystemPropertiesRestoreRule$1.evaluate(SystemPropertiesRestoreRule.java:57)
	at org.apache.lucene.util.AbstractBeforeAfterRule$1.evaluate(AbstractBeforeAfterRule.java:45)
	at com.carrotsearch.randomizedtesting.rules.StatementAdapter.evaluate(StatementAdapter.java:36)
	at org.apache.lucene.util.TestRuleStoreClassName$1.evaluate(TestRuleStoreClassName.java:41)
	at com.carrotsearch.randomizedtesting.rules.NoShadowingOrOverridesOnMethodsRule$1.evaluate(NoShadowingOrOverridesOnMethodsRule.java:40)
	at com.carrotsearch.randomizedtesting.rules.NoShadowingOrOverridesOnMethodsRule$1.evaluate(NoShadowingOrOverridesOnMethodsRule.java:40)
	at com.carrotsearch.randomizedtesting.rules.StatementAdapter.evaluate(StatementAdapter.java:36)
	at com.carrotsearch.randomizedtesting.rules.StatementAdapter.evaluate(StatementAdapter.java:36)
	at com.carrotsearch.randomizedtesting.rules.StatementAdapter.evaluate(StatementAdapter.java:36)
	at org.apache.lucene.util.TestRuleAssertionsRequired$1.evaluate(TestRuleAssertionsRequired.java:53)
	at org.apache.lucene.util.TestRuleMarkFailure$1.evaluate(TestRuleMarkFailure.java:47)
	at org.apache.lucene.util.TestRuleIgnoreAfterMaxFailures$1.evaluate(TestRuleIgnoreAfterMaxFailures.java:64)
	at org.apache.lucene.util.TestRuleIgnoreTestSuites$1.evaluate(TestRuleIgnoreTestSuites.java:54)
	at com.carrotsearch.randomizedtesting.rules.StatementAdapter.evaluate(StatementAdapter.java:36)
	at com.carrotsearch.randomizedtesting.ThreadLeakControl$StatementRunner.run(ThreadLeakControl.java:368)
	at java.lang.Thread.run(Thread.java:748)


FAILED:  org.apache.solr.cloud.FullSolrCloudDistribCmdsTest.test

Error Message:
Could not find collection:collection2

Stack Trace:
java.lang.AssertionError: Could not find collection:collection2
	at __randomizedtesting.SeedInfo.seed([8004907CC82B7714:850AFA666D71AEC]:0)
	at org.junit.Assert.fail(Assert.java:93)
	at org.junit.Assert.assertTrue(Assert.java:43)
	at org.junit.Assert.assertNotNull(Assert.java:526)
	at org.apache.solr.cloud.AbstractDistribZkTestBase.waitForRecoveriesToFinish(AbstractDistribZkTestBase.java:155)
	at org.apache.solr.cloud.AbstractDistribZkTestBase.waitForRecoveriesToFinish(AbstractDistribZkTestBase.java:140)
	at org.apache.solr.cloud.AbstractDistribZkTestBase.waitForRecoveriesToFinish(AbstractDistribZkTestBase.java:135)
	at org.apache.solr.cloud.AbstractFullDistribZkTestBase.waitForRecoveriesToFinish(AbstractFullDistribZkTestBase.java:908)
	at org.apache.solr.cloud.FullSolrCloudDistribCmdsTest.testIndexingBatchPerRequestWithHttpSolrClient(FullSolrCloudDistribCmdsTest.java:612)
	at org.apache.solr.cloud.FullSolrCloudDistribCmdsTest.test(FullSolrCloudDistribCmdsTest.java:152)
	at sun.reflect.NativeMethodAccessorImpl.invoke0(Native Method)
	at sun.reflect.NativeMethodAccessorImpl.invoke(NativeMethodAccessorImpl.java:62)
	at sun.reflect.DelegatingMethodAccessorImpl.invoke(DelegatingMethodAccessorImpl.java:43)
	at java.lang.reflect.Method.invoke(Method.java:498)
	at com.carrotsearch.randomizedtesting.RandomizedRunner.invoke(RandomizedRunner.java:1737)
	at com.carrotsearch.randomizedtesting.RandomizedRunner$8.evaluate(RandomizedRunner.java:934)
	at com.carrotsearch.randomizedtesting.RandomizedRunner$9.evaluate(RandomizedRunner.java:970)
	at com.carrotsearch.randomizedtesting.RandomizedRunner$10.evaluate(RandomizedRunner.java:984)
	at org.apache.solr.BaseDistributedSearchTestCase$ShardsRepeatRule$ShardsFixedStatement.callStatement(BaseDistributedSearchTestCase.java:993)
	at org.apache.solr.BaseDistributedSearchTestCase$ShardsRepeatRule$ShardsStatement.evaluate(BaseDistributedSearchTestCase.java:968)
	at com.carrotsearch.randomizedtesting.rules.SystemPropertiesRestoreRule$1.evaluate(SystemPropertiesRestoreRule.java:57)
	at org.apache.lucene.util.TestRuleSetupTeardownChained$1.evaluate(TestRuleSetupTeardownChained.java:49)
	at org.apache.lucene.util.AbstractBeforeAfterRule$1.evaluate(AbstractBeforeAfterRule.java:45)
	at org.apache.lucene.util.TestRuleThreadAndTestName$1.evaluate(TestRuleThreadAndTestName.java:48)
	at org.apache.lucene.util.TestRuleIgnoreAfterMaxFailures$1.evaluate(TestRuleIgnoreAfterMaxFailures.java:64)
	at org.apache.lucene.util.TestRuleMarkFailure$1.evaluate(TestRuleMarkFailure.java:47)
	at com.carrotsearch.randomizedtesting.rules.StatementAdapter.evaluate(StatementAdapter.java:36)
	at com.carrotsearch.randomizedtesting.ThreadLeakControl$StatementRunner.run(ThreadLeakControl.java:368)
	at com.carrotsearch.randomizedtesting.ThreadLeakControl.forkTimeoutingTask(ThreadLeakControl.java:817)
	at com.carrotsearch.randomizedtesting.ThreadLeakControl$3.evaluate(ThreadLeakControl.java:468)
	at com.carrotsearch.randomizedtesting.RandomizedRunner.runSingleTest(RandomizedRunner.java:943)
	at com.carrotsearch.randomizedtesting.RandomizedRunner$5.evaluate(RandomizedRunner.java:829)
	at com.carrotsearch.randomizedtesting.RandomizedRunner$6.evaluate(RandomizedRunner.java:879)
	at com.carrotsearch.randomizedtesting.RandomizedRunner$7.evaluate(RandomizedRunner.java:890)
	at com.carrotsearch.randomizedtesting.rules.StatementAdapter.evaluate(StatementAdapter.java:36)
	at com.carrotsearch.randomizedtesting.rules.SystemPropertiesRestoreRule$1.evaluate(SystemPropertiesRestoreRule.java:57)
	at org.apache.lucene.util.AbstractBeforeAfterRule$1.evaluate(AbstractBeforeAfterRule.java:45)
	at com.carrotsearch.randomizedtesting.rules.StatementAdapter.evaluate(StatementAdapter.java:36)
	at org.apache.lucene.util.TestRuleStoreClassName$1.evaluate(TestRuleStoreClassName.java:41)
	at com.carrotsearch.randomizedtesting.rules.NoShadowingOrOverridesOnMethodsRule$1.evaluate(NoShadowingOrOverridesOnMethodsRule.java:40)
	at com.carrotsearch.randomizedtesting.rules.NoShadowingOrOverridesOnMethodsRule$1.evaluate(NoShadowingOrOverridesOnMethodsRule.java:40)
	at com.carrotsearch.randomizedtesting.rules.StatementAdapter.evaluate(StatementAdapter.java:36)
	at com.carrotsearch.randomizedtesting.rules.StatementAdapter.evaluate(StatementAdapter.java:36)
	at com.carrotsearch.randomizedtesting.rules.StatementAdapter.evaluate(StatementAdapter.java:36)
	at org.apache.lucene.util.TestRuleAssertionsRequired$1.evaluate(TestRuleAssertionsRequired.java:53)
	at org.apache.lucene.util.TestRuleMarkFailure$1.evaluate(TestRuleMarkFailure.java:47)
	at org.apache.lucene.util.TestRuleIgnoreAfterMaxFailures$1.evaluate(TestRuleIgnoreAfterMaxFailures.java:64)
	at org.apache.lucene.util.TestRuleIgnoreTestSuites$1.evaluate(TestRuleIgnoreTestSuites.java:54)
	at com.carrotsearch.randomizedtesting.rules.StatementAdapter.evaluate(StatementAdapter.java:36)
	at com.carrotsearch.randomizedtesting.ThreadLeakControl$StatementRunner.run(ThreadLeakControl.java:368)
	at java.lang.Thread.run(Thread.java:748)


FAILED:  org.apache.solr.cloud.TestPullReplica.testCreateDelete {seed=[8004907CC82B7714:9B1461303EDB8F24]}

Error Message:
Could not find collection : pull_replica_test_create_delete

Stack Trace:
org.apache.solr.common.SolrException: Could not find collection : pull_replica_test_create_delete
	at __randomizedtesting.SeedInfo.seed([8004907CC82B7714:9B1461303EDB8F24]:0)
	at org.apache.solr.common.cloud.ClusterState.getCollection(ClusterState.java:111)
	at org.apache.solr.cloud.SolrCloudTestCase.getCollectionState(SolrCloudTestCase.java:247)
	at org.apache.solr.cloud.TestPullReplica.testCreateDelete(TestPullReplica.java:161)
	at sun.reflect.NativeMethodAccessorImpl.invoke0(Native Method)
	at sun.reflect.NativeMethodAccessorImpl.invoke(NativeMethodAccessorImpl.java:62)
	at sun.reflect.DelegatingMethodAccessorImpl.invoke(DelegatingMethodAccessorImpl.java:43)
	at java.lang.reflect.Method.invoke(Method.java:498)
	at com.carrotsearch.randomizedtesting.RandomizedRunner.invoke(RandomizedRunner.java:1737)
	at com.carrotsearch.randomizedtesting.RandomizedRunner$8.evaluate(RandomizedRunner.java:934)
	at com.carrotsearch.randomizedtesting.RandomizedRunner$9.evaluate(RandomizedRunner.java:970)
	at com.carrotsearch.randomizedtesting.RandomizedRunner$10.evaluate(RandomizedRunner.java:984)
	at com.carrotsearch.randomizedtesting.rules.SystemPropertiesRestoreRule$1.evaluate(SystemPropertiesRestoreRule.java:57)
	at org.apache.lucene.util.TestRuleSetupTeardownChained$1.evaluate(TestRuleSetupTeardownChained.java:49)
	at org.apache.lucene.util.AbstractBeforeAfterRule$1.evaluate(AbstractBeforeAfterRule.java:45)
	at org.apache.lucene.util.TestRuleThreadAndTestName$1.evaluate(TestRuleThreadAndTestName.java:48)
	at org.apache.lucene.util.TestRuleIgnoreAfterMaxFailures$1.evaluate(TestRuleIgnoreAfterMaxFailures.java:64)
	at org.apache.lucene.util.TestRuleMarkFailure$1.evaluate(TestRuleMarkFailure.java:47)
	at com.carrotsearch.randomizedtesting.rules.StatementAdapter.evaluate(StatementAdapter.java:36)
	at com.carrotsearch.randomizedtesting.ThreadLeakControl$StatementRunner.run(ThreadLeakControl.java:368)
	at com.carrotsearch.randomizedtesting.ThreadLeakControl.forkTimeoutingTask(ThreadLeakControl.java:817)
	at com.carrotsearch.randomizedtesting.ThreadLeakControl$3.evaluate(ThreadLeakControl.java:468)
	at com.carrotsearch.randomizedtesting.RandomizedRunner.runSingleTest(RandomizedRunner.java:943)
	at com.carrotsearch.randomizedtesting.RandomizedRunner$5.evaluate(RandomizedRunner.java:829)
	at com.carrotsearch.randomizedtesting.RandomizedRunner$6.evaluate(RandomizedRunner.java:879)
	at com.carrotsearch.randomizedtesting.RandomizedRunner$7.evaluate(RandomizedRunner.java:890)
	at com.carrotsearch.randomizedtesting.rules.StatementAdapter.evaluate(StatementAdapter.java:36)
	at com.carrotsearch.randomizedtesting.rules.SystemPropertiesRestoreRule$1.evaluate(SystemPropertiesRestoreRule.java:57)
	at org.apache.lucene.util.AbstractBeforeAfterRule$1.evaluate(AbstractBeforeAfterRule.java:45)
	at com.carrotsearch.randomizedtesting.rules.StatementAdapter.evaluate(StatementAdapter.java:36)
	at org.apache.lucene.util.TestRuleStoreClassName$1.evaluate(TestRuleStoreClassName.java:41)
	at com.carrotsearch.randomizedtesting.rules.NoShadowingOrOverridesOnMethodsRule$1.evaluate(NoShadowingOrOverridesOnMethodsRule.java:40)
	at com.carrotsearch.randomizedtesting.rules.NoShadowingOrOverridesOnMethodsRule$1.evaluate(NoShadowingOrOverridesOnMethodsRule.java:40)
	at com.carrotsearch.randomizedtesting.rules.StatementAdapter.evaluate(StatementAdapter.java:36)
	at com.carrotsearch.randomizedtesting.rules.StatementAdapter.evaluate(StatementAdapter.java:36)
	at com.carrotsearch.randomizedtesting.rules.StatementAdapter.evaluate(StatementAdapter.java:36)
	at org.apache.lucene.util.TestRuleAssertionsRequired$1.evaluate(TestRuleAssertionsRequired.java:53)
	at org.apache.lucene.util.TestRuleMarkFailure$1.evaluate(TestRuleMarkFailure.java:47)
	at org.apache.lucene.util.TestRuleIgnoreAfterMaxFailures$1.evaluate(TestRuleIgnoreAfterMaxFailures.java:64)
	at org.apache.lucene.util.TestRuleIgnoreTestSuites$1.evaluate(TestRuleIgnoreTestSuites.java:54)
	at com.carrotsearch.randomizedtesting.rules.StatementAdapter.evaluate(StatementAdapter.java:36)
	at com.carrotsearch.randomizedtesting.ThreadLeakControl$StatementRunner.run(ThreadLeakControl.java:368)
	at java.lang.Thread.run(Thread.java:748)


FAILED:  org.apache.solr.cloud.TestPullReplica.testCreateDelete {seed=[8004907CC82B7714:2F42DDCC0A194408]}

Error Message:
Too many open files

Stack Trace:
java.net.SocketException: Too many open files
	at __randomizedtesting.SeedInfo.seed([8004907CC82B7714:2F42DDCC0A194408]:0)
	at java.net.Socket.createImpl(Socket.java:460)
	at java.net.Socket.getImpl(Socket.java:520)
	at java.net.Socket.setSoTimeout(Socket.java:1141)
	at org.apache.http.impl.conn.DefaultHttpClientConnectionOperator.connect(DefaultHttpClientConnectionOperator.java:120)
	at org.apache.http.impl.conn.PoolingHttpClientConnectionManager.connect(PoolingHttpClientConnectionManager.java:359)
	at org.apache.http.impl.execchain.MainClientExec.establishRoute(MainClientExec.java:381)
	at org.apache.http.impl.execchain.MainClientExec.execute(MainClientExec.java:237)
	at org.apache.http.impl.execchain.ProtocolExec.execute(ProtocolExec.java:185)
	at org.apache.http.impl.execchain.RetryExec.execute(RetryExec.java:89)
	at org.apache.http.impl.execchain.RedirectExec.execute(RedirectExec.java:111)
	at org.apache.http.impl.client.InternalHttpClient.doExecute(InternalHttpClient.java:185)
	at org.apache.http.impl.client.CloseableHttpClient.execute(CloseableHttpClient.java:83)
	at org.apache.http.impl.client.CloseableHttpClient.execute(CloseableHttpClient.java:108)
	at org.apache.http.impl.client.CloseableHttpClient.execute(CloseableHttpClient.java:56)
	at org.apache.solr.cloud.TestPullReplica.testCreateDelete(TestPullReplica.java:141)
	at sun.reflect.NativeMethodAccessorImpl.invoke0(Native Method)
	at sun.reflect.NativeMethodAccessorImpl.invoke(NativeMethodAccessorImpl.java:62)
	at sun.reflect.DelegatingMethodAccessorImpl.invoke(DelegatingMethodAccessorImpl.java:43)
	at java.lang.reflect.Method.invoke(Method.java:498)
	at com.carrotsearch.randomizedtesting.RandomizedRunner.invoke(RandomizedRunner.java:1737)
	at com.carrotsearch.randomizedtesting.RandomizedRunner$8.evaluate(RandomizedRunner.java:934)
	at com.carrotsearch.randomizedtesting.RandomizedRunner$9.evaluate(RandomizedRunner.java:970)
	at com.carrotsearch.randomizedtesting.RandomizedRunner$10.evaluate(RandomizedRunner.java:984)
	at com.carrotsearch.randomizedtesting.rules.SystemPropertiesRestoreRule$1.evaluate(SystemPropertiesRestoreRule.java:57)
	at org.apache.lucene.util.TestRuleSetupTeardownChained$1.evaluate(TestRuleSetupTeardownChained.java:49)
	at org.apache.lucene.util.AbstractBeforeAfterRule$1.evaluate(AbstractBeforeAfterRule.java:45)
	at org.apache.lucene.util.TestRuleThreadAndTestName$1.evaluate(TestRuleThreadAndTestName.java:48)
	at org.apache.lucene.util.TestRuleIgnoreAfterMaxFailures$1.evaluate(TestRuleIgnoreAfterMaxFailures.java:64)
	at org.apache.lucene.util.TestRuleMarkFailure$1.evaluate(TestRuleMarkFailure.java:47)
	at com.carrotsearch.randomizedtesting.rules.StatementAdapter.evaluate(StatementAdapter.java:36)
	at com.carrotsearch.randomizedtesting.ThreadLeakControl$StatementRunner.run(ThreadLeakControl.java:368)
	at com.carrotsearch.randomizedtesting.ThreadLeakControl.forkTimeoutingTask(ThreadLeakControl.java:817)
	at com.carrotsearch.randomizedtesting.ThreadLeakControl$3.evaluate(ThreadLeakControl.java:468)
	at com.carrotsearch.randomizedtesting.RandomizedRunner.runSingleTest(RandomizedRunner.java:943)
	at com.carrotsearch.randomizedtesting.RandomizedRunner$5.evaluate(RandomizedRunner.java:829)
	at com.carrotsearch.randomizedtesting.RandomizedRunner$6.evaluate(RandomizedRunner.java:879)
	at com.carrotsearch.randomizedtesting.RandomizedRunner$7.evaluate(RandomizedRunner.java:890)
	at com.carrotsearch.randomizedtesting.rules.StatementAdapter.evaluate(StatementAdapter.java:36)
	at com.carrotsearch.randomizedtesting.rules.SystemPropertiesRestoreRule$1.evaluate(SystemPropertiesRestoreRule.java:57)
	at org.apache.lucene.util.AbstractBeforeAfterRule$1.evaluate(AbstractBeforeAfterRule.java:45)
	at com.carrotsearch.randomizedtesting.rules.StatementAdapter.evaluate(StatementAdapter.java:36)
	at org.apache.lucene.util.TestRuleStoreClassName$1.evaluate(TestRuleStoreClassName.java:41)
	at com.carrotsearch.randomizedtesting.rules.NoShadowingOrOverridesOnMethodsRule$1.evaluate(NoShadowingOrOverridesOnMethodsRule.java:40)
	at com.carrotsearch.randomizedtesting.rules.NoShadowingOrOverridesOnMethodsRule$1.evaluate(NoShadowingOrOverridesOnMethodsRule.java:40)
	at com.carrotsearch.randomizedtesting.rules.StatementAdapter.evaluate(StatementAdapter.java:36)
	at com.carrotsearch.randomizedtesting.rules.StatementAdapter.evaluate(StatementAdapter.java:36)
	at com.carrotsearch.randomizedtesting.rules.StatementAdapter.evaluate(StatementAdapter.java:36)
	at org.apache.lucene.util.TestRuleAssertionsRequired$1.evaluate(TestRuleAssertionsRequired.java:53)
	at org.apache.lucene.util.TestRuleMarkFailure$1.evaluate(TestRuleMarkFailure.java:47)
	at org.apache.lucene.util.TestRuleIgnoreAfterMaxFailures$1.evaluate(TestRuleIgnoreAfterMaxFailures.java:64)
	at org.apache.lucene.util.TestRuleIgnoreTestSuites$1.evaluate(TestRuleIgnoreTestSuites.java:54)
	at com.carrotsearch.randomizedtesting.rules.StatementAdapter.evaluate(StatementAdapter.java:36)
	at com.carrotsearch.randomizedtesting.ThreadLeakControl$StatementRunner.run(ThreadLeakControl.java:368)
	at java.lang.Thread.run(Thread.java:748)


FAILED:  org.apache.solr.cloud.TestPullReplica.testKillLeader

Error Message:
Expected collection to be created with 1 shard and 2 replicas null Live Nodes: [127.0.0.1:58276_solr, 127.0.0.1:58277_solr] Last available state: null

Stack Trace:
java.lang.AssertionError: Expected collection to be created with 1 shard and 2 replicas
null
Live Nodes: [127.0.0.1:58276_solr, 127.0.0.1:58277_solr]
Last available state: null
	at __randomizedtesting.SeedInfo.seed([8004907CC82B7714:C91264C8AA90E342]:0)
	at org.junit.Assert.fail(Assert.java:93)
	at org.apache.solr.cloud.SolrCloudTestCase.waitForState(SolrCloudTestCase.java:269)
	at org.apache.solr.cloud.TestPullReplica.doTestNoLeader(TestPullReplica.java:374)
	at org.apache.solr.cloud.TestPullReplica.testKillLeader(TestPullReplica.java:290)
	at sun.reflect.NativeMethodAccessorImpl.invoke0(Native Method)
	at sun.reflect.NativeMethodAccessorImpl.invoke(NativeMethodAccessorImpl.java:62)
	at sun.reflect.DelegatingMethodAccessorImpl.invoke(DelegatingMethodAccessorImpl.java:43)
	at java.lang.reflect.Method.invoke(Method.java:498)
	at com.carrotsearch.randomizedtesting.RandomizedRunner.invoke(RandomizedRunner.java:1737)
	at com.carrotsearch.randomizedtesting.RandomizedRunner$8.evaluate(RandomizedRunner.java:934)
	at com.carrotsearch.randomizedtesting.RandomizedRunner$9.evaluate(RandomizedRunner.java:970)
	at com.carrotsearch.randomizedtesting.RandomizedRunner$10.evaluate(RandomizedRunner.java:984)
	at com.carrotsearch.randomizedtesting.rules.SystemPropertiesRestoreRule$1.evaluate(SystemPropertiesRestoreRule.java:57)
	at org.apache.lucene.util.TestRuleSetupTeardownChained$1.evaluate(TestRuleSetupTeardownChained.java:49)
	at org.apache.lucene.util.AbstractBeforeAfterRule$1.evaluate(AbstractBeforeAfterRule.java:45)
	at org.apache.lucene.util.TestRuleThreadAndTestName$1.evaluate(TestRuleThreadAndTestName.java:48)
	at org.apache.lucene.util.TestRuleIgnoreAfterMaxFailures$1.evaluate(TestRuleIgnoreAfterMaxFailures.java:64)
	at org.apache.lucene.util.TestRuleMarkFailure$1.evaluate(TestRuleMarkFailure.java:47)
	at com.carrotsearch.randomizedtesting.rules.StatementAdapter.evaluate(StatementAdapter.java:36)
	at com.carrotsearch.randomizedtesting.ThreadLeakControl$StatementRunner.run(ThreadLeakControl.java:368)
	at com.carrotsearch.randomizedtesting.ThreadLeakControl.forkTimeoutingTask(ThreadLeakControl.java:817)
	at com.carrotsearch.randomizedtesting.ThreadLeakControl$3.evaluate(ThreadLeakControl.java:468)
	at com.carrotsearch.randomizedtesting.RandomizedRunner.runSingleTest(RandomizedRunner.java:943)
	at com.carrotsearch.randomizedtesting.RandomizedRunner$5.evaluate(RandomizedRunner.java:829)
	at com.carrotsearch.randomizedtesting.RandomizedRunner$6.evaluate(RandomizedRunner.java:879)
	at com.carrotsearch.randomizedtesting.RandomizedRunner$7.evaluate(RandomizedRunner.java:890)
	at com.carrotsearch.randomizedtesting.rules.StatementAdapter.evaluate(StatementAdapter.java:36)
	at com.carrotsearch.randomizedtesting.rules.SystemPropertiesRestoreRule$1.evaluate(SystemPropertiesRestoreRule.java:57)
	at org.apache.lucene.util.AbstractBeforeAfterRule$1.evaluate(AbstractBeforeAfterRule.java:45)
	at com.carrotsearch.randomizedtesting.rules.StatementAdapter.evaluate(StatementAdapter.java:36)
	at org.apache.lucene.util.TestRuleStoreClassName$1.evaluate(TestRuleStoreClassName.java:41)
	at com.carrotsearch.randomizedtesting.rules.NoShadowingOrOverridesOnMethodsRule$1.evaluate(NoShadowingOrOverridesOnMethodsRule.java:40)
	at com.carrotsearch.randomizedtesting.rules.NoShadowingOrOverridesOnMethodsRule$1.evaluate(NoShadowingOrOverridesOnMethodsRule.java:40)
	at com.carrotsearch.randomizedtesting.rules.StatementAdapter.evaluate(StatementAdapter.java:36)
	at com.carrotsearch.randomizedtesting.rules.StatementAdapter.evaluate(StatementAdapter.java:36)
	at com.carrotsearch.randomizedtesting.rules.StatementAdapter.evaluate(StatementAdapter.java:36)
	at org.apache.lucene.util.TestRuleAssertionsRequired$1.evaluate(TestRuleAssertionsRequired.java:53)
	at org.apache.lucene.util.TestRuleMarkFailure$1.evaluate(TestRuleMarkFailure.java:47)
	at org.apache.lucene.util.TestRuleIgnoreAfterMaxFailures$1.evaluate(TestRuleIgnoreAfterMaxFailures.java:64)
	at org.apache.lucene.util.TestRuleIgnoreTestSuites$1.evaluate(TestRuleIgnoreTestSuites.java:54)
	at com.carrotsearch.randomizedtesting.rules.StatementAdapter.evaluate(StatementAdapter.java:36)
	at com.carrotsearch.randomizedtesting.ThreadLeakControl$StatementRunner.run(ThreadLeakControl.java:368)
	at java.lang.Thread.run(Thread.java:748)




Build Log:
[...truncated 12436 lines...]
   [junit4] Suite: org.apache.solr.cloud.FullSolrCloudDistribCmdsTest
   [junit4]   2> Creating dataDir: /Users/jenkins/workspace/Lucene-Solr-master-MacOSX/solr/build/solr-core/test/J1/temp/solr.cloud.FullSolrCloudDistribCmdsTest_8004907CC82B7714-001/init-core-data-001
   [junit4]   2> 1255435 WARN  (SUITE-FullSolrCloudDistribCmdsTest-seed#[8004907CC82B7714]-worker) [    ] o.a.s.SolrTestCaseJ4 startTrackingSearchers: numOpens=15 numCloses=15
   [junit4]   2> 1255435 INFO  (SUITE-FullSolrCloudDistribCmdsTest-seed#[8004907CC82B7714]-worker) [    ] o.a.s.SolrTestCaseJ4 Using TrieFields (NUMERIC_POINTS_SYSPROP=false) w/NUMERIC_DOCVALUES_SYSPROP=true
   [junit4]   2> 1255439 INFO  (SUITE-FullSolrCloudDistribCmdsTest-seed#[8004907CC82B7714]-worker) [    ] o.a.s.SolrTestCaseJ4 Randomized ssl (false) and clientAuth (false) via: @org.apache.solr.SolrTestCaseJ4$SuppressSSL(bugUrl=https://issues.apache.org/jira/browse/SOLR-5776) w/ MAC_OS_X supressed clientAuth
   [junit4]   2> 1255439 INFO  (SUITE-FullSolrCloudDistribCmdsTest-seed#[8004907CC82B7714]-worker) [    ] o.a.s.SolrTestCaseJ4 SecureRandom sanity checks: test.solr.allowed.securerandom=null & java.security.egd=file:/dev/./urandom
   [junit4]   2> 1255439 INFO  (SUITE-FullSolrCloudDistribCmdsTest-seed#[8004907CC82B7714]-worker) [    ] o.a.s.BaseDistributedSearchTestCase Setting hostContext system property: /di_w/y
   [junit4]   2> 1255441 INFO  (TEST-FullSolrCloudDistribCmdsTest.test-seed#[8004907CC82B7714]) [    ] o.a.s.c.ZkTestServer STARTING ZK TEST SERVER
   [junit4]   2> 1255441 INFO  (Thread-1929) [    ] o.a.s.c.ZkTestServer client port:0.0.0.0/0.0.0.0:0
   [junit4]   2> 1255441 INFO  (Thread-1929) [    ] o.a.s.c.ZkTestServer Starting server
   [junit4]   2> 1255444 ERROR (Thread-1929) [    ] o.a.z.s.ZooKeeperServer ZKShutdownHandler is not registered, so ZooKeeper server won't take any action on ERROR or SHUTDOWN server state changes
   [junit4]   2> 1255550 INFO  (TEST-FullSolrCloudDistribCmdsTest.test-seed#[8004907CC82B7714]) [    ] o.a.s.c.ZkTestServer start zk server on port:53246
   [junit4]   2> 1255578 INFO  (TEST-FullSolrCloudDistribCmdsTest.test-seed#[8004907CC82B7714]) [    ] o.a.s.c.AbstractZkTestCase put /Users/jenkins/workspace/Lucene-Solr-master-MacOSX/solr/core/src/test-files/solr/collection1/conf/solrconfig-tlog.xml to /configs/conf1/solrconfig.xml
   [junit4]   2> 1255581 INFO  (TEST-FullSolrCloudDistribCmdsTest.test-seed#[8004907CC82B7714]) [    ] o.a.s.c.AbstractZkTestCase put /Users/jenkins/workspace/Lucene-Solr-master-MacOSX/solr/core/src/test-files/solr/collection1/conf/schema15.xml to /configs/conf1/schema.xml
   [junit4]   2> 1255584 INFO  (TEST-FullSolrCloudDistribCmdsTest.test-seed#[8004907CC82B7714]) [    ] o.a.s.c.AbstractZkTestCase put /Users/jenkins/workspace/Lucene-Solr-master-MacOSX/solr/core/src/test-files/solr/collection1/conf/solrconfig.snippet.randomindexconfig.xml to /configs/conf1/solrconfig.snippet.randomindexconfig.xml
   [junit4]   2> 1255586 INFO  (TEST-FullSolrCloudDistribCmdsTest.test-seed#[8004907CC82B7714]) [    ] o.a.s.c.AbstractZkTestCase put /Users/jenkins/workspace/Lucene-Solr-master-MacOSX/solr/core/src/test-files/solr/collection1/conf/stopwords.txt to /configs/conf1/stopwords.txt
   [junit4]   2> 1255588 INFO  (TEST-FullSolrCloudDistribCmdsTest.test-seed#[8004907CC82B7714]) [    ] o.a.s.c.AbstractZkTestCase put /Users/jenkins/workspace/Lucene-Solr-master-MacOSX/solr/core/src/test-files/solr/collection1/conf/protwords.txt to /configs/conf1/protwords.txt
   [junit4]   2> 1255591 INFO  (TEST-FullSolrCloudDistribCmdsTest.test-seed#[8004907CC82B7714]) [    ] o.a.s.c.AbstractZkTestCase put /Users/jenkins/workspace/Lucene-Solr-master-MacOSX/solr/core/src/test-files/solr/collection1/conf/currency.xml to /configs/conf1/currency.xml
   [junit4]   2> 1255593 INFO  (TEST-FullSolrCloudDistribCmdsTest.test-seed#[8004907CC82B7714]) [    ] o.a.s.c.AbstractZkTestCase put /Users/jenkins/workspace/Lucene-Solr-master-MacOSX/solr/core/src/test-files/solr/collection1/conf/enumsConfig.xml to /configs/conf1/enumsConfig.xml
   [junit4]   2> 1255595 INFO  (TEST-FullSolrCloudDistribCmdsTest.test-seed#[8004907CC82B7714]) [    ] o.a.s.c.AbstractZkTestCase put /Users/jenkins/workspace/Lucene-Solr-master-MacOSX/solr/core/src/test-files/solr/collection1/conf/open-exchange-rates.json to /configs/conf1/open-exchange-rates.json
   [junit4]   2> 1255597 INFO  (TEST-FullSolrCloudDistribCmdsTest.test-seed#[8004907CC82B7714]) [    ] o.a.s.c.AbstractZkTestCase put /Users/jenkins/workspace/Lucene-Solr-master-MacOSX/solr/core/src/test-files/solr/collection1/conf/mapping-ISOLatin1Accent.txt to /configs/conf1/mapping-ISOLatin1Accent.txt
   [junit4]   2> 1255599 INFO  (TEST-FullSolrCloudDistribCmdsTest.test-seed#[8004907CC82B7714]) [    ] o.a.s.c.AbstractZkTestCase put /Users/jenkins/workspace/Lucene-Solr-master-MacOSX/solr/core/src/test-files/solr/collection1/conf/old_synonyms.txt to /configs/conf1/old_synonyms.txt
   [junit4]   2> 1255601 INFO  (TEST-FullSolrCloudDistribCmdsTest.test-seed#[8004907CC82B7714]) [    ] o.a.s.c.AbstractZkTestCase put /Users/jenkins/workspace/Lucene-Solr-master-MacOSX/solr/core/src/test-files/solr/collection1/conf/synonyms.txt to /configs/conf1/synonyms.txt
   [junit4]   2> 1255604 INFO  (TEST-FullSolrCloudDistribCmdsTest.test-seed#[8004907CC82B7714]) [    ] o.a.s.c.AbstractFullDistribZkTestBase Will use NRT replicas unless explicitly asked otherwise
   [junit4]   2> 1255919 INFO  (TEST-FullSolrCloudDistribCmdsTest.test-seed#[8004907CC82B7714]) [    ] o.e.j.s.Server jetty-9.3.20.v20170531
   [junit4]   2> 1255922 INFO  (TEST-FullSolrCloudDistribCmdsTest.test-seed#[8004907CC82B7714]) [    ] o.e.j.s.h.ContextHandler Started o.e.j.s.ServletContextHandler@5e1b245d{/di_w/y,null,AVAILABLE}
   [junit4]   2> 1255924 INFO  (TEST-FullSolrCloudDistribCmdsTest.test-seed#[8004907CC82B7714]) [    ] o.e.j.s.AbstractConnector Started ServerConnector@1b261cb6{HTTP/1.1,[http/1.1]}{127.0.0.1:53249}
   [junit4]   2> 1255924 INFO  (TEST-FullSolrCloudDistribCmdsTest.test-seed#[8004907CC82B7714]) [    ] o.e.j.s.Server Started @1258832ms
   [junit4]   2> 1255924 INFO  (TEST-FullSolrCloudDistribCmdsTest.test-seed#[8004907CC82B7714]) [    ] o.a.s.c.s.e.JettySolrRunner Jetty properties: {solr.data.dir=/Users/jenkins/workspace/Lucene-Solr-master-MacOSX/solr/build/solr-core/test/J1/temp/solr.cloud.FullSolrCloudDistribCmdsTest_8004907CC82B7714-001/tempDir-001/control/data, replicaType=NRT, hostContext=/di_w/y, hostPort=53249, coreRootDirectory=/Users/jenkins/workspace/Lucene-Solr-master-MacOSX/solr/build/solr-core/test/J1/temp/solr.cloud.FullSolrCloudDistribCmdsTest_8004907CC82B7714-001/control-001/cores}
   [junit4]   2> 1255925 ERROR (TEST-FullSolrCloudDistribCmdsTest.test-seed#[8004907CC82B7714]) [    ] o.a.s.u.StartupLoggingUtils Missing Java Option solr.log.dir. Logging may be missing or incomplete.
   [junit4]   2> 1255925 INFO  (TEST-FullSolrCloudDistribCmdsTest.test-seed#[8004907CC82B7714]) [    ] o.a.s.s.SolrDispatchFilter  ___      _       Welcome to Apache Solr? version 8.0.0
   [junit4]   2> 1255925 INFO  (TEST-FullSolrCloudDistribCmdsTest.test-seed#[8004907CC82B7714]) [    ] o.a.s.s.SolrDispatchFilter / __| ___| |_ _   Starting in cloud mode on port null
   [junit4]   2> 1255925 INFO  (TEST-FullSolrCloudDistribCmdsTest.test-seed#[8004907CC82B7714]) [    ] o.a.s.s.SolrDispatchFilter \__ \/ _ \ | '_|  Install dir: null, Default config dir: null
   [junit4]   2> 1255925 INFO  (TEST-FullSolrCloudDistribCmdsTest.test-seed#[8004907CC82B7714]) [    ] o.a.s.s.SolrDispatchFilter |___/\___/_|_|    Start time: 2017-10-18T13:53:17.758Z
   [junit4]   2> 1255928 INFO  (TEST-FullSolrCloudDistribCmdsTest.test-seed#[8004907CC82B7714]) [    ] o.a.s.s.SolrDispatchFilter Loading solr.xml from SolrHome (not found in ZooKeeper)
   [junit4]   2> 1255928 INFO  (TEST-FullSolrCloudDistribCmdsTest.test-seed#[8004907CC82B7714]) [    ] o.a.s.c.SolrXmlConfig Loading container configuration from /Users/jenkins/workspace/Lucene-Solr-master-MacOSX/solr/build/solr-core/test/J1/temp/solr.cloud.FullSolrCloudDistribCmdsTest_8004907CC82B7714-001/control-001/solr.xml
   [junit4]   2> 1255933 INFO  (TEST-FullSolrCloudDistribCmdsTest.test-seed#[8004907CC82B7714]) [    ] o.a.s.c.SolrXmlConfig Configuration parameter autoReplicaFailoverWorkLoopDelay is ignored
   [junit4]   2> 1255933 INFO  (TEST-FullSolrCloudDistribCmdsTest.test-seed#[8004907CC82B7714]) [    ] o.a.s.c.SolrXmlConfig Configuration parameter autoReplicaFailoverBadNodeExpiration is ignored
   [junit4]   2> 1255933 INFO  (TEST-FullSolrCloudDistribCmdsTest.test-seed#[8004907CC82B7714]) [    ] o.a.s.c.SolrXmlConfig MBean server found: com.sun.jmx.mbeanserver.JmxMBeanServer@e0a81d0, but no JMX reporters were configured - adding default JMX reporter.
   [junit4]   2> 1255937 INFO  (TEST-FullSolrCloudDistribCmdsTest.test-seed#[8004907CC82B7714]) [    ] o.a.s.c.ZkContainer Zookeeper client=127.0.0.1:53246/solr
   [junit4]   2> 1256083 INFO  (TEST-FullSolrCloudDistribCmdsTest.test-seed#[8004907CC82B7714]) [n:127.0.0.1:53249_di_w%2Fy    ] o.a.s.c.Overseer Overseer (id=null) closing
   [junit4]   2> 1256084 INFO  (TEST-FullSolrCloudDistribCmdsTest.test-seed#[8004907CC82B7714]) [n:127.0.0.1:53249_di_w%2Fy    ] o.a.s.c.OverseerElectionContext I am going to be the leader 127.0.0.1:53249_di_w%2Fy
   [junit4]   2> 1256086 INFO  (TEST-FullSolrCloudDistribCmdsTest.test-seed#[8004907CC82B7714]) [n:127.0.0.1:53249_di_w%2Fy    ] o.a.s.c.Overseer Overseer (id=98850229274279940-127.0.0.1:53249_di_w%2Fy-n_0000000000) starting
   [junit4]   2> 1256097 INFO  (TEST-FullSolrCloudDistribCmdsTest.test-seed#[8004907CC82B7714]) [n:127.0.0.1:53249_di_w%2Fy    ] o.a.s.c.ZkController Register node as live in ZooKeeper:/live_nodes/127.0.0.1:53249_di_w%2Fy
   [junit4]   2> 1256100 INFO  (OverseerStateUpdate-98850229274279940-127.0.0.1:53249_di_w%2Fy-n_0000000000) [n:127.0.0.1:53249_di_w%2Fy    ] o.a.s.c.c.ZkStateReader Updated live nodes from ZooKeeper... (0) -> (1)
   [junit4]   2> 1256185 INFO  (TEST-FullSolrCloudDistribCmdsTest.test-seed#[8004907CC82B7714]) [n:127.0.0.1:53249_di_w%2Fy    ] o.a.s.m.r.SolrJmxReporter JMX monitoring for 'solr.node' (registry 'solr.node') enabled at server: com.sun.jmx.mbeanserver.JmxMBeanServer@e0a81d0
   [junit4]   2> 1256192 INFO  (TEST-FullSolrCloudDistribCmdsTest.test-seed#[8004907CC82B7714]) [n:127.0.0.1:53249_di_w%2Fy    ] o.a.s.m.r.SolrJmxReporter JMX monitoring for 'solr.jvm' (registry 'solr.jvm') enabled at server: com.sun.jmx.mbeanserver.JmxMBeanServer@e0a81d0
   [junit4]   2> 1256192 INFO  (TEST-FullSolrCloudDistribCmdsTest.test-seed#[8004907CC82B7714]) [n:127.0.0.1:53249_di_w%2Fy    ] o.a.s.m.r.SolrJmxReporter JMX monitoring for 'solr.jetty' (registry 'solr.jetty') enabled at server: com.sun.jmx.mbeanserver.JmxMBeanServer@e0a81d0
   [junit4]   2> 1256193 INFO  (TEST-FullSolrCloudDistribCmdsTest.test-seed#[8004907CC82B7714]) [n:127.0.0.1:53249_di_w%2Fy    ] o.a.s.c.CorePropertiesLocator Found 0 core definitions underneath /Users/jenkins/workspace/Lucene-Solr-master-MacOSX/solr/build/solr-core/test/J1/temp/solr.cloud.FullSolrCloudDistribCmdsTest_8004907CC82B7714-001/control-001/cores
   [junit4]   2> 1256214 INFO  (TEST-FullSolrCloudDistribCmdsTest.test-seed#[8004907CC82B7714]) [    ] o.a.s.c.c.ZkStateReader Updated live nodes from ZooKeeper... (0) -> (1)
   [junit4]   2> 1256219 INFO  (TEST-FullSolrCloudDistribCmdsTest.test-seed#[8004907CC82B7714]) [    ] o.a.s.c.s.i.ZkClientClusterStateProvider Cluster at 127.0.0.1:53246/solr ready
   [junit4]   2> 1256222 INFO  (qtp958319570-9975) [n:127.0.0.1:53249_di_w%2Fy    ] o.a.s.h.a.CollectionsHandler Invoked Collection Action :create with params replicationFactor=1&collection.configName=conf1&name=control_collection&nrtReplicas=1&action=CREATE&numShards=1&createNodeSet=127.0.0.1:53249_di_w%252Fy&wt=javabin&version=2 and sendToOCPQueue=true
   [junit4]   2> 1256225 INFO  (OverseerThreadFactory-4762-thread-1-processing-n:127.0.0.1:53249_di_w%2Fy) [n:127.0.0.1:53249_di_w%2Fy    ] o.a.s.c.CreateCollectionCmd Create collection control_collection
   [junit4]   2> 1256343 INFO  (qtp958319570-9977) [n:127.0.0.1:53249_di_w%2Fy    ] o.a.s.h.a.CoreAdminOperation core create command qt=/admin/cores&collection.configName=conf1&newCollection=true&name=control_collection_shard1_replica_n1&action=CREATE&numShards=1&collection=control_collection&shard=shard1&wt=javabin&version=2&replicaType=NRT
   [junit4]   2> 1256344 INFO  (qtp958319570-9977) [n:127.0.0.1:53249_di_w%2Fy    ] o.a.s.c.TransientSolrCoreCacheDefault Allocating transient cache for 4 transient cores
   [junit4]   2> 1256459 INFO  (zkCallback-1683-thread-1-processing-n:127.0.0.1:53249_di_w%2Fy) [n:127.0.0.1:53249_di_w%2Fy    ] o.a.s.c.c.ZkStateReader A cluster state change: [WatchedEvent state:SyncConnected type:NodeDataChanged path:/collections/control_collection/state.json] for collection [control_collection] has occurred - updating... (live nodes size: [1])
   [junit4]   2> 1257379 INFO  (qtp958319570-9977) [n:127.0.0.1:53249_di_w%2Fy c:control_collection s:shard1  x:control_collection_shard1_replica_n1] o.a.s.c.SolrConfig Using Lucene MatchVersion: 8.0.0
   [junit4]   2> 1257398 INFO  (qtp958319570-9977) [n:127.0.0.1:53249_di_w%2Fy c:control_collection s:shard1  x:control_collection_shard1_replica_n1] o.a.s.s.IndexSchema [control_collection_shard1_replica_n1] Schema name=test
   [junit4]   2> 1257498 INFO  (qtp958319570-9977) [n:127.0.0.1:53249_di_w%2Fy c:control_collection s:shard1  x:control_collection_shard1_replica_n1] o.a.s.s.IndexSchema Loaded schema test/1.6 with uniqueid field id
   [junit4]   2> 1257535 INFO  (qtp958319570-9977) [n:127.0.0.1:53249_di_w%2Fy c:control_collection s:shard1  x:control_collection_shard1_replica_n1] o.a.s.c.CoreContainer Creating SolrCore 'control_collection_shard1_replica_n1' using configuration from collection control_collection, trusted=true
   [junit4]   2> 1257536 INFO  (qtp958319570-9977) [n:127.0.0.1:53249_di_w%2Fy c:control_collection s:shard1  x:control_collection_shard1_replica_n1] o.a.s.m.r.SolrJmxReporter JMX monitoring for 'solr.core.control_collection.shard1.replica_n1' (registry 'solr.core.control_collection.shard1.replica_n1') enabled at server: com.sun.jmx.mbeanserver.JmxMBeanServer@e0a81d0
   [junit4]   2> 1257536 INFO  (qtp958319570-9977) [n:127.0.0.1:53249_di_w%2Fy c:control_collection s:shard1  x:control_collection_shard1_replica_n1] o.a.s.c.SolrCore solr.RecoveryStrategy.Builder
   [junit4]   2> 1257536 INFO  (qtp958319570-9977) [n:127.0.0.1:53249_di_w%2Fy c:control_collection s:shard1  x:control_collection_shard1_replica_n1] o.a.s.c.SolrCore [[control_collection_shard1_replica_n1] ] Opening new SolrCore at [/Users/jenkins/workspace/Lucene-Solr-master-MacOSX/solr/build/solr-core/test/J1/temp/solr.cloud.FullSolrCloudDistribCmdsTest_8004907CC82B7714-001/control-001/cores/control_collection_shard1_replica_n1], dataDir=[/Users/jenkins/workspace/Lucene-Solr-master-MacOSX/solr/build/solr-core/test/J1/temp/solr.cloud.FullSolrCloudDistribCmdsTest_8004907CC82B7714-001/control-001/cores/control_collection_shard1_replica_n1/data/]
   [junit4]   2> 1257539 INFO  (qtp958319570-9977) [n:127.0.0.1:53249_di_w%2Fy c:control_collection s:shard1  x:control_collection_shard1_replica_n1] o.a.s.u.RandomMergePolicy RandomMergePolicy wrapping class org.apache.lucene.index.TieredMergePolicy: [TieredMergePolicy: maxMergeAtOnce=5, maxMergeAtOnceExplicit=5, maxMergedSegmentMB=3.3974609375, floorSegmentMB=1.7431640625, forceMergeDeletesPctAllowed=23.520056929982637, segmentsPerTier=49.0, maxCFSSegmentSizeMB=8.796093022207999E12, noCFSRatio=1.0
   [junit4]   2> 1257542 WARN  (qtp958319570-9977) [n:127.0.0.1:53249_di_w%2Fy c:control_collection s:shard1  x:control_collection_shard1_replica_n1] o.a.s.c.RequestHandlers INVALID paramSet a in requestHandler {type = requestHandler,name = /dump,class = DumpRequestHandler,attributes = {initParams=a, name=/dump, class=DumpRequestHandler},args = {defaults={a=A,b=B}}}
   [junit4]   2> 1257644 INFO  (qtp958319570-9977) [n:127.0.0.1:53249_di_w%2Fy c:control_collection s:shard1  x:control_collection_shard1_replica_n1] o.a.s.u.UpdateHandler Using UpdateLog implementation: org.apache.solr.update.UpdateLog
   [junit4]   2> 1257644 INFO  (qtp958319570-9977) [n:127.0.0.1:53249_di_w%2Fy c:control_collection s:shard1  x:control_collection_shard1_replica_n1] o.a.s.u.UpdateLog Initializing UpdateLog: dataDir= defaultSyncLevel=FLUSH numRecordsToKeep=100 maxNumLogsToKeep=10 numVersionBuckets=65536
   [junit4]   2> 1257645 INFO  (qtp958319570-9977) [n:127.0.0.1:53249_di_w%2Fy c:control_collection s:shard1  x:control_collection_shard1_replica_n1] o.a.s.u.CommitTracker Hard AutoCommit: disabled
   [junit4]   2> 1257645 INFO  (qtp958319570-9977) [n:127.0.0.1:53249_di_w%2Fy c:control_collection s:shard1  x:control_collection_shard1_replica_n1] o.a.s.u.CommitTracker Soft AutoCommit: disabled
   [junit4]   2> 1257648 INFO  (qtp958319570-9977) [n:127.0.0.1:53249_di_w%2Fy c:control_collection s:shard1  x:control_collection_shard1_replica_n1] o.a.s.u.RandomMergePolicy RandomMergePolicy wrapping class org.apache.lucene.index.TieredMergePolicy: [TieredMergePolicy: maxMergeAtOnce=49, maxMergeAtOnceExplicit=43, maxMergedSegmentMB=95.4404296875, floorSegmentMB=0.470703125, forceMergeDeletesPctAllowed=4.534362442792538, segmentsPerTier=44.0, maxCFSSegmentSizeMB=8.796093022207999E12, noCFSRatio=0.26429160646214656
   [junit4]   2> 1257648 INFO  (qtp958319570-9977) [n:127.0.0.1:53249_di_w%2Fy c:control_collection s:shard1  x:control_collection_shard1_replica_n1] o.a.s.s.SolrIndexSearcher Opening [Searcher@786c1d4[control_collection_shard1_replica_n1] main]
   [junit4]   2> 1257650 INFO  (qtp958319570-9977) [n:127.0.0.1:53249_di_w%2Fy c:control_collection s:shard1  x:control_collection_shard1_replica_n1] o.a.s.r.ManagedResourceStorage Configured ZooKeeperStorageIO with znodeBase: /configs/conf1
   [junit4]   2> 1257650 INFO  (qtp958319570-9977) [n:127.0.0.1:53249_di_w%2Fy c:control_collection s:shard1  x:control_collection_shard1_replica_n1] o.a.s.r.ManagedResourceStorage Loaded null at path _rest_managed.json using ZooKeeperStorageIO:path=/configs/conf1
   [junit4]   2> 1257651 INFO  (qtp958319570-9977) [n:127.0.0.1:53249_di_w%2Fy c:control_collection s:shard1  x:control_collection_shard1_replica_n1] o.a.s.h.ReplicationHandler Commits will be reserved for 10000ms.
   [junit4]   2> 1257651 INFO  (qtp958319570-9977) [n:127.0.0.1:53249_di_w%2Fy c:control_collection s:shard1  x:control_collection_shard1_replica_n1] o.a.s.u.UpdateLog Could not find max version in index or recent updates, using new clock 1581603670703734784
   [junit4]   2> 1257658 INFO  (qtp958319570-9977) [n:127.0.0.1:53249_di_w%2Fy c:control_collection s:shard1  x:control_collection_shard1_replica_n1] o.a.s.c.ShardLeaderElectionContext Enough replicas found to continue.
   [junit4]   2> 1257658 INFO  (qtp958319570-9977) [n:127.0.0.1:53249_di_w%2Fy c:control_collection s:shard1  x:control_collection_shard1_replica_n1] o.a.s.c.ShardLeaderElectionContext I may be the new leader - try and sync
   [junit4]   2> 1257658 INFO  (qtp958319570-9977) [n:127.0.0.1:53249_di_w%2Fy c:control_collection s:shard1  x:control_collection_shard1_replica_n1] o.a.s.c.SyncStrategy Sync replicas to http://127.0.0.1:53249/di_w/y/control_collection_shard1_replica_n1/
   [junit4]   2> 1257658 INFO  (qtp958319570-9977) [n:127.0.0.1:53249_di_w%2Fy c:control_collection s:shard1  x:control_collection_shard1_replica_n1] o.a.s.c.SyncStrategy Sync Success - now sync replicas to me
   [junit4]   2> 1257658 INFO  (qtp958319570-9977) [n:127.0.0.1:53249_di_w%2Fy c:control_collection s:shard1  x:control_collection_shard1_replica_n1] o.a.s.c.SyncStrategy http://127.0.0.1:53249/di_w/y/control_collection_shard1_replica_n1/ has no replicas
   [junit4]   2> 1257658 INFO  (qtp958319570-9977) [n:127.0.0.1:53249_di_w%2Fy c:control_collection s:shard1  x:control_collection_shard1_replica_n1] o.a.s.c.ShardLeaderElectionContext Found all replicas participating in election, clear LIR
   [junit4]   2> 1257663 INFO  (qtp958319570-9977) [n:127.0.0.1:53249_di_w%2Fy c:control_collection s:shard1  x:control_collection_shard1_replica_n1] o.a.s.c.ShardLeaderElectionContext I am the new leader: http://127.0.0.1:53249/di_w/y/control_collection_shard1_replica_n1/ shard1
   [junit4]   2> 1257663 INFO  (searcherExecutor-4765-thread-1-processing-n:127.0.0.1:53249_di_w%2Fy x:control_collection_shard1_replica_n1 s:shard1 c:control_collection) [n:127.0.0.1:53249_di_w%2Fy c:control_collection s:shard1  x:control_collection_shard1_replica_n1] o.a.s.c.SolrCore [control_collection_shard1_replica_n1] Registered new searcher Searcher@786c1d4[control_collection_shard1_replica_n1] main{ExitableDirectoryReader(UninvertingDirectoryReader())}
   [junit4]   2> 1257766 INFO  (zkCallback-1683-thread-2-processing-n:127.0.0.1:53249_di_w%2Fy) [n:127.0.0.1:53249_di_w%2Fy    ] o.a.s.c.c.ZkStateReader A cluster state change: [WatchedEvent state:SyncConnected type:NodeDataChanged path:/collections/control_collection/state.json] for collection [control_collection] has occurred - updating... (live nodes size: [1])
   [junit4]   2> 1257782 INFO  (qtp958319570-9977) [n:127.0.0.1:53249_di_w%2Fy c:control_collection s:shard1  x:control_collection_shard1_replica_n1] o.a.s.c.ZkController I am the leader, no recovery necessary
   [junit4]   2> 1257785 INFO  (qtp958319570-9977) [n:127.0.0.1:53249_di_w%2Fy c:control_collection s:shard1  x:control_collection_shard1_replica_n1] o.a.s.s.HttpSolrCall [admin] webapp=null path=/admin/cores params={qt=/admin/cores&collection.configName=conf1&newCollection=true&name=control_collection_shard1_replica_n1&action=CREATE&numShards=1&collection=control_collection&shard=shard1&wt=javabin&version=2&replicaType=NRT} status=0 QTime=1442
   [junit4]   2> 1257802 INFO  (qtp958319570-9975) [n:127.0.0.1:53249_di_w%2Fy    ] o.a.s.h.a.CollectionsHandler Wait for new collection to be active for at most 30 seconds. Check all shard replicas
   [junit4]   2> 1257897 INFO  (zkCallback-1683-thread-2-processing-n:127.0.0.1:53249_di_w%2Fy) [n:127.0.0.1:53249_di_w%2Fy    ] o.a.s.c.c.ZkStateReader A cluster state change: [WatchedEvent state:SyncConnected type:NodeDataChanged path:/collections/control_collection/state.json] for collection [control_collection] has occurred - updating... (live nodes size: [1])
   [junit4]   2> 1258234 INFO  (OverseerCollectionConfigSetProcessor-98850229274279940-127.0.0.1:53249_di_w%2Fy-n_0000000000) [n:127.0.0.1:53249_di_w%2Fy    ] o.a.s.c.OverseerTaskQueue Response ZK path: /overseer/collection-queue-work/qnr-0000000000 doesn't exist.  Requestor may have disconnected from ZooKeeper
   [junit4]   2> 1258804 INFO  (qtp958319570-9975) [n:127.0.0.1:53249_di_w%2Fy    ] o.a.s.s.HttpSolrCall [admin] webapp=null path=/admin/collections params={replicationFactor=1&collection.configName=conf1&name=control_collection&nrtReplicas=1&action=CREATE&numShards=1&createNodeSet=127.0.0.1:53249_di_w%252Fy&wt=javabin&version=2} status=0 QTime=2581
   [junit4]   2> 1258817 INFO  (TEST-FullSolrCloudDistribCmdsTest.test-seed#[8004907CC82B7714]) [    ] o.a.s.c.c.ZkStateReader Updated live nodes from ZooKeeper... (0) -> (1)
   [junit4]   2> 1258819 INFO  (TEST-FullSolrCloudDistribCmdsTest.test-seed#[8004907CC82B7714]) [    ] o.a.s.c.s.i.ZkClientClusterStateProvider Cluster at 127.0.0.1:53246/solr ready
   [junit4]   2> 1258819 INFO  (TEST-FullSolrCloudDistribCmdsTest.test-seed#[8004907CC82B7714]) [    ] o.a.s.c.ChaosMonkey monkey: init - expire sessions:false cause connection loss:false
   [junit4]   2> 1258820 INFO  (qtp958319570-9973) [n:127.0.0.1:53249_di_w%2Fy    ] o.a.s.h.a.CollectionsHandler Invoked Collection Action :create with params replicationFactor=1&collection.configName=conf1&name=collection1&nrtReplicas=1&action=CREATE&numShards=3&createNodeSet=&stateFormat=1&wt=javabin&version=2 and sendToOCPQueue=true
   [junit4]   2> 1258824 INFO  (OverseerThreadFactory-4762-thread-2-processing-n:127.0.0.1:53249_di_w%2Fy) [n:127.0.0.1:53249_di_w%2Fy    ] o.a.s.c.CreateCollectionCmd Create collection collection1
   [junit4]   2> 1258827 WARN  (OverseerThreadFactory-4762-thread-2-processing-n:127.0.0.1:53249_di_w%2Fy) [n:127.0.0.1:53249_di_w%2Fy    ] o.a.s.c.CreateCollectionCmd It is unusual to create a collection (collection1) without cores.
   [junit4]   2> 1259036 INFO  (qtp958319570-9973) [n:127.0.0.1:53249_di_w%2Fy    ] o.a.s.h.a.CollectionsHandler Wait for new collection to be active for at most 30 seconds. Check all shard replicas
   [junit4]   2> 1259036 INFO  (qtp958319570-9973) [n:127.0.0.1:53249_di_w%2Fy    ] o.a.s.s.HttpSolrCall [admin] webapp=null path=/admin/collections params={replicationFactor=1&collection.configName=conf1&name=collection1&nrtReplicas=1&action=CREATE&numShards=3&createNodeSet=&stateFormat=1&wt=javabin&version=2} status=0 QTime=215
   [junit4]   2> 1259447 INFO  (TEST-FullSolrCloudDistribCmdsTest.test-seed#[8004907CC82B7714]) [    ] o.a.s.c.AbstractFullDistribZkTestBase create jetty 1 in directory /Users/jenkins/workspace/Lucene-Solr-master-MacOSX/solr/build/solr-core/test/J1/temp/solr.cloud.FullSolrCloudDistribCmdsTest_8004907CC82B7714-001/shard-1-001 of type NRT
   [junit4]   2> 1259447 INFO  (TEST-FullSolrCloudDistribCmdsTest.test-seed#[8004907CC82B7714]) [    ] o.e.j.s.Server jetty-9.3.20.v20170531
   [junit4]   2> 1259449 INFO  (TEST-FullSolrCloudDistribCmdsTest.test-seed#[8004907CC82B7714]) [    ] o.e.j.s.h.ContextHandler Started o.e.j.s.ServletContextHandler@62d5c53a{/di_w/y,null,AVAILABLE}
   [junit4]   2> 1259450 INFO  (TEST-FullSolrCloudDistribCmdsTest.test-seed#[8004907CC82B7714]) [    ] o.e.j.s.AbstractConnector Started ServerConnector@4a8f73e0{HTTP/1.1,[http/1.1]}{127.0.0.1:53265}
   [junit4]   2> 1259450 INFO  (TEST-FullSolrCloudDistribCmdsTest.test-seed#[8004907CC82B7714]) [    ] o.e.j.s.Server Started @1262358ms
   [junit4]   2> 1259450 INFO  (TEST-FullSolrCloudDistribCmdsTest.test-seed#[8004907CC82B7714]) [    ] o.a.s.c.s.e.JettySolrRunner Jetty properties: {solr.data.dir=/Users/jenkins/workspace/Lucene-Solr-master-MacOSX/solr/build/solr-core/test/J1/temp/solr.cloud.FullSolrCloudDistribCmdsTest_8004907CC82B7714-001/tempDir-001/jetty1, solrconfig=solrconfig.xml, hostContext=/di_w/y, hostPort=53265, coreRootDirectory=/Users/jenkins/workspace/Lucene-Solr-master-MacOSX/solr/build/solr-core/test/J1/../../../../../../../../../Users/jenkins/workspace/Lucene-Solr-master-MacOSX/solr/build/solr-core/test/J1/temp/solr.cloud.FullSolrCloudDistribCmdsTest_8004907CC82B7714-001/shard-1-001/cores}
   [junit4]   2> 1259451 ERROR (TEST-FullSolrCloudDistribCmdsTest.test-seed#[8004907CC82B7714]) [    ] o.a.s.u.StartupLoggingUtils Missing Java Option solr.log.dir. Logging may be missing or incomplete.
   [junit4]   2> 1259451 INFO  (TEST-FullSolrCloudDistribCmdsTest.test-seed#[8004907CC82B7714]) [    ] o.a.s.s.SolrDispatchFilter  ___      _       Welcome to Apache Solr? version 8.0.0
   [junit4]   2> 1259451 INFO  (TEST-FullSolrCloudDistribCmdsTest.test-seed#[8004907CC82B7714]) [    ] o.a.s.s.SolrDispatchFilter / __| ___| |_ _   Starting in cloud mode on port null
   [junit4]   2> 1259451 INFO  (TEST-FullSolrCloudDistribCmdsTest.test-seed#[8004907CC82B7714]) [    ] o.a.s.s.SolrDispatchFilter \__ \/ _ \ | '_|  Install dir: null, Default config dir: null
   [junit4]   2> 1259451 INFO  (TEST-FullSolrCloudDistribCmdsTest.test-seed#[8004907CC82B7714]) [    ] o.a.s.s.SolrDispatchFilter |___/\___/_|_|    Start time: 2017-10-18T13:53:21.284Z
   [junit4]   2> 1259456 INFO  (TEST-FullSolrCloudDistribCmdsTest.test-seed#[8004907CC82B7714]) [    ] o.a.s.s.SolrDispatchFilter Loading solr.xml from SolrHome (not found in ZooKeeper)
   [junit4]   2> 1259456 INFO  (TEST-FullSolrCloudDistribCmdsTest.test-seed#[8004907CC82B7714]) [    ] o.a.s.c.SolrXmlConfig Loading container configuration from /Users/jenkins/workspace/Lucene-Solr-master-MacOSX/solr/build/solr-core/test/J1/temp/solr.cloud.FullSolrCloudDistribCmdsTest_8004907CC82B7714-001/shard-1-001/solr.xml
   [junit4]   2> 1259461 INFO  (TEST-FullSolrCloudDistribCmdsTest.test-seed#[8004907CC82B7714]) [    ] o.a.s.c.SolrXmlConfig Configuration parameter autoReplicaFailoverWorkLoopDelay is ignored
   [junit4]   2> 1259461 INFO  (TEST-FullSolrCloudDistribCmdsTest.test-seed#[8004907CC82B7714]) [    ] o.a.s.c.SolrXmlConfig Configuration parameter autoReplicaFailoverBadNodeExpiration is ignored
   [junit4]   2> 1259462 INFO  (TEST-FullSolrCloudDistribCmdsTest.test-seed#[8004907CC82B7714]) [    ] o.a.s.c.SolrXmlConfig MBean server found: com.sun.jmx.mbeanserver.JmxMBeanServer@e0a81d0, but no JMX reporters were configured - adding default JMX reporter.
   [junit4]   2> 1259466 INFO  (TEST-FullSolrCloudDistribCmdsTest.test-seed#[8004907CC82B7714]) [    ] o.a.s.c.ZkContainer Zookeeper client=127.0.0.1:53246/solr
   [junit4]   2> 1259486 INFO  (TEST-FullSolrCloudDistribCmdsTest.test-seed#[8004907CC82B7714]) [n:127.0.0.1:53265_di_w%2Fy    ] o.a.s.c.c.ZkStateReader Updated live nodes from ZooKeeper... (0) -> (1)
   [junit4]   2> 1259490 INFO  (TEST-FullSolrCloudDistribCmdsTest.test-seed#[8004907CC82B7714]) [n:127.0.0.1:53265_di_w%2Fy    ] o.a.s.c.Overseer Overseer (id=null) closing
   [junit4]   2> 1259494 INFO  (TEST-FullSolrCloudDistribCmdsTest.test-seed#[8004907CC82B7714]) [n:127.0.0.1:53265_di_w%2Fy    ] o.a.s.c.ZkController Register node as live in ZooKeeper:/live_nodes/127.0.0.1:53265_di_w%2Fy
   [junit4]   2> 1259496 INFO  (zkCallback-1683-thread-2-processing-n:127.0.0.1:53249_di_w%2Fy) [n:127.0.0.1:53249_di_w%2Fy    ] o.a.s.c.c.ZkStateReader Updated live nodes from ZooKeeper... (1) -> (2)
   [junit4]   2> 1259497 INFO  (zkCallback-1691-thread-1) [    ] o.a.s.c.c.ZkStateReader Updated live nodes from ZooKeeper... (1) -> (2)
   [junit4]   2> 1259497 INFO  (zkCallback-1696-thread-1-processing-n:127.0.0.1:53265_di_w%2Fy) [n:127.0.0.1:53265_di_w%2Fy    ] o.a.s.c.c.ZkStateReader Updated live nodes from ZooKeeper... (1) -> (2)
   [junit4]   2> 1259636 INFO  (TEST-FullSolrCloudDistribCmdsTest.test-seed#[8004907CC82B7714]) [n:127.0.0.1:53265_di_w%2Fy    ] o.a.s.m.r.SolrJmxReporter JMX monitoring for 'solr.node' (registry 'solr.node') enabled at server: com.sun.jmx.mbeanserver.JmxMBeanServer@e0a81d0
   [junit4]   2> 1259646 INFO  (TEST-FullSolrCloudDistribCmdsTest.test-seed#[8004907CC82B7714]) [n:127.0.0.1:53265_di_w%2Fy    ] o.a.s.m.r.SolrJmxReporter JMX monitoring for 'solr.jvm' (registry 'solr.jvm') enabled at server: com.sun.jmx.mbeanserver.JmxMBeanServer@e0a81d0
   [junit4]   2> 1259646 INFO  (TEST-FullSolrCloudDistribCmdsTest.test-seed#[8004907CC82B7714]) [n:127.0.0.1:53265_di_w%2Fy    ] o.a.s.m.r.SolrJmxReporter JMX monitoring for 'solr.jetty' (registry 'solr.jetty') enabled at server: com.sun.jmx.mbeanserver.JmxMBeanServer@e0a81d0
   [junit4]   2> 1259648 INFO  (TEST-FullSolrCloudDistribCmdsTest.test-seed#[8004907CC82B7714]) [n:127.0.0.1:53265_di_w%2Fy    ] o.a.s.c.CorePropertiesLocator Found 0 core definitions underneath /Users/jenkins/workspace/Lucene-Solr-master-MacOSX/solr/build/solr-core/test/J1/../../../../../../../../../Users/jenkins/workspace/Lucene-Solr-master-MacOSX/solr/build/solr-core/test/J1/temp/solr.cloud.FullSolrCloudDistribCmdsTest_8004907CC82B7714-001/shard-1-001/cores
   [junit4]   2> 1259684 INFO  (qtp958319570-9976) [n:127.0.0.1:53249_di_w%2Fy    ] o.a.s.h.a.CollectionsHandler Invoked Collection Action :addreplica with params node=127.0.0.1:53265_di_w%252Fy&action=ADDREPLICA&collection=collection1&shard=shard2&type=NRT&wt=javabin&version=2 and sendToOCPQueue=true
   [junit4]   2> 1259688 INFO  (OverseerCollectionConfigSetProcessor-98850229274279940-127.0.0.1:53249_di_w%2Fy-n_0000000000) [n:127.0.0.1:53249_di_w%2Fy    ] o.a.s.c.OverseerTaskQueue Response ZK path: /overseer/collection-queue-work/qnr-0000000002 doesn't exist.  Requestor may have disconnected from ZooKeeper
   [junit4]   2> 1259688 INFO  (OverseerThreadFactory-4762-thread-3-processing-n:127.0.0.1:53249_di_w%2Fy) [n:127.0.0.1:53249_di_w%2Fy    ] o.a.s.c.AddReplicaCmd Node Identified 127.0.0.1:53265_di_w%2Fy for creating new replica
   [junit4]   2> 1259692 INFO  (qtp18536946-10022) [n:127.0.0.1:53265_di_w%2Fy    ] o.a.s.h.a.CoreAdminOperation core create command qt=/admin/cores&collection.configName=conf1&name=collection1_shard2_replica_n61&action=CREATE&collection=collection1&shard=shard2&wt=javabin&version=2&replicaType=NRT
   [junit4]   2> 1259693 INFO  (qtp18536946-10022) [n:127.0.0.1:53265_di_w%2Fy    ] o.a.s.c.TransientSolrCoreCacheDefault Allocating transient cache for 4 transient cores
   [junit4]   2> 1260723 INFO  (qtp18536946-10022) [n:127.0.0.1:53265_di_w%2Fy c:collection1 s:shard2  x:collection1_shard2_replica_n61] o.a.s.c.SolrConfig Using Lucene MatchVersion: 8.0.0
   [junit4]   2> 1260734 INFO  (qtp18536946-10022) [n:127.0.0.1:53265_di_w%2Fy c:collection1 s:shard2  x:collection1_shard2_replica_n61] o.a.s.s.IndexSchema [collection1_shard2_replica_n61] Schema name=test
   [junit4]   2> 1262345 INFO  (qtp18536946-10022) [n:127.0.0.1:53265_di_w%2Fy c:collection1 s:shard2  x:collection1_shard2_replica_n61] o.a.s.s.IndexSchema Loaded schema test/1.6 with uniqueid field id
   [junit4]   2> 1262370 INFO  (qtp18536946-10022) [n:127.0.0.1:53265_di_w%2Fy c:collection1 s:shard2  x:collection1_shard2_replica_n61] o.a.s.c.CoreContainer Creating SolrCore 'collection1_shard2_replica_n61' using configuration from collection collection1, trusted=true
   [junit4]   2> 1262370 INFO  (qtp18536946-10022) [n:127.0.0.1:53265_di_w%2Fy c:collection1 s:shard2  x:collection1_shard2_replica_n61] o.a.s.m.r.SolrJmxReporter JMX monitoring for 'solr.core.collection1.shard2.replica_n61' (registry 'solr.core.collection1.shard2.replica_n61') enabled at server: com.sun.jmx.mbeanserver.JmxMBeanServer@e0a81d0
   [junit4]   2> 1262370 INFO  (qtp18536946-10022) [n:127.0.0.1:53265_di_w%2Fy c:collection1 s:shard2  x:collection1_shard2_replica_n61] o.a.s.c.SolrCore solr.RecoveryStrategy.Builder
   [junit4]   2> 1262371 INFO  (qtp18536946-10022) [n:127.0.0.1:53265_di_w%2Fy c:collection1 s:shard2  x:collection1_shard2_replica_n61] o.a.s.c.SolrCore [[collection1_shard2_replica_n61] ] Opening new SolrCore at [/Users/jenkins/workspace/Lucene-Solr-master-MacOSX/solr/build/solr-core/test/J1/temp/solr.cloud.FullSolrCloudDistribCmdsTest_8004907CC82B7714-001/shard-1-001/cores/collection1_shard2_replica_n61], dataDir=[/Users/jenkins/workspace/Lucene-Solr-master-MacOSX/solr/build/solr-core/test/J1/../../../../../../../../../Users/jenkins/workspace/Lucene-Solr-master-MacOSX/solr/build/solr-core/test/J1/temp/solr.cloud.FullSolrCloudDistribCmdsTest_8004907CC82B7714-001/shard-1-001/cores/collection1_shard2_replica_n61/data/]
   [junit4]   2> 1262372 INFO  (qtp18536946-10022) [n:127.0.0.1:53265_di_w%2Fy c:collection1 s:shard2  x:collection1_shard2_replica_n61] o.a.s.u.RandomMergePolicy RandomMergePolicy wrapping class org.apache.lucene.index.TieredMergePolicy: [TieredMergePolicy: maxMergeAtOnce=5, maxMergeAtOnceExplicit=5, maxMergedSegmentMB=3.3974609375, floorSegmentMB=1.7431640625, forceMergeDeletesPctAllowed=23.520056929982637, segmentsPerTier=49.0, maxCFSSegmentSizeMB=8.796093022207999E12, noCFSRatio=1.0
   [junit4]   2> 1262376 WARN  (qtp18536946-10022) [n:127.0.0.1:53265_di_w%2Fy c:collection1 s:shard2  x:collection1_shard2_replica_n61] o.a.s.c.RequestHandlers INVALID paramSet a in requestHandler {type = requestHandler,name = /dump,class = DumpRequestHandler,attributes = {initParams=a, name=/dump, class=DumpRequestHandler},args = {defaults={a=A,b=B}}}
   [junit4]   2> 1262430 INFO  (qtp18536946-10022) [n:127.0.0.1:53265_di_w%2Fy c:collection1 s:shard2  x:collection1_shard2_replica_n61] o.a.s.u.UpdateHandler Using UpdateLog implementation: org.apache.solr.update.UpdateLog
   [junit4]   2> 1262430 INFO  (qtp18536946-10022) [n:127.0.0.1:53265_di_w%2Fy c:collection1 s:shard2  x:collection1_shard2_replica_n61] o.a.s.u.UpdateLog Initializing UpdateLog: dataDir= defaultSyncLevel=FLUSH numRecordsToKeep=100 maxNumLogsToKeep=10 numVersionBuckets=65536
   [junit4]   2> 1262431 INFO  (qtp18536946-10022) [n:127.0.0.1:53265_di_w%2Fy c:collection1 s:shard2  x:collection1_shard2_replica_n61] o.a.s.u.CommitTracker Hard AutoCommit: disabled
   [junit4]   2> 1262431 INFO  (qtp18536946-10022) [n:127.0.0.1:53265_di_w%2Fy c:collection1 s:shard2  x:collection1_shard2_replica_n61] o.a.s.u.CommitTracker Soft AutoCommit: disabled
   [junit4]   2> 1262432 INFO  (qtp18536946-10022) [n:127.0.0.1:53265_di_w%2Fy c:collection1 s:shard2  x:collection1_shard2_replica_n61] o.a.s.u.RandomMergePolicy RandomMergePolicy wrapping class org.apache.lucene.index.TieredMergePolicy: [TieredMergePolicy: maxMergeAtOnce=49, maxMergeAtOnceExplicit=43, maxMergedSegmentMB=95.4404296875, floorSegmentMB=0.470703125, forceMergeDeletesPctAllowed=4.534362442792538, segmentsPerTier=44.0, maxCFSSegmentSizeMB=8.796093022207999E12, noCFSRatio=0.26429160646214656
   [junit4]   2> 1262432 INFO  (qtp18536946-10022) [n:127.0.0.1:53265_di_w%2Fy c:collection1 s:shard2  x:collection1_shard2_replica_n61] o.a.s.s.SolrIndexSearcher Opening [Searcher@1fabd43c[collection1_shard2_replica_n61] main]
   [junit4]   2> 1262434 INFO  (qtp18536946-10022) [n:127.0.0.1:53265_di_w%2Fy c:collection1 s:shard2  x:collection1_shard2_replica_n61] o.a.s.r.ManagedResourceStorage Configured ZooKeeperStorageIO with znodeBase: /configs/conf1
   [junit4]   2> 1262435 INFO  (qtp18536946-10022) [n:127.0.0.1:53265_di_w%2Fy c:collection1 s:shard2  x:collection1_shard2_replica_n61] o.a.s.r.ManagedResourceStorage Loaded null at path _rest_managed.json using ZooKeeperStorageIO:path=/configs/conf1
   [junit4]   2> 1262435 INFO  (qtp18536946-10022) [n:127.0.0.1:53265_di_w%2Fy c:collection1 s:shard2  x:collection1_shard2_replica_n61] o.a.s.h.ReplicationHandler Commits will be reserved for 10000ms.
   [junit4]   2> 1262435 INFO  (qtp18536946-10022) [n:127.0.0.1:53265_di_w%2Fy c:collection1 s:shard2  x:collection1_shard2_replica_n61] o.a.s.u.UpdateLog Could not find max version in index or recent updates, using new clock 1581603675720122368
   [junit4]   2> 1262436 INFO  (searcherExecutor-4776-thread-1-processing-n:127.0.0.1:53265_di_w%2Fy x:collection1_shard2_replica_n61 s:shard2 c:collection1) [n:127.0.0.1:53265_di_w%2Fy c:collection1 s:shard2  x:collection1_shard2_replica_n61] o.a.s.c.SolrCore [collection1_shard2_replica_n61] Registered new searcher Searcher@1fabd43c[collection1_shard2_replica_n61] main{ExitableDirectoryReader(UninvertingDirectoryReader())}
   [junit4]   2> 1262442 INFO  (qtp18536946-10022) [n:127.0.0.1:53265_di_w%2Fy c:collection1 s:shard2  x:collection1_shard2_replica_n61] o.a.s.c.ShardLeaderElectionContext Enough replicas found to continue.
   [junit4]   2> 1262442 INFO  (qtp18536946-10022) [n:127.0.0.1:53265_di_w%2Fy c:collection1 s:shard2  x:collection1_shard2_replica_n61] o.a.s.c.ShardLeaderElectionContext I may be the new leader - try and sync
   [junit4]   2> 1262442 INFO  (qtp18536946-10022) [n:127.0.0.1:53265_di_w%2Fy c:collection1 s:shard2  x:collection1_shard2_replica_n61] o.a.s.c.SyncStrategy Sync replicas to http://127.0.0.1:53265/di_w/y/collection1_shard2_replica_n61/
   [junit4]   2> 1262443 INFO  (qtp18536946-10022) [n:127.0.0.1:53265_di_w%2Fy c:collection1 s:shard2  x:collection1_shard2_replica_n61] o.a.s.c.SyncStrategy Sync Success - now sync replicas to me
   [junit4]   2> 1262443 INFO  (qtp18536946-10022) [n:127.0.0.1:53265_di_w%2Fy c:collection1 s:shard2  x:collection1_shard2_replica_n61] o.a.s.c.SyncStrategy http://127.0.0.1:53265/di_w/y/collection1_shard2_replica_n61/ has no replicas
   [junit4]   2> 1262443 INFO  (qtp18536946-10022) [n:127.0.0.1:53265_di_w%2Fy c:collection1 s:shard2  x:collection1_shard2_replica_n61] o.a.s.c.ShardLeaderElectionContext Found all replicas participating in election, clear LIR
   [junit4]   2> 1262448 INFO  (qtp18536946-10022) [n:127.0.0.1:53265_di_w%2Fy c:collection1 s:shard2  x:collection1_shard2_replica_n61] o.a.s.c.ShardLeaderElectionContext I am the new leader: http://127.0.0.1:53265/di_w/y/collection1_shard2_replica_n61/ shard2
   [junit4]   2> 1262509 INFO  (qtp18536946-10022) [n:127.0.0.1:53265_di_w%2Fy c:collection1 s:shard2  x:collection1_shard2_replica_n61] o.a.s.c.ZkController I am the leader, no recovery necessary
   [junit4]   2> 1262511 INFO  (qtp18536946-10022) [n:127.0.0.1:53265_di_w%2Fy c:collection1 s:shard2  x:collection1_shard2_replica_n61] o.a.s.s.HttpSolrCall [admin] webapp=null path=/admin/cores params={qt=/admin/cores&collection.configName=conf1&name=collection1_shard2_replica_n61&action=CREATE&collection=collection1&shard=shard2&wt=javabin&version=2&replicaType=NRT} status=0 QTime=2818
   [junit4]   2> 1262514 INFO  (qtp958319570-9976) [n:127.0.0.1:53249_di_w%2Fy    ] o.a.s.s.HttpSolrCall [admin] webapp=null path=/admin/collections params={node=127.0.0.1:53265_di_w%252Fy&action=ADDREPLICA&collection=collection1&shard=shard2&type=NRT&wt=javabin&version=2} status=0 QTime=2829
   [junit4]   2> 1262911 INFO  (TEST-FullSolrCloudDistribCmdsTest.test-seed#[8004907CC82B7714]) [    ] o.a.s.c.AbstractFullDistribZkTestBase create jetty 2 in directory /Users/jenkins/workspace/Lucene-Solr-master-MacOSX/solr/build/solr-core/test/J1/temp/solr.cloud.FullSolrCloudDistribCmdsTest_8004907CC82B7714-001/shard-2-001 of type NRT
   [junit4]   2> 1262911 INFO  (TEST-FullSolrCloudDistribCmdsTest.test-seed#[8004907CC82B7714]) [    ] o.e.j.s.Server jetty-9.3.20.v20170531
   [junit4]   2> 1262913 INFO  (TEST-FullSolrCloudDistribCmdsTest.test-seed#[8004907CC82B7714]) [    ] o.e.j.s.h.ContextHandler Started o.e.j.s.ServletContextHandler@5dae6e49{/di_w/y,null,AVAILABLE}
   [junit4]   2> 1262914 INFO  (TEST-FullSolrCloudDistribCmdsTest.test-seed#[8004907CC82B7714]) [    ] o.e.j.s.AbstractConnector Started ServerConnector@3c11c4c2{HTTP/1.1,[http/1.1]}{127.0.0.1:53280}
   [junit4]   2> 1262914 INFO  (TEST-FullSolrCloudDistribCmdsTest.test-seed#[8004907CC82B7714]) [    ] o.e.j.s.Server Started @1265821ms
   [junit4]   2> 1262914 INFO  (TEST-FullSolrCloudDistribCmdsTest.test-seed#[8004907CC82B7714]) [    ] o.a.s.c.s.e.JettySolrRunner Jetty properties: {solr.data.dir=/Users/jenkins/workspace/Lucene-Solr-master-MacOSX/solr/build/solr-core/test/J1/temp/solr.cloud.FullSolrCloudDistribCmdsTest_8004907CC82B7714-001/tempDir-001/jetty2, solrconfig=solrconfig.xml, hostContext=/di_w/y, hostPort=53280, coreRootDirectory=/Users/jenkins/workspace/Lucene-Solr-master-MacOSX/solr/build/solr-core/test/J1/../../../../../../../../../Users/jenkins/workspace/Lucene-Solr-master-MacOSX/solr/build/solr-core/test/J1/temp/solr.cloud.FullSolrCloudDistribCmdsTest_8004907CC82B7714-001/shard-2-001/cores}
   [junit4]   2> 1262915 ERROR (TEST-FullSolrCloudDistribCmdsTest.test-seed#[8004907CC82B7714]) [    ] o.a.s.u.StartupLoggingUtils Missing Java Option solr.log.dir. Logging may be missing or incomplete.
   [junit4]   2> 1262915 INFO  (TEST-FullSolrCloudDistribCmdsTest.test-seed#[8004907CC82B7714]) [    ] o.a.s.s.SolrDispatchFilter  ___      _       Welcome to Apache Solr? version 8.0.0
   [junit4]   2> 1262915 INFO  (TEST-FullSolrCloudDistribCmdsTest.test-seed#[8004907CC82B7714]) [    ] o.a.s.s.SolrDispatchFilter / __| ___| |_ _   Starting in cloud mode on port null
   [junit4]   2> 1262915 INFO  (TEST-FullSolrCloudDistribCmdsTest.test-seed#[8004907CC82B7714]) [    ] o.a.s.s.SolrDispatchFilter \__ \/ _ \ | '_|  Install dir: null, Default config dir: null
   [junit4]   2> 1262915 INFO  (TEST-FullSolrCloudDistribCmdsTest.test-seed#[8004907CC82B7714]) [    ] o.a.s.s.SolrDispatchFilter |___/\___/_|_|    Start time: 2017-10-18T13:53:24.748Z
   [junit4]   2> 1262920 INFO  (TEST-FullSolrCloudDistribCmdsTest.test-seed#[8004907CC82B7714]) [    ] o.a.s.s.SolrDispatchFilter Loading solr.xml from SolrHome (not found in ZooKeeper)
   [junit4]   2> 1262920 INFO  (TEST-FullSolrCloudDistribCmdsTest.test-seed#[8004907CC82B7714]) [    ] o.a.s.c.SolrXmlConfig Loading container configuration from /Users/jenkins/workspace/Lucene-Solr-master-MacOSX/solr/build/solr-core/test/J1/temp/solr.cloud.FullSolrCloudDistribCmdsTest_8004907CC82B7714-001/shard-2-001/solr.xml
   [junit4]   2> 1262933 INFO  (TEST-FullSolrCloudDistribCmdsTest.test-seed#[8004907CC82B7714]) [    ] o.a.s.c.SolrXmlConfig Configuration parameter autoReplicaFailoverWorkLoopDelay is ignored
   [junit4]   2> 1262933 INFO  (TEST-FullSolrCloudDistribCmdsTest.test-seed#[8004907CC82B7714]) [    ] o.a.s.c.SolrXmlConfig Configuration parameter autoReplicaFailoverBadNodeExpiration is ignored
   [junit4]   2> 1262934 INFO  (TEST-FullSolrCloudDistribCmdsTest.test-seed#[8004907CC82B7714]) [    ] o.a.s.c.SolrXmlConfig MBean server found: com.sun.jmx.mbeanserver.JmxMBeanServer@e0a81d0, but no JMX reporters were configured - adding default JMX reporter.
   [junit4]   2> 1262939 INFO  (TEST-FullSolrCloudDistribCmdsTest.test-seed#[8004907CC82B7714]) [    ] o.a.s.c.ZkContainer Zookeeper client=127.0.0.1:53246/solr
   [junit4]   2> 1262958 INFO  (TEST-FullSolrCloudDistribCmdsTest.test-seed#[8004907CC82B7714]) [n:127.0.0.1:53280_di_w%2Fy    ] o.a.s.c.c.ZkStateReader Updated live nodes from ZooKeeper... (0) -> (2)
   [junit4]   2> 1262962 INFO  (TEST-FullSolrCloudDistribCmdsTest.test-seed#[8004907CC82B7714]) [n:127.0.0.1:53280_di_w%2Fy    ] o.a.s.c.Overseer Overseer (id=null) closing
   [junit4]   2> 1262966 INFO  (TEST-FullSolrCloudDistribCmdsTest.test-seed#[8004907CC82B7714]) [n:127.0.0.1:53280_di_w%2Fy    ] o.a.s.c.ZkController Register node as live in ZooKeeper:/live_nodes/127.0.0.1:53280_di_w%2Fy
   [junit4]   2> 1262967 INFO  (zkCallback-1691-thread-1) [    ] o.a.s.c.c.ZkStateReader Updated live nodes from ZooKeeper... (2) -> (3)
   [junit4]   2> 1262968 INFO  (zkCallback-1696-thread-1-processing-n:127.0.0.1:53265_di_w%2Fy) [n:127.0.0.1:53265_di_w%2Fy    ] o.a.s.c.c.ZkStateReader Updated live nodes from ZooKeeper... (2) -> (3)
   [junit4]   2> 1262968 INFO  (zkCallback-1683-thread-1-processing-n:127.0.0.1:53249_di_w%2Fy) [n:127.0.0.1:53249_di_w%2Fy    ] o.a.s.c.c.ZkStateReader Updated live nodes from ZooKeeper... (2) -> (3)
   [junit4]   2> 1262968 INFO  (zkCallback-1702-thread-1-processing-n:127.0.0.1:53280_di_w%2Fy) [n:127.0.0.1:53280_di_w%2Fy    ] o.a.s.c.c.ZkStateReader Updated live nodes from ZooKeeper... (2) -> (3)
   [junit4]   2> 1263073 INFO  (TEST-FullSolrCloudDistribCmdsTest.test-seed#[8004907CC82B7714]) [n:127.0.0.1:53280_di_w%2Fy    ] o.a.s.m.r.SolrJmxReporter JMX monitoring for 'solr.node' (registry 'solr.node') enabled at server: com.sun.jmx.mbeanserver.JmxMBeanServer@e0a81d0
   [junit4]   2> 1263084 INFO  (TEST-FullSolrCloudDistribCmdsTest.test-seed#[8004907CC82B7714]) [n:127.0.0.1:53280_di_w%2Fy    ] o.a.s.m.r.SolrJmxReporter JMX monitoring for 'solr.jvm' (registry 'solr.jvm') enabled at server: com.sun.jmx.mbeanserver.JmxMBeanServer@e0a81d0
   [junit4]   2> 1263084 INFO  (TEST-FullSolrCloudDistribCmdsTest.test-seed#[8004907CC82B7714]) [n:127.0.0.1:53280_di_w%2Fy    ] o.a.s.m.r.SolrJmxReporter JMX monitoring for 'solr.jetty' (registry 'solr.jetty') enabled at server: com.sun.jmx.mbeanserver.JmxMBeanServer@e0a81d0
   [junit4]   2> 1263085 INFO  (TEST-FullSolrCloudDistribCmdsTest.test-seed#[8004907CC82B7714]) [n:127.0.0.1:53280_di_w%2Fy    ] o.a.s.c.CorePropertiesLocator Found 0 core definitions underneath /Users/jenkins/workspace/Lucene-Solr-master-MacOSX/solr/build/solr-core/test/J1/../../../../../../../../../Users/jenkins/workspace/Lucene-Solr-master-MacOSX/solr/build/solr-core/test/J1/temp/solr.cloud.FullSolrCloudDistribCmdsTest_8004907CC82B7714-001/shard-2-001/cores
   [junit4]   2> 1263124 INFO  (qtp958319570-9977) [n:127.0.0.1:53249_di_w%2Fy    ] o.a.s.h.a.CollectionsHandler Invoked Collection Action :addreplica with params node=127.0.0.1:53280_di_w%252Fy&action=ADDREPLICA&collection=collection1&shard=shard3&type=NRT&wt=javabin&version=2 and sendToOCPQueue=true
   [junit4]   2> 1263128 INFO  (OverseerCollectionConfigSetProcessor-98850229274279940-127.0.0.1:53249_di_w%2Fy-n_0000000000) [n:127.0.0.1:53249_di_w%2Fy    ] o.a.s.c.OverseerTaskQueue Response ZK path: /overseer/collection-queue-work/qnr-0000000004 doesn't exist.  Requestor may have disconnected from ZooKeeper
   [junit4]   2> 1263128 INFO  (OverseerThreadFactory-4762-thread-4-processing-n:127.0.0.1:53249_di_w%2Fy) [n:127.0.0.1:53249_di_w%2Fy    ] o.a.s.c.AddReplicaCmd Node Identified 127.0.0.1:53280_di_w%2Fy for creating new replica
   [junit4]   2> 1263134 INFO  (qtp1653533429-10051) [n:127.0.0.1:53280_di_w%2Fy    ] o.a.s.h.a.CoreAdminOperation core create command qt=/admin/cores&collection.configName=conf1&name=collection1_shard3_replica_n63&action=CREATE&collection=collection1&shard=shard3&wt=javabin&version=2&replicaType=NRT
   [junit4]   2> 1263135 INFO  (qtp1653533429-10051) [n:127.0.0.1:53280_di_w%2Fy    ] o.a.s.c.TransientSolrCoreCacheDefault Allocating transient cache for 4 transient cores
   [junit4]   2> 1264180 INFO  (qtp1653533429-10051) [n:127.0.0.1:53280_di_w%2Fy c:collection1 s:shard3  x:collection1_shard3_replica_n63] o.a.s.c.SolrConfig Using Lucene MatchVersion: 8.0.0
   [junit4]   2> 1264245 INFO  (qtp1653533429-10051) [n:127.0.0.1:53280_di_w%2Fy c:collection1 s:shard3  x:collection1_shard3_replica_n63] o.a.s.s.IndexSchema [collection1_shard3_replica_n63] Schema name=test
   [junit4]   2> 1264339 INFO  (qtp1653533429-10051) [n:127.0.0.1:53280_di_w%2Fy c:collection1 s:shard3  x:collection1_shard3_replica_n63] o.a.s.s.IndexSchema Loaded schema test/1.6 with uniqueid field id
   [junit4]   2> 1264376 INFO  (qtp1653533429-10051) [n:127.0.0.1:53280_di_w%2Fy c:collection1 s:shard3  x:collection1_shard3_replica_n63] o.a.s.c.CoreContainer Creating SolrCore 'collection1_shard3_replica_n63' using configuration from collection collection1, trusted=true
   [junit4]   2> 1264376 INFO  (qtp1653533429-10051) [n:127.0.0.1:53280_di_w%2Fy c:collection1 s:shard3  x:collection1_shard3_replica_n63] o.a.s.m.r.SolrJmxReporter JMX monitoring for 'solr.core.collection1.shard3.replica_n63' (registry 'solr.core.collection1.shard3.replica_n63') enabled at server: com.sun.jmx.mbeanserver.JmxMBeanServer@e0a81d0
   [junit4]   2> 1264377 INFO  (qtp1653533429-10051) [n:127.0.0.1:53280_di_w%2Fy c:collection1 s:shard3  x:collection1_shard3_replica_n63] o.a.s.c.SolrCore solr.RecoveryStrategy.Builder
   [junit4]   2> 1264377 INFO  (qtp1653533429-10051) [n:127.0.0.1:53280_di_w%2Fy c:collection1 s:shard3  x:collection1_shard3_replica_n63] o.a.s.c.SolrCore [[collection1_shard3_replica_n63] ] Opening new SolrCore at [/Users/jenkins/workspace/Lucene-Solr-master-MacOSX/solr/build/solr-core/test/J1/temp/solr.cloud.FullSolrCloudDistribCmdsTest_8004907CC82B7714-001/shard-2-001/cores/collection1_shard3_replica_n63], dataDir=[/Users/jenkins/workspace/Lucene-Solr-master-MacOSX/solr/build/solr-core/test/J1/../../../../../../../../../Users/jenkins/workspace/Lucene-Solr-master-MacOSX/solr/build/solr-core/test/J1/temp/solr.cloud.FullSolrCloudDistribCmdsTest_8004907CC82B7714-001/shard-2-001/cores/collection1_shard3_replica_n63/data/]
   [junit4]   2> 1264388 INFO  (qtp1653533429-10051) [n:127.0.0.1:53280_di_w%2Fy c:collection1 s:shard3  x:collection1_shard3_replica_n63] o.a.s.u.RandomMergePolicy RandomMergePolicy wrapping class org.apache.lucene.index.TieredMergePolicy: [TieredMergePolicy: maxMergeAtOnce=5, maxMergeAtOnceExplicit=5, maxMergedSegmentMB=3.3974609375, floorSegmentMB=1.7431640625, forceMergeDeletesPctAllowed=23.520056929982637, segmentsPerTier=49.0, maxCFSSegmentSizeMB=8.796093022207999E12, noCFSRatio=1.0
   [junit4]   2> 1264391 WARN  (qtp1653533429-10051) [n:127.0.0.1:53280_di_w%2Fy c:collection1 s:shard3  x:collection1_shard3_replica_n63] o.a.s.c.RequestHandlers INVALID paramSet a in requestHandler {type = requestHandler,name = /dump,class = DumpRequestHandler,attributes = {initParams=a, name=/dump, class=DumpRequestHandler},args = {defaults={a=A,b=B}}}
   [junit4]   2> 1264504 INFO  (qtp1653533429-10051) [n:127.0.0.1:53280_di_w%2Fy c:collection1 s:shard3  x:collection1_shard3_replica_n63] o.a.s.u.UpdateHandler Using UpdateLog implementation: org.apache.solr.update.UpdateLog
   [junit4]   2> 1264504 INFO  (qtp1653533429-10051) [n:127.0.0.1:53280_di_w%2Fy c:collection1 s:shard3  x:collection1_shard3_replica_n63] o.a.s.u.UpdateLog Initializing UpdateLog: dataDir= defaultSyncLevel=FLUSH numRecordsToKeep=100 maxNumLogsToKeep=10 numVersionBuckets=65536
   [junit4]   2> 1264507 INFO  (qtp1653533429-10051) [n:127.0.0.1:53280_di_w%2Fy c:collection1 s:shard3  x:collection1_shard3_replica_n63] o.a.s.u.CommitTracker Hard AutoCommit: disabled
   [junit4]   2> 1264507 INFO  (qtp1653533429-10051) [n:127.0.0.1:53280_di_w%2Fy c:collection1 s:shard3  x:collection1_shard3_replica_n63] o.a.s.u.CommitTracker Soft AutoCommit: disabled
   [junit4]   2> 1264521 INFO  (qtp1653533429-10051) [n:127.0.0.1:53280_di_w%2Fy c:collection1 s:shard3  x:collection1_shard3_replica_n63] o.a.s.u.RandomMergePolicy RandomMergePolicy wrapping class org.apache.lucene.index.TieredMergePolicy: [TieredMergePolicy: maxMergeAtOnce=49, maxMergeAtOnceExplicit=43, maxMergedSegmentMB=95.4404296875, floorSegmentMB=0.470703125, forceMergeDeletesPctAllowed=4.534362442792538, segmentsPerTier=44.0, maxCFSSegmentSizeMB=8.796093022207999E12, noCFSRatio=0.26429160646214656
   [junit4]   2> 1264523 INFO  (qtp1653533429-10051) [n:127.0.0.1:53280_di_w%2Fy c:collection1 s:shard3  x:collection1_shard3_replica_n63] o.a.s.s.SolrIndexSearcher Opening [Searcher@668142fd[collection1_shard3_replica_n63] main]
   [junit4]   2> 1264525 INFO  (qtp1653533429-10051) [n:127.0.0.1:53280_di_w%2Fy c:collection1 s:shard3  x:collection1_shard3_replica_n63] o.a.s.r.ManagedResourceStorage Configured ZooKeeperStorageIO with znodeBase: /configs/conf1
   [junit4]   2> 1264525 INFO  (qtp1653533429-10051) [n:127.0.0.1:53280_di_w%2Fy c:collection1 s:shard3  x:collection1_shard3_replica_n63] o.a.s.r.ManagedResourceStorage Loaded null at path _rest_managed.json using ZooKeeperStorageIO:path=/configs/conf1
   [junit4]   2> 1264526 INFO  (qtp1653533429-10051) [n:127.0.0.1:53280_di_w%2Fy c:collection1 s:shard3  x:collection1_shard3_replica_n63] o.a.s.h.ReplicationHandler Commits will be reserved for 10000ms.
   [junit4]   2> 1264526 INFO  (qtp1653533429-10051) [n:127.0.0.1:53280_di_w%2Fy c:collection1 s:shard3  x:collection1_shard3_replica_n63] o.a.s.u.UpdateLog Could not find max version in index or recent updates, using new clock 1581603677912694784
   [junit4]   2> 1264527 INFO  (searcherExecutor-4787-thread-1-processing-n:127.0.0.1:53280_di_w%2Fy x:collection1_shard3_replica_n63 s:shard3 c:collection1) [n:127.0.0.1:53280_di_w%2Fy c:collection1 s:shard3  x:collection1_shard3_replica_n63] o.a.s.c.SolrCore [collection1_shard3_replica_n63] Registered new searcher Searcher@668142fd[collection1_shard3_replica_n63] main{ExitableDirectoryReader(UninvertingDirectoryReader())}
   [junit4]   2> 1264544 INFO  (qtp1653533429-10051) [n:127.0.0.1:53280_di_w%2Fy c:collection1 s:shard3  x:collection1_shard3_replica_n63] o.a.s.c.ShardLeaderElectionContext Enough replicas found to continue.
   [junit4]   2> 1264545 INFO  (qtp1653533429-10051) [n:127.0.0.1:53280_di_w%2Fy c:collection1 s:shard3  x:collection1_shard3_replica_n63] o.a.s.c.ShardLeaderElectionContext I may be the new leader - try and sync
   [junit4]   2> 1264545 INFO  (qtp1653533429-10051) [n:127.0.0.1:53280_di_w%2Fy c:collection1 s:shard3  x:collection1_shard3_replica_n63] o.a.s.c.SyncStrategy Sync replicas to http://127.0.0.1:53280/di_w/y/collection1_shard3_replica_n63/
   [junit4]   2> 1264545 INFO  (qtp1653533429-10051) [n:127.0.0.1:53280_di_w%2Fy c:collection1 s:shard3  x:collection1_shard3_replica_n63] o.a.s.c.SyncStrategy Sync Success - now sync replicas to me
   [junit4]   2> 1264545 INFO  (qtp1653533429-10051) [n:127.0.0.1:53280_di_w%2Fy c:collection1 s:shard3  x:collection1_shard3_replica_n63] o.a.s.c.SyncStrategy http://127.0.0.1:53280/di_w/y/collection1_shard3_replica_n63/ has no replicas
   [junit4]   2> 1264545 INFO  (qtp1653533429-10051) [n:127.0.0.1:53280_di_w%2Fy c:collection1 s:shard3  x:collection1_shard3_replica_n63] o.a.s.c.ShardLeaderElectionContext Found all replicas participating in election, clear LIR
   [junit4]   2> 1264551 INFO  (qtp1653533429-10051) [n:127.0.0.1:53280_di_w%2Fy c:collection1 s:shard3  x:collection1_shard3_replica_n63] o.a.s.c.ShardLeaderElectionContext I am the new leader: http://127.0.0.1:53280/di_w/y/collection1_shard3_replica_n63/ shard3
   [junit4]   2> 1264659 INFO  (qtp1653533429-10051) [n:127.0.0.1:53280_di_w%2Fy c:collection1 s:shard3  x:collection1_shard3_replica_n63] o.a.s.c.ZkController I am the leader, no recovery necessary
   [junit4]   2> 1264662 INFO  (qtp1653533429-10051) [n:127.0.0.1:53280_di_w%2Fy c:collection1 s:shard3  x:collection1_shard3_replica_n63] o.a.s.s.HttpSolrCall [admin] webapp=null path=/admin/cores params={qt=/admin/cores&collection.configName=conf1&name=collection1_shard3_replica_n63&action=CREATE&collection=collection1&shard=shard3&wt=javabin&version=2&replicaType=NRT} status=0 QTime=1528
   [junit4]   2> 1264671 INFO  (qtp958319570-9977) [n:127.0.0.1:53249_di_w%2Fy    ] o.a.s.s.HttpSolrCall [admin] webapp=null path=/admin/collections params={node=127.0.0.1:53280_di_w%252Fy&action=ADDREPLICA&collection=collection1&shard=shard3&type=NRT&wt=javabin&version=2} status=0 QTime=1542
   [junit4]   2> 1265129 INFO  (TEST-FullSolrCloudDistribCmdsTest.test-seed#[8004907CC82B7714]) [    ] o.a.s.c.AbstractFullDistribZkTestBase create jetty 3 in directory /Users/jenkins/workspace/Lucene-Solr-master-MacOSX/solr/build/solr-core/test/J1/temp/solr.cloud.FullSolrCloudDistribCmdsTest_8004907CC82B7714-001/shard-3-001 of type NRT
   [junit4]   2> 1265129 INFO  (TEST-FullSolrCloudDistribCmdsTest.test-seed#[8004907CC82B7714]) [    ] o.e.j.s.Server jetty-9.3.20.v20170531
   [junit4]   2> 1265131 INFO  (OverseerCollectionConfigSetProcessor-98850229274279940-127.0.0.1:53249_di_w%2Fy-n_0000000000) [n:127.0.0.1:53249_di_w%2Fy    ] o.a.s.c.OverseerTaskQueue Response ZK path: /overseer/collection-queue-work/qnr-0000000006 doesn't exist.  Requestor may have disconnected from ZooKeeper
   [junit4]   2> 1265131 INFO  (TEST-FullSolrCloudDistribCmdsTest.test-seed#[8004907CC82B7714]) [    ] o.e.j.s.h.ContextHandler Started o.e.j.s.ServletContextHandler@643d9575{/di_w/y,null,AVAILABLE}
   [junit4]   2> 1265132 INFO  (TEST-FullSolrCloudDistribCmdsTest.test-seed#[8004907CC82B7714]) [    ] o.e.j.s.AbstractConnector Started ServerConnector@50c62c16{HTTP/1.1,[http/1.1]}{127.0.0.1:53290}
   [junit4]   2> 1265132 INFO  (TEST-FullSolrCloudDistribCmdsTest.test-seed#[8004907CC82B7714]) [    ] o.e.j.s.Server Started @1268040ms
   [junit4]   2> 1265132 INFO  (TEST-FullSolrCloudDistribCmdsTest.test-seed#[8004907CC82B7714]) [    ] o.a.s.c.s.e.JettySolrRunner Jetty properties: {solr.data.dir=/Users/jenkins/workspace/Lucene-Solr-master-MacOSX/solr/build/solr-core/test/J1/temp/solr.cloud.FullSolrCloudDistribCmdsTest_8004907CC82B7714-001/tempDir-001/jetty3, replicaType=NRT, solrconfig=solrconfig.xml, hostContext=/di_w/y, hostPort=53290, coreRootDirectory=/Users/jenkins/workspace/Lucene-Solr-master-MacOSX/solr/build/solr-core/test/J1/temp/solr.cloud.FullSolrCloudDistribCmdsTest_8004907CC82B7714-001/shard-3-001/cores}
   [junit4]   2> 1265133 ERROR (TEST-FullSolrCloudDistribCmdsTest.test-seed#[8004907CC82B7714]) [    ] o.a.s.u.StartupLoggingUtils Missing Java Option solr.log.dir. Logging may be missing or incomplete.
   [junit4]   2> 1265133 INFO  (TEST-FullSolrCloudDistribCmdsTest.test-seed#[8004907CC82B7714]) [    ] o.a.s.s.SolrDispatchFilter  ___      _       Welcome to Apache Solr? version 8.0.0
   [junit4]   2> 1265133 INFO  (TEST-FullSolrCloudDistribCmdsTest.test-seed#[8004907CC82B7714]) [    ] o.a.s.s.SolrDispatchFilter / __| ___| |_ _   Starting in cloud mode on port null
   [junit4]   2> 1265133 INFO  (TEST-FullSolrCloudDistribCmdsTest.test-seed#[8004907CC82B7714]) [    ] o.a.s.s.SolrDispatchFilter \__ \/ _ \ | '_|  Install dir: null, Default config dir: null
   [junit4]   2> 1265133 INFO  (TEST-FullSolrCloudDistribCmdsTest.test-seed#[8004907CC82B7714]) [    ] o.a.s.s.SolrDispatchFilter |___/\___/_|_|    Start time: 2017-10-18T13:53:26.966Z
   [junit4]   2> 1265136 INFO  (TEST-FullSolrCloudDistribCmdsTest.test-seed#[8004907CC82B7714]) [    ] o.a.s.s.SolrDispatchFilter Loading solr.xml from SolrHome (not found in ZooKeeper)
   [junit4]   2> 1265137 INFO  (TEST-FullSolrCloudDistribCmdsTest.test-seed#[8004907CC82B7714]) [    ] o.a.s.c.SolrXmlConfig Loading container configuration from /Users/jenkins/workspace/Lucene-Solr-master-MacOSX/solr/build/solr-core/test/J1/temp/solr.cloud.FullSolrCloudDistribCmdsTest_8004907CC82B7714-001/shard-3-001/solr.xml
   [junit4]   2> 1265142 INFO  (TEST-FullSolrCloudDistribCmdsTest.test-seed#[8004907CC82B7714]) [    ] o.a.s.c.SolrXmlConfig Configuration parameter autoReplicaFailoverWorkLoopDelay is ignored
   [junit4]   2> 1265142 INFO  (TEST-FullSolrCloudDistribCmdsTest.test-seed#[8004907CC82B7714]) [    ] o.a.s.c.SolrXmlConfig Configuration parameter autoReplicaFailoverBadNodeExpiration is ignored
   [junit4]   2> 1265143 INFO  (TEST-FullSolrCloudDistribCmdsTest.test-seed#[8004907CC82B7714]) [    ] o.a.s.c.SolrXmlConfig MBean server found: com.sun.jmx.mbeanserver.JmxMBeanServer@e0a81d0, but no JMX reporters were configured - adding default JMX reporter.
   [junit4]   2> 1265146 INFO  (TEST-FullSolrCloudDistribCmdsTest.test-seed#[8004907CC82B7714]) [    ] o.a.s.c.ZkContainer Zookeeper client=127.0.0.1:53246/solr
   [junit4]   2> 1265162 INFO  (TEST-FullSolrCloudDistribCmdsTest.test-seed#[8004907CC82B7714]) [n:127.0.0.1:53290_di_w%2Fy    ] o.a.s.c.c.ZkStateReader Updated live nodes from ZooKeeper... (0) -> (3)
   [junit4]   2> 1265167 INFO  (TEST-FullSolrCloudDistribCmdsTest.test-seed#[8004907CC82B7714]) [n:127.0.0.1:53290_di_w%2Fy    ] o.a.s.c.Overseer Overseer (id=null) closing
   [junit4]   2> 1265171 INFO  (TEST-FullSolrCloudDistribCmdsTest.test-seed#[8004907CC82B7714]) [n:127.0.0.1:53290_di_w%2Fy    ] o.a.s.c.ZkController Register node as live in ZooKeeper:/live_nodes/127.0.0.1:53290_di_w%2Fy
   [junit4]   2> 1265174 INFO  (zkCallback-1691-thread-1) [    ] o.a.s.c.c.ZkStateReader Updated live nodes from ZooKeeper... (3) -> (4)
   [junit4]   2> 1265174 INFO  (zkCallback-1696-thread-1-processing-n:127.0.0.1:53265_di_w%2Fy) [n:127.0.0.1:53265_di_w%2Fy    ] o.a.s.c.c.ZkStateReader Updated live nodes from ZooKeeper... (3) -> (4)
   [junit4]   2> 1265174 INFO  (zkCallback-1683-thread-1-processing-n:127.0.0.1:53249_di_w%2Fy) [n:127.0.0.1:53249_di_w%2Fy    ] o.a.s.c.c.ZkStateReader Updated live nodes from ZooKeeper... (3) -> (4)
   [junit4]   2> 1265174 INFO  (zkCallback-1702-thread-1-processing-n:127.0.0.1:53280_di_w%2Fy) [n:127.0.0.1:53280_di_w%2Fy    ] o.a.s.c.c.ZkStateReader Updated live nodes from ZooKeeper... (3) -> (4)
   [junit4]   2> 1265175 INFO  (zkCallback-1708-thread-1-processing-n:127.0.0.1:53290_di_w%2Fy) [n:127.0.0.1:53290_di_w%2Fy    ] o.a.s.c.c.ZkStateReader Updated live nodes from ZooKeeper... (3) -> (4)
   [junit4]   2> 1265355 INFO  (TEST-FullSolrCloudDistribCmdsTest.test-seed#[8004907CC82B7714]) [n:127.0.0.1:53290_di_w%2Fy    ] o.a.s.m.r.SolrJmxReporter JMX monitoring for 'solr.node' (registry 'solr.node') enabled at server: com.sun.jmx.mbeanserver.JmxMBeanServer@e0a81d0
   [junit4]   2> 1265387 INFO  (TEST-FullSolrCloudDistribCmdsTest.test-seed#[8004907CC82B7714]) [n:127.0.0.1:53290_di_w%2Fy    ] o.a.s.m.r.SolrJmxReporter JMX monitoring for 'solr.jvm' (registry 'solr.jvm') enabled at server: com.sun.jmx.mbeanserver.JmxMBeanServer@e0a81d0
   [junit4]   2> 1265387 INFO  (TEST-FullSolrCloudDistribCmdsTest.test-seed#[8004907CC82B7714]) [n:127.0.0.1:53290_di_w%2Fy    ] o.a.s.m.r.SolrJmxReporter JMX monitoring for 'solr.jetty' (registry 'solr.jetty') enabled at server: com.sun.jmx.mbeanserver.JmxMBeanServer@e0a81d0
   [junit4]   2> 1265390 INFO  (TEST-FullSolrCloudDistribCmdsTest.test-seed#[8004907CC82B7714]) [n:127.0.0.1:53290_di_w%2Fy    ] o.a.s.c.CorePropertiesLocator Found 0 core definitions underneath /Users/jenkins/workspace/Lucene-Solr-master-MacOSX/solr/build/solr-core/test/J1/temp/solr.cloud.FullSolrCloudDistribCmdsTest_8004907CC82B7714-001/shard-3-001/cores
   [junit4]   2> 1265479 INFO  (qtp958319570-9975) [n:127.0.0.1:53249_di_w%2Fy    ] o.a.s.h.a.CollectionsHandler Invoked Collection Action :addreplica with params node=127.0.0.1:53290_di_w%252Fy&action=ADDREPLICA&collection=collection1&shard=shard1&type=NRT&wt=javabin&version=2 and sendToOCPQueue=true
   [junit4]   2> 1265486 INFO  (OverseerThreadFactory-4762-thread-5-processing-n:127.0.0.1:53249_di_w%2Fy) [n:127.0.0.1:53249_di_w%2Fy    ] o.a.s.c.AddReplicaCmd Node Identified 127.0.0.1:53290_di_w%2Fy for creating new replica
   [junit4]   2> 1265490 INFO  (qtp807985343-10080) [n:127.0.0.1:53290_di_w%2Fy    ] o.a.s.h.a.CoreAdminOperation core create command qt=/admin/cores&collection.configName=conf1&name=collection1_shard1_replica_n65&action=CREATE&collection=collection1&shard=shard1&wt=javabin&version=2&replicaType=NRT
   [junit4]   2> 1265491 INFO  (qtp807985343-10080) [n:127.0.0.1:53290_di_w%2Fy    ] o.a.s.c.TransientSolrCoreCacheDefault Allocating transient cache for 4 transient cores
   [junit4]   2> 1266545 INFO  (qtp807985343-10080) [n:127.0.0.1:53290_di_w%2Fy c:collection1 s:shard1  x:collection1_shard1_replica_n65] o.a.s.c.SolrConfig Using Lucene MatchVersion: 8.0.0
   [junit4]   2> 1266569 INFO  (qtp807985343-10080) [n:127.0.0.1:53290_di_w%2Fy c:collection1 s:shard1  x:collection1_shard1_replica_n65] o.a.s.s.IndexSchema [collection1_shard1_replica_n65] Schema name=test
   [junit4]   2> 1266688 INFO  (qtp807985343-10080) [n:127.0.0.1:53290_di_w%2Fy c:collection1 s:shard1  x:collection1_shard1_replica_n65] o.a.s.s.IndexSchema Loaded schema test/1.6 with uniqueid field id
   [junit4]   2> 1266718 INFO  (qtp807985343-10080) [n:127.0.0.1:53290

[...truncated too long message...]

ll_pull_replica slice: shard1 saw state=null with live_nodes=[127.0.0.1:58276_solr]
   [junit4]   2> 	at org.apache.solr.common.cloud.ZkStateReader.getLeaderRetry(ZkStateReader.java:814)
   [junit4]   2> 	at org.apache.solr.common.cloud.ZkStateReader.getLeaderRetry(ZkStateReader.java:798)
   [junit4]   2> 	at org.apache.solr.handler.IndexFetcher.getLeaderReplica(IndexFetcher.java:677)
   [junit4]   2> 	at org.apache.solr.handler.IndexFetcher.fetchLatestIndex(IndexFetcher.java:373)
   [junit4]   2> 	at org.apache.solr.handler.IndexFetcher.fetchLatestIndex(IndexFetcher.java:338)
   [junit4]   2> 	at org.apache.solr.handler.ReplicationHandler.doFetch(ReplicationHandler.java:421)
   [junit4]   2> 	at org.apache.solr.handler.ReplicationHandler.lambda$setupPolling$12(ReplicationHandler.java:1185)
   [junit4]   2> 	at java.util.concurrent.Executors$RunnableAdapter.call(Executors.java:511)
   [junit4]   2> 	at java.util.concurrent.FutureTask.runAndReset(FutureTask.java:308)
   [junit4]   2> 	at java.util.concurrent.ScheduledThreadPoolExecutor$ScheduledFutureTask.access$301(ScheduledThreadPoolExecutor.java:180)
   [junit4]   2> 	at java.util.concurrent.ScheduledThreadPoolExecutor$ScheduledFutureTask.run(ScheduledThreadPoolExecutor.java:294)
   [junit4]   2> 	at java.util.concurrent.ThreadPoolExecutor.runWorker(ThreadPoolExecutor.java:1149)
   [junit4]   2> 	at java.util.concurrent.ThreadPoolExecutor$Worker.run(ThreadPoolExecutor.java:624)
   [junit4]   2> 	at java.lang.Thread.run(Thread.java:748)
   [junit4]   2> 
   [junit4]   2> 2929211 INFO  (Thread-4841) [    ] o.a.s.c.ZkTestServer connecting to 127.0.0.1:58274 58274
   [junit4]   2> 2929422 WARN  (Thread-4841) [    ] o.a.s.c.ZkTestServer Watch limit violations: 
   [junit4]   2> Maximum concurrent create/delete watches above limit:
   [junit4]   2> 
   [junit4]   2> 	8	/solr/configs/conf
   [junit4]   2> 	4	/solr/aliases.json
   [junit4]   2> 	3	/solr/security.json
   [junit4]   2> 	3	/solr/clusterprops.json
   [junit4]   2> 	2	/solr/collections/pull_replica_test_create_delete/state.json
   [junit4]   2> 
   [junit4]   2> Maximum concurrent data watches above limit:
   [junit4]   2> 
   [junit4]   2> 	23	/solr/collections/pull_replica_test_add_remove_pull_replica/state.json
   [junit4]   2> 	23	/solr/collections/pull_replica_test_remove_all_writer_replicas/state.json
   [junit4]   2> 	23	/solr/collections/pull_replica_test_kill_pull_replica/state.json
   [junit4]   2> 	15	/solr/collections/pull_replica_test_real_time_get/state.json
   [junit4]   2> 	13	/solr/collections/pull_replica_test_add_docs/state.json
   [junit4]   2> 	6	/solr/collections/pull_replica_test_create_delete/state.json
   [junit4]   2> 	4	/solr/clusterstate.json
   [junit4]   2> 	4	/solr/clusterprops.json
   [junit4]   2> 	2	/solr/overseer_elect/election/98850326016360454-127.0.0.1:58277_solr-n_0000000000
   [junit4]   2> 
   [junit4]   2> Maximum concurrent children watches above limit:
   [junit4]   2> 
   [junit4]   2> 	4	/solr/collections
   [junit4]   2> 	3	/solr/live_nodes
   [junit4]   2> 
   [junit4]   2> NOTE: leaving temporary files on disk at: /Users/jenkins/workspace/Lucene-Solr-master-MacOSX/solr/build/solr-core/test/J0/temp/solr.cloud.TestPullReplica_8004907CC82B7714-001
   [junit4]   2> NOTE: test params are: codec=Asserting(Lucene70): {foo=PostingsFormat(name=Memory), id=PostingsFormat(name=LuceneFixedGap), foo_s=PostingsFormat(name=Memory)}, docValues:{_version_=DocValuesFormat(name=Lucene70)}, maxPointsInLeafNode=1027, maxMBSortInHeap=6.987962078542472, sim=RandomSimilarity(queryNorm=false): {}, locale=es-CR, timezone=America/Marigot
   [junit4]   2> NOTE: Mac OS X 10.11.6 x86_64/Oracle Corporation 1.8.0_144 (64-bit)/cpus=3,threads=1,free=43507312,total=525336576
   [junit4]   2> NOTE: All tests run in this JVM: [TestIntervalFaceting, TestFiltering, NoCacheHeaderTest, TestSolrCoreSnapshots, TestRestoreCore, InfixSuggestersTest, RegexBoostProcessorTest, BooleanFieldTest, TestDFRSimilarityFactory, SearchHandlerTest, XmlUpdateRequestHandlerTest, CurrencyFieldTypeTest, CursorPagingTest, TestConfigsApi, SuggesterFSTTest, ConcurrentDeleteAndCreateCollectionTest, TestSchemaNameResource, TestLMDirichletSimilarityFactory, CdcrUpdateLogTest, PropertiesRequestHandlerTest, SuggesterTSTTest, TestFieldCache, TestPayloadCheckQParserPlugin, TestCodecSupport, CloudExitableDirectoryReaderTest, CdcrRequestHandlerTest, TestLazyCores, TestXmlQParserPlugin, TestPushWriter, TestQuerySenderListener, MetricsConfigTest, PKIAuthenticationIntegrationTest, BlockCacheTest, FieldAnalysisRequestHandlerTest, ResponseLogComponentTest, TestAuthenticationFramework, V2ApiIntegrationTest, DocExpirationUpdateProcessorFactoryTest, AddBlockUpdateTest, ZkControllerTest, TestDistribDocBasedVersion, ScriptEngineTest, TestSolrCoreProperties, TestRangeQuery, TestMissingGroups, ManagedSchemaRoundRobinCloudTest, DirectSolrConnectionTest, TestExactStatsCache, SolrTestCaseJ4Test, DirectoryFactoryTest, TestSolrConfigHandlerConcurrent, OverseerRolesTest, TestSolr4Spatial, SolrMetricsIntegrationTest, AutoScalingHandlerTest, TimeZoneUtilsTest, DeleteStatusTest, RestartWhileUpdatingTest, TestJsonFacets, SolrCloudReportersTest, QueryParsingTest, SpellCheckComponentTest, TestStressLiveNodes, TestOnReconnectListenerSupport, ConfigureRecoveryStrategyTest, TestTolerantSearch, UniqFieldsUpdateProcessorFactoryTest, TestBulkSchemaAPI, TestCloudRecovery, StressHdfsTest, BasicAuthIntegrationTest, DistanceFunctionTest, TestRecoveryHdfs, BJQParserTest, TestReplicationHandler, TestSubQueryTransformerDistrib, TestClassicSimilarityFactory, HdfsDirectoryFactoryTest, JSONWriterTest, DateFieldTest, TestShortCircuitedRequests, TestSkipOverseerOperations, UUIDUpdateProcessorFallbackTest, CollectionStateFormat2Test, DeleteLastCustomShardedReplicaTest, TestIndexingPerformance, TestXIncludeConfig, CdcrReplicationDistributedZkTest, DistribDocExpirationUpdateProcessorTest, RecoveryZkTest, TestReplicationHandlerBackup, TestRealTimeGet, DefaultValueUpdateProcessorTest, TestCollectionsAPIViaSolrCloudCluster, TestDynamicFieldCollectionResource, TestComplexPhraseLeadingWildcard, TestExportWriter, CSVRequestHandlerTest, TestDistribIDF, ImplicitSnitchTest, HighlighterTest, SolrGraphiteReporterTest, ResponseHeaderTest, TestSimpleTextCodec, ConnectionReuseTest, LeaderElectionContextKeyTest, HighlighterConfigTest, SuggesterWFSTTest, TestWriterPerf, TestCoreDiscovery, TestSolrCoreParser, ClassificationUpdateProcessorFactoryTest, StatsComponentTest, TestNonDefinedSimilarityFactory, TestHdfsUpdateLog, TestIBSimilarityFactory, TestBinaryField, AssignTest, ChaosMonkeyNothingIsSafeTest, ClusterStateTest, DistributedSuggestComponentTest, OverseerTest, TestInitParams, HdfsUnloadDistributedZkTest, TestLegacyFieldCache, TestStandardQParsers, TestStressRecovery, BufferStoreTest, HLLSerializationTest, PrimitiveFieldTypeTest, ExplicitHLLTest, TestTolerantUpdateProcessorCloud, CloudMLTQParserTest, TestOmitPositions, TestNumericRangeQuery64, LeaderElectionTest, SolrCmdDistributorTest, TestCustomSort, TestSubQueryTransformer, AutoscalingHistoryHandlerTest, HdfsBasicDistributedZk2Test, TestSlowCompositeReaderWrapper, DocValuesNotIndexedTest, DistributedQueueTest, AutoAddReplicasIntegrationTest, ConnectionManagerTest, DistributedSpellCheckComponentTest, TestQueryWrapperFilter, TestSurroundQueryParser, ReturnFieldsTest, TestSolrDeletionPolicy2, SpatialFilterTest, TestCryptoKeys, TestCursorMarkWithoutUniqueKey, TestRebalanceLeaders, SparseHLLTest, ResourceLoaderTest, TestFilteredDocIdSet, MultiThreadedOCPTest, TestImpersonationWithHadoopAuth, DateMathParserTest, TestSolrQueryResponse, ReplaceNodeTest, TestHalfAndHalfDocValues, HttpTriggerListenerTest, IndexSchemaTest, TestReversedWildcardFilterFactory, AtomicUpdateProcessorFactoryTest, TestPKIAuthenticationPlugin, HighlighterMaxOffsetTest, VersionInfoTest, CollectionsAPIAsyncDistributedZkTest, TestGraphMLResponseWriter, NumericFieldsTest, TestUseDocValuesAsStored2, TestMacroExpander, PeerSyncWithIndexFingerprintCachingTest, SSLMigrationTest, SliceStateTest, BasicDistributedZkTest, BasicDistributedZk2Test, UnloadDistributedZkTest, SyncSliceTest, ShardRoutingTest, ClusterStateUpdateTest, TestRandomFaceting, ZkSolrClientTest, TestZkChroot, TestRandomDVFaceting, ZkCLITest, TestDistributedGrouping, TestFaceting, TestRecovery, TestCoreContainer, SolrCoreTest, ConvertedLegacyTest, TestBadConfig, SoftAutoCommitTest, SOLR749Test, AlternateDirectoryTest, TestSolrIndexConfig, TestQuerySenderNoQuery, SolrIndexConfigTest, MultiTermTest, SampleTest, TestDocSet, TestSearchPerf, MinimalSchemaTest, TestConfig, OutputWriterTest, TestFuzzyAnalyzedSuggestions, TestPhraseSuggestions, EchoParamsTest, TestPerFieldSimilarity, PluginInfoTest, TestSuggestSpellingConverter, DOMUtilTest, TestSolrJ, TestUtils, FileUtilsTest, DistributedIntervalFacetingTest, BaseCdcrDistributedZkTest, CdcrBootstrapTest, ChaosMonkeySafeLeaderWithPullReplicasTest, CleanupOldIndexTest, CollectionsAPISolrJTest, DeleteInactiveReplicaTest, DeleteNodeTest, DeleteReplicaTest, DistribJoinFromCollectionTest, DistributedVersionInfoTest, LeaderFailoverAfterPartitionTest, LeaderFailureAfterFreshStartTest, MissingSegmentRecoveryTest, MoveReplicaHDFSFailoverTest, NodeMutatorTest, OutOfBoxZkACLAndCredentialsProvidersTest, OverriddenZkACLAndCredentialsProvidersTest, OverseerStatusTest, PeerSyncReplicationTest, SimpleCollectionCreateDeleteTest, SolrCloudExampleTest, SolrXmlInZkTest, TestCloudDeleteByQuery, TestCloudInspectUtil, TestCloudPivotFacet, TestClusterProperties, TestCollectionAPI, TestConfigSetsAPIExclusivity, TestConfigSetsAPIZkFailure, TestDeleteCollectionOnDownNodes, TestExclusionRuleCollectionAccess, TestLeaderElectionWithEmptyReplica, TestLeaderInitiatedRecoveryThread, TestLocalFSCloudBackupRestore, TestLockTree, TestPrepRecovery, TestPullReplica]
   [junit4] Completed [563/743 (3!)] on J0 in 198.63s, 10 tests, 1 failure, 2 errors, 1 skipped <<< FAILURES!

[...truncated 47797 lines...]

Mime
View raw message