lucene-dev mailing list archives

Site index · List index
Message view « Date » · « Thread »
Top « Date » · « Thread »
From Policeman Jenkins Server <jenk...@thetaphi.de>
Subject [JENKINS] Lucene-Solr-7.x-Linux (64bit/jdk1.8.0_144) - Build # 710 - Still Unstable!
Date Tue, 31 Oct 2017 12:43:50 GMT
Build: https://jenkins.thetaphi.de/job/Lucene-Solr-7.x-Linux/710/
Java: 64bit/jdk1.8.0_144 -XX:+UseCompressedOops -XX:+UseG1GC

5 tests failed.
FAILED:  junit.framework.TestSuite.org.apache.solr.core.TestLazyCores

Error Message:
1 thread leaked from SUITE scope at org.apache.solr.core.TestLazyCores:     1) Thread[id=13129, name=searcherExecutor-4976-thread-1, state=WAITING, group=TGRP-TestLazyCores]         at sun.misc.Unsafe.park(Native Method)         at java.util.concurrent.locks.LockSupport.park(LockSupport.java:175)         at java.util.concurrent.locks.AbstractQueuedSynchronizer$ConditionObject.await(AbstractQueuedSynchronizer.java:2039)         at java.util.concurrent.LinkedBlockingQueue.take(LinkedBlockingQueue.java:442)         at java.util.concurrent.ThreadPoolExecutor.getTask(ThreadPoolExecutor.java:1074)         at java.util.concurrent.ThreadPoolExecutor.runWorker(ThreadPoolExecutor.java:1134)         at java.util.concurrent.ThreadPoolExecutor$Worker.run(ThreadPoolExecutor.java:624)         at java.lang.Thread.run(Thread.java:748)

Stack Trace:
com.carrotsearch.randomizedtesting.ThreadLeakError: 1 thread leaked from SUITE scope at org.apache.solr.core.TestLazyCores: 
   1) Thread[id=13129, name=searcherExecutor-4976-thread-1, state=WAITING, group=TGRP-TestLazyCores]
        at sun.misc.Unsafe.park(Native Method)
        at java.util.concurrent.locks.LockSupport.park(LockSupport.java:175)
        at java.util.concurrent.locks.AbstractQueuedSynchronizer$ConditionObject.await(AbstractQueuedSynchronizer.java:2039)
        at java.util.concurrent.LinkedBlockingQueue.take(LinkedBlockingQueue.java:442)
        at java.util.concurrent.ThreadPoolExecutor.getTask(ThreadPoolExecutor.java:1074)
        at java.util.concurrent.ThreadPoolExecutor.runWorker(ThreadPoolExecutor.java:1134)
        at java.util.concurrent.ThreadPoolExecutor$Worker.run(ThreadPoolExecutor.java:624)
        at java.lang.Thread.run(Thread.java:748)
	at __randomizedtesting.SeedInfo.seed([D08611E34F0C267C]:0)


FAILED:  junit.framework.TestSuite.org.apache.solr.core.TestLazyCores

Error Message:
There are still zombie threads that couldn't be terminated:    1) Thread[id=13129, name=searcherExecutor-4976-thread-1, state=WAITING, group=TGRP-TestLazyCores]         at sun.misc.Unsafe.park(Native Method)         at java.util.concurrent.locks.LockSupport.park(LockSupport.java:175)         at java.util.concurrent.locks.AbstractQueuedSynchronizer$ConditionObject.await(AbstractQueuedSynchronizer.java:2039)         at java.util.concurrent.LinkedBlockingQueue.take(LinkedBlockingQueue.java:442)         at java.util.concurrent.ThreadPoolExecutor.getTask(ThreadPoolExecutor.java:1074)         at java.util.concurrent.ThreadPoolExecutor.runWorker(ThreadPoolExecutor.java:1134)         at java.util.concurrent.ThreadPoolExecutor$Worker.run(ThreadPoolExecutor.java:624)         at java.lang.Thread.run(Thread.java:748)

Stack Trace:
com.carrotsearch.randomizedtesting.ThreadLeakError: There are still zombie threads that couldn't be terminated:
   1) Thread[id=13129, name=searcherExecutor-4976-thread-1, state=WAITING, group=TGRP-TestLazyCores]
        at sun.misc.Unsafe.park(Native Method)
        at java.util.concurrent.locks.LockSupport.park(LockSupport.java:175)
        at java.util.concurrent.locks.AbstractQueuedSynchronizer$ConditionObject.await(AbstractQueuedSynchronizer.java:2039)
        at java.util.concurrent.LinkedBlockingQueue.take(LinkedBlockingQueue.java:442)
        at java.util.concurrent.ThreadPoolExecutor.getTask(ThreadPoolExecutor.java:1074)
        at java.util.concurrent.ThreadPoolExecutor.runWorker(ThreadPoolExecutor.java:1134)
        at java.util.concurrent.ThreadPoolExecutor$Worker.run(ThreadPoolExecutor.java:624)
        at java.lang.Thread.run(Thread.java:748)
	at __randomizedtesting.SeedInfo.seed([D08611E34F0C267C]:0)


FAILED:  org.apache.solr.cloud.autoscaling.ComputePlanActionTest.testNodeWithMultipleReplicasLost

Error Message:
Error from server at https://127.0.0.1:39375/solr: create the collection time out:180s

Stack Trace:
org.apache.solr.client.solrj.impl.HttpSolrClient$RemoteSolrException: Error from server at https://127.0.0.1:39375/solr: create the collection time out:180s
	at __randomizedtesting.SeedInfo.seed([D08611E34F0C267C:E046F061C77EC720]:0)
	at org.apache.solr.client.solrj.impl.HttpSolrClient.executeMethod(HttpSolrClient.java:658)
	at org.apache.solr.client.solrj.impl.HttpSolrClient.request(HttpSolrClient.java:255)
	at org.apache.solr.client.solrj.impl.HttpSolrClient.request(HttpSolrClient.java:244)
	at org.apache.solr.client.solrj.impl.LBHttpSolrClient.doRequest(LBHttpSolrClient.java:483)
	at org.apache.solr.client.solrj.impl.LBHttpSolrClient.request(LBHttpSolrClient.java:413)
	at org.apache.solr.client.solrj.impl.CloudSolrClient.sendRequest(CloudSolrClient.java:1096)
	at org.apache.solr.client.solrj.impl.CloudSolrClient.requestWithRetryOnStaleState(CloudSolrClient.java:875)
	at org.apache.solr.client.solrj.impl.CloudSolrClient.request(CloudSolrClient.java:808)
	at org.apache.solr.client.solrj.SolrRequest.process(SolrRequest.java:178)
	at org.apache.solr.client.solrj.SolrRequest.process(SolrRequest.java:195)
	at org.apache.solr.cloud.autoscaling.ComputePlanActionTest.testNodeWithMultipleReplicasLost(ComputePlanActionTest.java:251)
	at sun.reflect.NativeMethodAccessorImpl.invoke0(Native Method)
	at sun.reflect.NativeMethodAccessorImpl.invoke(NativeMethodAccessorImpl.java:62)
	at sun.reflect.DelegatingMethodAccessorImpl.invoke(DelegatingMethodAccessorImpl.java:43)
	at java.lang.reflect.Method.invoke(Method.java:498)
	at com.carrotsearch.randomizedtesting.RandomizedRunner.invoke(RandomizedRunner.java:1737)
	at com.carrotsearch.randomizedtesting.RandomizedRunner$8.evaluate(RandomizedRunner.java:934)
	at com.carrotsearch.randomizedtesting.RandomizedRunner$9.evaluate(RandomizedRunner.java:970)
	at com.carrotsearch.randomizedtesting.RandomizedRunner$10.evaluate(RandomizedRunner.java:984)
	at com.carrotsearch.randomizedtesting.rules.SystemPropertiesRestoreRule$1.evaluate(SystemPropertiesRestoreRule.java:57)
	at org.apache.lucene.util.TestRuleSetupTeardownChained$1.evaluate(TestRuleSetupTeardownChained.java:49)
	at org.apache.lucene.util.AbstractBeforeAfterRule$1.evaluate(AbstractBeforeAfterRule.java:45)
	at org.apache.lucene.util.TestRuleThreadAndTestName$1.evaluate(TestRuleThreadAndTestName.java:48)
	at org.apache.lucene.util.TestRuleIgnoreAfterMaxFailures$1.evaluate(TestRuleIgnoreAfterMaxFailures.java:64)
	at org.apache.lucene.util.TestRuleMarkFailure$1.evaluate(TestRuleMarkFailure.java:47)
	at com.carrotsearch.randomizedtesting.rules.StatementAdapter.evaluate(StatementAdapter.java:36)
	at com.carrotsearch.randomizedtesting.ThreadLeakControl$StatementRunner.run(ThreadLeakControl.java:368)
	at com.carrotsearch.randomizedtesting.ThreadLeakControl.forkTimeoutingTask(ThreadLeakControl.java:817)
	at com.carrotsearch.randomizedtesting.ThreadLeakControl$3.evaluate(ThreadLeakControl.java:468)
	at com.carrotsearch.randomizedtesting.RandomizedRunner.runSingleTest(RandomizedRunner.java:943)
	at com.carrotsearch.randomizedtesting.RandomizedRunner$5.evaluate(RandomizedRunner.java:829)
	at com.carrotsearch.randomizedtesting.RandomizedRunner$6.evaluate(RandomizedRunner.java:879)
	at com.carrotsearch.randomizedtesting.RandomizedRunner$7.evaluate(RandomizedRunner.java:890)
	at com.carrotsearch.randomizedtesting.rules.StatementAdapter.evaluate(StatementAdapter.java:36)
	at com.carrotsearch.randomizedtesting.rules.SystemPropertiesRestoreRule$1.evaluate(SystemPropertiesRestoreRule.java:57)
	at org.apache.lucene.util.AbstractBeforeAfterRule$1.evaluate(AbstractBeforeAfterRule.java:45)
	at com.carrotsearch.randomizedtesting.rules.StatementAdapter.evaluate(StatementAdapter.java:36)
	at org.apache.lucene.util.TestRuleStoreClassName$1.evaluate(TestRuleStoreClassName.java:41)
	at com.carrotsearch.randomizedtesting.rules.NoShadowingOrOverridesOnMethodsRule$1.evaluate(NoShadowingOrOverridesOnMethodsRule.java:40)
	at com.carrotsearch.randomizedtesting.rules.NoShadowingOrOverridesOnMethodsRule$1.evaluate(NoShadowingOrOverridesOnMethodsRule.java:40)
	at com.carrotsearch.randomizedtesting.rules.StatementAdapter.evaluate(StatementAdapter.java:36)
	at com.carrotsearch.randomizedtesting.rules.StatementAdapter.evaluate(StatementAdapter.java:36)
	at com.carrotsearch.randomizedtesting.rules.StatementAdapter.evaluate(StatementAdapter.java:36)
	at org.apache.lucene.util.TestRuleAssertionsRequired$1.evaluate(TestRuleAssertionsRequired.java:53)
	at org.apache.lucene.util.TestRuleMarkFailure$1.evaluate(TestRuleMarkFailure.java:47)
	at org.apache.lucene.util.TestRuleIgnoreAfterMaxFailures$1.evaluate(TestRuleIgnoreAfterMaxFailures.java:64)
	at org.apache.lucene.util.TestRuleIgnoreTestSuites$1.evaluate(TestRuleIgnoreTestSuites.java:54)
	at com.carrotsearch.randomizedtesting.rules.StatementAdapter.evaluate(StatementAdapter.java:36)
	at com.carrotsearch.randomizedtesting.ThreadLeakControl$StatementRunner.run(ThreadLeakControl.java:368)
	at java.lang.Thread.run(Thread.java:748)


FAILED:  org.apache.solr.cloud.autoscaling.ComputePlanActionTest.testNodeLost

Error Message:
Error from server at https://127.0.0.1:39031/solr: Could not fully create collection: testNodeLost

Stack Trace:
org.apache.solr.client.solrj.impl.HttpSolrClient$RemoteSolrException: Error from server at https://127.0.0.1:39031/solr: Could not fully create collection: testNodeLost
	at __randomizedtesting.SeedInfo.seed([D08611E34F0C267C:6F93DF1DCCE643FA]:0)
	at org.apache.solr.client.solrj.impl.HttpSolrClient.executeMethod(HttpSolrClient.java:658)
	at org.apache.solr.client.solrj.impl.HttpSolrClient.request(HttpSolrClient.java:255)
	at org.apache.solr.client.solrj.impl.HttpSolrClient.request(HttpSolrClient.java:244)
	at org.apache.solr.client.solrj.impl.LBHttpSolrClient.doRequest(LBHttpSolrClient.java:483)
	at org.apache.solr.client.solrj.impl.LBHttpSolrClient.request(LBHttpSolrClient.java:413)
	at org.apache.solr.client.solrj.impl.CloudSolrClient.sendRequest(CloudSolrClient.java:1096)
	at org.apache.solr.client.solrj.impl.CloudSolrClient.requestWithRetryOnStaleState(CloudSolrClient.java:875)
	at org.apache.solr.client.solrj.impl.CloudSolrClient.request(CloudSolrClient.java:808)
	at org.apache.solr.client.solrj.SolrRequest.process(SolrRequest.java:178)
	at org.apache.solr.client.solrj.SolrRequest.process(SolrRequest.java:195)
	at org.apache.solr.cloud.autoscaling.ComputePlanActionTest.testNodeLost(ComputePlanActionTest.java:165)
	at sun.reflect.NativeMethodAccessorImpl.invoke0(Native Method)
	at sun.reflect.NativeMethodAccessorImpl.invoke(NativeMethodAccessorImpl.java:62)
	at sun.reflect.DelegatingMethodAccessorImpl.invoke(DelegatingMethodAccessorImpl.java:43)
	at java.lang.reflect.Method.invoke(Method.java:498)
	at com.carrotsearch.randomizedtesting.RandomizedRunner.invoke(RandomizedRunner.java:1737)
	at com.carrotsearch.randomizedtesting.RandomizedRunner$8.evaluate(RandomizedRunner.java:934)
	at com.carrotsearch.randomizedtesting.RandomizedRunner$9.evaluate(RandomizedRunner.java:970)
	at com.carrotsearch.randomizedtesting.RandomizedRunner$10.evaluate(RandomizedRunner.java:984)
	at com.carrotsearch.randomizedtesting.rules.SystemPropertiesRestoreRule$1.evaluate(SystemPropertiesRestoreRule.java:57)
	at org.apache.lucene.util.TestRuleSetupTeardownChained$1.evaluate(TestRuleSetupTeardownChained.java:49)
	at org.apache.lucene.util.AbstractBeforeAfterRule$1.evaluate(AbstractBeforeAfterRule.java:45)
	at org.apache.lucene.util.TestRuleThreadAndTestName$1.evaluate(TestRuleThreadAndTestName.java:48)
	at org.apache.lucene.util.TestRuleIgnoreAfterMaxFailures$1.evaluate(TestRuleIgnoreAfterMaxFailures.java:64)
	at org.apache.lucene.util.TestRuleMarkFailure$1.evaluate(TestRuleMarkFailure.java:47)
	at com.carrotsearch.randomizedtesting.rules.StatementAdapter.evaluate(StatementAdapter.java:36)
	at com.carrotsearch.randomizedtesting.ThreadLeakControl$StatementRunner.run(ThreadLeakControl.java:368)
	at com.carrotsearch.randomizedtesting.ThreadLeakControl.forkTimeoutingTask(ThreadLeakControl.java:817)
	at com.carrotsearch.randomizedtesting.ThreadLeakControl$3.evaluate(ThreadLeakControl.java:468)
	at com.carrotsearch.randomizedtesting.RandomizedRunner.runSingleTest(RandomizedRunner.java:943)
	at com.carrotsearch.randomizedtesting.RandomizedRunner$5.evaluate(RandomizedRunner.java:829)
	at com.carrotsearch.randomizedtesting.RandomizedRunner$6.evaluate(RandomizedRunner.java:879)
	at com.carrotsearch.randomizedtesting.RandomizedRunner$7.evaluate(RandomizedRunner.java:890)
	at com.carrotsearch.randomizedtesting.rules.StatementAdapter.evaluate(StatementAdapter.java:36)
	at com.carrotsearch.randomizedtesting.rules.SystemPropertiesRestoreRule$1.evaluate(SystemPropertiesRestoreRule.java:57)
	at org.apache.lucene.util.AbstractBeforeAfterRule$1.evaluate(AbstractBeforeAfterRule.java:45)
	at com.carrotsearch.randomizedtesting.rules.StatementAdapter.evaluate(StatementAdapter.java:36)
	at org.apache.lucene.util.TestRuleStoreClassName$1.evaluate(TestRuleStoreClassName.java:41)
	at com.carrotsearch.randomizedtesting.rules.NoShadowingOrOverridesOnMethodsRule$1.evaluate(NoShadowingOrOverridesOnMethodsRule.java:40)
	at com.carrotsearch.randomizedtesting.rules.NoShadowingOrOverridesOnMethodsRule$1.evaluate(NoShadowingOrOverridesOnMethodsRule.java:40)
	at com.carrotsearch.randomizedtesting.rules.StatementAdapter.evaluate(StatementAdapter.java:36)
	at com.carrotsearch.randomizedtesting.rules.StatementAdapter.evaluate(StatementAdapter.java:36)
	at com.carrotsearch.randomizedtesting.rules.StatementAdapter.evaluate(StatementAdapter.java:36)
	at org.apache.lucene.util.TestRuleAssertionsRequired$1.evaluate(TestRuleAssertionsRequired.java:53)
	at org.apache.lucene.util.TestRuleMarkFailure$1.evaluate(TestRuleMarkFailure.java:47)
	at org.apache.lucene.util.TestRuleIgnoreAfterMaxFailures$1.evaluate(TestRuleIgnoreAfterMaxFailures.java:64)
	at org.apache.lucene.util.TestRuleIgnoreTestSuites$1.evaluate(TestRuleIgnoreTestSuites.java:54)
	at com.carrotsearch.randomizedtesting.rules.StatementAdapter.evaluate(StatementAdapter.java:36)
	at com.carrotsearch.randomizedtesting.ThreadLeakControl$StatementRunner.run(ThreadLeakControl.java:368)
	at java.lang.Thread.run(Thread.java:748)


FAILED:  org.apache.solr.core.TestLazyCores.testNoCommit

Error Message:
Exception during query

Stack Trace:
java.lang.RuntimeException: Exception during query
	at __randomizedtesting.SeedInfo.seed([D08611E34F0C267C:FE6B032842B45D9]:0)
	at org.apache.solr.SolrTestCaseJ4.assertQ(SolrTestCaseJ4.java:885)
	at org.apache.solr.core.TestLazyCores.check10(TestLazyCores.java:847)
	at org.apache.solr.core.TestLazyCores.testNoCommit(TestLazyCores.java:829)
	at sun.reflect.NativeMethodAccessorImpl.invoke0(Native Method)
	at sun.reflect.NativeMethodAccessorImpl.invoke(NativeMethodAccessorImpl.java:62)
	at sun.reflect.DelegatingMethodAccessorImpl.invoke(DelegatingMethodAccessorImpl.java:43)
	at java.lang.reflect.Method.invoke(Method.java:498)
	at com.carrotsearch.randomizedtesting.RandomizedRunner.invoke(RandomizedRunner.java:1737)
	at com.carrotsearch.randomizedtesting.RandomizedRunner$8.evaluate(RandomizedRunner.java:934)
	at com.carrotsearch.randomizedtesting.RandomizedRunner$9.evaluate(RandomizedRunner.java:970)
	at com.carrotsearch.randomizedtesting.RandomizedRunner$10.evaluate(RandomizedRunner.java:984)
	at com.carrotsearch.randomizedtesting.rules.SystemPropertiesRestoreRule$1.evaluate(SystemPropertiesRestoreRule.java:57)
	at org.apache.lucene.util.TestRuleSetupTeardownChained$1.evaluate(TestRuleSetupTeardownChained.java:49)
	at org.apache.lucene.util.AbstractBeforeAfterRule$1.evaluate(AbstractBeforeAfterRule.java:45)
	at org.apache.lucene.util.TestRuleThreadAndTestName$1.evaluate(TestRuleThreadAndTestName.java:48)
	at org.apache.lucene.util.TestRuleIgnoreAfterMaxFailures$1.evaluate(TestRuleIgnoreAfterMaxFailures.java:64)
	at org.apache.lucene.util.TestRuleMarkFailure$1.evaluate(TestRuleMarkFailure.java:47)
	at com.carrotsearch.randomizedtesting.rules.StatementAdapter.evaluate(StatementAdapter.java:36)
	at com.carrotsearch.randomizedtesting.ThreadLeakControl$StatementRunner.run(ThreadLeakControl.java:368)
	at com.carrotsearch.randomizedtesting.ThreadLeakControl.forkTimeoutingTask(ThreadLeakControl.java:817)
	at com.carrotsearch.randomizedtesting.ThreadLeakControl$3.evaluate(ThreadLeakControl.java:468)
	at com.carrotsearch.randomizedtesting.RandomizedRunner.runSingleTest(RandomizedRunner.java:943)
	at com.carrotsearch.randomizedtesting.RandomizedRunner$5.evaluate(RandomizedRunner.java:829)
	at com.carrotsearch.randomizedtesting.RandomizedRunner$6.evaluate(RandomizedRunner.java:879)
	at com.carrotsearch.randomizedtesting.RandomizedRunner$7.evaluate(RandomizedRunner.java:890)
	at com.carrotsearch.randomizedtesting.rules.StatementAdapter.evaluate(StatementAdapter.java:36)
	at com.carrotsearch.randomizedtesting.rules.SystemPropertiesRestoreRule$1.evaluate(SystemPropertiesRestoreRule.java:57)
	at org.apache.lucene.util.AbstractBeforeAfterRule$1.evaluate(AbstractBeforeAfterRule.java:45)
	at com.carrotsearch.randomizedtesting.rules.StatementAdapter.evaluate(StatementAdapter.java:36)
	at org.apache.lucene.util.TestRuleStoreClassName$1.evaluate(TestRuleStoreClassName.java:41)
	at com.carrotsearch.randomizedtesting.rules.NoShadowingOrOverridesOnMethodsRule$1.evaluate(NoShadowingOrOverridesOnMethodsRule.java:40)
	at com.carrotsearch.randomizedtesting.rules.NoShadowingOrOverridesOnMethodsRule$1.evaluate(NoShadowingOrOverridesOnMethodsRule.java:40)
	at com.carrotsearch.randomizedtesting.rules.StatementAdapter.evaluate(StatementAdapter.java:36)
	at com.carrotsearch.randomizedtesting.rules.StatementAdapter.evaluate(StatementAdapter.java:36)
	at com.carrotsearch.randomizedtesting.rules.StatementAdapter.evaluate(StatementAdapter.java:36)
	at org.apache.lucene.util.TestRuleAssertionsRequired$1.evaluate(TestRuleAssertionsRequired.java:53)
	at org.apache.lucene.util.TestRuleMarkFailure$1.evaluate(TestRuleMarkFailure.java:47)
	at org.apache.lucene.util.TestRuleIgnoreAfterMaxFailures$1.evaluate(TestRuleIgnoreAfterMaxFailures.java:64)
	at org.apache.lucene.util.TestRuleIgnoreTestSuites$1.evaluate(TestRuleIgnoreTestSuites.java:54)
	at com.carrotsearch.randomizedtesting.rules.StatementAdapter.evaluate(StatementAdapter.java:36)
	at com.carrotsearch.randomizedtesting.ThreadLeakControl$StatementRunner.run(ThreadLeakControl.java:368)
	at java.lang.Thread.run(Thread.java:748)
Caused by: java.lang.RuntimeException: REQUEST FAILED: xpath=//result[@numFound='10']
	xml response was: <?xml version="1.0" encoding="UTF-8"?>
<response>
<lst name="responseHeader"><int name="status">0</int><int name="QTime">0</int><lst name="params"><str name="q">*:*</str></lst></lst><result name="response" numFound="0" start="0"></result>
</response>

	request was:q=*:*
	at org.apache.solr.SolrTestCaseJ4.assertQ(SolrTestCaseJ4.java:878)
	... 41 more




Build Log:
[...truncated 11842 lines...]
   [junit4] Suite: org.apache.solr.cloud.autoscaling.ComputePlanActionTest
   [junit4]   2> Creating dataDir: /home/jenkins/workspace/Lucene-Solr-7.x-Linux/solr/build/solr-core/test/J0/temp/solr.cloud.autoscaling.ComputePlanActionTest_D08611E34F0C267C-001/init-core-data-001
   [junit4]   2> 4912 WARN  (SUITE-ComputePlanActionTest-seed#[D08611E34F0C267C]-worker) [    ] o.a.s.SolrTestCaseJ4 startTrackingSearchers: numOpens=1 numCloses=1
   [junit4]   2> 4912 INFO  (SUITE-ComputePlanActionTest-seed#[D08611E34F0C267C]-worker) [    ] o.a.s.SolrTestCaseJ4 Using PointFields (NUMERIC_POINTS_SYSPROP=true) w/NUMERIC_DOCVALUES_SYSPROP=true
   [junit4]   2> 4914 INFO  (SUITE-ComputePlanActionTest-seed#[D08611E34F0C267C]-worker) [    ] o.a.s.SolrTestCaseJ4 Randomized ssl (true) and clientAuth (false) via: @org.apache.solr.util.RandomizeSSL(reason=, value=NaN, ssl=NaN, clientAuth=NaN)
   [junit4]   2> 4914 INFO  (SUITE-ComputePlanActionTest-seed#[D08611E34F0C267C]-worker) [    ] o.a.s.SolrTestCaseJ4 SecureRandom sanity checks: test.solr.allowed.securerandom=null & java.security.egd=file:/dev/./urandom
   [junit4]   2> 4918 INFO  (SUITE-ComputePlanActionTest-seed#[D08611E34F0C267C]-worker) [    ] o.a.s.c.MiniSolrCloudCluster Starting cluster of 1 servers in /home/jenkins/workspace/Lucene-Solr-7.x-Linux/solr/build/solr-core/test/J0/temp/solr.cloud.autoscaling.ComputePlanActionTest_D08611E34F0C267C-001/tempDir-001
   [junit4]   2> 4933 INFO  (SUITE-ComputePlanActionTest-seed#[D08611E34F0C267C]-worker) [    ] o.a.s.c.ZkTestServer STARTING ZK TEST SERVER
   [junit4]   2> 4944 INFO  (Thread-4) [    ] o.a.s.c.ZkTestServer client port:0.0.0.0/0.0.0.0:0
   [junit4]   2> 4944 INFO  (Thread-4) [    ] o.a.s.c.ZkTestServer Starting server
   [junit4]   2> 5043 INFO  (SUITE-ComputePlanActionTest-seed#[D08611E34F0C267C]-worker) [    ] o.a.s.c.ZkTestServer start zk server on port:38221
   [junit4]   2> 5122 ERROR (Thread-4) [    ] o.a.z.s.ZooKeeperServer ZKShutdownHandler is not registered, so ZooKeeper server won't take any action on ERROR or SHUTDOWN server state changes
   [junit4]   2> 5613 INFO  (jetty-launcher-7-thread-1) [    ] o.e.j.s.Server jetty-9.3.20.v20170531
   [junit4]   2> 5814 INFO  (jetty-launcher-7-thread-1) [    ] o.e.j.s.h.ContextHandler Started o.e.j.s.ServletContextHandler@5e2b1f56{/solr,null,AVAILABLE}
   [junit4]   2> 5873 INFO  (jetty-launcher-7-thread-1) [    ] o.e.j.s.AbstractConnector Started ServerConnector@2ed8b260{SSL,[ssl, http/1.1]}{127.0.0.1:45803}
   [junit4]   2> 5874 INFO  (jetty-launcher-7-thread-1) [    ] o.e.j.s.Server Started @7771ms
   [junit4]   2> 5874 INFO  (jetty-launcher-7-thread-1) [    ] o.a.s.c.s.e.JettySolrRunner Jetty properties: {hostContext=/solr, hostPort=45803}
   [junit4]   2> 5892 ERROR (jetty-launcher-7-thread-1) [    ] o.a.s.u.StartupLoggingUtils Missing Java Option solr.log.dir. Logging may be missing or incomplete.
   [junit4]   2> 5892 INFO  (jetty-launcher-7-thread-1) [    ] o.a.s.s.SolrDispatchFilter  ___      _       Welcome to Apache Solr? version 7.2.0
   [junit4]   2> 5892 INFO  (jetty-launcher-7-thread-1) [    ] o.a.s.s.SolrDispatchFilter / __| ___| |_ _   Starting in cloud mode on port null
   [junit4]   2> 5893 INFO  (jetty-launcher-7-thread-1) [    ] o.a.s.s.SolrDispatchFilter \__ \/ _ \ | '_|  Install dir: null
   [junit4]   2> 5916 INFO  (jetty-launcher-7-thread-1) [    ] o.a.s.s.SolrDispatchFilter |___/\___/_|_|    Start time: 2017-10-31T11:51:30.372Z
   [junit4]   2> 5964 INFO  (jetty-launcher-7-thread-1) [    ] o.a.s.s.SolrDispatchFilter solr.xml found in ZooKeeper. Loading...
   [junit4]   2> 6048 INFO  (jetty-launcher-7-thread-1) [    ] o.a.s.c.ZkContainer Zookeeper client=127.0.0.1:38221/solr
   [junit4]   2> 6446 INFO  (jetty-launcher-7-thread-1) [n:127.0.0.1:45803_solr    ] o.a.s.c.Overseer Overseer (id=null) closing
   [junit4]   2> 6448 INFO  (jetty-launcher-7-thread-1) [n:127.0.0.1:45803_solr    ] o.a.s.c.OverseerElectionContext I am going to be the leader 127.0.0.1:45803_solr
   [junit4]   2> 6462 INFO  (jetty-launcher-7-thread-1) [n:127.0.0.1:45803_solr    ] o.a.s.c.Overseer Overseer (id=98923360384647171-127.0.0.1:45803_solr-n_0000000000) starting
   [junit4]   2> 6589 DEBUG (OverseerStateUpdate-98923360384647171-127.0.0.1:45803_solr-n_0000000000) [n:127.0.0.1:45803_solr    ] o.a.s.c.Overseer Starting to work on the main queue
   [junit4]   2> 6619 INFO  (jetty-launcher-7-thread-1) [n:127.0.0.1:45803_solr    ] o.a.s.c.ZkController Register node as live in ZooKeeper:/live_nodes/127.0.0.1:45803_solr
   [junit4]   2> 6654 INFO  (OverseerStateUpdate-98923360384647171-127.0.0.1:45803_solr-n_0000000000) [n:127.0.0.1:45803_solr    ] o.a.s.c.c.ZkStateReader Updated live nodes from ZooKeeper... (0) -> (1)
   [junit4]   2> 6725 DEBUG (OverseerAutoScalingTriggerThread-98923360384647171-127.0.0.1:45803_solr-n_0000000000) [n:127.0.0.1:45803_solr    ] o.a.s.c.a.OverseerTriggerThread Adding .autoAddReplicas trigger
   [junit4]   2> 6778 DEBUG (OverseerAutoScalingTriggerThread-98923360384647171-127.0.0.1:45803_solr-n_0000000000) [n:127.0.0.1:45803_solr    ] o.a.s.c.a.OverseerTriggerThread Refreshing /autoscaling.json with znode version 1
   [junit4]   2> 6908 DEBUG (OverseerAutoScalingTriggerThread-98923360384647171-127.0.0.1:45803_solr-n_0000000000) [n:127.0.0.1:45803_solr    ] o.a.s.c.a.NodeLostTrigger Initial livenodes: [127.0.0.1:45803_solr]
   [junit4]   2> 6909 DEBUG (OverseerAutoScalingTriggerThread-98923360384647171-127.0.0.1:45803_solr-n_0000000000) [n:127.0.0.1:45803_solr    ] o.a.s.c.a.OverseerTriggerThread Current znodeVersion 1, lastZnodeVersion -1
   [junit4]   2> 6909 DEBUG (OverseerAutoScalingTriggerThread-98923360384647171-127.0.0.1:45803_solr-n_0000000000) [n:127.0.0.1:45803_solr    ] o.a.s.c.a.OverseerTriggerThread Processed trigger updates upto znodeVersion 1
   [junit4]   2> 6960 DEBUG (OverseerAutoScalingTriggerThread-98923360384647171-127.0.0.1:45803_solr-n_0000000000) [n:127.0.0.1:45803_solr    ] o.a.s.c.a.OverseerTriggerThread -- clean old nodeAdded markers
   [junit4]   2> 6961 DEBUG (OverseerAutoScalingTriggerThread-98923360384647171-127.0.0.1:45803_solr-n_0000000000) [n:127.0.0.1:45803_solr    ] o.a.s.c.a.OverseerTriggerThread Current znodeVersion 1, lastZnodeVersion 1
   [junit4]   2> 6962 DEBUG (ScheduledTrigger-44-thread-1) [n:127.0.0.1:45803_solr    ] o.a.s.c.a.NodeLostTrigger Running NodeLostTrigger: .auto_add_replicas with currently live nodes: [127.0.0.1:45803_solr]
   [junit4]   2> 7108 INFO  (jetty-launcher-7-thread-1) [n:127.0.0.1:45803_solr    ] o.a.s.m.r.SolrJmxReporter JMX monitoring for 'solr_45803.solr.node' (registry 'solr.node') enabled at server: com.sun.jmx.mbeanserver.JmxMBeanServer@477f2a6a
   [junit4]   2> 7108 INFO  (jetty-launcher-7-thread-1) [n:127.0.0.1:45803_solr    ] o.a.s.m.r.SolrJmxReporter JMX monitoring for 'solr_45803.solr.jvm' (registry 'solr.jvm') enabled at server: com.sun.jmx.mbeanserver.JmxMBeanServer@477f2a6a
   [junit4]   2> 7109 INFO  (jetty-launcher-7-thread-1) [n:127.0.0.1:45803_solr    ] o.a.s.m.r.SolrJmxReporter JMX monitoring for 'solr_45803.solr.jetty' (registry 'solr.jetty') enabled at server: com.sun.jmx.mbeanserver.JmxMBeanServer@477f2a6a
   [junit4]   2> 7152 INFO  (jetty-launcher-7-thread-1) [n:127.0.0.1:45803_solr    ] o.a.s.c.CorePropertiesLocator Found 0 core definitions underneath /home/jenkins/workspace/Lucene-Solr-7.x-Linux/solr/build/solr-core/test/J0/temp/solr.cloud.autoscaling.ComputePlanActionTest_D08611E34F0C267C-001/tempDir-001/node1/.
   [junit4]   2> 7376 INFO  (SUITE-ComputePlanActionTest-seed#[D08611E34F0C267C]-worker) [    ] o.a.s.c.c.ZkStateReader Updated live nodes from ZooKeeper... (0) -> (1)
   [junit4]   2> 7377 INFO  (SUITE-ComputePlanActionTest-seed#[D08611E34F0C267C]-worker) [    ] o.a.s.c.s.i.ZkClientClusterStateProvider Cluster at 127.0.0.1:38221/solr ready
   [junit4]   2> 7398 INFO  (TEST-ComputePlanActionTest.testNodeWithMultipleReplicasLost-seed#[D08611E34F0C267C]) [    ] o.a.s.SolrTestCaseJ4 ###Starting testNodeWithMultipleReplicasLost
   [junit4]   2> 7399 DEBUG (zkCallback-14-thread-1-processing-n:127.0.0.1:45803_solr) [n:127.0.0.1:45803_solr    ] o.a.s.c.a.OverseerTriggerThread Refreshing /autoscaling.json with znode version 2
   [junit4]   2> 7413 DEBUG (OverseerAutoScalingTriggerThread-98923360384647171-127.0.0.1:45803_solr-n_0000000000) [n:127.0.0.1:45803_solr    ] o.a.s.c.a.OverseerTriggerThread Processed trigger updates upto znodeVersion 2
   [junit4]   2> 7423 DEBUG (OverseerAutoScalingTriggerThread-98923360384647171-127.0.0.1:45803_solr-n_0000000000) [n:127.0.0.1:45803_solr    ] o.a.s.c.a.OverseerTriggerThread -- clean old nodeLost markers
   [junit4]   2> 7423 DEBUG (OverseerAutoScalingTriggerThread-98923360384647171-127.0.0.1:45803_solr-n_0000000000) [n:127.0.0.1:45803_solr    ] o.a.s.c.a.OverseerTriggerThread -- clean old nodeAdded markers
   [junit4]   2> 7424 DEBUG (OverseerAutoScalingTriggerThread-98923360384647171-127.0.0.1:45803_solr-n_0000000000) [n:127.0.0.1:45803_solr    ] o.a.s.c.a.OverseerTriggerThread Current znodeVersion 2, lastZnodeVersion 2
   [junit4]   2> 8043 INFO  (qtp1809236203-58) [n:127.0.0.1:45803_solr    ] o.a.s.h.a.CollectionsHandler Invoked Collection Action :delete with params name=testNodeLost&action=DELETE&wt=javabin&version=2 and sendToOCPQueue=true
   [junit4]   2> 8063 INFO  (OverseerThreadFactory-46-thread-1-processing-n:127.0.0.1:45803_solr) [n:127.0.0.1:45803_solr    ] o.a.s.c.OverseerCollectionMessageHandler Executing Collection Cmd : action=UNLOAD&deleteInstanceDir=true&deleteDataDir=true
   [junit4]   2> 8069 ERROR (OverseerThreadFactory-46-thread-1-processing-n:127.0.0.1:45803_solr) [n:127.0.0.1:45803_solr    ] o.a.s.c.OverseerCollectionMessageHandler Collection: testNodeLost operation: delete failed:org.apache.solr.common.SolrException: Could not find collection : testNodeLost
   [junit4]   2> 	at org.apache.solr.common.cloud.ClusterState.getCollection(ClusterState.java:111)
   [junit4]   2> 	at org.apache.solr.cloud.OverseerCollectionMessageHandler.collectionCmd(OverseerCollectionMessageHandler.java:800)
   [junit4]   2> 	at org.apache.solr.cloud.DeleteCollectionCmd.call(DeleteCollectionCmd.java:91)
   [junit4]   2> 	at org.apache.solr.cloud.OverseerCollectionMessageHandler.processMessage(OverseerCollectionMessageHandler.java:232)
   [junit4]   2> 	at org.apache.solr.cloud.OverseerTaskProcessor$Runner.run(OverseerTaskProcessor.java:464)
   [junit4]   2> 	at org.apache.solr.common.util.ExecutorUtil$MDCAwareThreadPoolExecutor.lambda$execute$0(ExecutorUtil.java:188)
   [junit4]   2> 	at java.util.concurrent.ThreadPoolExecutor.runWorker(ThreadPoolExecutor.java:1149)
   [junit4]   2> 	at java.util.concurrent.ThreadPoolExecutor$Worker.run(ThreadPoolExecutor.java:624)
   [junit4]   2> 	at java.lang.Thread.run(Thread.java:748)
   [junit4]   2> 
   [junit4]   2> 8105 INFO  (qtp1809236203-58) [n:127.0.0.1:45803_solr    ] o.a.s.s.HttpSolrCall [admin] webapp=null path=/admin/collections params={name=testNodeLost&action=DELETE&wt=javabin&version=2} status=400 QTime=68
   [junit4]   2> 8110 INFO  (OverseerCollectionConfigSetProcessor-98923360384647171-127.0.0.1:45803_solr-n_0000000000) [n:127.0.0.1:45803_solr    ] o.a.s.c.OverseerTaskQueue Response ZK path: /overseer/collection-queue-work/qnr-0000000000 doesn't exist.  Requestor may have disconnected from ZooKeeper
   [junit4]   2> 8168 INFO  (qtp1809236203-53) [n:127.0.0.1:45803_solr    ] o.a.s.h.a.CollectionsHandler Invoked Collection Action :delete with params name=testNodeAdded&action=DELETE&wt=javabin&version=2 and sendToOCPQueue=true
   [junit4]   2> 8186 INFO  (OverseerThreadFactory-46-thread-2-processing-n:127.0.0.1:45803_solr) [n:127.0.0.1:45803_solr    ] o.a.s.c.OverseerCollectionMessageHandler Executing Collection Cmd : action=UNLOAD&deleteInstanceDir=true&deleteDataDir=true
   [junit4]   2> 8187 ERROR (OverseerThreadFactory-46-thread-2-processing-n:127.0.0.1:45803_solr) [n:127.0.0.1:45803_solr    ] o.a.s.c.OverseerCollectionMessageHandler Collection: testNodeAdded operation: delete failed:org.apache.solr.common.SolrException: Could not find collection : testNodeAdded
   [junit4]   2> 	at org.apache.solr.common.cloud.ClusterState.getCollection(ClusterState.java:111)
   [junit4]   2> 	at org.apache.solr.cloud.OverseerCollectionMessageHandler.collectionCmd(OverseerCollectionMessageHandler.java:800)
   [junit4]   2> 	at org.apache.solr.cloud.DeleteCollectionCmd.call(DeleteCollectionCmd.java:91)
   [junit4]   2> 	at org.apache.solr.cloud.OverseerCollectionMessageHandler.processMessage(OverseerCollectionMessageHandler.java:232)
   [junit4]   2> 	at org.apache.solr.cloud.OverseerTaskProcessor$Runner.run(OverseerTaskProcessor.java:464)
   [junit4]   2> 	at org.apache.solr.common.util.ExecutorUtil$MDCAwareThreadPoolExecutor.lambda$execute$0(ExecutorUtil.java:188)
   [junit4]   2> 	at java.util.concurrent.ThreadPoolExecutor.runWorker(ThreadPoolExecutor.java:1149)
   [junit4]   2> 	at java.util.concurrent.ThreadPoolExecutor$Worker.run(ThreadPoolExecutor.java:624)
   [junit4]   2> 	at java.lang.Thread.run(Thread.java:748)
   [junit4]   2> 
   [junit4]   2> 8196 INFO  (OverseerCollectionConfigSetProcessor-98923360384647171-127.0.0.1:45803_solr-n_0000000000) [n:127.0.0.1:45803_solr    ] o.a.s.c.OverseerTaskQueue Response ZK path: /overseer/collection-queue-work/qnr-0000000002 doesn't exist.  Requestor may have disconnected from ZooKeeper
   [junit4]   2> 8194 INFO  (qtp1809236203-53) [n:127.0.0.1:45803_solr    ] o.a.s.s.HttpSolrCall [admin] webapp=null path=/admin/collections params={name=testNodeAdded&action=DELETE&wt=javabin&version=2} status=400 QTime=26
   [junit4]   2> 8202 INFO  (qtp1809236203-59) [n:127.0.0.1:45803_solr    ] o.a.s.h.a.CollectionsHandler Invoked Collection Action :delete with params name=testNodeWithMultipleReplicasLost&action=DELETE&wt=javabin&version=2 and sendToOCPQueue=true
   [junit4]   2> 8226 INFO  (OverseerThreadFactory-46-thread-3-processing-n:127.0.0.1:45803_solr) [n:127.0.0.1:45803_solr    ] o.a.s.c.OverseerCollectionMessageHandler Executing Collection Cmd : action=UNLOAD&deleteInstanceDir=true&deleteDataDir=true
   [junit4]   2> 8228 ERROR (OverseerThreadFactory-46-thread-3-processing-n:127.0.0.1:45803_solr) [n:127.0.0.1:45803_solr    ] o.a.s.c.OverseerCollectionMessageHandler Collection: testNodeWithMultipleReplicasLost operation: delete failed:org.apache.solr.common.SolrException: Could not find collection : testNodeWithMultipleReplicasLost
   [junit4]   2> 	at org.apache.solr.common.cloud.ClusterState.getCollection(ClusterState.java:111)
   [junit4]   2> 	at org.apache.solr.cloud.OverseerCollectionMessageHandler.collectionCmd(OverseerCollectionMessageHandler.java:800)
   [junit4]   2> 	at org.apache.solr.cloud.DeleteCollectionCmd.call(DeleteCollectionCmd.java:91)
   [junit4]   2> 	at org.apache.solr.cloud.OverseerCollectionMessageHandler.processMessage(OverseerCollectionMessageHandler.java:232)
   [junit4]   2> 	at org.apache.solr.cloud.OverseerTaskProcessor$Runner.run(OverseerTaskProcessor.java:464)
   [junit4]   2> 	at org.apache.solr.common.util.ExecutorUtil$MDCAwareThreadPoolExecutor.lambda$execute$0(ExecutorUtil.java:188)
   [junit4]   2> 	at java.util.concurrent.ThreadPoolExecutor.runWorker(ThreadPoolExecutor.java:1149)
   [junit4]   2> 	at java.util.concurrent.ThreadPoolExecutor$Worker.run(ThreadPoolExecutor.java:624)
   [junit4]   2> 	at java.lang.Thread.run(Thread.java:748)
   [junit4]   2> 
   [junit4]   2> 8247 INFO  (qtp1809236203-59) [n:127.0.0.1:45803_solr    ] o.a.s.s.HttpSolrCall [admin] webapp=null path=/admin/collections params={name=testNodeWithMultipleReplicasLost&action=DELETE&wt=javabin&version=2} status=400 QTime=44
   [junit4]   2> 8300 INFO  (qtp1809236203-60) [n:127.0.0.1:45803_solr    ] o.a.s.c.c.ZkStateReader Updated live nodes from ZooKeeper... (0) -> (1)
   [junit4]   2> 8301 INFO  (qtp1809236203-60) [n:127.0.0.1:45803_solr    ] o.a.s.c.s.i.ZkClientClusterStateProvider Cluster at 127.0.0.1:38221/solr ready
   [junit4]   2> 8355 INFO  (qtp1809236203-54) [n:127.0.0.1:45803_solr    ] o.a.s.s.HttpSolrCall [admin] webapp=null path=/admin/metrics params={prefix=CORE.coreName&wt=javabin&version=2&group=solr.core} status=0 QTime=4
   [junit4]   2> 8363 DEBUG (qtp1809236203-60) [n:127.0.0.1:45803_solr    ] o.a.s.c.a.AutoScalingHandler Verified autoscaling configuration
   [junit4]   2> 8377 DEBUG (zkCallback-14-thread-1-processing-n:127.0.0.1:45803_solr) [n:127.0.0.1:45803_solr    ] o.a.s.c.a.OverseerTriggerThread Refreshing /autoscaling.json with znode version 3
   [junit4]   2> 8377 DEBUG (OverseerAutoScalingTriggerThread-98923360384647171-127.0.0.1:45803_solr-n_0000000000) [n:127.0.0.1:45803_solr    ] o.a.s.c.a.OverseerTriggerThread Processed trigger updates upto znodeVersion 3
   [junit4]   2> 8377 DEBUG (OverseerAutoScalingTriggerThread-98923360384647171-127.0.0.1:45803_solr-n_0000000000) [n:127.0.0.1:45803_solr    ] o.a.s.c.a.OverseerTriggerThread -- clean old nodeLost markers
   [junit4]   2> 8378 DEBUG (OverseerAutoScalingTriggerThread-98923360384647171-127.0.0.1:45803_solr-n_0000000000) [n:127.0.0.1:45803_solr    ] o.a.s.c.a.OverseerTriggerThread -- clean old nodeAdded markers
   [junit4]   2> 8378 INFO  (qtp1809236203-60) [n:127.0.0.1:45803_solr    ] o.a.s.s.HttpSolrCall [admin] webapp=null path=/admin/autoscaling params={wt=javabin&version=2} status=0 QTime=123
   [junit4]   2> 8378 DEBUG (OverseerAutoScalingTriggerThread-98923360384647171-127.0.0.1:45803_solr-n_0000000000) [n:127.0.0.1:45803_solr    ] o.a.s.c.a.OverseerTriggerThread Current znodeVersion 3, lastZnodeVersion 3
   [junit4]   2> 8421 INFO  (qtp1809236203-60) [n:127.0.0.1:45803_solr    ] o.a.s.c.c.ZkStateReader Updated live nodes from ZooKeeper... (0) -> (1)
   [junit4]   2> 8423 INFO  (qtp1809236203-60) [n:127.0.0.1:45803_solr    ] o.a.s.c.s.i.ZkClientClusterStateProvider Cluster at 127.0.0.1:38221/solr ready
   [junit4]   2> 8437 INFO  (qtp1809236203-59) [n:127.0.0.1:45803_solr    ] o.a.s.s.HttpSolrCall [admin] webapp=null path=/admin/metrics params={prefix=CONTAINER.fs.usableSpace,CORE.coreName&wt=javabin&version=2&group=solr.node,solr.core} status=0 QTime=9
   [junit4]   2> 8438 DEBUG (qtp1809236203-60) [n:127.0.0.1:45803_solr    ] o.a.s.c.a.AutoScalingHandler Verified autoscaling configuration
   [junit4]   2> 8451 INFO  (qtp1809236203-60) [n:127.0.0.1:45803_solr    ] o.a.s.s.HttpSolrCall [admin] webapp=null path=/cluster/autoscaling params={wt=javabin&version=2} status=0 QTime=63
   [junit4]   2> 8458 INFO  (TEST-ComputePlanActionTest.testNodeWithMultipleReplicasLost-seed#[D08611E34F0C267C]) [    ] o.e.j.s.Server jetty-9.3.20.v20170531
   [junit4]   2> 8491 INFO  (TEST-ComputePlanActionTest.testNodeWithMultipleReplicasLost-seed#[D08611E34F0C267C]) [    ] o.e.j.s.h.ContextHandler Started o.e.j.s.ServletContextHandler@7a433168{/solr,null,AVAILABLE}
   [junit4]   2> 8493 INFO  (TEST-ComputePlanActionTest.testNodeWithMultipleReplicasLost-seed#[D08611E34F0C267C]) [    ] o.e.j.s.AbstractConnector Started ServerConnector@7c3e0c67{SSL,[ssl, http/1.1]}{127.0.0.1:39989}
   [junit4]   2> 8493 INFO  (TEST-ComputePlanActionTest.testNodeWithMultipleReplicasLost-seed#[D08611E34F0C267C]) [    ] o.e.j.s.Server Started @10390ms
   [junit4]   2> 8493 INFO  (TEST-ComputePlanActionTest.testNodeWithMultipleReplicasLost-seed#[D08611E34F0C267C]) [    ] o.a.s.c.s.e.JettySolrRunner Jetty properties: {hostContext=/solr, hostPort=39989}
   [junit4]   2> 8493 ERROR (TEST-ComputePlanActionTest.testNodeWithMultipleReplicasLost-seed#[D08611E34F0C267C]) [    ] o.a.s.u.StartupLoggingUtils Missing Java Option solr.log.dir. Logging may be missing or incomplete.
   [junit4]   2> 8493 INFO  (TEST-ComputePlanActionTest.testNodeWithMultipleReplicasLost-seed#[D08611E34F0C267C]) [    ] o.a.s.s.SolrDispatchFilter  ___      _       Welcome to Apache Solr? version 7.2.0
   [junit4]   2> 8493 INFO  (TEST-ComputePlanActionTest.testNodeWithMultipleReplicasLost-seed#[D08611E34F0C267C]) [    ] o.a.s.s.SolrDispatchFilter / __| ___| |_ _   Starting in cloud mode on port null
   [junit4]   2> 8493 INFO  (TEST-ComputePlanActionTest.testNodeWithMultipleReplicasLost-seed#[D08611E34F0C267C]) [    ] o.a.s.s.SolrDispatchFilter \__ \/ _ \ | '_|  Install dir: null
   [junit4]   2> 8493 INFO  (TEST-ComputePlanActionTest.testNodeWithMultipleReplicasLost-seed#[D08611E34F0C267C]) [    ] o.a.s.s.SolrDispatchFilter |___/\___/_|_|    Start time: 2017-10-31T11:51:32.970Z
   [junit4]   2> 8521 DEBUG (zkCallback-14-thread-1-processing-n:127.0.0.1:45803_solr) [n:127.0.0.1:45803_solr    ] o.a.s.c.a.OverseerTriggerThread Refreshing /autoscaling.json with znode version 4
   [junit4]   2> 8521 DEBUG (OverseerAutoScalingTriggerThread-98923360384647171-127.0.0.1:45803_solr-n_0000000000) [n:127.0.0.1:45803_solr    ] o.a.s.c.a.OverseerTriggerThread Processed trigger updates upto znodeVersion 4
   [junit4]   2> 8521 DEBUG (OverseerAutoScalingTriggerThread-98923360384647171-127.0.0.1:45803_solr-n_0000000000) [n:127.0.0.1:45803_solr    ] o.a.s.c.a.OverseerTriggerThread -- clean old nodeLost markers
   [junit4]   2> 8545 DEBUG (OverseerAutoScalingTriggerThread-98923360384647171-127.0.0.1:45803_solr-n_0000000000) [n:127.0.0.1:45803_solr    ] o.a.s.c.a.OverseerTriggerThread -- clean old nodeAdded markers
   [junit4]   2> 8547 DEBUG (OverseerAutoScalingTriggerThread-98923360384647171-127.0.0.1:45803_solr-n_0000000000) [n:127.0.0.1:45803_solr    ] o.a.s.c.a.OverseerTriggerThread Current znodeVersion 4, lastZnodeVersion 4
   [junit4]   2> 8550 INFO  (TEST-ComputePlanActionTest.testNodeWithMultipleReplicasLost-seed#[D08611E34F0C267C]) [    ] o.a.s.s.SolrDispatchFilter solr.xml found in ZooKeeper. Loading...
   [junit4]   2> 8597 INFO  (TEST-ComputePlanActionTest.testNodeWithMultipleReplicasLost-seed#[D08611E34F0C267C]) [    ] o.a.s.c.ZkContainer Zookeeper client=127.0.0.1:38221/solr
   [junit4]   2> 8713 INFO  (TEST-ComputePlanActionTest.testNodeWithMultipleReplicasLost-seed#[D08611E34F0C267C]) [n:127.0.0.1:39989_solr    ] o.a.s.c.c.ZkStateReader Updated live nodes from ZooKeeper... (0) -> (1)
   [junit4]   2> 8728 INFO  (TEST-ComputePlanActionTest.testNodeWithMultipleReplicasLost-seed#[D08611E34F0C267C]) [n:127.0.0.1:39989_solr    ] o.a.s.c.Overseer Overseer (id=null) closing
   [junit4]   2> 8735 INFO  (TEST-ComputePlanActionTest.testNodeWithMultipleReplicasLost-seed#[D08611E34F0C267C]) [n:127.0.0.1:39989_solr    ] o.a.s.c.ZkController Register node as live in ZooKeeper:/live_nodes/127.0.0.1:39989_solr
   [junit4]   2> 8736 DEBUG (OverseerStateUpdate-98923360384647171-127.0.0.1:45803_solr-n_0000000000) [n:127.0.0.1:45803_solr    ] o.a.s.c.Overseer processMessage: queueSize: 1, message = {
   [junit4]   2>   "operation":"downnode",
   [junit4]   2>   "node_name":"127.0.0.1:39989_solr"} current state version: 0
   [junit4]   2> 8740 DEBUG (OverseerStateUpdate-98923360384647171-127.0.0.1:45803_solr-n_0000000000) [n:127.0.0.1:45803_solr    ] o.a.s.c.o.NodeMutator DownNode state invoked for node: 127.0.0.1:39989_solr
   [junit4]   2> 8741 INFO  (zkCallback-20-thread-1) [    ] o.a.s.c.c.ZkStateReader Updated live nodes from ZooKeeper... (1) -> (2)
   [junit4]   2> 8741 INFO  (zkCallback-14-thread-1-processing-n:127.0.0.1:45803_solr) [n:127.0.0.1:45803_solr    ] o.a.s.c.c.ZkStateReader Updated live nodes from ZooKeeper... (1) -> (2)
   [junit4]   2> 8764 INFO  (zkCallback-31-thread-1-processing-n:127.0.0.1:39989_solr) [n:127.0.0.1:39989_solr    ] o.a.s.c.c.ZkStateReader Updated live nodes from ZooKeeper... (1) -> (2)
   [junit4]   2> 9134 INFO  (TEST-ComputePlanActionTest.testNodeWithMultipleReplicasLost-seed#[D08611E34F0C267C]) [n:127.0.0.1:39989_solr    ] o.a.s.m.r.SolrJmxReporter JMX monitoring for 'solr_39989.solr.node' (registry 'solr.node') enabled at server: com.sun.jmx.mbeanserver.JmxMBeanServer@477f2a6a
   [junit4]   2> 9170 INFO  (TEST-ComputePlanActionTest.testNodeWithMultipleReplicasLost-seed#[D08611E34F0C267C]) [n:127.0.0.1:39989_solr    ] o.a.s.m.r.SolrJmxReporter JMX monitoring for 'solr_39989.solr.jvm' (registry 'solr.jvm') enabled at server: com.sun.jmx.mbeanserver.JmxMBeanServer@477f2a6a
   [junit4]   2> 9170 INFO  (TEST-ComputePlanActionTest.testNodeWithMultipleReplicasLost-seed#[D08611E34F0C267C]) [n:127.0.0.1:39989_solr    ] o.a.s.m.r.SolrJmxReporter JMX monitoring for 'solr_39989.solr.jetty' (registry 'solr.jetty') enabled at server: com.sun.jmx.mbeanserver.JmxMBeanServer@477f2a6a
   [junit4]   2> 9190 INFO  (TEST-ComputePlanActionTest.testNodeWithMultipleReplicasLost-seed#[D08611E34F0C267C]) [n:127.0.0.1:39989_solr    ] o.a.s.c.CorePropertiesLocator Found 0 core definitions underneath /home/jenkins/workspace/Lucene-Solr-7.x-Linux/solr/build/solr-core/test/J0/temp/solr.cloud.autoscaling.ComputePlanActionTest_D08611E34F0C267C-001/tempDir-001/node2/.
   [junit4]   2> 9261 INFO  (TEST-ComputePlanActionTest.testNodeWithMultipleReplicasLost-seed#[D08611E34F0C267C]) [    ] o.e.j.s.Server jetty-9.3.20.v20170531
   [junit4]   2> 9289 INFO  (TEST-ComputePlanActionTest.testNodeWithMultipleReplicasLost-seed#[D08611E34F0C267C]) [    ] o.e.j.s.h.ContextHandler Started o.e.j.s.ServletContextHandler@76e42833{/solr,null,AVAILABLE}
   [junit4]   2> 9290 INFO  (TEST-ComputePlanActionTest.testNodeWithMultipleReplicasLost-seed#[D08611E34F0C267C]) [    ] o.e.j.s.AbstractConnector Started ServerConnector@305478d1{SSL,[ssl, http/1.1]}{127.0.0.1:39375}
   [junit4]   2> 9290 INFO  (TEST-ComputePlanActionTest.testNodeWithMultipleReplicasLost-seed#[D08611E34F0C267C]) [    ] o.e.j.s.Server Started @11187ms
   [junit4]   2> 9290 INFO  (TEST-ComputePlanActionTest.testNodeWithMultipleReplicasLost-seed#[D08611E34F0C267C]) [    ] o.a.s.c.s.e.JettySolrRunner Jetty properties: {hostContext=/solr, hostPort=39375}
   [junit4]   2> 9291 ERROR (TEST-ComputePlanActionTest.testNodeWithMultipleReplicasLost-seed#[D08611E34F0C267C]) [    ] o.a.s.u.StartupLoggingUtils Missing Java Option solr.log.dir. Logging may be missing or incomplete.
   [junit4]   2> 9291 INFO  (TEST-ComputePlanActionTest.testNodeWithMultipleReplicasLost-seed#[D08611E34F0C267C]) [    ] o.a.s.s.SolrDispatchFilter  ___      _       Welcome to Apache Solr? version 7.2.0
   [junit4]   2> 9291 INFO  (TEST-ComputePlanActionTest.testNodeWithMultipleReplicasLost-seed#[D08611E34F0C267C]) [    ] o.a.s.s.SolrDispatchFilter / __| ___| |_ _   Starting in cloud mode on port null
   [junit4]   2> 9291 INFO  (TEST-ComputePlanActionTest.testNodeWithMultipleReplicasLost-seed#[D08611E34F0C267C]) [    ] o.a.s.s.SolrDispatchFilter \__ \/ _ \ | '_|  Install dir: null
   [junit4]   2> 9291 INFO  (TEST-ComputePlanActionTest.testNodeWithMultipleReplicasLost-seed#[D08611E34F0C267C]) [    ] o.a.s.s.SolrDispatchFilter |___/\___/_|_|    Start time: 2017-10-31T11:51:33.768Z
   [junit4]   2> 9309 INFO  (TEST-ComputePlanActionTest.testNodeWithMultipleReplicasLost-seed#[D08611E34F0C267C]) [    ] o.a.s.s.SolrDispatchFilter solr.xml found in ZooKeeper. Loading...
   [junit4]   2> 9345 INFO  (TEST-ComputePlanActionTest.testNodeWithMultipleReplicasLost-seed#[D08611E34F0C267C]) [    ] o.a.s.c.ZkContainer Zookeeper client=127.0.0.1:38221/solr
   [junit4]   2> 9432 INFO  (TEST-ComputePlanActionTest.testNodeWithMultipleReplicasLost-seed#[D08611E34F0C267C]) [n:127.0.0.1:39375_solr    ] o.a.s.c.c.ZkStateReader Updated live nodes from ZooKeeper... (0) -> (2)
   [junit4]   2> 9434 INFO  (TEST-ComputePlanActionTest.testNodeWithMultipleReplicasLost-seed#[D08611E34F0C267C]) [n:127.0.0.1:39375_solr    ] o.a.s.c.Overseer Overseer (id=null) closing
   [junit4]   2> 9444 DEBUG (OverseerStateUpdate-98923360384647171-127.0.0.1:45803_solr-n_0000000000) [n:127.0.0.1:45803_solr    ] o.a.s.c.Overseer processMessage: queueSize: 1, message = {
   [junit4]   2>   "operation":"downnode",
   [junit4]   2>   "node_name":"127.0.0.1:39375_solr"} current state version: 0
   [junit4]   2> 9444 DEBUG (OverseerStateUpdate-98923360384647171-127.0.0.1:45803_solr-n_0000000000) [n:127.0.0.1:45803_solr    ] o.a.s.c.o.NodeMutator DownNode state invoked for node: 127.0.0.1:39375_solr
   [junit4]   2> 9445 INFO  (TEST-ComputePlanActionTest.testNodeWithMultipleReplicasLost-seed#[D08611E34F0C267C]) [n:127.0.0.1:39375_solr    ] o.a.s.c.ZkController Register node as live in ZooKeeper:/live_nodes/127.0.0.1:39375_solr
   [junit4]   2> 9446 INFO  (zkCallback-31-thread-1-processing-n:127.0.0.1:39989_solr) [n:127.0.0.1:39989_solr    ] o.a.s.c.c.ZkStateReader Updated live nodes from ZooKeeper... (2) -> (3)
   [junit4]   2> 9447 INFO  (zkCallback-20-thread-1) [    ] o.a.s.c.c.ZkStateReader Updated live nodes from ZooKeeper... (2) -> (3)
   [junit4]   2> 9447 INFO  (zkCallback-14-thread-1-processing-n:127.0.0.1:45803_solr) [n:127.0.0.1:45803_solr    ] o.a.s.c.c.ZkStateReader Updated live nodes from ZooKeeper... (2) -> (3)
   [junit4]   2> 9468 INFO  (zkCallback-37-thread-1-processing-n:127.0.0.1:39375_solr) [n:127.0.0.1:39375_solr    ] o.a.s.c.c.ZkStateReader Updated live nodes from ZooKeeper... (2) -> (3)
   [junit4]   2> 9614 INFO  (TEST-ComputePlanActionTest.testNodeWithMultipleReplicasLost-seed#[D08611E34F0C267C]) [n:127.0.0.1:39375_solr    ] o.a.s.m.r.SolrJmxReporter JMX monitoring for 'solr_39375.solr.node' (registry 'solr.node') enabled at server: com.sun.jmx.mbeanserver.JmxMBeanServer@477f2a6a
   [junit4]   2> 9653 INFO  (TEST-ComputePlanActionTest.testNodeWithMultipleReplicasLost-seed#[D08611E34F0C267C]) [n:127.0.0.1:39375_solr    ] o.a.s.m.r.SolrJmxReporter JMX monitoring for 'solr_39375.solr.jvm' (registry 'solr.jvm') enabled at server: com.sun.jmx.mbeanserver.JmxMBeanServer@477f2a6a
   [junit4]   2> 9653 INFO  (TEST-ComputePlanActionTest.testNodeWithMultipleReplicasLost-seed#[D08611E34F0C267C]) [n:127.0.0.1:39375_solr    ] o.a.s.m.r.SolrJmxReporter JMX monitoring for 'solr_39375.solr.jetty' (registry 'solr.jetty') enabled at server: com.sun.jmx.mbeanserver.JmxMBeanServer@477f2a6a
   [junit4]   2> 9655 INFO  (TEST-ComputePlanActionTest.testNodeWithMultipleReplicasLost-seed#[D08611E34F0C267C]) [n:127.0.0.1:39375_solr    ] o.a.s.c.CorePropertiesLocator Found 0 core definitions underneath /home/jenkins/workspace/Lucene-Solr-7.x-Linux/solr/build/solr-core/test/J0/temp/solr.cloud.autoscaling.ComputePlanActionTest_D08611E34F0C267C-001/tempDir-001/node3/.
   [junit4]   2> 9774 INFO  (TEST-ComputePlanActionTest.testNodeWithMultipleReplicasLost-seed#[D08611E34F0C267C]) [    ] o.e.j.s.Server jetty-9.3.20.v20170531
   [junit4]   2> 9850 INFO  (TEST-ComputePlanActionTest.testNodeWithMultipleReplicasLost-seed#[D08611E34F0C267C]) [    ] o.e.j.s.h.ContextHandler Started o.e.j.s.ServletContextHandler@1774924e{/solr,null,AVAILABLE}
   [junit4]   2> 9851 INFO  (TEST-ComputePlanActionTest.testNodeWithMultipleReplicasLost-seed#[D08611E34F0C267C]) [    ] o.e.j.s.AbstractConnector Started ServerConnector@5d844cbd{SSL,[ssl, http/1.1]}{127.0.0.1:42133}
   [junit4]   2> 9851 INFO  (TEST-ComputePlanActionTest.testNodeWithMultipleReplicasLost-seed#[D08611E34F0C267C]) [    ] o.e.j.s.Server Started @11749ms
   [junit4]   2> 9852 INFO  (TEST-ComputePlanActionTest.testNodeWithMultipleReplicasLost-seed#[D08611E34F0C267C]) [    ] o.a.s.c.s.e.JettySolrRunner Jetty properties: {hostContext=/solr, hostPort=42133}
   [junit4]   2> 9852 ERROR (TEST-ComputePlanActionTest.testNodeWithMultipleReplicasLost-seed#[D08611E34F0C267C]) [    ] o.a.s.u.StartupLoggingUtils Missing Java Option solr.log.dir. Logging may be missing or incomplete.
   [junit4]   2> 9852 INFO  (TEST-ComputePlanActionTest.testNodeWithMultipleReplicasLost-seed#[D08611E34F0C267C]) [    ] o.a.s.s.SolrDispatchFilter  ___      _       Welcome to Apache Solr? version 7.2.0
   [junit4]   2> 9852 INFO  (TEST-ComputePlanActionTest.testNodeWithMultipleReplicasLost-seed#[D08611E34F0C267C]) [    ] o.a.s.s.SolrDispatchFilter / __| ___| |_ _   Starting in cloud mode on port null
   [junit4]   2> 9852 INFO  (TEST-ComputePlanActionTest.testNodeWithMultipleReplicasLost-seed#[D08611E34F0C267C]) [    ] o.a.s.s.SolrDispatchFilter \__ \/ _ \ | '_|  Install dir: null
   [junit4]   2> 9852 INFO  (TEST-ComputePlanActionTest.testNodeWithMultipleReplicasLost-seed#[D08611E34F0C267C]) [    ] o.a.s.s.SolrDispatchFilter |___/\___/_|_|    Start time: 2017-10-31T11:51:34.329Z
   [junit4]   2> 9882 INFO  (TEST-ComputePlanActionTest.testNodeWithMultipleReplicasLost-seed#[D08611E34F0C267C]) [    ] o.a.s.s.SolrDispatchFilter solr.xml found in ZooKeeper. Loading...
   [junit4]   2> 9925 INFO  (TEST-ComputePlanActionTest.testNodeWithMultipleReplicasLost-seed#[D08611E34F0C267C]) [    ] o.a.s.c.ZkContainer Zookeeper client=127.0.0.1:38221/solr
   [junit4]   2> 9982 INFO  (TEST-ComputePlanActionTest.testNodeWithMultipleReplicasLost-seed#[D08611E34F0C267C]) [n:127.0.0.1:42133_solr    ] o.a.s.c.c.ZkStateReader Updated live nodes from ZooKeeper... (0) -> (3)
   [junit4]   2> 9984 INFO  (TEST-ComputePlanActionTest.testNodeWithMultipleReplicasLost-seed#[D08611E34F0C267C]) [n:127.0.0.1:42133_solr    ] o.a.s.c.Overseer Overseer (id=null) closing
   [junit4]   2> 9987 INFO  (TEST-ComputePlanActionTest.testNodeWithMultipleReplicasLost-seed#[D08611E34F0C267C]) [n:127.0.0.1:42133_solr    ] o.a.s.c.ZkController Register node as live in ZooKeeper:/live_nodes/127.0.0.1:42133_solr
   [junit4]   2> 9988 DEBUG (OverseerStateUpdate-98923360384647171-127.0.0.1:45803_solr-n_0000000000) [n:127.0.0.1:45803_solr    ] o.a.s.c.Overseer processMessage: queueSize: 1, message = {
   [junit4]   2>   "operation":"downnode",
   [junit4]   2>   "node_name":"127.0.0.1:42133_solr"} current state version: 0
   [junit4]   2> 9988 DEBUG (OverseerStateUpdate-98923360384647171-127.0.0.1:45803_solr-n_0000000000) [n:127.0.0.1:45803_solr    ] o.a.s.c.o.NodeMutator DownNode state invoked for node: 127.0.0.1:42133_solr
   [junit4]   2> 9990 INFO  (zkCallback-20-thread-1) [    ] o.a.s.c.c.ZkStateReader Updated live nodes from ZooKeeper... (3) -> (4)
   [junit4]   2> 9991 INFO  (zkCallback-31-thread-1-processing-n:127.0.0.1:39989_solr) [n:127.0.0.1:39989_solr    ] o.a.s.c.c.ZkStateReader Updated live nodes from ZooKeeper... (3) -> (4)
   [junit4]   2> 9991 INFO  (zkCallback-14-thread-1-processing-n:127.0.0.1:45803_solr) [n:127.0.0.1:45803_solr    ] o.a.s.c.c.ZkStateReader Updated live nodes from ZooKeeper... (3) -> (4)
   [junit4]   2> 9996 INFO  (zkCallback-37-thread-1-processing-n:127.0.0.1:39375_solr) [n:127.0.0.1:39375_solr    ] o.a.s.c.c.ZkStateReader Updated live nodes from ZooKeeper... (3) -> (4)
   [junit4]   2> 10006 INFO  (zkCallback-43-thread-1-processing-n:127.0.0.1:42133_solr) [n:127.0.0.1:42133_solr    ] o.a.s.c.c.ZkStateReader Updated live nodes from ZooKeeper... (3) -> (4)
   [junit4]   2> 10210 INFO  (TEST-ComputePlanActionTest.testNodeWithMultipleReplicasLost-seed#[D08611E34F0C267C]) [n:127.0.0.1:42133_solr    ] o.a.s.m.r.SolrJmxReporter JMX monitoring for 'solr_42133.solr.node' (registry 'solr.node') enabled at server: com.sun.jmx.mbeanserver.JmxMBeanServer@477f2a6a
   [junit4]   2> 10223 INFO  (TEST-ComputePlanActionTest.testNodeWithMultipleReplicasLost-seed#[D08611E34F0C267C]) [n:127.0.0.1:42133_solr    ] o.a.s.m.r.SolrJmxReporter JMX monitoring for 'solr_42133.solr.jvm' (registry 'solr.jvm') enabled at server: com.sun.jmx.mbeanserver.JmxMBeanServer@477f2a6a
   [junit4]   2> 10224 INFO  (TEST-ComputePlanActionTest.testNodeWithMultipleReplicasLost-seed#[D08611E34F0C267C]) [n:127.0.0.1:42133_solr    ] o.a.s.m.r.SolrJmxReporter JMX monitoring for 'solr_42133.solr.jetty' (registry 'solr.jetty') enabled at server: com.sun.jmx.mbeanserver.JmxMBeanServer@477f2a6a
   [junit4]   2> 10226 INFO  (TEST-ComputePlanActionTest.testNodeWithMultipleReplicasLost-seed#[D08611E34F0C267C]) [n:127.0.0.1:42133_solr    ] o.a.s.c.CorePropertiesLocator Found 0 core definitions underneath /home/jenkins/workspace/Lucene-Solr-7.x-Linux/solr/build/solr-core/test/J0/temp/solr.cloud.autoscaling.ComputePlanActionTest_D08611E34F0C267C-001/tempDir-001/node4/.
   [junit4]   2> 10236 INFO  (OverseerCollectionConfigSetProcessor-98923360384647171-127.0.0.1:45803_solr-n_0000000000) [n:127.0.0.1:45803_solr    ] o.a.s.c.OverseerTaskQueue Response ZK path: /overseer/collection-queue-work/qnr-0000000004 doesn't exist.  Requestor may have disconnected from ZooKeeper
   [junit4]   2> 10452 INFO  (qtp700639-148) [n:127.0.0.1:42133_solr    ] o.a.s.c.c.ZkStateReader Updated live nodes from ZooKeeper... (0) -> (4)
   [junit4]   2> 10453 INFO  (qtp700639-148) [n:127.0.0.1:42133_solr    ] o.a.s.c.s.i.ZkClientClusterStateProvider Cluster at 127.0.0.1:38221/solr ready
   [junit4]   2> 10500 INFO  (qtp1698275096-103) [n:127.0.0.1:39989_solr    ] o.a.s.s.HttpSolrCall [admin] webapp=null path=/admin/metrics params={prefix=CONTAINER.fs.usableSpace,CORE.coreName&wt=javabin&version=2&group=solr.node,solr.core} status=0 QTime=1
   [junit4]   2> 10531 INFO  (qtp589889531-127) [n:127.0.0.1:39375_solr    ] o.a.s.s.HttpSolrCall [admin] webapp=null path=/admin/metrics params={prefix=CONTAINER.fs.usableSpace,CORE.coreName&wt=javabin&version=2&group=solr.node,solr.core} status=0 QTime=0
   [junit4]   2> 10544 INFO  (qtp700639-142) [n:127.0.0.1:42133_solr    ] o.a.s.s.HttpSolrCall [admin] webapp=null path=/admin/metrics params={prefix=CONTAINER.fs.usableSpace,CORE.coreName&wt=javabin&version=2&group=solr.node,solr.core} status=0 QTime=1
   [junit4]   2> 10559 INFO  (qtp1809236203-59) [n:127.0.0.1:45803_solr    ] o.a.s.s.HttpSolrCall [admin] webapp=null path=/admin/metrics params={prefix=CONTAINER.fs.usableSpace,CORE.coreName&wt=javabin&version=2&group=solr.node,solr.core} status=0 QTime=0
   [junit4]   2> 10562 DEBUG (qtp700639-148) [n:127.0.0.1:42133_solr    ] o.a.s.c.a.AutoScalingHandler Verified autoscaling configuration
   [junit4]   2> 10586 INFO  (qtp700639-148) [n:127.0.0.1:42133_solr    ] o.a.s.s.HttpSolrCall [admin] webapp=null path=/cluster/autoscaling params={wt=javabin&version=2} status=0 QTime=197
   [junit4]   2> 10586 DEBUG (zkCallback-14-thread-1-processing-n:127.0.0.1:45803_solr) [n:127.0.0.1:45803_solr    ] o.a.s.c.a.OverseerTriggerThread Refreshing /autoscaling.json with znode version 5
   [junit4]   2> 10592 DEBUG (zkCallback-14-thread-1-processing-n:127.0.0.1:45803_solr) [n:127.0.0.1:45803_solr    ] o.a.s.c.a.NodeLostTrigger Initial livenodes: [127.0.0.1:39989_solr, 127.0.0.1:42133_solr, 127.0.0.1:45803_solr, 127.0.0.1:39375_solr]
   [junit4]   2> 10594 DEBUG (OverseerAutoScalingTriggerThread-98923360384647171-127.0.0.1:45803_solr-n_0000000000) [n:127.0.0.1:45803_solr    ] o.a.s.c.a.OverseerTriggerThread Processed trigger updates upto znodeVersion 5
   [junit4]   2> 10601 INFO  (qtp589889531-124) [n:127.0.0.1:39375_solr    ] o.a.s.h.a.CollectionsHandler Invoked Collection Action :create with params replicationFactor=3&collection.configName=conf&name=testNodeWithMultipleReplicasLost&nrtReplicas=3&action=CREATE&numShards=2&wt=javabin&version=2 and sendToOCPQueue=true
   [junit4]   2> 10606 DEBUG (ScheduledTrigger-44-thread-2) [n:127.0.0.1:45803_solr    ] o.a.s.c.a.NodeLostTrigger Running NodeLostTrigger: node_lost_trigger with currently live nodes: [127.0.0.1:39989_solr, 127.0.0.1:42133_solr, 127.0.0.1:45803_solr, 127.0.0.1:39375_solr]
   [junit4]   2> 10620 DEBUG (OverseerAutoScalingTriggerThread-98923360384647171-127.0.0.1:45803_solr-n_0000000000) [n:127.0.0.1:45803_solr    ] o.a.s.c.a.OverseerTriggerThread -- clean old nodeAdded markers
   [junit4]   2> 10632 DEBUG (OverseerAutoScalingTriggerThread-98923360384647171-127.0.0.1:45803_solr-n_0000000000) [n:127.0.0.1:45803_solr    ] o.a.s.c.a.OverseerTriggerThread Current znodeVersion 5, lastZnodeVersion 5
   [junit4]   2> 10665 INFO  (OverseerThreadFactory-46-thread-4-processing-n:127.0.0.1:45803_solr) [n:127.0.0.1:45803_solr    ] o.a.s.c.CreateCollectionCmd Create collection testNodeWithMultipleReplicasLost
   [junit4]   2> 10683 INFO  (qtp589889531-122) [n:127.0.0.1:39375_solr    ] o.a.s.s.HttpSolrCall [admin] webapp=null path=/admin/metrics params={prefix=CONTAINER.fs.usableSpace,CORE.coreName&wt=javabin&version=2&group=solr.node,solr.core} status=0 QTime=0
   [junit4]   2> 10695 INFO  (qtp1698275096-98) [n:127.0.0.1:39989_solr    ] o.a.s.s.HttpSolrCall [admin] webapp=null path=/admin/metrics params={prefix=CONTAINER.fs.usableSpace,CORE.coreName&wt=javabin&version=2&group=solr.node,solr.core} status=0 QTime=0
   [junit4]   2> 10731 INFO  (qtp700639-148) [n:127.0.0.1:42133_solr    ] o.a.s.s.HttpSolrCall [admin] webapp=null path=/admin/metrics params={prefix=CONTAINER.fs.usableSpace,CORE.coreName&wt=javabin&version=2&group=solr.node,solr.core} status=0 QTime=0
   [junit4]   2> 10737 INFO  (qtp1809236203-56) [n:127.0.0.1:45803_solr    ] o.a.s.s.HttpSolrCall [admin] webapp=null path=/admin/metrics params={prefix=CONTAINER.fs.usableSpace,CORE.coreName&wt=javabin&version=2&group=solr.node,solr.core} status=0 QTime=0
   [junit4]   2> 10774 DEBUG (OverseerStateUpdate-98923360384647171-127.0.0.1:45803_solr-n_0000000000) [n:127.0.0.1:45803_solr    ] o.a.s.c.Overseer processMessage: queueSize: 1, message = {
   [junit4]   2>   "name":"testNodeWithMultipleReplicasLost",
   [junit4]   2>   "fromApi":"true",
   [junit4]   2>   "replicationFactor":"3",
   [junit4]   2>   "collection.configName":"conf",
   [junit4]   2>   "numShards":"2",
   [junit4]   2>   "nrtReplicas":"3",
   [junit4]   2>   "stateFormat":"2",
   [junit4]   2>   "operation":"create"} current state version: 0
   [junit4]   2> 10774 DEBUG (OverseerStateUpdate-98923360384647171-127.0.0.1:45803_solr-n_0000000000) [n:127.0.0.1:45803_solr    ] o.a.s.c.o.ClusterStateMutator building a new cName: testNodeWithMultipleReplicasLost
   [junit4]   2> 10779 DEBUG (OverseerStateUpdate-98923360384647171-127.0.0.1:45803_solr-n_0000000000) [n:127.0.0.1:45803_solr    ] o.a.s.c.o.ZkStateWriter going to create_collection /collections/testNodeWithMultipleReplicasLost/state.json
   [junit4]   2> 10885 DEBUG (OverseerStateUpdate-98923360384647171-127.0.0.1:45803_solr-n_0000000000) [n:127.0.0.1:45803_solr    ] o.a.s.c.Overseer processMessage: queueSize: 1, message = {
   [junit4]   2>   "operation":"ADDREPLICA",
   [junit4]   2>   "collection":"testNodeWithMultipleReplicasLost",
   [junit4]   2>   "shard":"shard1",
   [junit4]   2>   "core":"testNodeWithMultipleReplicasLost_shard1_replica_n1",
   [junit4]   2>   "state":"down",
   [junit4]   2>   "base_url":"https://127.0.0.1:45803/solr",
   [junit4]   2>   "type":"NRT",
   [junit4]   2>   "waitForFinalState":"false"} current state version: 0
   [junit4]   2> 10887 INFO  (OverseerStateUpdate-98923360384647171-127.0.0.1:45803_solr-n_0000000000) [n:127.0.0.1:45803_solr    ] o.a.s.c.o.SliceMutator createReplica() {
   [junit4]   2>   "operation":"ADDREPLICA",
   [junit4]   2>   "collection":"testNodeWithMultipleReplicasLost",
   [junit4]   2>   "shard":"shard1",
   [junit4]   2>   "core":"testNodeWithMultipleReplicasLost_shard1_replica_n1",
   [junit4]   2>   "state":"down",
   [junit4]   2>   "base_url":"https://127.0.0.1:45803/solr",
   [junit4]   2>   "type":"NRT",
   [junit4]   2>   "waitForFinalState":"false"} 
   [junit4]   2> 10892 DEBUG (OverseerStateUpdate-98923360384647171-127.0.0.1:45803_solr-n_0000000000) [n:127.0.0.1:45803_solr    ] o.a.s.c.o.SliceMutator Old Slice: shard1:{
   [junit4]   2>   "range":"80000000-ffffffff",
   [junit4]   2>   "state":"active",
   [junit4]   2>   "replicas":{}}
   [junit4]   2> 10892 DEBUG (OverseerStateUpdate-98923360384647171-127.0.0.1:45803_solr-n_0000000000) [n:127.0.0.1:45803_solr    ] o.a.s.c.o.SliceMutator New Slice: shard1:{
   [junit4]   2>   "range":"80000000-ffffffff",
   [junit4]   2>   "state":"active",
   [junit4]   2>   "replicas":{"core_node2":{
   [junit4]   2>       "core":"testNodeWithMultipleReplicasLost_shard1_replica_n1",
   [junit4]   2>       "base_url":"https://127.0.0.1:45803/solr",
   [junit4]   2>       "state":"down",
   [junit4]   2>       "node_name":null,
   [junit4]   2>       "type":"NRT"}}}
   [junit4]   2> 10895 DEBUG (OverseerStateUpdate-98923360384647171-127.0.0.1:45803_solr-n_0000000000) [n:127.0.0.1:45803_solr    ] o.a.s.c.Overseer processMessage: queueSize: 2, message = {
   [junit4]   2>   "operation":"ADDREPLICA",
   [junit4]   2>   "collection":"testNodeWithMultipleReplicasLost",
   [junit4]   2>   "shard":"shard1",
   [junit4]   2>   "core":"testNodeWithMultipleReplicasLost_shard1_replica_n3",
   [junit4]   2>   "state":"down",
   [junit4]   2>   "base_url":"https://127.0.0.1:42133/solr",
   [junit4]   2>   "type":"NRT",
   [junit4]   2>   "waitForFinalState":"false"} current state version: 0
   [junit4]   2> 10895 INFO  (OverseerStateUpdate-98923360384647171-127.0.0.1:45803_solr-n_0000000000) [n:127.0.0.1:45803_solr    ] o.a.s.c.o.SliceMutator createReplica() {
   [junit4]   2>   "operation":"ADDREPLICA",
   [junit4]   2>   "collection":"testNodeWithMultipleReplicasLost",
   [junit4]   2>   "shard":"shard1",
   [junit4]   2>   "core":"testNodeWithMultipleReplicasLost_shard1_replica_n3",
   [junit4]   2>   "state":"down",
   [junit4]   2>   "base_url":"https://127.0.0.1:42133/solr",
   [junit4]   2>   "type":"NRT",
   [junit4]   2>   "waitForFinalState":"false"} 
   [junit4]   2> 10897 DEBUG (OverseerStateUpdate-98923360384647171-127.0.0.1:45803_solr-n_0000000000) [n:127.0.0.1:45803_solr    ] o.a.s.c.o.SliceMutator Old Slice: shard1:{
   [junit4]   2>   "range":"80000000-ffffffff",
   [junit4]   2>   "state":"active",
   [junit4]   2>   "replicas":{"core_node2":{
   [junit4]   2>       "core":"testNodeWithMultipleReplicasLost_shard1_replica_n1",
   [junit4]   2>       "base_url":"https://127.0.0.1:45803/solr",
   [junit4]   2>       "state":"down",
   [junit4]   2>       "node_name":null,
   [junit4]   2>       "type":"NRT"}}}
   [junit4]   2> 10897 DEBUG (OverseerStateUpdate-98923360384647171-127.0.0.1:45803_solr-n_0000000000) [n:127.0.0.1:45803_solr    ] o.a.s.c.o.SliceMutator New Slice: shard1:{
   [junit4]   2>   "range":"80000000-ffffffff",
   [junit4]   2>   "state":"active",
   [junit4]   2>   "replicas":{
   [junit4]   2>     "core_node2":{
   [junit4]   2>       "core":"testNodeWithMultipleReplicasLost_shard1_replica_n1",
   [junit4]   2>       "base_url":"https://127.0.0.1:45803/solr",
   [junit4]   2>       "state":"down",
   [junit4]   2>       "node_name":null,
   [junit4]   2>       "type":"NRT"},
   [junit4]   2>     "core_node4":{
   [junit4]   2>       "core":"testNodeWithMultipleReplicasLost_shard1_replica_n3",
   [junit4]   2>       "base_url":"https://127.0.0.1:42133/solr",
   [junit4]   2>       "state":"down",
   [junit4]   2>       "node_name":null,
   [junit4]   2>       "type":"NRT"}}}
   [junit4]   2> 10901 DEBUG (OverseerStateUpdate-98923360384647171-127.0.0.1:45803_solr-n_0000000000) [n:127.0.0.1:45803_solr    ] o.a.s.c.Overseer processMessage: queueSize: 3, message = {
   [junit4]   2>   "operation":"ADDREPLICA",
   [junit4]   2>   "collection":"testNodeWithMultipleReplicasLost",
   [junit4]   2>   "shard":"shard1",
   [junit4]   2>   "core":"testNodeWithMultipleReplicasLost_shard1_replica_n5",
   [junit4]   2>   "state":"down",
   [junit4]   2>   "base_url":"https://127.0.0.1:39989/solr",
   [junit4]   2>   "type":"NRT",
   [junit4]   2>   "waitForFinalState":"false"} current state version: 0
   [junit4]   2> 10901 INFO  (OverseerStateUpdate-98923360384647171-127.0.0.1:45803_solr-n_0000000000) [n:127.0.0.1:45803_solr    ] o.a.s.c.o.SliceMutator createReplica() {
   [junit4]   2>   "operation":"ADDREPLICA",
   [junit4]   2>   "collection":"testNodeWithMultipleReplicasLost",
   [junit4]   2>   "shard":"shard1",
   [junit4]   2>   "core":"testNodeWithMultipleReplicasLost_shard1_replica_n5",
   [junit4]   2>   "state":"down",
   [junit4]   2>   "base_url":"https://127.0.0.1:39989/solr",
   [junit4]   2>   "type":"NRT",
   [junit4]   2>   "waitForFinalState":"false"} 
   [junit4]   2> 10904 DEBUG (OverseerStateUpdate-98923360384647171-127.0.0.1:45803_solr-n_0000000000) [n:127.0.0.1:45803_solr    ] o.a.s.c.o.SliceMutator Old Slice: shard1:{
   [junit4]   2>   "range":"80000000-ffffffff",
   [junit4]   2>   "state":"active",
   [junit4]   2>   "replicas":{
   [junit4]   2>     "core_node2":{
   [junit4]   2>       "core":"testNodeWithMultipleReplicasLost_shard1_replica_n1",
   [junit4]   2>       "base_url":"https://127.0.0.1:45803/solr",
   [junit4]   2>       "state":"down",
   [junit4]   2>       "node_name":null,
   [junit4]   2>       "type":"NRT"},
   [junit4]   2>     "core_node4":{
   [junit4]   2>       "core":"testNodeWithMultipleReplicasLost_shard1_replica_n3",
   [junit4]   2>       "base_url":"https://127.0.0.1:42133/solr",
   [junit4]   2>       "state":"down",
   [junit4]   2>       "node_name":null,
   [junit4]   2>       "type":"NRT"}}}
   [junit4]   2> 10904 DEBUG (OverseerStateUpdate-98923360384647171-127.0.0.1:45803_solr-n_0000000000) [n:127.0.0.1:45803_solr    ] o.a.s.c.o.SliceMutator New Slice: shard1:{
   [junit4]   2>   "range":"80000000-ffffffff",
   [junit4]   2>   "state":"active",
   [junit4]   2>   "replicas":{
   [junit4]   2>     "core_node2":{
   [junit4]   2>       "core":"testNodeWithMultipleReplicasLost_shard1_replica_n1",
   [junit4]   2>       "base_url":"https://127.0.0.1:45803/solr",
   [junit4]   2>       "state":"down",
   [junit4]   2>       "node_name":null,
   [junit4]   2>       "type":"NRT"},
   [junit4]   2>     "core_node4":{
   [junit4]   2>       "core":"testNodeWithMultipleReplicasLost_shard1_replica_n3",
   [junit4]   2>       "base_url":"https://127.0.0.1:42133/solr",
   [junit4]   2>       "state":"down",
   [junit4]   2>       "node_name":null,
   [junit4]   2>       "type":"NRT"},
   [junit4]   2>     "core_node7":{
   [junit4]   2>       "core":"testNodeWithMultipleReplicasLost_shard1_replica_n5",
   [junit4]   2>       "base_url":"https://127.0.0.1:39989/solr",
   [junit4]   2>       "state":"down",
   [junit4]   2>       "node_name":null,
   [junit4]   2>       "type":"NRT"}}}
   [junit4]   2> 10925 DEBUG (OverseerStateUpdate-98923360384647171-127.0.0.1:45803_solr-n_0000000000) [n:127.0.0.1:45803_solr    ] o.a.s.c.Overseer processMessage: queueSize: 4, message = {
   [junit4]   2>   "operation":"ADDREPLICA",
   [junit4]   2>   "collection":"testNodeWithMultipleReplicasLost",
   [junit4]   2>   "shard":"shard2",
   [junit4]   2>   "core":"testNodeWithMultipleReplicasLost_shard2_replica_n6",
   [junit4]   2>   "state":"down",
   [junit4]   2>   "base_url":"https://127.0.0.1:39375/solr",
   [junit4]   2>   "type":"NRT",
   [junit4]   2>   "waitForFinalState":"false"} current state version: 0
   [junit4]   2> 10925 INFO  (OverseerStateUpdate-98923360384647171-127.0.0.1:45803_solr-n_0000000000) [n:127.0.0.1:45803_solr    ] o.a.s.c.o.SliceMutator createReplica() {
   [junit4]   2>   "operation":"ADDREPLICA",
   [junit4]   2>   "collection":"testNodeWithMultipleReplicasLost",
   [junit4]   2>   "shard":"shard2",
   [junit4]   2>   "core":"testNodeWithMultipleReplicasLost_shard2_replica_n6",
   [junit4]   2>   "state":"down",
   [junit4]   2>   "base_url":"https://127.0.0.1:39375/solr",
   [junit4]   2>   "type":"NRT",
   [junit4]   2>   "waitForFinalState":"false"} 
   [junit4]   2> 10928 DEBUG (OverseerStateUpdate-98923360384647171-127.0.0.1:45803_solr-n_0000000000) [n:127.0.0.1:45803_solr    ] o.a.s.c.o.SliceMutator Old Slice: shard2:{
   [junit4]   2>   "range":"0-7fffffff",
   [junit4]   2>   "state":"active",
   [junit4]   2>   "replicas":{}}
   [junit4]   2> 10928 DEBUG (OverseerStateUpdate-98923360384647171-127.0.0.1:45803_solr-n_0000000000) [n:127.0.0.1:45803_solr    ] o.a.s.c.o.SliceMutator New Slice: shard2:{
   [junit4]   2>   "range":"0-7fffffff",
   [junit4]   2>   "state":"active",
   [junit4]   2>   "replicas":{"core_node10":{
   [junit4]   2>       "core":"testNodeWithMultipleReplicasLost_shard2_replica_n6",
   [junit4]   2>       "base_url":"https://127.0.0.1:39375/solr",
   [junit4]   2>       "state":"down",
   [junit4]   2>       "node_name":null,
   [junit4]   2>       "type":"NRT"}}}
   [junit4]   2> 10930 DEBUG (OverseerStateUpdate-98923360384647171-127.0.0.1:45803_solr-n_0000000000) [n:127.0.0.1:45803_solr    ] o.a.s.c.Overseer processMessage: queueSize: 5, message = {
   [junit4]   2>   "operation":"ADDREPLICA",
   [junit4]   2>   "collection":"testNodeWithMultipleReplicasLost",
   [junit4]   2>   "shard":"shard2",
   [junit4]   2>   "core":"testNodeWithMultipleReplicasLost_shard2_replica_n8",
   [junit4]   2>   "state":"down",
   [junit4]   2>   "base_url":"https://127.0.0.1:39989/solr",
   [junit4]   2>   "type":"NRT",
   [junit4]   2>   "waitForFinalState":"false"} current state version: 0
   [junit4]   2> 10930 INFO  (OverseerStateUpdate-98923360384647171-127.0.0.1:45803_solr-n_0000000000) [n:127.0.0.1:45803_solr    ] o.a.s.c.o.SliceMutator createReplica() {
   [junit4]   2>   "operation":"ADDREPLICA",
   [junit4]   2>   "collection":"testNodeWithMultipleReplicasLost",
   [junit4]   2>   "shard":"shard2",
   [junit4]   2>   "core":"testNodeWithMultipleReplicasLost_shard2_replica_n8",
   [junit4]   2>   "state":"down",
   [junit4]   2>   "base_url":"https://127.0.0.1:39989/solr",
   [junit4]   2>   "type":"NRT",
   [junit4]   2>   "waitForFinalState":"false"} 
   [junit4]   2> 10931 DEBUG (OverseerStateUpdate-98923360384647171-127.0.0.1:45803_solr-n_0000000000) [n:127.0.0.1:45803_solr    ] o.a.s.c.o.SliceMutator Old Slice: shard2:{
   [junit4]   2>   "range":"0-7fffffff",
   [junit4]   2>   "state":"active",
   [junit4]   2>   "replicas":{"core_node10":{
   [junit4]   2>       "core":"testNodeWithMultipleReplicasLost_shard2_replica_n6",
   [junit4]   2>       "base_url":"https://127.0.0.1:39375/solr",
   [junit4]   2>       "state":"down",
   [junit4]   2>       "node_name":null,
   [junit4]   2>       "type":"NRT"}}}
   [junit4]   2> 10931 DEBUG (OverseerStateUpdate-98923360384647171-127.0.0.1:45803_solr-n_0000000000) [n:127.0.0.1:45803_solr    ] o.a.s.c.o.SliceMutator New Slice: shard2:{
   [junit4]   2>   "range":"0-7fffffff",
   [junit4]   2>   "state":"active",
   [junit4]   2>   "replicas":{
   [junit4]   2>     "core_node10":{
   [junit4]   2>       "core":"testNodeWithMultipleReplicasLost_shard2_replica_n6",
   [junit4]   2>       "base_url":"https://127.0.0.1:39375/solr",
   [junit4]   2>       "state":"down",
   [junit4]   2>       "node_name":null,
   [junit4]   2>       "type":"NRT"},
   [junit4]   2>     "core_node11":{
   [junit4]   2>       "core":"testNodeWithMultipleReplicasLost_shard2_replica_n8",
   [junit4]   2>       "base_url":"https://127.0.0.1:39989/solr",
   [junit4]   2>       "state":"down",
   [junit4]   2>       "node_name":null,
   [junit4]   2>       "type":"NRT"}}}
   [junit4]   2> 10932 DEBUG (OverseerStateUpdate-98923360384647171-127.0.0.1:45803_solr-n_0000000000) [n:127.0.0.1:45803_solr    ] o.a.s.c.Overseer processMessage: queueSize: 6, message = {
   [junit4]   2>   "operation":"ADDREPLICA",
   [junit4]   2>   "collection":"testNodeWithMultipleReplicasLost",
   [junit4]   2>   "shard":"shard2",
   [junit4]   2>   "core":"testNodeWithMultipleReplicasLost_shard2_replica_n9",
   [junit4]   2>   "state":"down",
   [junit4]   2>   "base_url":"https://127.0.0.1:42133/solr",
   [junit4]   2>   "type":"NRT",
   [junit4]   2>   "waitForFinalState":"false"} current state version: 0
   [junit4]   2> 10932 INFO  (OverseerStateUpdate-98923360384647171-127.0.0.1:45803_solr-n_0000000000) [n:127.0.0.1:45803_solr    ] o.a.s.c.o.SliceMutator createReplica() {
   [junit4]   2>   "operation":"ADDREPLICA",
   [junit4]   2>   "collection":"testNodeWithMultipleReplicasLost",
   [junit4]   2>   "shard":"shard2",
   [junit4]   2>   "core":"testNodeWithMultipleReplicasLost_shard2_replica_n9",
   [junit4]   2>   "state":"down",
   [junit4]   2>   "base_url":"https://127.0.0.1:42133/solr",
   [junit4]   2>   "type":"NRT",
   [junit4]   2>   "waitForFinalState":"false"} 
   [junit4]   2> 10933 DEBUG (OverseerStateUpdate-98923360384647171-127.0.0.1:45803_solr-n_0000000000) [n:127.0.0.1:45803_solr    ] o.a.s.c.o.SliceMutator Old Slice: shard2:{
   [junit4]   2>   "range":"0-7fffffff",
   [junit4]   2>   "state":"active",
   [junit4]   2>   "replicas":{
   [junit4]   2>     "core_node10":{
   [junit4]   2>       "core":"testNodeWithMultipleReplicasLost_shard2_replica_n6",
   [junit4]   2>       "base_url":"https://127.0.0.1:39375/solr",
   [junit4]   2>       "state":"down",
   [junit4]   2>       "node_name":null,
   [junit4]   2>       "type":"NRT"},
   [junit4]   2>     "core_node11":{
   [junit4]   2>       "core":"testNodeWithMultipleReplicasLost_shard2_replica_n8",
   [junit4]   2>       "base_url":"https://127.0.0.1:39989/solr",
   [junit4]   2>       "state":"down",
   [junit4]   2>       "node_name":null,
   [junit4]   2>       "type":"NRT"}}}
   [junit4]   2> 10934 DEBUG (OverseerStateUpdate-98923360384647171-127.0.0.1:45803_solr-n_0000000000) [n:127.0.0.1:45803_solr    ] o.a.s.c.o.SliceMutator New Slice: shard2:{
   [junit4]   2>   "range":"0-7fffffff",
   [junit4]   2>   "state":"active",
   [junit4]   2>   "replicas":{
   [junit4]   2>     "core_node10":{
   [junit4]   2>       "core":"testNodeWithMultipleReplicasLost_shard2_replica_n6",
   [junit4]   2>       "base_url":"https://127.0.0.1:39375/solr",
   [junit4]   2>       "state":"down",
   [junit4]   2>       "node_name":null,
   [junit4]   2>       "type":"NRT"},
   [junit4]   2>     "core_node11":{
   [junit4]   2>       "core":"testNodeWithMultipleReplicasLost_shard2_replica_n8",
   [junit4]   2>       "base_url":"https://127.0.0.1:39989/solr",
   [junit4]   2>       "state":"down",
   [junit4]   2>       "node_name":null,
   [junit4]   2>       "type":"NRT"},
   [junit4]   2>     "core_node12":{
   [junit4]   2>       "core":"testNodeWithMultipleReplicasLost_shard2_replica_n9",
   [junit4]   2>       "base_url":"https://127.0.0.1:42133/solr",
   [junit4]   2>       "state":"down",
   [junit4]   2>       "node_name":null,
   [junit4]   2>       "type":"NRT"}}}
   [junit4]   2> 11035 DEBUG (OverseerStateUpdate-98923360384647171-127.0.0.1:45803_solr-n_0000000000) [n:127.0.0.1:45803_solr    ] o.a.s.c.o.ZkStateWriter going to update_collection /collections/testNodeWithMultipleReplicasLost/state.json version: 0
   [junit4]   2> 11155 INFO  (qtp700639-144) [n:127.0.0.1:42133_solr    ] o.a.s.h.a.CoreAdminOperation core create command qt=/admin/cores&coreNodeName=core_node4&collection.configName=conf&newCollection=true&name=testNodeWithMultipleReplicasLost_shard1_replica_n3&action=CREATE&numShards=2&collection=testNodeWithMultipleReplicasLost&shard=shard1&wt=javabin&version=2&replicaType=NRT
   [junit4]   2> 11156 INFO  (qtp1809236203-53) [n:127.0.0.1:45803_solr    ] o.a.s.h.a.CoreAdminOperation core create command qt=/admin/cores&coreNodeName=core_node2&collection.configName=conf&newCollection=true&name=testNodeWithMultipleReplicasLost_shard1_replica_n1&action=CREATE&numShards=2&collection=testNodeWithMultipleReplicasLost&shard=shard1&wt=javabin&version=2&replicaType=NRT
   [junit4]   2> 11163 INFO  (qtp1698275096-99) [n:127.0.0.1:39989_solr    ] o.a.s.h.a.CoreAdminOperation core create command qt=/admin/cores&coreNodeName=core_node7&collection.configName=conf&newCollection=true&name=testNodeWithMultipleReplicasLost_shard1_replica_n5&action=CREATE&numShards=2&collection=testNodeWithMultipleReplicasLost&shard=shard1&wt=javabin&version=2&replicaType=NRT
   [junit4]   2> 11159 INFO  (qtp700639-144) [n:127.0.0.1:42133_solr    ] o.a.s.c.TransientSolrCoreCacheDefault Allocating transient cache for 2147483647 transient cores
   [junit4]   2> 11171 INFO  (qtp589889531-123) [n:127.0.0.1:39375_solr    ] o.a.s.h.a.CoreAdminOperation core create command qt=/admin/cores&coreNodeName=core_node10&collection.configName=conf&newCollection=true&name=testNodeWithMultipleReplicasLost_shard2_replica_n6&action=CREATE&numShards=2&collection=testNodeWithMultipleReplicasLost&shard=shard2&wt=javabin&version=2&replicaType=NRT
   [junit4]   2> 11172 INFO  (qtp589889531-123) [n:127.0.0.1:39375_solr    ] o.a.s.c.TransientSolrCoreCacheDefault Allocating transient cache for 2147483647 transient cores
   [junit4]   2> 11172 INFO  (qtp1809236203-53) [n:127.0.0.1:45803_solr    ] o.a.s.c.TransientSolrCoreCacheDefault Allocating transient cache for 2147483647 transient cores
   [junit4]   2> 11179 INFO  (qtp1698275096-99) [n:127.0.0.1:39989_solr    ] o.a.s.c.TransientSolrCoreCacheDefault Allocating transient cache for 2147483647 transient cores
   [junit4]   2> 11197 DEBUG (OverseerStateUpdate-98923360384647171-127.0.0.1:45803_solr-n_0000000000) [n:127.0.0.1:45803_solr    ] o.a.s.c.Overseer processMessage: queueSize: 1, message = {
   [junit4]   2>   "core":"testNodeWithMultipleReplicasLost_shard1_replica_n3",
   [junit4]   2>   "core_node_name":"core_node4",
   [junit4]   2>   "roles":null,
   [junit4]   2>   "base_url":"https://127.0.0.1:42133/solr",
   [junit4]   2>   "node_name":"127.0.0.1:42133_solr",
   [junit4]   2>   "numShards":"2",
   [junit4]   2>   "state":"down",
   [junit4]   2>   "shard":"shard1",
   [junit4]   2>   "collection":"testNodeWithMultipleReplicasLost",
   [junit4]   2>   "type":"NRT",
   [junit4]   2>   "operation":"state"} current state version: 0
   [junit4]   2> 11199 DEBUG (OverseerStateUpdate-98923360384647171-127.0.0.1:45803_solr-n_0000000000) [n:127.0.0.1:45803_solr    ] o.a.s.c.o.ReplicaMutator Update state numShards=2 message={
   [junit4]   2>   "core":"testNodeWithMultipleReplicasLost_shard1_replica_n3",
   [junit4]   2>   "core_node_name":"core_node4",
   [junit4]   2>   "roles":null,
   [junit4]   2>   "base_url":"https://127.0.0.1:42133/solr",
   [junit4]   2>   "node_name":"127.0.0.1:42133_solr",
   [junit4]   2>   "numShards":"2",
   [junit4]   2>   "state":"down",
   [junit4]   2>   "shard":"shard1",
   [junit4]   2>   "collection":"testNodeWithMultipleReplicasLost",
   [junit4]   2>   "type":"NRT",
   [junit4]   2>   "operation":"state"}
   [junit4]   2> 11199 DEBUG (OverseerStateUpdate-98923360384647171-127.0.0.1:45803_solr-n_0000000000) [n:127.0.0.1:45803_solr    ] o.a.s.c.o.ReplicaMutator Will update state for replica: core_node4:{"core":"testNodeWithMultipleReplicasLost_shard1_replica_n3","base_url":"https://127.0.0.1:42133/solr","node_name":"127.0.0.1:42133_solr","state":"down","type":"NRT"}
   [junit4]   2> 11199 DEBUG (OverseerStateUpdate-98923360384647171-127.0.0.1:45803_solr-n_0000000000) [n:127.0.0.1:45803_solr    ] o.a.s.c.o.ReplicaMutator Collection is now: DocCollection(testNodeWithMultipleReplicasLost//collections/testNodeWithMultipleReplicasLost/state.json/1)={
   [junit4]   2>   "pullReplicas":"0",
   [junit4]   2>   "replicationFactor":"3",
   [junit4]   2>   "router":{"name":"compositeId"},
   [junit4]   2>   "maxShardsPerNode":"1",
   [junit4]   2>   "autoAddReplicas":"false",
   [junit4]   2>   "nrtReplicas":"3",
   [junit4]   2>   "tlogReplicas":"0",
   [junit4]   2>   "shards":{
   [junit4]   2>     "shard1":{
   [junit4]   2>       "range":"80000000-ffffffff",
   [junit4]   2>       "state":"active",
   [junit4]   2>       "replicas":{
   [junit4]   2>         "core_node2":{
   [junit4]   2>           "core":"testNodeWithMultipleReplicasLost_shard1_replica_n1",
   [junit4]   2>           "base_url":"https://127.0.0.1:45803/solr",
   [junit4]   2>           "state":"down",
   [junit4]   2>           "node_name":null,
   [junit4]   2>           "type":"NRT"},
   [junit4]   2>         "core_node4":{
   [junit4]   2>           "core":"testNodeWithMultipleReplicasLost_shard1_replica_n3",
   [junit4]   2>           "base_url":"https://127.0.0.1:42133/solr",
   [junit4]   2>           "node_name":"127.0.0.1:42133_solr",
   [junit4]   2>           "state":"down",
   [junit4]   2>           "type":"NRT"},
   [junit4]   2>         "core_node7":{
   [junit4]   2>           "core":"testNodeWithMultipleReplicasLost_shard1_replica_n5",
   [junit4]   2>           "base_url":"https://127.0.0.1:39989/solr",
   [junit4]   2>           "state":"down",
   [junit4]   2>           "node_name":null,
   [junit4]   2>           "type":"NRT"}}},
   [junit4]   2>     "shard2":{
   [junit4]   2>       "range":"0-7fffffff",
   [junit4]   2>       "state":"active",
   [junit4]   2>       "replicas":{
   [junit4]   2>         "core_node10":{
   [junit4]   2>           "core":"testNodeWithMultipleReplicasLost_shard2_replica_n6",
   [junit4]   2>           "base_url":"https://127.0.0.1:39375/solr",
   [junit4]   2>           "state":"down",
   [junit4]   2>           "node_name":null,
   [junit4]   2>           "type":"NRT"},
   [junit4]   2>         "core_node11":{
   [junit4]   2>           "core":"testNodeWithMultipleReplicasLost_shard2_replica_n8",
   [junit4]   2>           "base_url":"https://127.0.0.1:39989/solr",
   [junit4]   2>           "state":"down",
   [junit4]   2>           "node_name":null,
   [junit4]   2>           "type":"NRT"},
   [junit4]   2>         "core_node12":{
   [junit4]   2>           "core":"testNodeWithMultipleReplicasLost_shard2_replica_n9",
   [junit4]   2>           "base_url":"https://127.0.0.1:42133/solr",
   [junit4]   2>           "state":"down",
   [junit4]   2>           "node_name":null,
   [junit4]   2>           "type":"NRT"}}}}}
   [junit4]   2> 11257 INFO  (qtp1698275096-105) [n:127.0.0.1:39989_solr    ] o.a.s.h.a.CoreAdminOperation core create command qt=/admin/cores&coreNodeName=core_node11&collection.configName=conf&newCollection=true&name=testNodeWithMultipleReplicasLost_shard2_replica_n8&action=CREATE&numShards=2&collection=testNodeWithMultipleReplicasLost&shard=shard2&wt=javabin&version=2&replicaType=NRT
   [junit4]   2> 11263 INFO  (qtp700639-143) [n:127.0.0.1:42133_solr    ] o.a.s.h.a.CoreAdminOperation core create command qt=/admin/cores&coreNodeName=core_node12&collection.configName=conf&newCollection=true&name=testNodeWithMultipleReplicasLost_shard2_replica_n9&action=CREATE&numShards=2&collection=testNodeWithMultipleReplicasLost&shard=shard2&wt=javabin&version=2&replicaType=NRT
   [junit4]   2> 11278 DEBUG (OverseerStateUpdate-98923360384647171-127.0.0.1:45803_solr-n_0000000000) [n:127.0.0.1:45803_solr    ] o.a.s.c.Overseer processMessage: queueSize: 4, message = {
   [junit4]   2>   "core":"testNodeWithMultipleReplicasLost_shard2_replica_n6",
   [junit4]   2>   "core_node_name":"core_node10",
   [junit4]   2>   "roles":null,
   [junit4]   2>   "base_url":"https://127.0.0.1:39375/solr",
   [junit4]   2>   "node_name":"127.0.0.1:39375_solr",
   [junit4]   2>   "numShards":"2",
   [junit4]   2>   "state":"down",
   [junit4]   2>   "shard":"shard2",
   [junit4]   2>   "collection":"testNodeWithMultipleReplicasLost",
   [junit4]   2>   "type":"NRT",
   [junit4]   2>   "operation":"state"} current state version: 0
   [junit4]   2> 11279 DEBUG (OverseerStateUpdate-98923360384647171-127.0.0.1:45803_solr-n_0000000000) [n:127.0.0.1:45803_solr    ] o.a.s.c.o.ReplicaMutator Update state numShards=2 message={
   [junit4]   2>   "core":"testNodeWithMultipleReplicasLost_shard2_replica_n6",
   [junit4]   2>   "core_node_name":"core_node10",
   [junit4]   2>   "roles":null,
   [junit4]   2>   "base_url":"https://127.0.0.1:39375/solr",
   [junit4]   2>   "node_name":"127.0.0.1:39375_solr",
   [junit4]   2>   "numShards":"2",
   [junit4]   2>   "state":"down",
   [junit4]   2>   "shard":"shard2",
   [junit4]   2>   "collection":"testNodeWithMultipleReplicasLost",
   [junit4]   2>   "type":"NRT",
   [junit4]   2>   "operation":"state"}
   [junit4]   2> 11279 DEBUG (OverseerStateUpdate-98923360384647171-127.0.0.1:45803_solr-n_0000000000) [n:127.0.0.1:45803_solr    ] o.a.s.c.o.ReplicaMutator Will update state for replica: core_node10:{"core":"testNodeWithMultipleReplicasLost_shard2_replica_n6","base_url":"https://127.0.0.1:39375/solr","node_name":"127.0.0.1:39375_solr","state":"down","type":"NRT"}
   [junit4]   2> 11279 DEBUG (OverseerStateUpdate-98923360384647171-127.0.0.1:45803_solr-n_0000000000) [n:127.0.0.1:45803_solr    ] o.a.s.c.o.ReplicaMutator Collection is now: DocCollection(testNodeWithMultipleReplicasLost//collections/testNodeWithMultipleReplicasLost/state.json/1)={
   [junit4]   2>   "pullReplicas":"0",
   [junit4]   2>   "replicationFactor":"3",
   [junit4]   2>   "router":{"name":"compositeId"},
   [junit4]   2>   "maxShardsPerNode":"1",
   [junit4]   2>   "autoAddReplicas":"false",
   [junit4]   2>   "nrtReplicas":"3",
   [junit4]   2>   "tlogReplicas":"0",
   [junit4]   2>   "shards":{
   [junit4]   2>     "shard1":{
   [junit4]   2>       "range":"80000000-ffffffff",
   [junit4]   2>       "state":"active",
   [junit4]   2>       "replicas":{
   [junit4]   2>         "core_node2":{
   [junit4]   2>           "core":"testNodeWithMultipleReplicasLost_shard1_replica_n1",
   [junit4]   2>           "base_url":"https://127.0.0.1:45803/solr",
   [junit4]   2>           "state":"down",
   [junit4]   2>           "node_name":null,
   [junit4]   2>           "type":"NRT"},
   [junit4]   2>         "core_node4":{
   [junit4]   2>           "core":"testNodeWithMultipleReplicasLost_shard1_replica_n3",
   [junit4]   2>           "base_url":"https://127.0.0.1:42133/solr",
   [junit4]   2>           "node_name":"127.0.0.1:42133_solr",
   [junit4]   2>           "state":"down",
   [junit4]   2>           "type":"NRT"},
   [junit4]   2>         "core_node7":{
   [junit4]   2>           "core":"testNodeWithMultipleReplicasLost_shard1_replica_n5",
   [junit4]   2>           "base_url":"https://127.0.0.1:39989/solr",
   [junit4]   2>           "state":"down",
   [junit4]   2>           "node_name":null,
   [junit4]   2>           "type":"NRT"}}},
   [junit4]   2>     "shard2":{
   [junit4]   2>       "range":"0-7fffffff",
   [junit4]   2>       "state":"active",
   [junit4]   2>       "replicas":{
   [junit4]   2>         "core_node10":{
   [junit4]   2>           "core":"testNodeWithMultipleReplicasLost_shard2_replica_n6",
   [junit4]   2>           "base_url":"https://127.0.0.1:39375/solr",
   [junit4]   2>           "node_name":"127.0.0.1:39375_solr",
   [junit4]   2>           "state":"down",
   [junit4]   2>           "type":"NRT"},
   [junit4]   2>         "core_node11":{
   [junit4]   2>           "core":"testNodeWithMultipleReplicasLost_shard2_replica_n8",
   [junit4]   2>           "base_url":"https://127.0.0.1:39989/solr",
   [junit4]   2>           "state":"down",
   [junit4]   2>           "node_name":null,
   [junit4]   2>           "type":"NRT"},
   [junit4]   2>         "core_node12":{
   [junit4]   2>           "core":"testNodeWithMultipleReplicasLost_shard2_replica_n9",
   [junit4]   2>           "base_url":"https://127.0.0.1:42133/solr",
   [junit4]   2>           "state":"down",
   [junit4]   2>           "node_name":null,
   [junit4]   2>           "type":"NRT"}}}}}
   [junit4]   2> 11279 DEBUG (OverseerStateUpdate-98923360384647171-127.0.0.1:45803_solr-n_0000000000) [n:127.0.0.1:45803_solr    ] o.a.s.c.Overseer processMessage: queueSize: 4, message = {
   [junit4]   2>   "cor

[...truncated too long message...]

x:collection3] o.a.s.SolrTestCaseJ4 ###deleteCore
   [junit4]   2> 2043718 INFO  (SUITE-TestLazyCores-seed#[D08611E34F0C267C]-worker) [    x:collection3] o.a.s.c.CoreContainer Shutting down CoreContainer instance=1818749051
   [junit4]   2> 2043718 INFO  (SUITE-TestLazyCores-seed#[D08611E34F0C267C]-worker) [    x:collection3] o.a.s.m.SolrMetricManager Closing metric reporters for registry=solr.node, tag=null
   [junit4]   2> 2043718 INFO  (SUITE-TestLazyCores-seed#[D08611E34F0C267C]-worker) [    x:collection3] o.a.s.m.SolrMetricManager Closing metric reporters for registry=solr.jvm, tag=null
   [junit4]   2> 2043719 INFO  (SUITE-TestLazyCores-seed#[D08611E34F0C267C]-worker) [    x:collection3] o.a.s.m.SolrMetricManager Closing metric reporters for registry=solr.jetty, tag=null
   [junit4]   2> NOTE: leaving temporary files on disk at: /home/jenkins/workspace/Lucene-Solr-7.x-Linux/solr/build/solr-core/test/J0/temp/solr.core.TestLazyCores_D08611E34F0C267C-001
   [junit4]   2> Oct 31, 2017 12:25:28 PM com.carrotsearch.randomizedtesting.ThreadLeakControl checkThreadLeaks
   [junit4]   2> WARNING: Will linger awaiting termination of 1 leaked thread(s).
   [junit4]   2> Oct 31, 2017 12:25:48 PM com.carrotsearch.randomizedtesting.ThreadLeakControl checkThreadLeaks
   [junit4]   2> SEVERE: 1 thread leaked from SUITE scope at org.apache.solr.core.TestLazyCores: 
   [junit4]   2>    1) Thread[id=13129, name=searcherExecutor-4976-thread-1, state=WAITING, group=TGRP-TestLazyCores]
   [junit4]   2>         at sun.misc.Unsafe.park(Native Method)
   [junit4]   2>         at java.util.concurrent.locks.LockSupport.park(LockSupport.java:175)
   [junit4]   2>         at java.util.concurrent.locks.AbstractQueuedSynchronizer$ConditionObject.await(AbstractQueuedSynchronizer.java:2039)
   [junit4]   2>         at java.util.concurrent.LinkedBlockingQueue.take(LinkedBlockingQueue.java:442)
   [junit4]   2>         at java.util.concurrent.ThreadPoolExecutor.getTask(ThreadPoolExecutor.java:1074)
   [junit4]   2>         at java.util.concurrent.ThreadPoolExecutor.runWorker(ThreadPoolExecutor.java:1134)
   [junit4]   2>         at java.util.concurrent.ThreadPoolExecutor$Worker.run(ThreadPoolExecutor.java:624)
   [junit4]   2>         at java.lang.Thread.run(Thread.java:748)
   [junit4]   2> Oct 31, 2017 12:25:48 PM com.carrotsearch.randomizedtesting.ThreadLeakControl tryToInterruptAll
   [junit4]   2> INFO: Starting to interrupt leaked threads:
   [junit4]   2>    1) Thread[id=13129, name=searcherExecutor-4976-thread-1, state=WAITING, group=TGRP-TestLazyCores]
   [junit4]   2> Oct 31, 2017 12:25:51 PM com.carrotsearch.randomizedtesting.ThreadLeakControl tryToInterruptAll
   [junit4]   2> SEVERE: There are still zombie threads that couldn't be terminated:
   [junit4]   2>    1) Thread[id=13129, name=searcherExecutor-4976-thread-1, state=WAITING, group=TGRP-TestLazyCores]
   [junit4]   2>         at sun.misc.Unsafe.park(Native Method)
   [junit4]   2>         at java.util.concurrent.locks.LockSupport.park(LockSupport.java:175)
   [junit4]   2>         at java.util.concurrent.locks.AbstractQueuedSynchronizer$ConditionObject.await(AbstractQueuedSynchronizer.java:2039)
   [junit4]   2>         at java.util.concurrent.LinkedBlockingQueue.take(LinkedBlockingQueue.java:442)
   [junit4]   2>         at java.util.concurrent.ThreadPoolExecutor.getTask(ThreadPoolExecutor.java:1074)
   [junit4]   2>         at java.util.concurrent.ThreadPoolExecutor.runWorker(ThreadPoolExecutor.java:1134)
   [junit4]   2>         at java.util.concurrent.ThreadPoolExecutor$Worker.run(ThreadPoolExecutor.java:624)
   [junit4]   2>         at java.lang.Thread.run(Thread.java:748)
   [junit4]   2> NOTE: test params are: codec=FastCompressingStoredFields(storedFieldsFormat=CompressingStoredFieldsFormat(compressionMode=FAST, chunkSize=31514, maxDocsPerChunk=5, blockSize=8), termVectorsFormat=CompressingTermVectorsFormat(compressionMode=FAST, chunkSize=31514, blockSize=8)), sim=RandomSimilarity(queryNorm=true): {}, locale=es-PR, timezone=Europe/Luxembourg
   [junit4]   2> NOTE: Linux 4.10.0-37-generic amd64/Oracle Corporation 1.8.0_144 (64-bit)/cpus=8,threads=2,free=286606400,total=536870912
   [junit4]   2> NOTE: All tests run in this JVM: [SolrMetricsIntegrationTest, TestDFRSimilarityFactory, ComputePlanActionTest, VersionInfoTest, CurrencyFieldTypeTest, TestIBSimilarityFactory, TestUpdate, UpdateRequestProcessorFactoryTest, TestPayloadScoreQParserPlugin, DeleteInactiveReplicaTest, TestChildDocTransformer, SearchHandlerTest, TestFieldSortValues, TestCoreAdminApis, TestConfigSetsAPIExclusivity, StressHdfsTest, TestLeaderElectionZkExpiry, AutoAddReplicasIntegrationTest, TestJavabinTupleStreamParser, TestDFISimilarityFactory, TolerantUpdateProcessorTest, TestAuthorizationFramework, DistributedFacetPivotSmallAdvancedTest, TestCSVLoader, MultiThreadedOCPTest, JsonLoaderTest, TestComplexPhraseLeadingWildcard, DirectUpdateHandlerOptimizeTest, AnalyticsMergeStrategyTest, TestSlowCompositeReaderWrapper, TestFieldCacheReopen, SolrJmxReporterCloudTest, TestNumericTerms32, TestNumericRangeQuery32, PeerSyncReplicationTest, TestSolrJ, TestConfig, TestInPlaceUpdatesDistrib, LeaderElectionIntegrationTest, QueryResultKeyTest, TestHttpShardHandlerFactory, TestBinaryField, BaseCdcrDistributedZkTest, TestSimpleTextCodec, TestTrieFacet, TestRestManager, TestJoin, TestRandomDVFaceting, SolrCoreTest, EnumFieldTest, SliceStateTest, DateFieldTest, TestSuggestSpellingConverter, TestFieldCacheVsDocValues, TestMergePolicyConfig, TestOrdValues, SuggestComponentTest, TestPHPSerializedResponseWriter, TestApiFramework, CachingDirectoryFactoryTest, TestRandomFaceting, TestExclusionRuleCollectionAccess, SparseHLLTest, AtomicUpdatesTest, URLClassifyProcessorTest, TestRandomFlRTGCloud, BigEndianAscendingWordSerializerTest, TestSweetSpotSimilarityFactory, TriggerIntegrationTest, DirectoryFactoryTest, TestReloadDeadlock, HdfsTlogReplayBufferedWhileIndexingTest, DistributedQueueTest, TestSubQueryTransformerDistrib, IgnoreCommitOptimizeUpdateProcessorFactoryTest, TestUtils, TestSolrConfigHandlerCloud, RAMDirectoryFactoryTest, TestAuthenticationFramework, TestWordDelimiterFilterFactory, TestDistributedSearch, FastVectorHighlighterTest, V2ApiIntegrationTest, TestBadConfig, TestFastOutputStream, TestSha256AuthenticationProvider, TestSolrDeletionPolicy1, SimpleFacetsTest, HdfsRestartWhileUpdatingTest, TestCloudJSONFacetJoinDomain, DateMathParserTest, TestPhraseSuggestions, SolrCoreMetricManagerTest, SearchRateTriggerTest, ReplaceNodeTest, TestCloudManagedSchema, DistributedQueryElevationComponentTest, BasicZkTest, SoftAutoCommitTest, BasicFunctionalityTest, TestStressVersions, TestSolrCloudSnapshots, ForceLeaderTest, SearchHandlerTest, HdfsChaosMonkeyNothingIsSafeTest, SolrCloudReportersTest, TermsComponentTest, FullHLLTest, StatelessScriptUpdateProcessorFactoryTest, TestIndexingPerformance, DistribCursorPagingTest, TestDocBasedVersionConstraints, TestCloudRecovery, SolrPluginUtilsTest, TestLegacyNumericUtils, TestDeleteCollectionOnDownNodes, NoCacheHeaderTest, TestSort, AnalysisAfterCoreReloadTest, AddBlockUpdateTest, TestRealTimeGet, TestStressReorder, TestReload, DistributedTermsComponentTest, StatsComponentTest, TestGroupingSearch, BadIndexSchemaTest, TestFunctionQuery, TestLazyCores]
   [junit4]   2> NOTE: reproduce with: ant test  -Dtestcase=TestLazyCores -Dtests.seed=D08611E34F0C267C -Dtests.multiplier=3 -Dtests.slow=true -Dtests.locale=es-PR -Dtests.timezone=Europe/Luxembourg -Dtests.asserts=true -Dtests.file.encoding=US-ASCII
   [junit4] ERROR   0.00s J0 | TestLazyCores (suite) <<<
   [junit4]    > Throwable #1: com.carrotsearch.randomizedtesting.ThreadLeakError: 1 thread leaked from SUITE scope at org.apache.solr.core.TestLazyCores: 
   [junit4]    >    1) Thread[id=13129, name=searcherExecutor-4976-thread-1, state=WAITING, group=TGRP-TestLazyCores]
   [junit4]    >         at sun.misc.Unsafe.park(Native Method)
   [junit4]    >         at java.util.concurrent.locks.LockSupport.park(LockSupport.java:175)
   [junit4]    >         at java.util.concurrent.locks.AbstractQueuedSynchronizer$ConditionObject.await(AbstractQueuedSynchronizer.java:2039)
   [junit4]    >         at java.util.concurrent.LinkedBlockingQueue.take(LinkedBlockingQueue.java:442)
   [junit4]    >         at java.util.concurrent.ThreadPoolExecutor.getTask(ThreadPoolExecutor.java:1074)
   [junit4]    >         at java.util.concurrent.ThreadPoolExecutor.runWorker(ThreadPoolExecutor.java:1134)
   [junit4]    >         at java.util.concurrent.ThreadPoolExecutor$Worker.run(ThreadPoolExecutor.java:624)
   [junit4]    >         at java.lang.Thread.run(Thread.java:748)
   [junit4]    > 	at __randomizedtesting.SeedInfo.seed([D08611E34F0C267C]:0)Throwable #2: com.carrotsearch.randomizedtesting.ThreadLeakError: There are still zombie threads that couldn't be terminated:
   [junit4]    >    1) Thread[id=13129, name=searcherExecutor-4976-thread-1, state=WAITING, group=TGRP-TestLazyCores]
   [junit4]    >         at sun.misc.Unsafe.park(Native Method)
   [junit4]    >         at java.util.concurrent.locks.LockSupport.park(LockSupport.java:175)
   [junit4]    >         at java.util.concurrent.locks.AbstractQueuedSynchronizer$ConditionObject.await(AbstractQueuedSynchronizer.java:2039)
   [junit4]    >         at java.util.concurrent.LinkedBlockingQueue.take(LinkedBlockingQueue.java:442)
   [junit4]    >         at java.util.concurrent.ThreadPoolExecutor.getTask(ThreadPoolExecutor.java:1074)
   [junit4]    >         at java.util.concurrent.ThreadPoolExecutor.runWorker(ThreadPoolExecutor.java:1134)
   [junit4]    >         at java.util.concurrent.ThreadPoolExecutor$Worker.run(ThreadPoolExecutor.java:624)
   [junit4]    >         at java.lang.Thread.run(Thread.java:748)
   [junit4]    > 	at __randomizedtesting.SeedInfo.seed([D08611E34F0C267C]:0)
   [junit4] Completed [420/745 (2!)] on J0 in 32.23s, 9 tests, 3 errors <<< FAILURES!

[...truncated 48289 lines...]

Mime
View raw message