lucene-dev mailing list archives

Site index · List index
Message view « Date » · « Thread »
Top « Date » · « Thread »
From Policeman Jenkins Server <jenk...@thetaphi.de>
Subject [JENKINS] Lucene-Solr-master-Linux (64bit/jdk1.8.0_144) - Build # 20639 - Still unstable!
Date Mon, 09 Oct 2017 10:48:16 GMT
Build: https://jenkins.thetaphi.de/job/Lucene-Solr-master-Linux/20639/
Java: 64bit/jdk1.8.0_144 -XX:-UseCompressedOops -XX:+UseG1GC

1 tests failed.
FAILED:  org.apache.solr.cloud.TestAuthenticationFramework.testBasics

Error Message:
Error from server at https://127.0.0.1:41495/solr/testcollection_shard1_replica_n3: Expected mime type application/octet-stream but got text/html. <html> <head> <meta http-equiv="Content-Type" content="text/html;charset=ISO-8859-1"/> <title>Error 404 </title> </head> <body> <h2>HTTP ERROR: 404</h2> <p>Problem accessing /solr/testcollection_shard1_replica_n3/update. Reason: <pre>    Can not find: /solr/testcollection_shard1_replica_n3/update</pre></p> <hr /><a href="http://eclipse.org/jetty">Powered by Jetty:// 9.3.20.v20170531</a><hr/> </body> </html> 

Stack Trace:
org.apache.solr.client.solrj.impl.CloudSolrClient$RouteException: Error from server at https://127.0.0.1:41495/solr/testcollection_shard1_replica_n3: Expected mime type application/octet-stream but got text/html. <html>
<head>
<meta http-equiv="Content-Type" content="text/html;charset=ISO-8859-1"/>
<title>Error 404 </title>
</head>
<body>
<h2>HTTP ERROR: 404</h2>
<p>Problem accessing /solr/testcollection_shard1_replica_n3/update. Reason:
<pre>    Can not find: /solr/testcollection_shard1_replica_n3/update</pre></p>
<hr /><a href="http://eclipse.org/jetty">Powered by Jetty:// 9.3.20.v20170531</a><hr/>
</body>
</html>

	at __randomizedtesting.SeedInfo.seed([7A8D8D9AC81CD729:475523B6F0F28959]:0)
	at org.apache.solr.client.solrj.impl.CloudSolrClient.directUpdate(CloudSolrClient.java:539)
	at org.apache.solr.client.solrj.impl.CloudSolrClient.sendRequest(CloudSolrClient.java:993)
	at org.apache.solr.client.solrj.impl.CloudSolrClient.requestWithRetryOnStaleState(CloudSolrClient.java:862)
	at org.apache.solr.client.solrj.impl.CloudSolrClient.request(CloudSolrClient.java:793)
	at org.apache.solr.client.solrj.SolrRequest.process(SolrRequest.java:178)
	at org.apache.solr.client.solrj.request.UpdateRequest.commit(UpdateRequest.java:233)
	at org.apache.solr.cloud.TestAuthenticationFramework.collectionCreateSearchDeleteTwice(TestAuthenticationFramework.java:126)
	at org.apache.solr.cloud.TestAuthenticationFramework.testBasics(TestAuthenticationFramework.java:74)
	at sun.reflect.NativeMethodAccessorImpl.invoke0(Native Method)
	at sun.reflect.NativeMethodAccessorImpl.invoke(NativeMethodAccessorImpl.java:62)
	at sun.reflect.DelegatingMethodAccessorImpl.invoke(DelegatingMethodAccessorImpl.java:43)
	at java.lang.reflect.Method.invoke(Method.java:498)
	at com.carrotsearch.randomizedtesting.RandomizedRunner.invoke(RandomizedRunner.java:1737)
	at com.carrotsearch.randomizedtesting.RandomizedRunner$8.evaluate(RandomizedRunner.java:934)
	at com.carrotsearch.randomizedtesting.RandomizedRunner$9.evaluate(RandomizedRunner.java:970)
	at com.carrotsearch.randomizedtesting.RandomizedRunner$10.evaluate(RandomizedRunner.java:984)
	at com.carrotsearch.randomizedtesting.rules.SystemPropertiesRestoreRule$1.evaluate(SystemPropertiesRestoreRule.java:57)
	at org.apache.lucene.util.TestRuleSetupTeardownChained$1.evaluate(TestRuleSetupTeardownChained.java:49)
	at org.apache.lucene.util.AbstractBeforeAfterRule$1.evaluate(AbstractBeforeAfterRule.java:45)
	at org.apache.lucene.util.TestRuleThreadAndTestName$1.evaluate(TestRuleThreadAndTestName.java:48)
	at org.apache.lucene.util.TestRuleIgnoreAfterMaxFailures$1.evaluate(TestRuleIgnoreAfterMaxFailures.java:64)
	at org.apache.lucene.util.TestRuleMarkFailure$1.evaluate(TestRuleMarkFailure.java:47)
	at com.carrotsearch.randomizedtesting.rules.StatementAdapter.evaluate(StatementAdapter.java:36)
	at com.carrotsearch.randomizedtesting.ThreadLeakControl$StatementRunner.run(ThreadLeakControl.java:368)
	at com.carrotsearch.randomizedtesting.ThreadLeakControl.forkTimeoutingTask(ThreadLeakControl.java:817)
	at com.carrotsearch.randomizedtesting.ThreadLeakControl$3.evaluate(ThreadLeakControl.java:468)
	at com.carrotsearch.randomizedtesting.RandomizedRunner.runSingleTest(RandomizedRunner.java:943)
	at com.carrotsearch.randomizedtesting.RandomizedRunner$5.evaluate(RandomizedRunner.java:829)
	at com.carrotsearch.randomizedtesting.RandomizedRunner$6.evaluate(RandomizedRunner.java:879)
	at com.carrotsearch.randomizedtesting.RandomizedRunner$7.evaluate(RandomizedRunner.java:890)
	at com.carrotsearch.randomizedtesting.rules.StatementAdapter.evaluate(StatementAdapter.java:36)
	at com.carrotsearch.randomizedtesting.rules.SystemPropertiesRestoreRule$1.evaluate(SystemPropertiesRestoreRule.java:57)
	at org.apache.lucene.util.AbstractBeforeAfterRule$1.evaluate(AbstractBeforeAfterRule.java:45)
	at com.carrotsearch.randomizedtesting.rules.StatementAdapter.evaluate(StatementAdapter.java:36)
	at org.apache.lucene.util.TestRuleStoreClassName$1.evaluate(TestRuleStoreClassName.java:41)
	at com.carrotsearch.randomizedtesting.rules.NoShadowingOrOverridesOnMethodsRule$1.evaluate(NoShadowingOrOverridesOnMethodsRule.java:40)
	at com.carrotsearch.randomizedtesting.rules.NoShadowingOrOverridesOnMethodsRule$1.evaluate(NoShadowingOrOverridesOnMethodsRule.java:40)
	at com.carrotsearch.randomizedtesting.rules.StatementAdapter.evaluate(StatementAdapter.java:36)
	at com.carrotsearch.randomizedtesting.rules.StatementAdapter.evaluate(StatementAdapter.java:36)
	at com.carrotsearch.randomizedtesting.rules.StatementAdapter.evaluate(StatementAdapter.java:36)
	at org.apache.lucene.util.TestRuleAssertionsRequired$1.evaluate(TestRuleAssertionsRequired.java:53)
	at org.apache.lucene.util.TestRuleMarkFailure$1.evaluate(TestRuleMarkFailure.java:47)
	at org.apache.lucene.util.TestRuleIgnoreAfterMaxFailures$1.evaluate(TestRuleIgnoreAfterMaxFailures.java:64)
	at org.apache.lucene.util.TestRuleIgnoreTestSuites$1.evaluate(TestRuleIgnoreTestSuites.java:54)
	at com.carrotsearch.randomizedtesting.rules.StatementAdapter.evaluate(StatementAdapter.java:36)
	at com.carrotsearch.randomizedtesting.ThreadLeakControl$StatementRunner.run(ThreadLeakControl.java:368)
	at java.lang.Thread.run(Thread.java:748)
Caused by: org.apache.solr.client.solrj.impl.HttpSolrClient$RemoteSolrException: Error from server at https://127.0.0.1:41495/solr/testcollection_shard1_replica_n3: Expected mime type application/octet-stream but got text/html. <html>
<head>
<meta http-equiv="Content-Type" content="text/html;charset=ISO-8859-1"/>
<title>Error 404 </title>
</head>
<body>
<h2>HTTP ERROR: 404</h2>
<p>Problem accessing /solr/testcollection_shard1_replica_n3/update. Reason:
<pre>    Can not find: /solr/testcollection_shard1_replica_n3/update</pre></p>
<hr /><a href="http://eclipse.org/jetty">Powered by Jetty:// 9.3.20.v20170531</a><hr/>
</body>
</html>

	at org.apache.solr.client.solrj.impl.HttpSolrClient.executeMethod(HttpSolrClient.java:590)
	at org.apache.solr.client.solrj.impl.HttpSolrClient.request(HttpSolrClient.java:253)
	at org.apache.solr.client.solrj.impl.HttpSolrClient.request(HttpSolrClient.java:242)
	at org.apache.solr.client.solrj.impl.LBHttpSolrClient.doRequest(LBHttpSolrClient.java:483)
	at org.apache.solr.client.solrj.impl.LBHttpSolrClient.request(LBHttpSolrClient.java:413)
	at org.apache.solr.client.solrj.impl.CloudSolrClient.lambda$directUpdate$0(CloudSolrClient.java:516)
	at java.util.concurrent.FutureTask.run(FutureTask.java:266)
	at org.apache.solr.common.util.ExecutorUtil$MDCAwareThreadPoolExecutor.lambda$execute$0(ExecutorUtil.java:188)
	at java.util.concurrent.ThreadPoolExecutor.runWorker(ThreadPoolExecutor.java:1149)
	at java.util.concurrent.ThreadPoolExecutor$Worker.run(ThreadPoolExecutor.java:624)
	... 1 more




Build Log:
[...truncated 11498 lines...]
   [junit4] Suite: org.apache.solr.cloud.TestAuthenticationFramework
   [junit4]   2> Creating dataDir: /home/jenkins/workspace/Lucene-Solr-master-Linux/solr/build/solr-core/test/J0/temp/solr.cloud.TestAuthenticationFramework_7A8D8D9AC81CD729-001/init-core-data-001
   [junit4]   2> 13940 WARN  (SUITE-TestAuthenticationFramework-seed#[7A8D8D9AC81CD729]-worker) [    ] o.a.s.SolrTestCaseJ4 startTrackingSearchers: numOpens=1 numCloses=1
   [junit4]   2> 13940 INFO  (SUITE-TestAuthenticationFramework-seed#[7A8D8D9AC81CD729]-worker) [    ] o.a.s.SolrTestCaseJ4 Using TrieFields (NUMERIC_POINTS_SYSPROP=false) w/NUMERIC_DOCVALUES_SYSPROP=true
   [junit4]   2> 13942 INFO  (SUITE-TestAuthenticationFramework-seed#[7A8D8D9AC81CD729]-worker) [    ] o.a.s.SolrTestCaseJ4 Randomized ssl (true) and clientAuth (true) via: @org.apache.solr.util.RandomizeSSL(reason=, ssl=NaN, value=NaN, clientAuth=NaN)
   [junit4]   2> 13943 INFO  (SUITE-TestAuthenticationFramework-seed#[7A8D8D9AC81CD729]-worker) [    ] o.a.s.SolrTestCaseJ4 SecureRandom sanity checks: test.solr.allowed.securerandom=null & java.security.egd=file:/dev/./urandom
   [junit4]   2> 13959 INFO  (TEST-TestAuthenticationFramework.testBasics-seed#[7A8D8D9AC81CD729]) [    ] o.a.s.c.MiniSolrCloudCluster Starting cluster of 2 servers in /home/jenkins/workspace/Lucene-Solr-master-Linux/solr/build/solr-core/test/J0/temp/solr.cloud.TestAuthenticationFramework_7A8D8D9AC81CD729-001/tempDir-001
   [junit4]   2> 13968 INFO  (TEST-TestAuthenticationFramework.testBasics-seed#[7A8D8D9AC81CD729]) [    ] o.a.s.c.ZkTestServer STARTING ZK TEST SERVER
   [junit4]   2> 13975 INFO  (Thread-12) [    ] o.a.s.c.ZkTestServer client port:0.0.0.0/0.0.0.0:0
   [junit4]   2> 13975 INFO  (Thread-12) [    ] o.a.s.c.ZkTestServer Starting server
   [junit4]   2> 14074 INFO  (TEST-TestAuthenticationFramework.testBasics-seed#[7A8D8D9AC81CD729]) [    ] o.a.s.c.ZkTestServer start zk server on port:35683
   [junit4]   2> 14144 ERROR (Thread-12) [    ] o.a.z.s.ZooKeeperServer ZKShutdownHandler is not registered, so ZooKeeper server won't take any action on ERROR or SHUTDOWN server state changes
   [junit4]   2> 14217 WARN  (NIOServerCxn.Factory:0.0.0.0/0.0.0.0:0) [    ] o.a.z.s.NIOServerCnxn caught end of stream exception
   [junit4]   2> EndOfStreamException: Unable to read additional data from client sessionid 0x15f008c13920000, likely client has closed socket
   [junit4]   2> 	at org.apache.zookeeper.server.NIOServerCnxn.doIO(NIOServerCnxn.java:239)
   [junit4]   2> 	at org.apache.zookeeper.server.NIOServerCnxnFactory.run(NIOServerCnxnFactory.java:203)
   [junit4]   2> 	at java.lang.Thread.run(Thread.java:748)
   [junit4]   2> 14232 INFO  (jetty-launcher-5-thread-1) [    ] o.e.j.s.Server jetty-9.3.20.v20170531
   [junit4]   2> 14233 INFO  (jetty-launcher-5-thread-2) [    ] o.e.j.s.Server jetty-9.3.20.v20170531
   [junit4]   2> 14246 INFO  (jetty-launcher-5-thread-1) [    ] o.e.j.s.h.ContextHandler Started o.e.j.s.ServletContextHandler@1a5a6087{/solr,null,AVAILABLE}
   [junit4]   2> 14251 INFO  (jetty-launcher-5-thread-2) [    ] o.e.j.s.h.ContextHandler Started o.e.j.s.ServletContextHandler@4b569802{/solr,null,AVAILABLE}
   [junit4]   2> 14252 INFO  (jetty-launcher-5-thread-2) [    ] o.e.j.s.AbstractConnector Started ServerConnector@5fc953a0{SSL,[ssl, http/1.1]}{127.0.0.1:41495}
   [junit4]   2> 14254 INFO  (jetty-launcher-5-thread-2) [    ] o.e.j.s.Server Started @15952ms
   [junit4]   2> 14255 INFO  (jetty-launcher-5-thread-2) [    ] o.a.s.c.s.e.JettySolrRunner Jetty properties: {hostContext=/solr, hostPort=41495}
   [junit4]   2> 14255 INFO  (jetty-launcher-5-thread-1) [    ] o.e.j.s.AbstractConnector Started ServerConnector@187f3a5f{SSL,[ssl, http/1.1]}{127.0.0.1:34425}
   [junit4]   2> 14255 INFO  (jetty-launcher-5-thread-1) [    ] o.e.j.s.Server Started @15953ms
   [junit4]   2> 14255 INFO  (jetty-launcher-5-thread-1) [    ] o.a.s.c.s.e.JettySolrRunner Jetty properties: {hostContext=/solr, hostPort=34425}
   [junit4]   2> 14255 ERROR (jetty-launcher-5-thread-2) [    ] o.a.s.u.StartupLoggingUtils Missing Java Option solr.log.dir. Logging may be missing or incomplete.
   [junit4]   2> 14255 ERROR (jetty-launcher-5-thread-1) [    ] o.a.s.u.StartupLoggingUtils Missing Java Option solr.log.dir. Logging may be missing or incomplete.
   [junit4]   2> 14255 INFO  (jetty-launcher-5-thread-2) [    ] o.a.s.s.SolrDispatchFilter  ___      _       Welcome to Apache Solr? version 8.0.0
   [junit4]   2> 14255 INFO  (jetty-launcher-5-thread-2) [    ] o.a.s.s.SolrDispatchFilter / __| ___| |_ _   Starting in cloud mode on port null
   [junit4]   2> 14255 INFO  (jetty-launcher-5-thread-2) [    ] o.a.s.s.SolrDispatchFilter \__ \/ _ \ | '_|  Install dir: null, Default config dir: null
   [junit4]   2> 14255 INFO  (jetty-launcher-5-thread-2) [    ] o.a.s.s.SolrDispatchFilter |___/\___/_|_|    Start time: 2017-10-09T09:51:41.143Z
   [junit4]   2> 14256 INFO  (jetty-launcher-5-thread-2) [    ] o.a.s.c.SolrResourceLoader solr home defaulted to 'solr/' (could not find system property or JNDI)
   [junit4]   2> 14255 INFO  (jetty-launcher-5-thread-1) [    ] o.a.s.s.SolrDispatchFilter  ___      _       Welcome to Apache Solr? version 8.0.0
   [junit4]   2> 14257 INFO  (jetty-launcher-5-thread-1) [    ] o.a.s.s.SolrDispatchFilter / __| ___| |_ _   Starting in cloud mode on port null
   [junit4]   2> 14257 INFO  (jetty-launcher-5-thread-1) [    ] o.a.s.s.SolrDispatchFilter \__ \/ _ \ | '_|  Install dir: null, Default config dir: null
   [junit4]   2> 14257 INFO  (jetty-launcher-5-thread-1) [    ] o.a.s.s.SolrDispatchFilter |___/\___/_|_|    Start time: 2017-10-09T09:51:41.145Z
   [junit4]   2> 14263 INFO  (jetty-launcher-5-thread-2) [    ] o.a.s.s.SolrDispatchFilter solr.xml found in ZooKeeper. Loading...
   [junit4]   2> 14263 INFO  (jetty-launcher-5-thread-1) [    ] o.a.s.s.SolrDispatchFilter solr.xml found in ZooKeeper. Loading...
   [junit4]   2> 14323 INFO  (jetty-launcher-5-thread-2) [    ] o.a.s.c.ZkContainer Zookeeper client=127.0.0.1:35683/solr
   [junit4]   2> 14338 INFO  (jetty-launcher-5-thread-1) [    ] o.a.s.c.ZkContainer Zookeeper client=127.0.0.1:35683/solr
   [junit4]   2> 14349 WARN  (NIOServerCxn.Factory:0.0.0.0/0.0.0.0:0) [    ] o.a.z.s.NIOServerCnxn caught end of stream exception
   [junit4]   2> EndOfStreamException: Unable to read additional data from client sessionid 0x15f008c13920003, likely client has closed socket
   [junit4]   2> 	at org.apache.zookeeper.server.NIOServerCnxn.doIO(NIOServerCnxn.java:239)
   [junit4]   2> 	at org.apache.zookeeper.server.NIOServerCnxnFactory.run(NIOServerCnxnFactory.java:203)
   [junit4]   2> 	at java.lang.Thread.run(Thread.java:748)
   [junit4]   2> 14351 WARN  (NIOServerCxn.Factory:0.0.0.0/0.0.0.0:0) [    ] o.a.z.s.NIOServerCnxn caught end of stream exception
   [junit4]   2> EndOfStreamException: Unable to read additional data from client sessionid 0x15f008c13920004, likely client has closed socket
   [junit4]   2> 	at org.apache.zookeeper.server.NIOServerCnxn.doIO(NIOServerCnxn.java:239)
   [junit4]   2> 	at org.apache.zookeeper.server.NIOServerCnxnFactory.run(NIOServerCnxnFactory.java:203)
   [junit4]   2> 	at java.lang.Thread.run(Thread.java:748)
   [junit4]   2> 14612 INFO  (jetty-launcher-5-thread-1) [n:127.0.0.1:34425_solr    ] o.a.s.c.Overseer Overseer (id=null) closing
   [junit4]   2> 14615 INFO  (jetty-launcher-5-thread-1) [n:127.0.0.1:34425_solr    ] o.a.s.c.OverseerElectionContext I am going to be the leader 127.0.0.1:34425_solr
   [junit4]   2> 14619 INFO  (jetty-launcher-5-thread-1) [n:127.0.0.1:34425_solr    ] o.a.s.c.Overseer Overseer (id=98798318449197061-127.0.0.1:34425_solr-n_0000000000) starting
   [junit4]   2> 14623 INFO  (jetty-launcher-5-thread-2) [n:127.0.0.1:41495_solr    ] o.a.s.c.Overseer Overseer (id=null) closing
   [junit4]   2> 14626 INFO  (jetty-launcher-5-thread-2) [n:127.0.0.1:41495_solr    ] o.a.s.c.ZkController Register node as live in ZooKeeper:/live_nodes/127.0.0.1:41495_solr
   [junit4]   2> 14655 INFO  (zkCallback-17-thread-1-processing-n:127.0.0.1:41495_solr) [n:127.0.0.1:41495_solr    ] o.a.s.c.c.ZkStateReader Updated live nodes from ZooKeeper... (0) -> (1)
   [junit4]   2> 14655 INFO  (zkCallback-16-thread-1-processing-n:127.0.0.1:34425_solr) [n:127.0.0.1:34425_solr    ] o.a.s.c.c.ZkStateReader Updated live nodes from ZooKeeper... (0) -> (1)
   [junit4]   2> 14832 INFO  (jetty-launcher-5-thread-1) [n:127.0.0.1:34425_solr    ] o.a.s.c.ZkController Register node as live in ZooKeeper:/live_nodes/127.0.0.1:34425_solr
   [junit4]   2> 14842 INFO  (zkCallback-17-thread-1-processing-n:127.0.0.1:41495_solr) [n:127.0.0.1:41495_solr    ] o.a.s.c.c.ZkStateReader Updated live nodes from ZooKeeper... (1) -> (2)
   [junit4]   2> 14851 INFO  (zkCallback-16-thread-2-processing-n:127.0.0.1:34425_solr) [n:127.0.0.1:34425_solr    ] o.a.s.c.c.ZkStateReader Updated live nodes from ZooKeeper... (1) -> (2)
   [junit4]   2> 15097 INFO  (jetty-launcher-5-thread-1) [n:127.0.0.1:34425_solr    ] o.a.s.c.CoreContainer Initializing authentication plugin: org.apache.solr.cloud.TestAuthenticationFramework$MockAuthenticationPlugin
   [junit4]   2> 15186 INFO  (jetty-launcher-5-thread-2) [n:127.0.0.1:41495_solr    ] o.a.s.c.CoreContainer Initializing authentication plugin: org.apache.solr.cloud.TestAuthenticationFramework$MockAuthenticationPlugin
   [junit4]   2> 15520 INFO  (jetty-launcher-5-thread-1) [n:127.0.0.1:34425_solr    ] o.a.s.m.r.SolrJmxReporter JMX monitoring for 'solr_34425.solr.node' (registry 'solr.node') enabled at server: com.sun.jmx.mbeanserver.JmxMBeanServer@f0c7a7d
   [junit4]   2> 15539 INFO  (jetty-launcher-5-thread-2) [n:127.0.0.1:41495_solr    ] o.a.s.m.r.SolrJmxReporter JMX monitoring for 'solr_41495.solr.node' (registry 'solr.node') enabled at server: com.sun.jmx.mbeanserver.JmxMBeanServer@f0c7a7d
   [junit4]   2> 15555 INFO  (jetty-launcher-5-thread-1) [n:127.0.0.1:34425_solr    ] o.a.s.m.r.SolrJmxReporter JMX monitoring for 'solr_34425.solr.jvm' (registry 'solr.jvm') enabled at server: com.sun.jmx.mbeanserver.JmxMBeanServer@f0c7a7d
   [junit4]   2> 15555 INFO  (jetty-launcher-5-thread-1) [n:127.0.0.1:34425_solr    ] o.a.s.m.r.SolrJmxReporter JMX monitoring for 'solr_34425.solr.jetty' (registry 'solr.jetty') enabled at server: com.sun.jmx.mbeanserver.JmxMBeanServer@f0c7a7d
   [junit4]   2> 15573 INFO  (jetty-launcher-5-thread-1) [n:127.0.0.1:34425_solr    ] o.a.s.c.CorePropertiesLocator Found 0 core definitions underneath /home/jenkins/workspace/Lucene-Solr-master-Linux/solr/build/solr-core/test/J0/temp/solr.cloud.TestAuthenticationFramework_7A8D8D9AC81CD729-001/tempDir-001/node1/.
   [junit4]   2> 15633 INFO  (jetty-launcher-5-thread-2) [n:127.0.0.1:41495_solr    ] o.a.s.m.r.SolrJmxReporter JMX monitoring for 'solr_41495.solr.jvm' (registry 'solr.jvm') enabled at server: com.sun.jmx.mbeanserver.JmxMBeanServer@f0c7a7d
   [junit4]   2> 15633 INFO  (jetty-launcher-5-thread-2) [n:127.0.0.1:41495_solr    ] o.a.s.m.r.SolrJmxReporter JMX monitoring for 'solr_41495.solr.jetty' (registry 'solr.jetty') enabled at server: com.sun.jmx.mbeanserver.JmxMBeanServer@f0c7a7d
   [junit4]   2> 15655 INFO  (jetty-launcher-5-thread-2) [n:127.0.0.1:41495_solr    ] o.a.s.c.CorePropertiesLocator Found 0 core definitions underneath /home/jenkins/workspace/Lucene-Solr-master-Linux/solr/build/solr-core/test/J0/temp/solr.cloud.TestAuthenticationFramework_7A8D8D9AC81CD729-001/tempDir-001/node2/.
   [junit4]   2> 15912 INFO  (TEST-TestAuthenticationFramework.testBasics-seed#[7A8D8D9AC81CD729]) [    ] o.a.s.c.c.ZkStateReader Updated live nodes from ZooKeeper... (0) -> (2)
   [junit4]   2> 15913 INFO  (TEST-TestAuthenticationFramework.testBasics-seed#[7A8D8D9AC81CD729]) [    ] o.a.s.c.s.i.ZkClientClusterStateProvider Cluster at 127.0.0.1:35683/solr ready
   [junit4]   2> 15917 INFO  (TEST-TestAuthenticationFramework.testBasics-seed#[7A8D8D9AC81CD729]) [    ] o.a.s.SolrTestCaseJ4 ###Starting testBasics
   [junit4]   2> 15997 INFO  (qtp1976245490-64) [n:127.0.0.1:34425_solr    ] o.a.s.h.a.CollectionsHandler Invoked Collection Action :create with params replicationFactor=2&collection.configName=solrCloudCollectionConfig&maxShardsPerNode=2&name=testcollection&nrtReplicas=2&action=CREATE&numShards=2&wt=javabin&version=2 and sendToOCPQueue=true
   [junit4]   2> 16012 INFO  (OverseerThreadFactory-37-thread-1-processing-n:127.0.0.1:34425_solr) [n:127.0.0.1:34425_solr    ] o.a.s.c.CreateCollectionCmd Create collection testcollection
   [junit4]   2> 16148 INFO  (OverseerStateUpdate-98798318449197061-127.0.0.1:34425_solr-n_0000000000) [n:127.0.0.1:34425_solr    ] o.a.s.c.o.SliceMutator createReplica() {
   [junit4]   2>   "operation":"ADDREPLICA",
   [junit4]   2>   "collection":"testcollection",
   [junit4]   2>   "shard":"shard1",
   [junit4]   2>   "core":"testcollection_shard1_replica_n1",
   [junit4]   2>   "state":"down",
   [junit4]   2>   "base_url":"https://127.0.0.1:34425/solr",
   [junit4]   2>   "type":"NRT"} 
   [junit4]   2> 16156 INFO  (OverseerStateUpdate-98798318449197061-127.0.0.1:34425_solr-n_0000000000) [n:127.0.0.1:34425_solr    ] o.a.s.c.o.SliceMutator createReplica() {
   [junit4]   2>   "operation":"ADDREPLICA",
   [junit4]   2>   "collection":"testcollection",
   [junit4]   2>   "shard":"shard1",
   [junit4]   2>   "core":"testcollection_shard1_replica_n3",
   [junit4]   2>   "state":"down",
   [junit4]   2>   "base_url":"https://127.0.0.1:41495/solr",
   [junit4]   2>   "type":"NRT"} 
   [junit4]   2> 16168 INFO  (OverseerStateUpdate-98798318449197061-127.0.0.1:34425_solr-n_0000000000) [n:127.0.0.1:34425_solr    ] o.a.s.c.o.SliceMutator createReplica() {
   [junit4]   2>   "operation":"ADDREPLICA",
   [junit4]   2>   "collection":"testcollection",
   [junit4]   2>   "shard":"shard2",
   [junit4]   2>   "core":"testcollection_shard2_replica_n5",
   [junit4]   2>   "state":"down",
   [junit4]   2>   "base_url":"https://127.0.0.1:34425/solr",
   [junit4]   2>   "type":"NRT"} 
   [junit4]   2> 16174 INFO  (OverseerStateUpdate-98798318449197061-127.0.0.1:34425_solr-n_0000000000) [n:127.0.0.1:34425_solr    ] o.a.s.c.o.SliceMutator createReplica() {
   [junit4]   2>   "operation":"ADDREPLICA",
   [junit4]   2>   "collection":"testcollection",
   [junit4]   2>   "shard":"shard2",
   [junit4]   2>   "core":"testcollection_shard2_replica_n7",
   [junit4]   2>   "state":"down",
   [junit4]   2>   "base_url":"https://127.0.0.1:41495/solr",
   [junit4]   2>   "type":"NRT"} 
   [junit4]   2> 16443 INFO  (qtp1976245490-123) [n:127.0.0.1:34425_solr    ] o.a.s.h.a.CoreAdminOperation core create command qt=/admin/cores&coreNodeName=core_node2&collection.configName=solrCloudCollectionConfig&newCollection=true&name=testcollection_shard1_replica_n1&action=CREATE&numShards=2&collection=testcollection&shard=shard1&wt=javabin&version=2&replicaType=NRT
   [junit4]   2> 16447 INFO  (qtp1976245490-58) [n:127.0.0.1:34425_solr    ] o.a.s.h.a.CoreAdminOperation core create command qt=/admin/cores&coreNodeName=core_node6&collection.configName=solrCloudCollectionConfig&newCollection=true&name=testcollection_shard2_replica_n5&action=CREATE&numShards=2&collection=testcollection&shard=shard2&wt=javabin&version=2&replicaType=NRT
   [junit4]   2> 16447 INFO  (qtp1976245490-123) [n:127.0.0.1:34425_solr    ] o.a.s.c.TransientSolrCoreCacheDefault Allocating transient cache for 2147483647 transient cores
   [junit4]   2> 16478 INFO  (qtp685136286-74) [n:127.0.0.1:41495_solr    ] o.a.s.h.a.CoreAdminOperation core create command qt=/admin/cores&coreNodeName=core_node8&collection.configName=solrCloudCollectionConfig&newCollection=true&name=testcollection_shard2_replica_n7&action=CREATE&numShards=2&collection=testcollection&shard=shard2&wt=javabin&version=2&replicaType=NRT
   [junit4]   2> 16479 INFO  (qtp685136286-74) [n:127.0.0.1:41495_solr    ] o.a.s.c.TransientSolrCoreCacheDefault Allocating transient cache for 2147483647 transient cores
   [junit4]   2> 16511 INFO  (qtp685136286-73) [n:127.0.0.1:41495_solr    ] o.a.s.h.a.CoreAdminOperation core create command qt=/admin/cores&coreNodeName=core_node4&collection.configName=solrCloudCollectionConfig&newCollection=true&name=testcollection_shard1_replica_n3&action=CREATE&numShards=2&collection=testcollection&shard=shard1&wt=javabin&version=2&replicaType=NRT
   [junit4]   2> 16628 INFO  (zkCallback-17-thread-1-processing-n:127.0.0.1:41495_solr) [n:127.0.0.1:41495_solr    ] o.a.s.c.c.ZkStateReader A cluster state change: [WatchedEvent state:SyncConnected type:NodeDataChanged path:/collections/testcollection/state.json] for collection [testcollection] has occurred - updating... (live nodes size: [2])
   [junit4]   2> 16630 INFO  (zkCallback-16-thread-2-processing-n:127.0.0.1:34425_solr) [n:127.0.0.1:34425_solr    ] o.a.s.c.c.ZkStateReader A cluster state change: [WatchedEvent state:SyncConnected type:NodeDataChanged path:/collections/testcollection/state.json] for collection [testcollection] has occurred - updating... (live nodes size: [2])
   [junit4]   2> 16634 INFO  (zkCallback-17-thread-2-processing-n:127.0.0.1:41495_solr) [n:127.0.0.1:41495_solr    ] o.a.s.c.c.ZkStateReader A cluster state change: [WatchedEvent state:SyncConnected type:NodeDataChanged path:/collections/testcollection/state.json] for collection [testcollection] has occurred - updating... (live nodes size: [2])
   [junit4]   2> 17494 INFO  (qtp1976245490-123) [n:127.0.0.1:34425_solr c:testcollection s:shard1 r:core_node2 x:testcollection_shard1_replica_n1] o.a.s.c.SolrConfig Using Lucene MatchVersion: 8.0.0
   [junit4]   2> 17503 INFO  (qtp1976245490-58) [n:127.0.0.1:34425_solr c:testcollection s:shard2 r:core_node6 x:testcollection_shard2_replica_n5] o.a.s.c.SolrConfig Using Lucene MatchVersion: 8.0.0
   [junit4]   2> 17543 INFO  (qtp685136286-74) [n:127.0.0.1:41495_solr c:testcollection s:shard2 r:core_node8 x:testcollection_shard2_replica_n7] o.a.s.c.SolrConfig Using Lucene MatchVersion: 8.0.0
   [junit4]   2> 17563 INFO  (qtp1976245490-123) [n:127.0.0.1:34425_solr c:testcollection s:shard1 r:core_node2 x:testcollection_shard1_replica_n1] o.a.s.s.IndexSchema [testcollection_shard1_replica_n1] Schema name=minimal
   [junit4]   2> 17569 INFO  (qtp1976245490-58) [n:127.0.0.1:34425_solr c:testcollection s:shard2 r:core_node6 x:testcollection_shard2_replica_n5] o.a.s.s.IndexSchema [testcollection_shard2_replica_n5] Schema name=minimal
   [junit4]   2> 17573 INFO  (qtp685136286-73) [n:127.0.0.1:41495_solr c:testcollection s:shard1 r:core_node4 x:testcollection_shard1_replica_n3] o.a.s.c.SolrConfig Using Lucene MatchVersion: 8.0.0
   [junit4]   2> 17586 INFO  (qtp685136286-73) [n:127.0.0.1:41495_solr c:testcollection s:shard1 r:core_node4 x:testcollection_shard1_replica_n3] o.a.s.s.IndexSchema [testcollection_shard1_replica_n3] Schema name=minimal
   [junit4]   2> 17589 INFO  (qtp685136286-73) [n:127.0.0.1:41495_solr c:testcollection s:shard1 r:core_node4 x:testcollection_shard1_replica_n3] o.a.s.s.IndexSchema Loaded schema minimal/1.1 with uniqueid field id
   [junit4]   2> 17589 INFO  (qtp685136286-73) [n:127.0.0.1:41495_solr c:testcollection s:shard1 r:core_node4 x:testcollection_shard1_replica_n3] o.a.s.c.CoreContainer Creating SolrCore 'testcollection_shard1_replica_n3' using configuration from collection testcollection, trusted=true
   [junit4]   2> 17592 INFO  (qtp1976245490-123) [n:127.0.0.1:34425_solr c:testcollection s:shard1 r:core_node2 x:testcollection_shard1_replica_n1] o.a.s.s.IndexSchema Loaded schema minimal/1.1 with uniqueid field id
   [junit4]   2> 17592 INFO  (qtp1976245490-123) [n:127.0.0.1:34425_solr c:testcollection s:shard1 r:core_node2 x:testcollection_shard1_replica_n1] o.a.s.c.CoreContainer Creating SolrCore 'testcollection_shard1_replica_n1' using configuration from collection testcollection, trusted=true
   [junit4]   2> 17595 INFO  (qtp1976245490-58) [n:127.0.0.1:34425_solr c:testcollection s:shard2 r:core_node6 x:testcollection_shard2_replica_n5] o.a.s.s.IndexSchema Loaded schema minimal/1.1 with uniqueid field id
   [junit4]   2> 17595 INFO  (qtp1976245490-58) [n:127.0.0.1:34425_solr c:testcollection s:shard2 r:core_node6 x:testcollection_shard2_replica_n5] o.a.s.c.CoreContainer Creating SolrCore 'testcollection_shard2_replica_n5' using configuration from collection testcollection, trusted=true
   [junit4]   2> 17603 INFO  (qtp685136286-73) [n:127.0.0.1:41495_solr c:testcollection s:shard1 r:core_node4 x:testcollection_shard1_replica_n3] o.a.s.m.r.SolrJmxReporter JMX monitoring for 'solr_41495.solr.core.testcollection.shard1.replica_n3' (registry 'solr.core.testcollection.shard1.replica_n3') enabled at server: com.sun.jmx.mbeanserver.JmxMBeanServer@f0c7a7d
   [junit4]   2> 17603 INFO  (qtp685136286-73) [n:127.0.0.1:41495_solr c:testcollection s:shard1 r:core_node4 x:testcollection_shard1_replica_n3] o.a.s.c.SolrCore solr.RecoveryStrategy.Builder
   [junit4]   2> 17603 INFO  (qtp685136286-73) [n:127.0.0.1:41495_solr c:testcollection s:shard1 r:core_node4 x:testcollection_shard1_replica_n3] o.a.s.c.SolrCore [[testcollection_shard1_replica_n3] ] Opening new SolrCore at [/home/jenkins/workspace/Lucene-Solr-master-Linux/solr/build/solr-core/test/J0/temp/solr.cloud.TestAuthenticationFramework_7A8D8D9AC81CD729-001/tempDir-001/node2/testcollection_shard1_replica_n3], dataDir=[/home/jenkins/workspace/Lucene-Solr-master-Linux/solr/build/solr-core/test/J0/temp/solr.cloud.TestAuthenticationFramework_7A8D8D9AC81CD729-001/tempDir-001/node2/./testcollection_shard1_replica_n3/data/]
   [junit4]   2> 17610 INFO  (qtp1976245490-123) [n:127.0.0.1:34425_solr c:testcollection s:shard1 r:core_node2 x:testcollection_shard1_replica_n1] o.a.s.m.r.SolrJmxReporter JMX monitoring for 'solr_34425.solr.core.testcollection.shard1.replica_n1' (registry 'solr.core.testcollection.shard1.replica_n1') enabled at server: com.sun.jmx.mbeanserver.JmxMBeanServer@f0c7a7d
   [junit4]   2> 17610 INFO  (qtp1976245490-123) [n:127.0.0.1:34425_solr c:testcollection s:shard1 r:core_node2 x:testcollection_shard1_replica_n1] o.a.s.c.SolrCore solr.RecoveryStrategy.Builder
   [junit4]   2> 17610 INFO  (qtp1976245490-123) [n:127.0.0.1:34425_solr c:testcollection s:shard1 r:core_node2 x:testcollection_shard1_replica_n1] o.a.s.c.SolrCore [[testcollection_shard1_replica_n1] ] Opening new SolrCore at [/home/jenkins/workspace/Lucene-Solr-master-Linux/solr/build/solr-core/test/J0/temp/solr.cloud.TestAuthenticationFramework_7A8D8D9AC81CD729-001/tempDir-001/node1/testcollection_shard1_replica_n1], dataDir=[/home/jenkins/workspace/Lucene-Solr-master-Linux/solr/build/solr-core/test/J0/temp/solr.cloud.TestAuthenticationFramework_7A8D8D9AC81CD729-001/tempDir-001/node1/./testcollection_shard1_replica_n1/data/]
   [junit4]   2> 17614 INFO  (qtp685136286-74) [n:127.0.0.1:41495_solr c:testcollection s:shard2 r:core_node8 x:testcollection_shard2_replica_n7] o.a.s.s.IndexSchema [testcollection_shard2_replica_n7] Schema name=minimal
   [junit4]   2> 17720 INFO  (qtp1976245490-58) [n:127.0.0.1:34425_solr c:testcollection s:shard2 r:core_node6 x:testcollection_shard2_replica_n5] o.a.s.m.r.SolrJmxReporter JMX monitoring for 'solr_34425.solr.core.testcollection.shard2.replica_n5' (registry 'solr.core.testcollection.shard2.replica_n5') enabled at server: com.sun.jmx.mbeanserver.JmxMBeanServer@f0c7a7d
   [junit4]   2> 17720 INFO  (qtp1976245490-58) [n:127.0.0.1:34425_solr c:testcollection s:shard2 r:core_node6 x:testcollection_shard2_replica_n5] o.a.s.c.SolrCore solr.RecoveryStrategy.Builder
   [junit4]   2> 17721 INFO  (qtp1976245490-58) [n:127.0.0.1:34425_solr c:testcollection s:shard2 r:core_node6 x:testcollection_shard2_replica_n5] o.a.s.c.SolrCore [[testcollection_shard2_replica_n5] ] Opening new SolrCore at [/home/jenkins/workspace/Lucene-Solr-master-Linux/solr/build/solr-core/test/J0/temp/solr.cloud.TestAuthenticationFramework_7A8D8D9AC81CD729-001/tempDir-001/node1/testcollection_shard2_replica_n5], dataDir=[/home/jenkins/workspace/Lucene-Solr-master-Linux/solr/build/solr-core/test/J0/temp/solr.cloud.TestAuthenticationFramework_7A8D8D9AC81CD729-001/tempDir-001/node1/./testcollection_shard2_replica_n5/data/]
   [junit4]   2> 17722 INFO  (qtp685136286-74) [n:127.0.0.1:41495_solr c:testcollection s:shard2 r:core_node8 x:testcollection_shard2_replica_n7] o.a.s.s.IndexSchema Loaded schema minimal/1.1 with uniqueid field id
   [junit4]   2> 17723 INFO  (qtp685136286-74) [n:127.0.0.1:41495_solr c:testcollection s:shard2 r:core_node8 x:testcollection_shard2_replica_n7] o.a.s.c.CoreContainer Creating SolrCore 'testcollection_shard2_replica_n7' using configuration from collection testcollection, trusted=true
   [junit4]   2> 17724 INFO  (qtp685136286-74) [n:127.0.0.1:41495_solr c:testcollection s:shard2 r:core_node8 x:testcollection_shard2_replica_n7] o.a.s.m.r.SolrJmxReporter JMX monitoring for 'solr_41495.solr.core.testcollection.shard2.replica_n7' (registry 'solr.core.testcollection.shard2.replica_n7') enabled at server: com.sun.jmx.mbeanserver.JmxMBeanServer@f0c7a7d
   [junit4]   2> 17724 INFO  (qtp685136286-74) [n:127.0.0.1:41495_solr c:testcollection s:shard2 r:core_node8 x:testcollection_shard2_replica_n7] o.a.s.c.SolrCore solr.RecoveryStrategy.Builder
   [junit4]   2> 17724 INFO  (qtp685136286-74) [n:127.0.0.1:41495_solr c:testcollection s:shard2 r:core_node8 x:testcollection_shard2_replica_n7] o.a.s.c.SolrCore [[testcollection_shard2_replica_n7] ] Opening new SolrCore at [/home/jenkins/workspace/Lucene-Solr-master-Linux/solr/build/solr-core/test/J0/temp/solr.cloud.TestAuthenticationFramework_7A8D8D9AC81CD729-001/tempDir-001/node2/testcollection_shard2_replica_n7], dataDir=[/home/jenkins/workspace/Lucene-Solr-master-Linux/solr/build/solr-core/test/J0/temp/solr.cloud.TestAuthenticationFramework_7A8D8D9AC81CD729-001/tempDir-001/node2/./testcollection_shard2_replica_n7/data/]
   [junit4]   2> 17882 INFO  (qtp1976245490-58) [n:127.0.0.1:34425_solr c:testcollection s:shard2 r:core_node6 x:testcollection_shard2_replica_n5] o.a.s.u.UpdateHandler Using UpdateLog implementation: org.apache.solr.update.UpdateLog
   [junit4]   2> 17892 INFO  (qtp685136286-74) [n:127.0.0.1:41495_solr c:testcollection s:shard2 r:core_node8 x:testcollection_shard2_replica_n7] o.a.s.u.UpdateHandler Using UpdateLog implementation: org.apache.solr.update.UpdateLog
   [junit4]   2> 17882 INFO  (qtp1976245490-58) [n:127.0.0.1:34425_solr c:testcollection s:shard2 r:core_node6 x:testcollection_shard2_replica_n5] o.a.s.u.UpdateLog Initializing UpdateLog: dataDir=null defaultSyncLevel=FLUSH numRecordsToKeep=100 maxNumLogsToKeep=10 numVersionBuckets=65536
   [junit4]   2> 17893 INFO  (qtp685136286-73) [n:127.0.0.1:41495_solr c:testcollection s:shard1 r:core_node4 x:testcollection_shard1_replica_n3] o.a.s.u.UpdateHandler Using UpdateLog implementation: org.apache.solr.update.UpdateLog
   [junit4]   2> 17893 INFO  (qtp685136286-73) [n:127.0.0.1:41495_solr c:testcollection s:shard1 r:core_node4 x:testcollection_shard1_replica_n3] o.a.s.u.UpdateLog Initializing UpdateLog: dataDir=null defaultSyncLevel=FLUSH numRecordsToKeep=100 maxNumLogsToKeep=10 numVersionBuckets=65536
   [junit4]   2> 17897 INFO  (qtp685136286-73) [n:127.0.0.1:41495_solr c:testcollection s:shard1 r:core_node4 x:testcollection_shard1_replica_n3] o.a.s.u.CommitTracker Hard AutoCommit: disabled
   [junit4]   2> 17898 INFO  (qtp685136286-73) [n:127.0.0.1:41495_solr c:testcollection s:shard1 r:core_node4 x:testcollection_shard1_replica_n3] o.a.s.u.CommitTracker Soft AutoCommit: disabled
   [junit4]   2> 17899 INFO  (qtp1976245490-58) [n:127.0.0.1:34425_solr c:testcollection s:shard2 r:core_node6 x:testcollection_shard2_replica_n5] o.a.s.u.CommitTracker Hard AutoCommit: disabled
   [junit4]   2> 17899 INFO  (qtp1976245490-58) [n:127.0.0.1:34425_solr c:testcollection s:shard2 r:core_node6 x:testcollection_shard2_replica_n5] o.a.s.u.CommitTracker Soft AutoCommit: disabled
   [junit4]   2> 17901 INFO  (qtp685136286-73) [n:127.0.0.1:41495_solr c:testcollection s:shard1 r:core_node4 x:testcollection_shard1_replica_n3] o.a.s.s.SolrIndexSearcher Opening [Searcher@1dd7b585[testcollection_shard1_replica_n3] main]
   [junit4]   2> 17892 INFO  (qtp685136286-74) [n:127.0.0.1:41495_solr c:testcollection s:shard2 r:core_node8 x:testcollection_shard2_replica_n7] o.a.s.u.UpdateLog Initializing UpdateLog: dataDir=null defaultSyncLevel=FLUSH numRecordsToKeep=100 maxNumLogsToKeep=10 numVersionBuckets=65536
   [junit4]   2> 17904 INFO  (qtp685136286-73) [n:127.0.0.1:41495_solr c:testcollection s:shard1 r:core_node4 x:testcollection_shard1_replica_n3] o.a.s.r.ManagedResourceStorage Configured ZooKeeperStorageIO with znodeBase: /configs/solrCloudCollectionConfig
   [junit4]   2> 17905 INFO  (qtp685136286-73) [n:127.0.0.1:41495_solr c:testcollection s:shard1 r:core_node4 x:testcollection_shard1_replica_n3] o.a.s.r.ManagedResourceStorage Loaded null at path _rest_managed.json using ZooKeeperStorageIO:path=/configs/solrCloudCollectionConfig
   [junit4]   2> 17906 INFO  (qtp685136286-73) [n:127.0.0.1:41495_solr c:testcollection s:shard1 r:core_node4 x:testcollection_shard1_replica_n3] o.a.s.h.ReplicationHandler Commits will be reserved for 10000ms.
   [junit4]   2> 17915 INFO  (qtp685136286-74) [n:127.0.0.1:41495_solr c:testcollection s:shard2 r:core_node8 x:testcollection_shard2_replica_n7] o.a.s.u.CommitTracker Hard AutoCommit: disabled
   [junit4]   2> 17916 INFO  (qtp685136286-74) [n:127.0.0.1:41495_solr c:testcollection s:shard2 r:core_node8 x:testcollection_shard2_replica_n7] o.a.s.u.CommitTracker Soft AutoCommit: disabled
   [junit4]   2> 17920 INFO  (qtp1976245490-58) [n:127.0.0.1:34425_solr c:testcollection s:shard2 r:core_node6 x:testcollection_shard2_replica_n5] o.a.s.s.SolrIndexSearcher Opening [Searcher@35f03be6[testcollection_shard2_replica_n5] main]
   [junit4]   2> 17921 INFO  (qtp1976245490-58) [n:127.0.0.1:34425_solr c:testcollection s:shard2 r:core_node6 x:testcollection_shard2_replica_n5] o.a.s.r.ManagedResourceStorage Configured ZooKeeperStorageIO with znodeBase: /configs/solrCloudCollectionConfig
   [junit4]   2> 17937 INFO  (searcherExecutor-42-thread-1-processing-n:127.0.0.1:41495_solr x:testcollection_shard1_replica_n3 s:shard1 c:testcollection r:core_node4) [n:127.0.0.1:41495_solr c:testcollection s:shard1 r:core_node4 x:testcollection_shard1_replica_n3] o.a.s.c.SolrCore [testcollection_shard1_replica_n3] Registered new searcher Searcher@1dd7b585[testcollection_shard1_replica_n3] main{ExitableDirectoryReader(UninvertingDirectoryReader())}
   [junit4]   2> 17937 INFO  (qtp685136286-73) [n:127.0.0.1:41495_solr c:testcollection s:shard1 r:core_node4 x:testcollection_shard1_replica_n3] o.a.s.u.UpdateLog Could not find max version in index or recent updates, using new clock 1580773099254579200
   [junit4]   2> 17938 INFO  (qtp1976245490-58) [n:127.0.0.1:34425_solr c:testcollection s:shard2 r:core_node6 x:testcollection_shard2_replica_n5] o.a.s.r.ManagedResourceStorage Loaded null at path _rest_managed.json using ZooKeeperStorageIO:path=/configs/solrCloudCollectionConfig
   [junit4]   2> 17940 INFO  (qtp1976245490-58) [n:127.0.0.1:34425_solr c:testcollection s:shard2 r:core_node6 x:testcollection_shard2_replica_n5] o.a.s.h.ReplicationHandler Commits will be reserved for 10000ms.
   [junit4]   2> 17942 INFO  (searcherExecutor-44-thread-1-processing-n:127.0.0.1:34425_solr x:testcollection_shard2_replica_n5 s:shard2 c:testcollection r:core_node6) [n:127.0.0.1:34425_solr c:testcollection s:shard2 r:core_node6 x:testcollection_shard2_replica_n5] o.a.s.c.SolrCore [testcollection_shard2_replica_n5] Registered new searcher Searcher@35f03be6[testcollection_shard2_replica_n5] main{ExitableDirectoryReader(UninvertingDirectoryReader())}
   [junit4]   2> 17942 INFO  (qtp1976245490-58) [n:127.0.0.1:34425_solr c:testcollection s:shard2 r:core_node6 x:testcollection_shard2_replica_n5] o.a.s.u.UpdateLog Could not find max version in index or recent updates, using new clock 1580773099259822080
   [junit4]   2> 17942 INFO  (qtp1976245490-123) [n:127.0.0.1:34425_solr c:testcollection s:shard1 r:core_node2 x:testcollection_shard1_replica_n1] o.a.s.u.UpdateHandler Using UpdateLog implementation: org.apache.solr.update.UpdateLog
   [junit4]   2> 17942 INFO  (qtp1976245490-123) [n:127.0.0.1:34425_solr c:testcollection s:shard1 r:core_node2 x:testcollection_shard1_replica_n1] o.a.s.u.UpdateLog Initializing UpdateLog: dataDir=null defaultSyncLevel=FLUSH numRecordsToKeep=100 maxNumLogsToKeep=10 numVersionBuckets=65536
   [junit4]   2> 17945 INFO  (qtp1976245490-123) [n:127.0.0.1:34425_solr c:testcollection s:shard1 r:core_node2 x:testcollection_shard1_replica_n1] o.a.s.u.CommitTracker Hard AutoCommit: disabled
   [junit4]   2> 17945 INFO  (qtp1976245490-123) [n:127.0.0.1:34425_solr c:testcollection s:shard1 r:core_node2 x:testcollection_shard1_replica_n1] o.a.s.u.CommitTracker Soft AutoCommit: disabled
   [junit4]   2> 17947 INFO  (qtp1976245490-123) [n:127.0.0.1:34425_solr c:testcollection s:shard1 r:core_node2 x:testcollection_shard1_replica_n1] o.a.s.s.SolrIndexSearcher Opening [Searcher@64c434ad[testcollection_shard1_replica_n1] main]
   [junit4]   2> 17949 INFO  (qtp1976245490-123) [n:127.0.0.1:34425_solr c:testcollection s:shard1 r:core_node2 x:testcollection_shard1_replica_n1] o.a.s.r.ManagedResourceStorage Configured ZooKeeperStorageIO with znodeBase: /configs/solrCloudCollectionConfig
   [junit4]   2> 17950 INFO  (qtp1976245490-123) [n:127.0.0.1:34425_solr c:testcollection s:shard1 r:core_node2 x:testcollection_shard1_replica_n1] o.a.s.r.ManagedResourceStorage Loaded null at path _rest_managed.json using ZooKeeperStorageIO:path=/configs/solrCloudCollectionConfig
   [junit4]   2> 17951 INFO  (qtp1976245490-123) [n:127.0.0.1:34425_solr c:testcollection s:shard1 r:core_node2 x:testcollection_shard1_replica_n1] o.a.s.h.ReplicationHandler Commits will be reserved for 10000ms.
   [junit4]   2> 17957 INFO  (searcherExecutor-43-thread-1-processing-n:127.0.0.1:34425_solr x:testcollection_shard1_replica_n1 s:shard1 c:testcollection r:core_node2) [n:127.0.0.1:34425_solr c:testcollection s:shard1 r:core_node2 x:testcollection_shard1_replica_n1] o.a.s.c.SolrCore [testcollection_shard1_replica_n1] Registered new searcher Searcher@64c434ad[testcollection_shard1_replica_n1] main{ExitableDirectoryReader(UninvertingDirectoryReader())}
   [junit4]   2> 17957 INFO  (qtp1976245490-123) [n:127.0.0.1:34425_solr c:testcollection s:shard1 r:core_node2 x:testcollection_shard1_replica_n1] o.a.s.u.UpdateLog Could not find max version in index or recent updates, using new clock 1580773099275550720
   [junit4]   2> 17957 INFO  (qtp685136286-74) [n:127.0.0.1:41495_solr c:testcollection s:shard2 r:core_node8 x:testcollection_shard2_replica_n7] o.a.s.s.SolrIndexSearcher Opening [Searcher@2cb47f20[testcollection_shard2_replica_n7] main]
   [junit4]   2> 17963 INFO  (qtp685136286-74) [n:127.0.0.1:41495_solr c:testcollection s:shard2 r:core_node8 x:testcollection_shard2_replica_n7] o.a.s.r.ManagedResourceStorage Configured ZooKeeperStorageIO with znodeBase: /configs/solrCloudCollectionConfig
   [junit4]   2> 17966 INFO  (qtp685136286-74) [n:127.0.0.1:41495_solr c:testcollection s:shard2 r:core_node8 x:testcollection_shard2_replica_n7] o.a.s.r.ManagedResourceStorage Loaded null at path _rest_managed.json using ZooKeeperStorageIO:path=/configs/solrCloudCollectionConfig
   [junit4]   2> 17968 INFO  (qtp685136286-74) [n:127.0.0.1:41495_solr c:testcollection s:shard2 r:core_node8 x:testcollection_shard2_replica_n7] o.a.s.h.ReplicationHandler Commits will be reserved for 10000ms.
   [junit4]   2> 17971 INFO  (searcherExecutor-45-thread-1-processing-n:127.0.0.1:41495_solr x:testcollection_shard2_replica_n7 s:shard2 c:testcollection r:core_node8) [n:127.0.0.1:41495_solr c:testcollection s:shard2 r:core_node8 x:testcollection_shard2_replica_n7] o.a.s.c.SolrCore [testcollection_shard2_replica_n7] Registered new searcher Searcher@2cb47f20[testcollection_shard2_replica_n7] main{ExitableDirectoryReader(UninvertingDirectoryReader())}
   [junit4]   2> 17975 INFO  (qtp685136286-74) [n:127.0.0.1:41495_solr c:testcollection s:shard2 r:core_node8 x:testcollection_shard2_replica_n7] o.a.s.u.UpdateLog Could not find max version in index or recent updates, using new clock 1580773099294425088
   [junit4]   2> 17982 INFO  (qtp1976245490-58) [n:127.0.0.1:34425_solr c:testcollection s:shard2 r:core_node6 x:testcollection_shard2_replica_n5] o.a.s.c.ShardLeaderElectionContext Waiting until we see more replicas up for shard shard2: total=2 found=1 timeoutin=9999ms
   [junit4]   2> 17982 INFO  (qtp685136286-73) [n:127.0.0.1:41495_solr c:testcollection s:shard1 r:core_node4 x:testcollection_shard1_replica_n3] o.a.s.c.ShardLeaderElectionContext Enough replicas found to continue.
   [junit4]   2> 17994 INFO  (qtp685136286-73) [n:127.0.0.1:41495_solr c:testcollection s:shard1 r:core_node4 x:testcollection_shard1_replica_n3] o.a.s.c.ShardLeaderElectionContext I may be the new leader - try and sync
   [junit4]   2> 17994 INFO  (qtp685136286-73) [n:127.0.0.1:41495_solr c:testcollection s:shard1 r:core_node4 x:testcollection_shard1_replica_n3] o.a.s.c.SyncStrategy Sync replicas to https://127.0.0.1:41495/solr/testcollection_shard1_replica_n3/
   [junit4]   2> 18001 INFO  (qtp685136286-73) [n:127.0.0.1:41495_solr c:testcollection s:shard1 r:core_node4 x:testcollection_shard1_replica_n3] o.a.s.u.PeerSync PeerSync: core=testcollection_shard1_replica_n3 url=https://127.0.0.1:41495/solr START replicas=[https://127.0.0.1:34425/solr/testcollection_shard1_replica_n1/] nUpdates=100
   [junit4]   2> 18030 INFO  (qtp1976245490-61) [n:127.0.0.1:34425_solr c:testcollection s:shard1 r:core_node2 x:testcollection_shard1_replica_n1] o.a.s.c.S.Request [testcollection_shard1_replica_n1]  webapp=/solr path=/get params={distrib=false&qt=/get&fingerprint=false&getVersions=100&wt=javabin&version=2} status=0 QTime=5
   [junit4]   2> 18096 INFO  (zkCallback-17-thread-2-processing-n:127.0.0.1:41495_solr) [n:127.0.0.1:41495_solr    ] o.a.s.c.c.ZkStateReader A cluster state change: [WatchedEvent state:SyncConnected type:NodeDataChanged path:/collections/testcollection/state.json] for collection [testcollection] has occurred - updating... (live nodes size: [2])
   [junit4]   2> 18096 INFO  (zkCallback-17-thread-1-processing-n:127.0.0.1:41495_solr) [n:127.0.0.1:41495_solr    ] o.a.s.c.c.ZkStateReader A cluster state change: [WatchedEvent state:SyncConnected type:NodeDataChanged path:/collections/testcollection/state.json] for collection [testcollection] has occurred - updating... (live nodes size: [2])
   [junit4]   2> 18096 INFO  (zkCallback-16-thread-2-processing-n:127.0.0.1:34425_solr) [n:127.0.0.1:34425_solr    ] o.a.s.c.c.ZkStateReader A cluster state change: [WatchedEvent state:SyncConnected type:NodeDataChanged path:/collections/testcollection/state.json] for collection [testcollection] has occurred - updating... (live nodes size: [2])
   [junit4]   2> 18317 INFO  (qtp685136286-73) [n:127.0.0.1:41495_solr c:testcollection s:shard1 r:core_node4 x:testcollection_shard1_replica_n3] o.a.s.u.PeerSync PeerSync: core=testcollection_shard1_replica_n3 url=https://127.0.0.1:41495/solr DONE.  We have no versions.  sync failed.
   [junit4]   2> 18318 INFO  (qtp685136286-73) [n:127.0.0.1:41495_solr c:testcollection s:shard1 r:core_node4 x:testcollection_shard1_replica_n3] o.a.s.c.SyncStrategy Leader's attempt to sync with shard failed, moving to the next candidate
   [junit4]   2> 18318 INFO  (qtp685136286-73) [n:127.0.0.1:41495_solr c:testcollection s:shard1 r:core_node4 x:testcollection_shard1_replica_n3] o.a.s.c.ShardLeaderElectionContext We failed sync, but we have no versions - we can't sync in that case - we were active before, so become leader anyway
   [junit4]   2> 18318 INFO  (qtp685136286-73) [n:127.0.0.1:41495_solr c:testcollection s:shard1 r:core_node4 x:testcollection_shard1_replica_n3] o.a.s.c.ShardLeaderElectionContext Found all replicas participating in election, clear LIR
   [junit4]   2> 18337 INFO  (qtp685136286-73) [n:127.0.0.1:41495_solr c:testcollection s:shard1 r:core_node4 x:testcollection_shard1_replica_n3] o.a.s.c.ShardLeaderElectionContext I am the new leader: https://127.0.0.1:41495/solr/testcollection_shard1_replica_n3/ shard1
   [junit4]   2> 18450 INFO  (zkCallback-16-thread-2-processing-n:127.0.0.1:34425_solr) [n:127.0.0.1:34425_solr    ] o.a.s.c.c.ZkStateReader A cluster state change: [WatchedEvent state:SyncConnected type:NodeDataChanged path:/collections/testcollection/state.json] for collection [testcollection] has occurred - updating... (live nodes size: [2])
   [junit4]   2> 18454 INFO  (zkCallback-17-thread-2-processing-n:127.0.0.1:41495_solr) [n:127.0.0.1:41495_solr    ] o.a.s.c.c.ZkStateReader A cluster state change: [WatchedEvent state:SyncConnected type:NodeDataChanged path:/collections/testcollection/state.json] for collection [testcollection] has occurred - updating... (live nodes size: [2])
   [junit4]   2> 18454 INFO  (zkCallback-17-thread-1-processing-n:127.0.0.1:41495_solr) [n:127.0.0.1:41495_solr    ] o.a.s.c.c.ZkStateReader A cluster state change: [WatchedEvent state:SyncConnected type:NodeDataChanged path:/collections/testcollection/state.json] for collection [testcollection] has occurred - updating... (live nodes size: [2])
   [junit4]   2> 18483 INFO  (qtp1976245490-58) [n:127.0.0.1:34425_solr c:testcollection s:shard2 r:core_node6 x:testcollection_shard2_replica_n5] o.a.s.c.ShardLeaderElectionContext Enough replicas found to continue.
   [junit4]   2> 18483 INFO  (qtp1976245490-58) [n:127.0.0.1:34425_solr c:testcollection s:shard2 r:core_node6 x:testcollection_shard2_replica_n5] o.a.s.c.ShardLeaderElectionContext I may be the new leader - try and sync
   [junit4]   2> 18483 INFO  (qtp1976245490-58) [n:127.0.0.1:34425_solr c:testcollection s:shard2 r:core_node6 x:testcollection_shard2_replica_n5] o.a.s.c.SyncStrategy Sync replicas to https://127.0.0.1:34425/solr/testcollection_shard2_replica_n5/
   [junit4]   2> 18484 INFO  (qtp1976245490-58) [n:127.0.0.1:34425_solr c:testcollection s:shard2 r:core_node6 x:testcollection_shard2_replica_n5] o.a.s.u.PeerSync PeerSync: core=testcollection_shard2_replica_n5 url=https://127.0.0.1:34425/solr START replicas=[https://127.0.0.1:41495/solr/testcollection_shard2_replica_n7/] nUpdates=100
   [junit4]   2> 18490 INFO  (qtp685136286-73) [n:127.0.0.1:41495_solr c:testcollection s:shard1 r:core_node4 x:testcollection_shard1_replica_n3] o.a.s.c.ZkController I am the leader, no recovery necessary
   [junit4]   2> 18492 INFO  (qtp685136286-73) [n:127.0.0.1:41495_solr c:testcollection s:shard1 r:core_node4 x:testcollection_shard1_replica_n3] o.a.s.s.HttpSolrCall [admin] webapp=null path=/admin/cores params={qt=/admin/cores&coreNodeName=core_node4&collection.configName=solrCloudCollectionConfig&newCollection=true&name=testcollection_shard1_replica_n3&action=CREATE&numShards=2&collection=testcollection&shard=shard1&wt=javabin&version=2&replicaType=NRT} status=0 QTime=1981
   [junit4]   2> 18517 INFO  (qtp685136286-67) [n:127.0.0.1:41495_solr c:testcollection s:shard2 r:core_node8 x:testcollection_shard2_replica_n7] o.a.s.c.S.Request [testcollection_shard2_replica_n7]  webapp=/solr path=/get params={distrib=false&qt=/get&fingerprint=false&getVersions=100&wt=javabin&version=2} status=0 QTime=1
   [junit4]   2> 18599 INFO  (zkCallback-17-thread-2-processing-n:127.0.0.1:41495_solr) [n:127.0.0.1:41495_solr    ] o.a.s.c.c.ZkStateReader A cluster state change: [WatchedEvent state:SyncConnected type:NodeDataChanged path:/collections/testcollection/state.json] for collection [testcollection] has occurred - updating... (live nodes size: [2])
   [junit4]   2> 18599 INFO  (zkCallback-17-thread-1-processing-n:127.0.0.1:41495_solr) [n:127.0.0.1:41495_solr    ] o.a.s.c.c.ZkStateReader A cluster state change: [WatchedEvent state:SyncConnected type:NodeDataChanged path:/collections/testcollection/state.json] for collection [testcollection] has occurred - updating... (live nodes size: [2])
   [junit4]   2> 18601 INFO  (zkCallback-16-thread-2-processing-n:127.0.0.1:34425_solr) [n:127.0.0.1:34425_solr    ] o.a.s.c.c.ZkStateReader A cluster state change: [WatchedEvent state:SyncConnected type:NodeDataChanged path:/collections/testcollection/state.json] for collection [testcollection] has occurred - updating... (live nodes size: [2])
   [junit4]   2> 18788 INFO  (qtp1976245490-58) [n:127.0.0.1:34425_solr c:testcollection s:shard2 r:core_node6 x:testcollection_shard2_replica_n5] o.a.s.u.PeerSync PeerSync: core=testcollection_shard2_replica_n5 url=https://127.0.0.1:34425/solr DONE.  We have no versions.  sync failed.
   [junit4]   2> 18788 INFO  (qtp1976245490-58) [n:127.0.0.1:34425_solr c:testcollection s:shard2 r:core_node6 x:testcollection_shard2_replica_n5] o.a.s.c.SyncStrategy Leader's attempt to sync with shard failed, moving to the next candidate
   [junit4]   2> 18788 INFO  (qtp1976245490-58) [n:127.0.0.1:34425_solr c:testcollection s:shard2 r:core_node6 x:testcollection_shard2_replica_n5] o.a.s.c.ShardLeaderElectionContext We failed sync, but we have no versions - we can't sync in that case - we were active before, so become leader anyway
   [junit4]   2> 18788 INFO  (qtp1976245490-58) [n:127.0.0.1:34425_solr c:testcollection s:shard2 r:core_node6 x:testcollection_shard2_replica_n5] o.a.s.c.ShardLeaderElectionContext Found all replicas participating in election, clear LIR
   [junit4]   2> 18795 INFO  (qtp1976245490-58) [n:127.0.0.1:34425_solr c:testcollection s:shard2 r:core_node6 x:testcollection_shard2_replica_n5] o.a.s.c.ShardLeaderElectionContext I am the new leader: https://127.0.0.1:34425/solr/testcollection_shard2_replica_n5/ shard2
   [junit4]   2> 18903 INFO  (zkCallback-16-thread-2-processing-n:127.0.0.1:34425_solr) [n:127.0.0.1:34425_solr    ] o.a.s.c.c.ZkStateReader A cluster state change: [WatchedEvent state:SyncConnected type:NodeDataChanged path:/collections/testcollection/state.json] for collection [testcollection] has occurred - updating... (live nodes size: [2])
   [junit4]   2> 18903 INFO  (zkCallback-17-thread-2-processing-n:127.0.0.1:41495_solr) [n:127.0.0.1:41495_solr    ] o.a.s.c.c.ZkStateReader A cluster state change: [WatchedEvent state:SyncConnected type:NodeDataChanged path:/collections/testcollection/state.json] for collection [testcollection] has occurred - updating... (live nodes size: [2])
   [junit4]   2> 18904 INFO  (zkCallback-17-thread-1-processing-n:127.0.0.1:41495_solr) [n:127.0.0.1:41495_solr    ] o.a.s.c.c.ZkStateReader A cluster state change: [WatchedEvent state:SyncConnected type:NodeDataChanged path:/collections/testcollection/state.json] for collection [testcollection] has occurred - updating... (live nodes size: [2])
   [junit4]   2> 18947 INFO  (qtp1976245490-58) [n:127.0.0.1:34425_solr c:testcollection s:shard2 r:core_node6 x:testcollection_shard2_replica_n5] o.a.s.c.ZkController I am the leader, no recovery necessary
   [junit4]   2> 18949 INFO  (qtp1976245490-58) [n:127.0.0.1:34425_solr c:testcollection s:shard2 r:core_node6 x:testcollection_shard2_replica_n5] o.a.s.s.HttpSolrCall [admin] webapp=null path=/admin/cores params={qt=/admin/cores&coreNodeName=core_node6&collection.configName=solrCloudCollectionConfig&newCollection=true&name=testcollection_shard2_replica_n5&action=CREATE&numShards=2&collection=testcollection&shard=shard2&wt=javabin&version=2&replicaType=NRT} status=0 QTime=2522
   [junit4]   2> 18984 INFO  (qtp1976245490-123) [n:127.0.0.1:34425_solr c:testcollection s:shard1 r:core_node2 x:testcollection_shard1_replica_n1] o.a.s.s.HttpSolrCall [admin] webapp=null path=/admin/cores params={qt=/admin/cores&coreNodeName=core_node2&collection.configName=solrCloudCollectionConfig&newCollection=true&name=testcollection_shard1_replica_n1&action=CREATE&numShards=2&collection=testcollection&shard=shard1&wt=javabin&version=2&replicaType=NRT} status=0 QTime=2555
   [junit4]   2> 19000 INFO  (qtp685136286-74) [n:127.0.0.1:41495_solr c:testcollection s:shard2 r:core_node8 x:testcollection_shard2_replica_n7] o.a.s.s.HttpSolrCall [admin] webapp=null path=/admin/cores params={qt=/admin/cores&coreNodeName=core_node8&collection.configName=solrCloudCollectionConfig&newCollection=true&name=testcollection_shard2_replica_n7&action=CREATE&numShards=2&collection=testcollection&shard=shard2&wt=javabin&version=2&replicaType=NRT} status=0 QTime=2522
   [junit4]   2> 19033 INFO  (qtp1976245490-64) [n:127.0.0.1:34425_solr    ] o.a.s.h.a.CollectionsHandler Wait for new collection to be active for at most 30 seconds. Check all shard replicas
   [junit4]   2> 19108 INFO  (zkCallback-17-thread-2-processing-n:127.0.0.1:41495_solr) [n:127.0.0.1:41495_solr    ] o.a.s.c.c.ZkStateReader A cluster state change: [WatchedEvent state:SyncConnected type:NodeDataChanged path:/collections/testcollection/state.json] for collection [testcollection] has occurred - updating... (live nodes size: [2])
   [junit4]   2> 19108 INFO  (zkCallback-17-thread-1-processing-n:127.0.0.1:41495_solr) [n:127.0.0.1:41495_solr    ] o.a.s.c.c.ZkStateReader A cluster state change: [WatchedEvent state:SyncConnected type:NodeDataChanged path:/collections/testcollection/state.json] for collection [testcollection] has occurred - updating... (live nodes size: [2])
   [junit4]   2> 19109 INFO  (zkCallback-16-thread-2-processing-n:127.0.0.1:34425_solr) [n:127.0.0.1:34425_solr    ] o.a.s.c.c.ZkStateReader A cluster state change: [WatchedEvent state:SyncConnected type:NodeDataChanged path:/collections/testcollection/state.json] for collection [testcollection] has occurred - updating... (live nodes size: [2])
   [junit4]   2> 20016 INFO  (OverseerCollectionConfigSetProcessor-98798318449197061-127.0.0.1:34425_solr-n_0000000000) [n:127.0.0.1:34425_solr    ] o.a.s.c.OverseerTaskQueue Response ZK path: /overseer/collection-queue-work/qnr-0000000000 doesn't exist.  Requestor may have disconnected from ZooKeeper
   [junit4]   2> 20033 INFO  (qtp1976245490-64) [n:127.0.0.1:34425_solr    ] o.a.s.s.HttpSolrCall [admin] webapp=null path=/admin/collections params={replicationFactor=2&collection.configName=solrCloudCollectionConfig&maxShardsPerNode=2&name=testcollection&nrtReplicas=2&action=CREATE&numShards=2&wt=javabin&version=2} status=0 QTime=4036
   [junit4]   2> 20039 INFO  (TEST-TestAuthenticationFramework.testBasics-seed#[7A8D8D9AC81CD729]) [    ] o.a.s.c.AbstractDistribZkTestBase Wait for recoveries to finish - collection: testcollection failOnTimeout:true timeout (sec):330
   [junit4]   1> -
   [junit4]   1> replica:core_node2 rstate:active live:true
   [junit4]   1> replica:core_node4 rstate:active live:true
   [junit4]   1> replica:core_node6 rstate:active live:true
   [junit4]   1> replica:core_node8 rstate:active live:true
   [junit4]   1> no one is recoverying
   [junit4]   2> 20040 INFO  (TEST-TestAuthenticationFramework.testBasics-seed#[7A8D8D9AC81CD729]) [    ] o.a.s.c.AbstractDistribZkTestBase Recoveries finished - collection: testcollection
   [junit4]   2> 20062 INFO  (qtp685136286-65) [n:127.0.0.1:41495_solr c:testcollection s:shard2 r:core_node8 x:testcollection_shard2_replica_n7] o.a.s.c.S.Request [testcollection_shard2_replica_n7]  webapp=/solr path=/select params={df=text&distrib=false&_stateVer_=testcollection:7&fl=id&fl=score&shards.purpose=4&start=0&fsv=true&shard.url=https://127.0.0.1:41495/solr/testcollection_shard2_replica_n7/|https://127.0.0.1:34425/solr/testcollection_shard2_replica_n5/&rows=10&version=2&q=*:*&NOW=1507542706941&isShard=true&wt=javabin} hits=0 status=0 QTime=2
   [junit4]   2> 20062 INFO  (qtp1976245490-59) [n:127.0.0.1:34425_solr c:testcollection s:shard1 r:core_node2 x:testcollection_shard1_replica_n1] o.a.s.c.S.Request [testcollection_shard1_replica_n1]  webapp=/solr path=/select params={df=text&distrib=false&_stateVer_=testcollection:7&fl=id&fl=score&shards.purpose=4&start=0&fsv=true&shard.url=https://127.0.0.1:34425/solr/testcollection_shard1_replica_n1/|https://127.0.0.1:41495/solr/testcollection_shard1_replica_n3/&rows=10&version=2&q=*:*&NOW=1507542706941&isShard=true&wt=javabin} hits=0 status=0 QTime=1
   [junit4]   2> 20069 INFO  (qtp1976245490-68) [n:127.0.0.1:34425_solr c:testcollection s:shard2 r:core_node6 x:testcollection_shard2_replica_n5] o.a.s.c.S.Request [testcollection_shard2_replica_n5]  webapp=/solr path=/select params={q=*:*&_stateVer_=testcollection:7&wt=javabin&version=2} hits=0 status=0 QTime=18
   [junit4]   2> 20143 INFO  (qtp1976245490-66) [n:127.0.0.1:34425_solr c:testcollection s:shard1 r:core_node2 x:testcollection_shard1_replica_n1] o.a.s.u.p.LogUpdateProcessorFactory [testcollection_shard1_replica_n1]  webapp=/solr path=/update params={update.distrib=FROMLEADER&distrib.from=https://127.0.0.1:41495/solr/testcollection_shard1_replica_n3/&wt=javabin&version=2}{add=[1 (1580773101527891968)]} 0 3
   [junit4]   2> 20154 INFO  (qtp685136286-65) [n:127.0.0.1:41495_solr c:testcollection s:shard1 r:core_node4 x:testcollection_shard1_replica_n3] o.a.s.u.p.LogUpdateProcessorFactory [testcollection_shard1_replica_n3]  webapp=/solr path=/update params={_stateVer_=testcollection:7&wt=javabin&version=2}{add=[1 (1580773101527891968)]} 0 64
   [junit4]   2> 20164 INFO  (qtp1976245490-58) [n:127.0.0.1:34425_solr c:testcollection s:shard1 r:core_node2 x:testcollection_shard1_replica_n1] o.a.s.u.DirectUpdateHandler2 start commit{_version_=1580773101589757952,optimize=false,openSearcher=true,waitSearcher=true,expungeDeletes=false,softCommit=false,prepareCommit=false}
   [junit4]   2> 20164 INFO  (qtp1976245490-58) [n:127.0.0.1:34425_solr c:testcollection s:shard1 r:core_node2 x:testcollection_shard1_replica_n1] o.a.s.u.SolrIndexWriter Calling setCommitData with IW:org.apache.solr.update.SolrIndexWriter@67158ff5 commitCommandVersion:1580773101589757952
   [junit4]   2> 20185 INFO  (qtp685136286-73) [n:127.0.0.1:41495_solr c:testcollection s:shard1 r:core_node4 x:testcollection_shard1_replica_n3] o.a.s.u.DirectUpdateHandler2 start commit{_version_=1580773101611778048,optimize=false,openSearcher=true,waitSearcher=true,expungeDeletes=false,softCommit=false,prepareCommit=false}
   [junit4]   2> 20185 INFO  (qtp685136286-73) [n:127.0.0.1:41495_solr c:testcollection s:shard1 r:core_node4 x:testcollection_shard1_replica_n3] o.a.s.u.SolrIndexWriter Calling setCommitData with IW:org.apache.solr.update.SolrIndexWriter@609f82ed commitCommandVersion:1580773101611778048
   [junit4]   2> 20186 INFO  (qtp1976245490-124) [n:127.0.0.1:34425_solr c:testcollection s:shard2 r:core_node6 x:testcollection_shard2_replica_n5] o.a.s.u.DirectUpdateHandler2 start commit{_version_=1580773101612826624,optimize=false,openSearcher=true,waitSearcher=true,expungeDeletes=false,softCommit=false,prepareCommit=false}
   [junit4]   2> 20186 INFO  (qtp1976245490-124) [n:127.0.0.1:34425_solr c:testcollection s:shard2 r:core_node6 x:testcollection_shard2_replica_n5] o.a.s.u.DirectUpdateHandler2 No uncommitted changes. Skipping IW.commit.
   [junit4]   2> 20204 INFO  (qtp1976245490-124) [n:127.0.0.1:34425_solr c:testcollection s:shard2 r:core_node6 x:testcollection_shard2_replica_n5] o.a.s.u.DirectUpdateHandler2 end_commit_flush
   [junit4]   2> 20204 INFO  (qtp1976245490-124) [n:127.0.0.1:34425_solr c:testcollection s:shard2 r:core_node6 x:testcollection_shard2_replica_n5] o.a.s.u.p.LogUpdateProcessorFactory [testcollection_shard2_replica_n5]  webapp=/solr path=/update params={update.distrib=FROMLEADER&waitSearcher=true&openSearcher=true&commit=true&softCommit=false&distrib.from=https://127.0.0.1:41495/solr/testcollection_shard1_replica_n3/&commit_end_point=true&wt=javabin&version=2&expungeDeletes=false}{commit=} 0 18
   [junit4]   2> 20215 INFO  (qtp1976245490-58) [n:127.0.0.1:34425_solr c:testcollection s:shard1 r:core_node2 x:testcollection_shard1_replica_n1] o.a.s.s.SolrIndexSearcher Opening [Searcher@189e9c64[testcollection_shard1_replica_n1] main]
   [junit4]   2> 20216 INFO  (qtp685136286-73) [n:127.0.0.1:41495_solr c:testcollection s:shard1 r:core_node4 x:testcollection_shard1_replica_n3] o.a.s.s.SolrIndexSearcher Opening [Searcher@34abc81a[testcollection_shard1_replica_n3] main]
   [junit4]   2> 20217 INFO  (qtp685136286-73) [n:127.0.0.1:41495_solr c:testcollection s:shard1 r:core_node4 x:testcollection_shard1_replica_n3] o.a.s.u.DirectUpdateHandler2 end_commit_flush
   [junit4]   2> 20218 INFO  (qtp685136286-65) [n:127.0.0.1:41495_solr c:testcollection s:shard2 r:core_node8 x:testcollection_shard2_replica_n7] o.a.s.u.DirectUpdateHandler2 start commit{_version_=1580773101646381056,optimize=false,openSearcher=true,waitSearcher=true,expungeDeletes=false,softCommit=false,prepareCommit=false}
   [junit4]   2> 20219 INFO  (qtp1976245490-58) [n:127.0.0.1:34425_solr c:testcollection s:shard1 r:core_node2 x:testcollection_shard1_replica_n1] o.a.s.u.DirectUpdateHandler2 end_commit_flush
   [junit4]   2> 20220 INFO  (qtp685136286-65) [n:127.0.0.1:41495_solr c:testcollection s:shard2 r:core_node8 x:testcollection_shard2_replica_n7] o.a.s.u.DirectUpdateHandler2 No uncommitted changes. Skipping IW.commit.
   [junit4]   2> 20223 INFO  (searcherExecutor-42-thread-1-processing-n:127.0.0.1:41495_solr x:testcollection_shard1_replica_n3 s:shard1 c:testcollection r:core_node4) [n:127.0.0.1:41495_solr c:testcollection s:shard1 r:core_node4 x:testcollection_shard1_replica_n3] o.a.s.c.SolrCore [testcollection_shard1_replica_n3] Registered new searcher Searcher@34abc81a[testcollection_shard1_replica_n3] main{ExitableDirectoryReader(UninvertingDirectoryReader(Uninverting(_0(8.0.0):C1)))}
   [junit4]   2> 20224 INFO  (searcherExecutor-43-thread-1-processing-n:127.0.0.1:34425_solr x:testcollection_shard1_replica_n1 s:shard1 c:testcollection r:core_node2) [n:127.0.0.1:34425_solr c:testcollection s:shard1 r:core_node2 x:testcollection_shard1_replica_n1] o.a.s.c.SolrCore [testcollection_shard1_replica_n1] Registered new searcher Searcher@189e9c64[testcollection_shard1_replica_n1] main{ExitableDirectoryReader(UninvertingDirectoryReader(Uninverting(_0(8.0.0):C1)))}
   [junit4]   2> 20228 INFO  (qtp685136286-65) [n:127.0.0.1:41495_solr c:testcollection s:shard2 r:core_node8 x:testcollection_shard2_replica_n7] o.a.s.u.DirectUpdateHandler2 end_commit_flush
   [junit4]   2> 20228 INFO  (qtp685136286-65) [n:127.0.0.1:41495_solr c:testcollection s:shard2 r:core_node8 x:testcollection_shard2_replica_n7] o.a.s.u.p.LogUpdateProcessorFactory [testcollection_shard2_replica_n7]  webapp=/solr path=/update params={update.distrib=FROMLEADER&waitSearcher=true&openSearcher=true&commit=true&softCommit=false&distrib.from=https://127.0.0.1:41495/solr/testcollection_shard1_replica_n3/&commit_end_point=true&wt=javabin&version=2&expungeDeletes=false}{commit=} 0 13
   [junit4]   2> 20229 INFO  (qtp685136286-73) [n:127.0.0.1:41495_solr c:testcollection s:shard1 r:core_node4 x:testcollection_shard1_replica_n3] o.a.s.u.p.LogUpdateProcessorFactory [testcollection_shard1_replica_n3]  webapp=/solr path=/update params={update.distrib=FROMLEADER&waitSearcher=true&openSearcher=true&commit=true&softCommit=false&distrib.from=https://127.0.0.1:41495/solr/testcollection_shard1_replica_n3/&commit_end_point=true&wt=javabin&version=2&expungeDeletes=false}{commit=} 0 41
   [junit4]   2> 20229 INFO  (qtp1976245490-58) [n:127.0.0.1:34425_solr c:testcollection s:shard1 r:core_node2 x:testcollection_shard1_replica_n1] o.a.s.u.p.LogUpdateProcessorFactory [testcollection_shard1_replica_n1]  webapp=/solr path=/update params={update.distrib=FROMLEADER&waitSearcher=true&openSearcher=true&commit=true&softCommit=false&distrib.from=https://127.0.0.1:41495/solr/testcollection_shard1_replica_n3/&commit_end_point=true&wt=javabin&version=2&expungeDeletes=false}{commit=} 0 65
   [junit4]   2> 20232 INFO  (qtp685136286-69) [n:127.0.0.1:41495_solr c:testcollection s:shard1 r:core_node4 x:testcollection_shard1_replica_n3] o.a.s.u.p.LogUpdateProcessorFactory [testcollection_shard1_replica_n3]  webapp=/solr path=/update params={_stateVer_=testcollection:7&commit=true&wt=javabin&version=2}{commit=} 0 74
   [junit4]   2> 20245 INFO  (qtp685136286-65) [n:127.0.0.1:41495_solr c:testcollection s:shard2 r:core_node8 x:testcollection_shard2_replica_n7] o.a.s.c.S.Request [testcollection_shard2_replica_n7]  webapp=/solr path=/select params={df=text&distrib=false&_stateVer_=testcollection:7&fl=id&fl=score&shards.purpose=4&start=0&fsv=true&shard.url=https://127.0.0.1:41495/solr/testcollection_shard2_replica_n7/|https://127.0.0.1:34425/solr/testcollection_shard2_replica_n5/&rows=10&version=2&q=*:*&NOW=1507542707122&isShard=true&wt=javabin} hits=0 status=0 QTime=0
   [junit4]   2> 20248 INFO  (qtp1976245490-66) [n:127.0.0.1:34425_solr c:testcollection s:shard1 r:core_node2 x:testcollection_shard1_replica_n1] o.a.s.c.S.Request [testcollection_shard1_replica_n1]  webapp=/solr path=/select params={df=text&distrib=false&_stateVer_=testcollection:7&fl=id&fl=score&shards.purpose=4&start=0&fsv=true&shard.url=https://127.0.0.1:34425/solr/testcollection_shard1_replica_n1/|https://127.0.0.1:41495/solr/testcollection_shard1_replica_n3/&rows=10&version=2&q=*:*&NOW=1507542707122&isShard=true&wt=javabin} hits=1 status=0 QTime=0
   [junit4]   2> 20258 INFO  (qtp1976245490-64) [n:127.0.0.1:34425_solr c:testcollection s:shard1 r:core_node2 x:testcollection_shard1_replica_n1] o.a.s.c.S.Request [testcollection_shard1_replica_n1]  webapp=/solr path=/select params={q=*:*&df=text&distrib=false&_stateVer_=testcollection:7&shards.purpose=64&NOW=1507542707122&ids=1&isShard=true&shard.url=https://127.0.0.1:34425/solr/testcollection_shard1_replica_n1/|https://127.0.0.1:41495/solr/testcollection_shard1_replica_n3/&wt=javabin&version=2} status=0 QTime=8
   [junit4]   2> 20261 INFO  (qtp685136286-67) [n:127.0.0.1:41495_solr c:testcollection s:shard1 r:core_node4 x:testcollection_shard1_replica_n3] o.a.s.c.S.Request [testcollection_shard1_replica_n3]  webapp=/solr path=/select params={q=*:*&_stateVer_=testcollection:7&wt=javabin&version=2} hits=1 status=0 QTime=27
   [junit4]   2> 20264 INFO  (qtp1976245490-139) [n:127.0.0.1:34425_solr    ] o.a.s.h.a.CollectionsHandler Invoked Collection Action :delete with params name=testcollection&action=DELETE&wt=javabin&version=2 and sendToOCPQueue=true
   [junit4]   2> 20271 INFO  (OverseerThreadFactory-37-thread-2-processing-n:127.0.0.1:34425_solr) [n:127.0.0.1:34425_solr    ] o.a.s.c.OverseerCollectionMessageHandler Executing Collection Cmd : action=UNLOAD&deleteInstanceDir=true&deleteDataDir=true
   [junit4]   2> 20273 INFO  (qtp685136286-74) [n:127.0.0.1:41495_solr    ] o.a.s.m.SolrMetricManager Closing metric reporters for registry=solr.core.testcollection.shard1.replica_n3, tag=null
   [junit4]   2> 20273 INFO  (qtp685136286-74) [n:127.0.0.1:41495_solr    ] o.a.s.m.r.SolrJmxReporter Closing reporter [org.apache.solr.metrics.reporters.SolrJmxReporter@652098d5: rootName = solr_41495, domain = solr.core.testcollection.shard1.replica_n3, service url = null, agent id = null] for registry solr.core.testcollection.shard1.replica_n3 / com.codahale.metrics.MetricRegistry@5ee92dd7
   [junit4]   2> 20274 INFO  (qtp1976245490-124) [n:127.0.0.1:34425_solr    ] o.a.s.m.SolrMetricManager Closing metric reporters for registry=solr.core.testcollection.shard2.replica_n5, tag=null
   [junit4]   2> 20278 INFO  (qtp1976245490-124) [n:127.0.0.1:34425_solr    ] o.a.s.m.r.SolrJmxReporter Closing reporter [org.apache.solr.metrics.reporters.SolrJmxReporter@72d34a46: rootName = solr_34425, domain = solr.core.testcollection.shard2.replica_n5, service url = null, agent id = null] for registry solr.core.testcollection.shard2.replica_n5 / com.codahale.metrics.MetricRegistry@67168164
   [junit4]   2> 20320 INFO  (qtp1976245490-61) [n:127.0.0.1:34425_solr    ] o.a.s.m.SolrMetricManager Closing metric reporters for registry=solr.core.testcollection.shard1.replica_n1, tag=null
   [junit4]   2> 20320 INFO  (qtp1976245490-61) [n:127.0.0.1:34425_solr    ] o.a.s.m.r.SolrJmxReporter Closing reporter [org.apache.solr.metrics.reporters.SolrJmxReporter@7f8f311e: rootName = solr_34425, domain = solr.core.testcollection.shard1.replica_n1, service url = null, agent id = null] for registry solr.core.testcollection.shard1.replica_n1 / com.codahale.metrics.MetricRegistry@27aa4be3
   [junit4]   2> 20321 INFO  (qtp1976245490-124) [n:127.0.0.1:34425_solr    ] o.a.s.c.SolrCore [testcollection_shard2_replica_n5]  CLOSING SolrCore org.apache.solr.core.SolrCore@46c8e36b
   [junit4]   2> 20338 INFO  (qtp1976245490-124) [n:127.0.0.1:34425_solr    ] o.a.s.m.SolrMetricManager Closing metric reporters for registry=solr.core.testcollection.shard2.replica_n5, tag=1187570539
   [junit4]   2> 20338 INFO  (qtp1976245490-61) [n:127.0.0.1:34425_solr    ] o.a.s.c.SolrCore [testcollection_shard1_replica_n1]  CLOSING SolrCore org.apache.solr.core.SolrCore@12577b07
   [junit4]   2> 20338 INFO  (qtp1976245490-124) [n:127.0.0.1:34425_solr    ] o.a.s.m.SolrMetricManager Closing metric reporters for registry=solr.collection.testcollection.shard2.leader, tag=1187570539
   [junit4]   2> 20338 INFO  (qtp1976245490-61) [n:127.0.0.1:34425_solr    ] o.a.s.m.SolrMetricManager Closing metric reporters for registry=solr.core.testcollection.shard1.replica_n1, tag=307723015
   [junit4]   2> 20338 INFO  (qtp1976245490-61) [n:127.0.0.1:34425_solr    ] o.a.s.m.SolrMetricManager Closing metric reporters for registry=solr.collection.testcollection.shard1.leader, tag=307723015
   [junit4]   2> 20338 INFO  (qtp685136286-63) [n:127.0.0.1:41495_solr    ] o.a.s.m.SolrMetricManager Closing metric reporters for registry=solr.core.testcollection.shard2.replica_n7, tag=null
   [junit4]   2> 20338 INFO  (qtp685136286-63) [n:127.0.0.1:41495_solr    ] o.a.s.m.r.SolrJmxReporter Closing reporter [org.apache.solr.metrics.reporters.SolrJmxReporter@493f2eaf: rootName = solr_41495, domain = solr.core.testcollection.shard2.replica_n7, service url = null, agent id = null] for registry solr.core.testcollection.shard2.replica_n7 / com.codahale.metrics.MetricRegistry@7538bb26
   [junit4]   2> 20340 INFO  (qtp685136286-74) [n:127.0.0.1:41495_solr    ] o.a.s.c.SolrCore [testcollection_shard1_replica_n3]  CLOSING SolrCore org.apache.solr.core.SolrCore@6c144ffe
   [junit4]   2> 20355 INFO  (qtp685136286-74) [n:127.0.0.1:41495_solr    ] o.a.s.m.SolrMetricManager Closing metric reporters for registry=solr.core.testcollection.shard1.replica_n3, tag=1813270526
   [junit4]   2> 20355 INFO  (qtp685136286-74) [n:127.0.0.1:41495_solr    ] o.a.s.m.SolrMetricManager Closing metric reporters for registry=solr.collection.testcollection.shard1.leader, tag=1813270526
   [junit4]   2> 20355 INFO  (qtp685136286-63) [n:127.0.0.1:41495_solr    ] o.a.s.c.SolrCore [testcollection_shard2_replica_n7]  CLOSING SolrCore org.apache.solr.core.SolrCore@1d93a659
   [junit4]   2> 20355 INFO  (qtp685136286-63) [n:127.0.0.1:41495_solr    ] o.a.s.m.SolrMetricManager Closing metric reporters for registry=solr.core.testcollection.shard2.replica_n7, tag=496215641
   [junit4]   2> 20355 INFO  (qtp685136286-63) [n:127.0.0.1:41495_solr    ] o.a.s.m.SolrMetricManager Closing metric reporters for registry=solr.collection.testcollection.shard2.leader, tag=496215641
   [junit4]   2> 20374 WARN  (zkCallback-17-thread-2-processing-n:127.0.0.1:41495_solr) [n:127.0.0.1:41495_solr    ] o.a.s.c.LeaderElector 
   [junit4]   2> org.apache.solr.common.SolrException: SolrCore not found:testcollection_shard2_replica_n7 in []
   [junit4]   2> 	at org.apache.solr.cloud.ShardLeaderElectionContext.runLeaderProcess(ElectionContext.java:309)
   [junit4]   2> 	at org.apache.solr.cloud.LeaderElector.runIamLeaderProcess(LeaderElector.java:170)
   [junit4]   2> 	at org.apache.solr.cloud.LeaderElector.checkIfIamLeader(LeaderElector.java:135)
   [junit4]   2> 	at org.apache.solr.cloud.LeaderElector.access$200(LeaderElector.java:56)
   [junit4]   2> 	at org.apache.solr.cloud.LeaderElector$ElectionWatcher.process(LeaderElector.java:348)
   [junit4]   2> 	at org.apache.solr.common.cloud.SolrZkClient$3.lambda$process$0(SolrZkClient.java:269)
   [junit4]   2> 	at java.util.concurrent.Executors$RunnableAdapter.call(Executors.java:511)
   [junit4]   2> 	at java.util.concurrent.FutureTask.run(FutureTask.java:266)
   [junit4]   2> 	at org.apache.solr.common.util.ExecutorUtil$MDCAwareThreadPoolExecutor.lambda$execute$0(ExecutorUtil.java:188)
   [junit4]   2> 	at java.util.concurrent.ThreadPoolExecutor.runWorker(ThreadPoolExecutor.java:1149)
   [junit4]   2> 	at java.util.concurrent.ThreadPoolExecutor$Worker.run(ThreadPoolExecutor.java:624)
   [junit4]   2> 	at java.lang.Thread.run(Thread.java:748)
   [junit4]   2> 20375 INFO  (qtp1976245490-124) [n:127.0.0.1:34425_solr    ] o.a.s.s.HttpSolrCall [admin] webapp=null path=/admin/cores params={deleteInstanceDir=true&core=testcollection_shard2_replica_n5&qt=/admin/cores&deleteDataDir=true&action=UNLOAD&wt=javabin&version=2} status=0 QTime=101
   [junit4]   2> 20399 INFO  (qtp685136286-63) [n:127.0.0.1:41495_solr    ] o.a.s.c.ShardLeaderElectionContextBase No version found for ephemeral leader parent node, won't remove previous leader registration.
   [junit4]   2> 20400 INFO  (qtp685136286-63) [n:127.0.0.1:41495_solr    ] o.a.s.s.HttpSolrCall [admin] webapp=null path=/admin/cores params={deleteInstanceDir=true&core=testcollection_shard2_replica_n7&qt=/admin/cores&deleteDataDir=true&action=UNLOAD&wt=javabin&version=2} status=0 QTime=113
   [junit4]   2> 20409 INFO  (qtp1976245490-61) [n:127.0.0.1:34425_solr    ] o.a.s.c.ShardLeaderElectionContextBase No version found for ephemeral leader parent node, won't remove previous leader registration.
   [junit4]   2> 20420 INFO  (qtp1976245490-61) [n:127.0.0.1:34425_solr    ] o.a.s.s.HttpSolrCall [admin] webapp=null path=/admin/cores params={deleteInstanceDir=true&core=testcollection_shard1_replica_n1&qt=/admin/cores&deleteDataDir=true&action=UNLOAD&wt=javabin&version=2} status=0 QTime=133
   [junit4]   2> 20427 INFO  (qtp685136286-74) [n:127.0.0.1:41495_solr    ] o.a.s.s.HttpSolrCall [admin] webapp=null path=/admin/cores params={deleteInstanceDir=true&core=testcollection_shard1_replica_n3&qt=/admin/cores&deleteDataDir=true&action=UNLOAD&wt=javabin&version=2} status=0 QTime=155
   [junit4]   2> 20427 WARN  (zkCallback-16-thread-2-processing-n:127.0.0.1:34425_solr) [n:127.0.0.1:34425_solr    ] o.a.s.c.LeaderElector Our node is no longer in line to be leader
   [junit4]   2> 21138 INFO  (qtp1976245490-139) [n:127.0.0.1:34425_solr    ] o.a.s.s.HttpSolrCall [admin] webapp=null path=/admin/collections params={name=testcollection&action=DELETE&wt=javabin&version=2} status=0 QTime=874
   [junit4]   2> 21139 INFO  (TEST-TestAuthenticationFramework.testBasics-seed#[7A8D8D9AC81CD729]) [    ] o.a.s.c.AbstractDistribZkTestBase Wait for collection to disappear - collection: testcollection failOnTimeout:true timeout (sec):330
   [junit4]   1> -
   [junit4]   2> 21139 INFO  (TEST-TestAuthenticationFramework.testBasics-seed#[7A8D8D9AC81CD729]) [    ] o.a.s.c.AbstractDistribZkTestBase Collection has disappeared - collection: testcollection
   [junit4]   2> 21141 INFO  (qtp1976245490-58) [n:127.0.0.1:34425_solr    ] o.a.s.h.a.CollectionsHandler Invoked Collection Action :create with params async=79490236-a3a3-448a-85fc-dcab5bbba0e8&replicationFactor=2&collection.configName=solrCloudCollectionConfig&maxShardsPerNode=2&name=testcollection&nrtReplicas=2&action=CREATE&numShards=2&wt=javabin&version=2 and sendToOCPQueue=true
   [junit4]   2> 21143 INFO  (qtp1976245490-58) [n:127.0.0.1:34425_solr    ] o.a.s.s.HttpSolrCall [admin] webapp=null path=/admin/collections params={async=79490236-a3a3-448a-85fc-dcab5bbba0e8&replicationFactor=2&collection.configName=solrCloudCollectionConfig&maxShardsPerNode=2&name=testcollection&nrtReplicas=2&action=CREATE&numShards=2&wt=javabin&version=2} status=0 QTime=1
   [junit4]   2> 21147 INFO  (qtp1976245490-66) [n:127.0.0.1:34425_solr    ] o.a.s.h.a.CollectionsHandler Invoked Collection Action :requeststatus with params requestid=79490236-a3a3-448a-85fc-dcab5bbba0e8&action=REQUESTSTATUS&wt=javabin&version=2 and sendToOCPQueue=true
   [junit4]   2> 21153 INFO  (qtp1976245490-66) [n:127.0.0.1:34425_solr    ] o.a.s.s.HttpSolrCall [admin] webapp=null path=/admin/collections params={requestid=79490236-a3a3-448a-85fc-dcab5bbba0e8&action=REQUESTSTATUS&wt=javabin&version=2} status=0 QTime=6
   [junit4]   2> 21167 INFO  (OverseerThreadFactory-37-thread-3-processing-n:127.0.0.1:34425_solr) [n:127.0.0.1:34425_solr    ] o.a.s.c.CreateCollectionCmd Create collection testcollection
   [junit4]   2> 21174 INFO  (OverseerCollectionConfigSetProcessor-98798318449197061-127.0.0.1:34425_solr-n_0000000000) [n:127.0.0.1:34425_solr    ] o.a.s.c.OverseerTaskQueue Response ZK path: /overseer/collection-queue-work/qnr-0000000002 doesn't exist.  Requestor may have disconnected from ZooKeeper
   [junit4]   2> 21391 INFO  (OverseerStateUpdate-98798318449197061-127.0.0.1:34425_solr-n_0000000000) [n:127.0.0.1:34425_solr    ] o.a.s.c.o.SliceMutator createReplica() {
   [junit4]   2>   "operation":"ADDREPLICA",
   [junit4]   2>   "collection":"testcollection",
   [junit4]   2>   "shard":"shard1",
   [junit4]   2>   "core":"testcollection_shard1_replica_n1",
   [junit4]   2>   "state":"down",
   [junit4]   2>   "base_url":"https://127.0.0.1:41495/solr",
   [junit4]   2>   "type":"NRT"} 
   [junit4]   2> 21404 INFO  (OverseerStateUpdate-98798318449197061-127.0.0.1:34425_solr-n_0000000000) [n:127.0.0.1:34425_solr    ] o.a.s.c.o.SliceMutator createReplica() {
   [junit4]   2>   "operation":"ADDREPLICA",
   [junit4]   2>   "collection":"testcollection",
   [junit4]   2>   "shard":"shard1",
   [junit4]   2>   "core":"testcollection_shard1_replica_n2",
   [junit4]   2>   "state":"down",
   [junit4]   2>   "base_url":"https://127.0.0.1:34425/solr",
   [junit4]   2>   "type":"NRT"} 
   [junit4]   2> 21408 INFO  (OverseerStateUpdate-98798318449197061-127.0.0.1:34425_solr-n_0000000000) [n:127.0.0.1:34425_solr    ] o.a.s.c.o.SliceMutator createReplica() {
   [junit4]   2>   "operation":"ADDREPLICA",
   [junit4]   2>   "collection":"testcollection",
   [junit4]   2>   "shard":"shard2",
   [junit4]   2>   "core":"testcollection_shard2_replica_n5",
   [junit4]   2>   "state":"down",
   [junit4]   2>   "base_url":"https://127.0.0.1:41495/solr",
   [junit4]   2>   "type":"NRT"} 
   [junit4]   2> 21421 INFO  (OverseerStateUpdate-98798318449197061-127.0.0.1:34425_solr-n_0000000000) [n:127.0.0.1:34425_solr    ] o.a.s.c.o.SliceMutator createReplica() {
   [junit4]   2>   "operation":"ADDREPLICA",
   [junit4]   2>   "collection":"testcollection",
   [junit4]   2>   "shard":"shard2",
   [junit4]   2>   "core":"testcollection_shard2_replica_n6",
   [junit4]   2>   "state":"down",
   [junit4]   2>   "base_url":"https://127.0.0.1:34425/solr",
   [junit4]   2>   "type":"NRT"} 
   [junit4]   2> 21626 INFO  (qtp685136286-69) [n:127.0.0.1:41495_solr    ] o.a.s.s.HttpSolrCall [admin] webapp=null path=/admin/cores params={qt=/admin/cores&collection.configName=solrCloudCollectionConfig&newCollection=true&collection=testcollection&version=2&replicaType=NRT&async=79490236-a3a3-448a-85fc-dcab5bbba0e83461557596457421&coreNodeName=core_node3&name=testcollection_shard1_replica_n1&action=CREATE&numShards=2&shard=shard1&wt=javabin} status=0 QTime=1
   [junit4]   2> 21626 INFO  (parallelCoreAdminExecutor-38-thread-1-processing-n:127.0.0.1:41495_solr 79490236-a3a3-448a-85fc-dcab5bbba0e83461557596457421 CREATE) [n:127.0.0.1:41495_solr    ] o.a.s.h.a.CoreAdminOperation core create command qt=/admin/cores&collection.configName=solrCloudCollectionConfig&newCollection=true&collection=testcollection&version=2&replicaType=NRT&async=79490236-a3a3-448a-85fc-dcab5bbba0e83461557596457421&coreNodeName=core_node3&name=testcollection_shard1_replica_n1&action=CREATE&numShards=2&shard=shard1&wt=javabin
   [junit4]   2> 21636 INFO  (qtp1976245490-59) [n:127.0.0.1:34425_solr    ] o.a.s.s.HttpSolrCall [admin] webapp=null path=/admin/cores params={qt=/admin/cores&collection.configName=solrCloudCollectionConfig&newCollection=true&collection=testcollection&version=2&replicaType=NRT&async=79490236-a3a3-448a-85fc-dcab5bbba0e83461557623152148&coreNodeName=core_node8&name=testcollection_shard2_replica_n6&action=CREATE&numShards=2&shard=shard2&wt=javabin} status=0 QTime=10
   [junit4]   2> 21638 INFO  (parallelCoreAdminExecutor-39-thread-1-processing-n:127.0.0.1:34425_solr 79490236-a3a3-448a-85fc-dcab5bbba0e83461557623152148 CREATE) [n:127.0.0.1:34425_solr    ] o.a.s.h.a.CoreAdminOperation core create command qt=/admin/cores&collection.configName=solrCloudCollectionConfig&newCollection=true&collection=testcollection&version=2&replicaType=NRT&async=79490236-a3a3-448a-85fc-dcab5bbba0e83461557623152148&coreNodeName=core_node8&name=testcollection_shard2_replica_n6&action=CREATE&numShards=2&shard=shard2&wt=javabin
   [junit4]   2> 21646 INFO  (qtp1976245490-68) [n:127.0.0.1:34425_solr    ] o.a.s.s.HttpSolrCall [admin] webapp=null path=/admin/cores params={qt=/admin/cores&collection.configName=solrCloudCollectionConfig&newCollection=true&collection=testcollection&version=2&replicaType=NRT&async=79490236-a3a3-448a-85fc-dcab5bbba0e83461557607242978&coreNodeName=core_node4&name=testcollection_shard1_replica_n2&action=CREATE&numShards=2&shard=shard1&wt=javabin} status=0 QTime=8
   [junit4]   2> 21646 INFO  (qtp685136286-71) [n:127.0.0.1:41495_solr    ] o.a.s.s.HttpSolrCall [admin] webapp=null path=/admin/cores params={qt=/admin/cores&collection.configName=solrCloudCollectionConfig&newCollection=true&collection=testcollection&version=2&replicaType=NRT&async=79490236-a3a3-448a-85fc-dcab5bbba0e83461557613686027&coreNodeName=core_node7&name=testcollection_shard2_replica_n5&action=CREATE&numShards=2&shard=shard2&wt=javabin} status=0 QTime=17
   [junit4]   2> 21646 INFO  (parallelCoreAdminExecutor-38-thread-2-processing-n:127.0.0.1:41495_solr 79490236-a3a3-448a-85fc-dcab5bbba0e83461557613686027 CREATE) [n:127.0.0.1:41495_solr    ] o.a.s.h.a.CoreAdminOperation core create command qt=/admin/cores&collection.configName=solrCloudCollectionConfig&newCollection=true&collection=testcollection&version=2&replicaType=NRT&async=79490236-a3a3-448a-85fc-dcab5bbba0e83461557613686027&coreNodeName=core_node7&name=testcollection_shard2_replica_n5&action=CREATE&numShards=2&shard=shard2&wt=javabin
   [junit4]   2> 21647 INFO  (parallelCoreAdminExecutor-39-thread-2-processing-n:127.0.0.1:34425_solr 79490236-a3a3-448a-85fc-dcab5bbba0e83461557607242978 CREATE) [n:127.0.0.1:34425_solr    ] o.a.s.h.a.CoreAdminOperation core create command qt=/admin/cores&collection.configName=solrCloudCollectionConfig&newCollection=true&collection=testcollection&version=2&replicaType=NRT&async=79490236-a3a3-448a-85fc-dcab5bbba0e83461557607242978&coreNodeName=core_node4&name=testcollection_shard1_replica_n2&action=CREATE&numShards=2&shard=shard1&wt=javabin
   [junit4]   2> 21649 INFO  (qtp685136286-65) [n:127.0.0.1:41495_solr    ] o.a.s.h.a.CoreAdminOperation Checking request status for : 79490236-a3a3-448a-85fc-dcab5bbba0e83461557613686027
   [junit4]   2> 21649 INFO  (qtp685136286-65) [n:127.0.0.1:41495_solr    ] o.a.s.s.HttpSolrCall [admin] webapp=null path=/admin/cores params={qt=/admin/cores&requestid=79490236-a3a3-448a-85fc-dcab5bbba0e83461557613686027&action=REQUESTSTATUS&wt=javabin&version=2} status=0 QTime=0
   [junit4]   2> 21752 INFO  (zkCallback-17-thread-2-processing-n:127.0.0.1:41495_solr) [n:127.0.0.1:41495_solr    ] o.a.s.c.c.ZkStateReader A cluster state change: [WatchedEvent state:SyncConnected type:NodeDataChanged path:/collections/testcollection/state.json] for collection [testcollection] has occurred - updating... (live nodes size: [2])
   [junit4]   2> 21752 INFO  (zkCallback-16-thread-1-processing-n:127.0.0.1:34425_solr) [n:127.0.0.1:34425_solr    ] o.a.s.c.c.ZkStateReader A cluster state change: [WatchedEvent state:SyncConnected type:NodeDataChanged path:/collections/testcollection/state.json] for collection [testcollection] has occurred - updating... (live nodes size: [2])
   [junit4]   2> 21753 INFO  (zkCallback-17-thread-1-processing-n:127.0.0.1:41495_solr) [n:127.0.0.1:41495_solr    ] o.a.s.c.c.ZkStateReader A cluster state change: [WatchedEvent state:SyncConnected type:NodeDataChanged path:/collections/testcollection/state.json] for collection [testcollection] has occurred - updating... (live nodes size: [2])
   [junit4]   2> 21752 INFO  (zkCallback-16-thread-2-processing-n:127.0.0.1:34425_solr) [n:127.0.0.1:34425_solr    ] o.a.s.c.c.ZkStateReader A cluster state change: [WatchedEvent state:SyncConnected type:NodeDataChanged path:/collections/testcollection/state.json] for collection [testcollection] has occurred - updating... (live nodes size: [2])
   [junit4]   2> 22156 INFO  (qtp1976245490-64) [n:127.0.0.1:34425_solr    ] o.a.s.h.a.CollectionsHandler Invoked Collection Action :requeststatus with params requestid=79490236-a3a3-448a-85fc-dcab5bbba0e8&action=REQUESTSTATUS&wt=javabin&version=2 and sendToOCPQueue=true
   [junit4]   2> 22157 INFO  (qtp1976245490-64) [n:127.0.0.1:34425_solr    ] o.a.s.s.HttpSolrCall [admin] webapp=null path=/admin/collections params={requestid=79490236-a3a3-448a-85fc-dcab5bbba0e8&action=REQUESTSTATUS&wt=javabin&version=2} status=0 QTime=1
   [junit4]   2> 22643 INFO  (parallelCoreAdminExecutor-38-thread-1-processing-n:127.0.0.1:41495_solr 79490236-a3a3-448a-85fc-dcab5bbba0e83461557596457421 CREATE) [n:127.0.0.1:41495_solr c:testcollection s:shard1 r:core_node3 x:testcollection_shard1_replica_n1] o.a.s.c.SolrConfig Using Lucene MatchVersion: 8.0.0
   [junit4]   2> 22651 INFO  (parallelCoreAdminExecutor-38-thread-1-processing-n:127.0.0.1:41495_solr 79490236-a3a3-448a-85fc-dcab5bbba0e83461557596457421 CREATE) [n:127.0.0.1:41495_solr c:testcollection s:shard1 r:core_node3 x:testcollection_shard1_replica_n1] o.a.s.s.IndexSchema [testcollection_shard1_replica_n1] Schema name=minimal
   [junit4]   2> 22652 INFO  (qtp685136286-65) [n:127.0.0.1:41495_solr    ] o.a.s.h.a.CoreAdminOperation Checking request status for : 79490236-a3a3-448a-85fc-dcab5bbba0e83461557613686027
   [junit4]   2> 22652 INFO  (qtp685136286-65) [n:127.0.0.1:41495_solr    ] o.a.s.s.HttpSolrCall [admin] webapp=null path=/admin/cores param

[...truncated too long message...]

NFO  (jetty-closer-6-thread-2) [    ] o.a.s.m.r.SolrJmxReporter Closing reporter [org.apache.solr.metrics.reporters.SolrJmxReporter@74300c6b: rootName = solr_41495, domain = solr.jetty, service url = null, agent id = null] for registry solr.jetty / com.codahale.metrics.MetricRegistry@27e9c153
   [junit4]   2> 25244 INFO  (jetty-closer-6-thread-1) [    ] o.a.s.m.SolrMetricManager Closing metric reporters for registry=solr.jetty, tag=null
   [junit4]   2> 25244 INFO  (jetty-closer-6-thread-1) [    ] o.a.s.m.r.SolrJmxReporter Closing reporter [org.apache.solr.metrics.reporters.SolrJmxReporter@4711ca65: rootName = solr_34425, domain = solr.jetty, service url = null, agent id = null] for registry solr.jetty / com.codahale.metrics.MetricRegistry@27e9c153
   [junit4]   2> 25247 INFO  (jetty-closer-6-thread-1) [    ] o.a.s.m.SolrMetricManager Closing metric reporters for registry=solr.cluster, tag=null
   [junit4]   2> 25247 INFO  (jetty-closer-6-thread-2) [    ] o.a.s.m.SolrMetricManager Closing metric reporters for registry=solr.cluster, tag=null
   [junit4]   2> 25254 INFO  (coreCloseExecutor-82-thread-2) [n:127.0.0.1:34425_solr c:testcollection s:shard1 r:core_node4 x:testcollection_shard1_replica_n2] o.a.s.c.SolrCore [testcollection_shard1_replica_n2]  CLOSING SolrCore org.apache.solr.core.SolrCore@7babf97c
   [junit4]   2> 25254 INFO  (coreCloseExecutor-82-thread-2) [n:127.0.0.1:34425_solr c:testcollection s:shard1 r:core_node4 x:testcollection_shard1_replica_n2] o.a.s.m.SolrMetricManager Closing metric reporters for registry=solr.core.testcollection.shard1.replica_n2, tag=2074868092
   [junit4]   2> 25254 INFO  (coreCloseExecutor-82-thread-2) [n:127.0.0.1:34425_solr c:testcollection s:shard1 r:core_node4 x:testcollection_shard1_replica_n2] o.a.s.m.r.SolrJmxReporter Closing reporter [org.apache.solr.metrics.reporters.SolrJmxReporter@595e13e1: rootName = solr_34425, domain = solr.core.testcollection.shard1.replica_n2, service url = null, agent id = null] for registry solr.core.testcollection.shard1.replica_n2 / com.codahale.metrics.MetricRegistry@463831a1
   [junit4]   2> 25264 INFO  (coreCloseExecutor-82-thread-1) [n:127.0.0.1:34425_solr c:testcollection s:shard2 r:core_node8 x:testcollection_shard2_replica_n6] o.a.s.c.SolrCore [testcollection_shard2_replica_n6]  CLOSING SolrCore org.apache.solr.core.SolrCore@73db1259
   [junit4]   2> 25270 INFO  (coreCloseExecutor-83-thread-1) [n:127.0.0.1:41495_solr c:testcollection s:shard1 r:core_node3 x:testcollection_shard1_replica_n1] o.a.s.c.SolrCore [testcollection_shard1_replica_n1]  CLOSING SolrCore org.apache.solr.core.SolrCore@2e76cbbf
   [junit4]   2> 25270 INFO  (coreCloseExecutor-83-thread-1) [n:127.0.0.1:41495_solr c:testcollection s:shard1 r:core_node3 x:testcollection_shard1_replica_n1] o.a.s.m.SolrMetricManager Closing metric reporters for registry=solr.core.testcollection.shard1.replica_n1, tag=779537343
   [junit4]   2> 25270 INFO  (coreCloseExecutor-83-thread-1) [n:127.0.0.1:41495_solr c:testcollection s:shard1 r:core_node3 x:testcollection_shard1_replica_n1] o.a.s.m.r.SolrJmxReporter Closing reporter [org.apache.solr.metrics.reporters.SolrJmxReporter@49847005: rootName = solr_41495, domain = solr.core.testcollection.shard1.replica_n1, service url = null, agent id = null] for registry solr.core.testcollection.shard1.replica_n1 / com.codahale.metrics.MetricRegistry@12edb40c
   [junit4]   2> 25272 INFO  (coreCloseExecutor-82-thread-1) [n:127.0.0.1:34425_solr c:testcollection s:shard2 r:core_node8 x:testcollection_shard2_replica_n6] o.a.s.m.SolrMetricManager Closing metric reporters for registry=solr.core.testcollection.shard2.replica_n6, tag=1943736921
   [junit4]   2> 25272 INFO  (coreCloseExecutor-82-thread-1) [n:127.0.0.1:34425_solr c:testcollection s:shard2 r:core_node8 x:testcollection_shard2_replica_n6] o.a.s.m.r.SolrJmxReporter Closing reporter [org.apache.solr.metrics.reporters.SolrJmxReporter@b419418: rootName = solr_34425, domain = solr.core.testcollection.shard2.replica_n6, service url = null, agent id = null] for registry solr.core.testcollection.shard2.replica_n6 / com.codahale.metrics.MetricRegistry@7c10c807
   [junit4]   2> 25272 INFO  (coreCloseExecutor-83-thread-2) [n:127.0.0.1:41495_solr c:testcollection s:shard2 r:core_node7 x:testcollection_shard2_replica_n5] o.a.s.c.SolrCore [testcollection_shard2_replica_n5]  CLOSING SolrCore org.apache.solr.core.SolrCore@4582d4cd
   [junit4]   2> 25285 INFO  (coreCloseExecutor-83-thread-2) [n:127.0.0.1:41495_solr c:testcollection s:shard2 r:core_node7 x:testcollection_shard2_replica_n5] o.a.s.m.SolrMetricManager Closing metric reporters for registry=solr.core.testcollection.shard2.replica_n5, tag=1166202061
   [junit4]   2> 25285 INFO  (coreCloseExecutor-83-thread-2) [n:127.0.0.1:41495_solr c:testcollection s:shard2 r:core_node7 x:testcollection_shard2_replica_n5] o.a.s.m.r.SolrJmxReporter Closing reporter [org.apache.solr.metrics.reporters.SolrJmxReporter@44941b83: rootName = solr_41495, domain = solr.core.testcollection.shard2.replica_n5, service url = null, agent id = null] for registry solr.core.testcollection.shard2.replica_n5 / com.codahale.metrics.MetricRegistry@49190abd
   [junit4]   2> 25285 INFO  (coreCloseExecutor-82-thread-2) [n:127.0.0.1:34425_solr c:testcollection s:shard1 r:core_node4 x:testcollection_shard1_replica_n2] o.a.s.m.SolrMetricManager Closing metric reporters for registry=solr.collection.testcollection.shard1.leader, tag=2074868092
   [junit4]   2> 25288 INFO  (coreCloseExecutor-82-thread-1) [n:127.0.0.1:34425_solr c:testcollection s:shard2 r:core_node8 x:testcollection_shard2_replica_n6] o.a.s.m.SolrMetricManager Closing metric reporters for registry=solr.collection.testcollection.shard2.leader, tag=1943736921
   [junit4]   2> 25297 INFO  (coreCloseExecutor-83-thread-1) [n:127.0.0.1:41495_solr c:testcollection s:shard1 r:core_node3 x:testcollection_shard1_replica_n1] o.a.s.m.SolrMetricManager Closing metric reporters for registry=solr.collection.testcollection.shard1.leader, tag=779537343
   [junit4]   2> 25297 INFO  (coreCloseExecutor-83-thread-2) [n:127.0.0.1:41495_solr c:testcollection s:shard2 r:core_node7 x:testcollection_shard2_replica_n5] o.a.s.m.SolrMetricManager Closing metric reporters for registry=solr.collection.testcollection.shard2.leader, tag=1166202061
   [junit4]   2> 25310 INFO  (jetty-closer-6-thread-1) [    ] o.a.s.c.Overseer Overseer (id=98798318449197061-127.0.0.1:34425_solr-n_0000000000) closing
   [junit4]   2> 25311 INFO  (OverseerStateUpdate-98798318449197061-127.0.0.1:34425_solr-n_0000000000) [n:127.0.0.1:34425_solr    ] o.a.s.c.Overseer Overseer Loop exiting : 127.0.0.1:34425_solr
   [junit4]   2> 25311 WARN  (OverseerAutoScalingTriggerThread-98798318449197061-127.0.0.1:34425_solr-n_0000000000) [n:127.0.0.1:34425_solr    ] o.a.s.c.a.OverseerTriggerThread OverseerTriggerThread woken up but we are closed, exiting.
   [junit4]   2> 25315 WARN  (NIOServerCxn.Factory:0.0.0.0/0.0.0.0:0) [    ] o.a.z.s.NIOServerCnxn caught end of stream exception
   [junit4]   2> EndOfStreamException: Unable to read additional data from client sessionid 0x15f008c13920006, likely client has closed socket
   [junit4]   2> 	at org.apache.zookeeper.server.NIOServerCnxn.doIO(NIOServerCnxn.java:239)
   [junit4]   2> 	at org.apache.zookeeper.server.NIOServerCnxnFactory.run(NIOServerCnxnFactory.java:203)
   [junit4]   2> 	at java.lang.Thread.run(Thread.java:748)
   [junit4]   2> 25316 WARN  (zkCallback-17-thread-2-processing-n:127.0.0.1:41495_solr) [n:127.0.0.1:41495_solr    ] o.a.s.c.c.ZkStateReader ZooKeeper watch triggered, but Solr cannot talk to ZK: [KeeperErrorCode = Session expired for /live_nodes]
   [junit4]   2> 25317 INFO  (jetty-closer-6-thread-2) [    ] o.e.j.s.h.ContextHandler Stopped o.e.j.s.ServletContextHandler@4b569802{/solr,null,UNAVAILABLE}
   [junit4]   2> 25317 INFO  (jetty-closer-6-thread-1) [    ] o.e.j.s.h.ContextHandler Stopped o.e.j.s.ServletContextHandler@1a5a6087{/solr,null,UNAVAILABLE}
   [junit4]   2> 25320 ERROR (SUITE-TestAuthenticationFramework-seed#[7A8D8D9AC81CD729]-worker) [    ] o.a.z.s.ZooKeeperServer ZKShutdownHandler is not registered, so ZooKeeper server won't take any action on ERROR or SHUTDOWN server state changes
   [junit4]   2> 25320 INFO  (SUITE-TestAuthenticationFramework-seed#[7A8D8D9AC81CD729]-worker) [    ] o.a.s.c.ZkTestServer connecting to 127.0.0.1:35683 35683
   [junit4]   2> 30380 INFO  (Thread-12) [    ] o.a.s.c.ZkTestServer connecting to 127.0.0.1:35683 35683
   [junit4]   2> 30381 WARN  (Thread-12) [    ] o.a.s.c.ZkTestServer Watch limit violations: 
   [junit4]   2> Maximum concurrent create/delete watches above limit:
   [junit4]   2> 
   [junit4]   2> 	4	/solr/configs/solrCloudCollectionConfig
   [junit4]   2> 	3	/solr/aliases.json
   [junit4]   2> 	2	/solr/security.json
   [junit4]   2> 
   [junit4]   2> Maximum concurrent data watches above limit:
   [junit4]   2> 
   [junit4]   2> 	25	/solr/collections/testcollection/state.json
   [junit4]   2> 	3	/solr/clusterstate.json
   [junit4]   2> 	3	/solr/clusterprops.json
   [junit4]   2> 
   [junit4]   2> Maximum concurrent children watches above limit:
   [junit4]   2> 
   [junit4]   2> 	3	/solr/live_nodes
   [junit4]   2> 	3	/solr/collections
   [junit4]   2> 
   [junit4]   2> NOTE: leaving temporary files on disk at: /home/jenkins/workspace/Lucene-Solr-master-Linux/solr/build/solr-core/test/J0/temp/solr.cloud.TestAuthenticationFramework_7A8D8D9AC81CD729-001
   [junit4]   2> NOTE: test params are: codec=Asserting(Lucene70), sim=RandomSimilarity(queryNorm=false): {}, locale=sl-SI, timezone=Europe/Sarajevo
   [junit4]   2> NOTE: Linux 4.10.0-33-generic amd64/Oracle Corporation 1.8.0_144 (64-bit)/cpus=8,threads=1,free=249107600,total=536870912
   [junit4]   2> NOTE: All tests run in this JVM: [TestSolr4Spatial, TestSchemaResource, TestAuthenticationFramework]
   [junit4] Completed [10/745 (1!)] on J0 in 16.48s, 1 test, 1 error <<< FAILURES!

[...truncated 49319 lines...]

Mime
View raw message