lucene-dev mailing list archives

Site index · List index
Message view « Date » · « Thread »
Top « Date » · « Thread »
From Policeman Jenkins Server <jenk...@thetaphi.de>
Subject [JENKINS] Lucene-Solr-7.x-Linux (32bit/jdk1.8.0_144) - Build # 598 - Still Unstable!
Date Thu, 12 Oct 2017 03:21:52 GMT
Build: https://jenkins.thetaphi.de/job/Lucene-Solr-7.x-Linux/598/
Java: 32bit/jdk1.8.0_144 -server -XX:+UseG1GC

1 tests failed.
FAILED:  org.apache.solr.cloud.LeaderElectionContextKeyTest.test

Error Message:


Stack Trace:
java.lang.AssertionError
	at __randomizedtesting.SeedInfo.seed([8A077130F18ACC69:2534EEA5F76A191]:0)
	at org.junit.Assert.fail(Assert.java:92)
	at org.junit.Assert.assertTrue(Assert.java:43)
	at org.junit.Assert.assertTrue(Assert.java:54)
	at org.apache.solr.cloud.LeaderElectionContextKeyTest.test(LeaderElectionContextKeyTest.java:88)
	at sun.reflect.NativeMethodAccessorImpl.invoke0(Native Method)
	at sun.reflect.NativeMethodAccessorImpl.invoke(NativeMethodAccessorImpl.java:62)
	at sun.reflect.DelegatingMethodAccessorImpl.invoke(DelegatingMethodAccessorImpl.java:43)
	at java.lang.reflect.Method.invoke(Method.java:498)
	at com.carrotsearch.randomizedtesting.RandomizedRunner.invoke(RandomizedRunner.java:1737)
	at com.carrotsearch.randomizedtesting.RandomizedRunner$8.evaluate(RandomizedRunner.java:934)
	at com.carrotsearch.randomizedtesting.RandomizedRunner$9.evaluate(RandomizedRunner.java:970)
	at com.carrotsearch.randomizedtesting.RandomizedRunner$10.evaluate(RandomizedRunner.java:984)
	at com.carrotsearch.randomizedtesting.rules.SystemPropertiesRestoreRule$1.evaluate(SystemPropertiesRestoreRule.java:57)
	at org.apache.lucene.util.TestRuleSetupTeardownChained$1.evaluate(TestRuleSetupTeardownChained.java:49)
	at org.apache.lucene.util.AbstractBeforeAfterRule$1.evaluate(AbstractBeforeAfterRule.java:45)
	at org.apache.lucene.util.TestRuleThreadAndTestName$1.evaluate(TestRuleThreadAndTestName.java:48)
	at org.apache.lucene.util.TestRuleIgnoreAfterMaxFailures$1.evaluate(TestRuleIgnoreAfterMaxFailures.java:64)
	at org.apache.lucene.util.TestRuleMarkFailure$1.evaluate(TestRuleMarkFailure.java:47)
	at com.carrotsearch.randomizedtesting.rules.StatementAdapter.evaluate(StatementAdapter.java:36)
	at com.carrotsearch.randomizedtesting.ThreadLeakControl$StatementRunner.run(ThreadLeakControl.java:368)
	at com.carrotsearch.randomizedtesting.ThreadLeakControl.forkTimeoutingTask(ThreadLeakControl.java:817)
	at com.carrotsearch.randomizedtesting.ThreadLeakControl$3.evaluate(ThreadLeakControl.java:468)
	at com.carrotsearch.randomizedtesting.RandomizedRunner.runSingleTest(RandomizedRunner.java:943)
	at com.carrotsearch.randomizedtesting.RandomizedRunner$5.evaluate(RandomizedRunner.java:829)
	at com.carrotsearch.randomizedtesting.RandomizedRunner$6.evaluate(RandomizedRunner.java:879)
	at com.carrotsearch.randomizedtesting.RandomizedRunner$7.evaluate(RandomizedRunner.java:890)
	at com.carrotsearch.randomizedtesting.rules.StatementAdapter.evaluate(StatementAdapter.java:36)
	at com.carrotsearch.randomizedtesting.rules.SystemPropertiesRestoreRule$1.evaluate(SystemPropertiesRestoreRule.java:57)
	at org.apache.lucene.util.AbstractBeforeAfterRule$1.evaluate(AbstractBeforeAfterRule.java:45)
	at com.carrotsearch.randomizedtesting.rules.StatementAdapter.evaluate(StatementAdapter.java:36)
	at org.apache.lucene.util.TestRuleStoreClassName$1.evaluate(TestRuleStoreClassName.java:41)
	at com.carrotsearch.randomizedtesting.rules.NoShadowingOrOverridesOnMethodsRule$1.evaluate(NoShadowingOrOverridesOnMethodsRule.java:40)
	at com.carrotsearch.randomizedtesting.rules.NoShadowingOrOverridesOnMethodsRule$1.evaluate(NoShadowingOrOverridesOnMethodsRule.java:40)
	at com.carrotsearch.randomizedtesting.rules.StatementAdapter.evaluate(StatementAdapter.java:36)
	at com.carrotsearch.randomizedtesting.rules.StatementAdapter.evaluate(StatementAdapter.java:36)
	at com.carrotsearch.randomizedtesting.rules.StatementAdapter.evaluate(StatementAdapter.java:36)
	at org.apache.lucene.util.TestRuleAssertionsRequired$1.evaluate(TestRuleAssertionsRequired.java:53)
	at org.apache.lucene.util.TestRuleMarkFailure$1.evaluate(TestRuleMarkFailure.java:47)
	at org.apache.lucene.util.TestRuleIgnoreAfterMaxFailures$1.evaluate(TestRuleIgnoreAfterMaxFailures.java:64)
	at org.apache.lucene.util.TestRuleIgnoreTestSuites$1.evaluate(TestRuleIgnoreTestSuites.java:54)
	at com.carrotsearch.randomizedtesting.rules.StatementAdapter.evaluate(StatementAdapter.java:36)
	at com.carrotsearch.randomizedtesting.ThreadLeakControl$StatementRunner.run(ThreadLeakControl.java:368)
	at java.lang.Thread.run(Thread.java:748)




Build Log:
[...truncated 11796 lines...]
   [junit4] Suite: org.apache.solr.cloud.LeaderElectionContextKeyTest
   [junit4]   2> 363531 INFO  (SUITE-LeaderElectionContextKeyTest-seed#[8A077130F18ACC69]-worker) [    ] o.a.s.SolrTestCaseJ4 SecureRandom sanity checks: test.solr.allowed.securerandom=null & java.security.egd=file:/dev/./urandom
   [junit4]   2> Creating dataDir: /home/jenkins/workspace/Lucene-Solr-7.x-Linux/solr/build/solr-core/test/J1/temp/solr.cloud.LeaderElectionContextKeyTest_8A077130F18ACC69-001/init-core-data-001
   [junit4]   2> 363532 WARN  (SUITE-LeaderElectionContextKeyTest-seed#[8A077130F18ACC69]-worker) [    ] o.a.s.SolrTestCaseJ4 startTrackingSearchers: numOpens=2 numCloses=2
   [junit4]   2> 363532 INFO  (SUITE-LeaderElectionContextKeyTest-seed#[8A077130F18ACC69]-worker) [    ] o.a.s.SolrTestCaseJ4 Using PointFields (NUMERIC_POINTS_SYSPROP=true) w/NUMERIC_DOCVALUES_SYSPROP=false
   [junit4]   2> 363533 INFO  (SUITE-LeaderElectionContextKeyTest-seed#[8A077130F18ACC69]-worker) [    ] o.a.s.SolrTestCaseJ4 Randomized ssl (true) and clientAuth (false) via: @org.apache.solr.util.RandomizeSSL(reason=, ssl=NaN, value=NaN, clientAuth=NaN)
   [junit4]   2> 363534 INFO  (SUITE-LeaderElectionContextKeyTest-seed#[8A077130F18ACC69]-worker) [    ] o.a.s.c.MiniSolrCloudCluster Starting cluster of 1 servers in /home/jenkins/workspace/Lucene-Solr-7.x-Linux/solr/build/solr-core/test/J1/temp/solr.cloud.LeaderElectionContextKeyTest_8A077130F18ACC69-001/tempDir-001
   [junit4]   2> 363534 INFO  (SUITE-LeaderElectionContextKeyTest-seed#[8A077130F18ACC69]-worker) [    ] o.a.s.c.ZkTestServer STARTING ZK TEST SERVER
   [junit4]   2> 363534 INFO  (Thread-1928) [    ] o.a.s.c.ZkTestServer client port:0.0.0.0/0.0.0.0:0
   [junit4]   2> 363534 INFO  (Thread-1928) [    ] o.a.s.c.ZkTestServer Starting server
   [junit4]   2> 363536 ERROR (Thread-1928) [    ] o.a.z.s.ZooKeeperServer ZKShutdownHandler is not registered, so ZooKeeper server won't take any action on ERROR or SHUTDOWN server state changes
   [junit4]   2> 363634 INFO  (SUITE-LeaderElectionContextKeyTest-seed#[8A077130F18ACC69]-worker) [    ] o.a.s.c.ZkTestServer start zk server on port:40319
   [junit4]   2> 363641 INFO  (jetty-launcher-412-thread-1) [    ] o.e.j.s.Server jetty-9.3.20.v20170531
   [junit4]   2> 363653 INFO  (jetty-launcher-412-thread-1) [    ] o.e.j.s.h.ContextHandler Started o.e.j.s.ServletContextHandler@18d28a1{/solr,null,AVAILABLE}
   [junit4]   2> 363654 INFO  (jetty-launcher-412-thread-1) [    ] o.e.j.s.AbstractConnector Started ServerConnector@11282d1{SSL,[ssl, http/1.1]}{127.0.0.1:44045}
   [junit4]   2> 363655 INFO  (jetty-launcher-412-thread-1) [    ] o.e.j.s.Server Started @365627ms
   [junit4]   2> 363655 INFO  (jetty-launcher-412-thread-1) [    ] o.a.s.c.s.e.JettySolrRunner Jetty properties: {hostContext=/solr, hostPort=44045}
   [junit4]   2> 363655 ERROR (jetty-launcher-412-thread-1) [    ] o.a.s.u.StartupLoggingUtils Missing Java Option solr.log.dir. Logging may be missing or incomplete.
   [junit4]   2> 363655 INFO  (jetty-launcher-412-thread-1) [    ] o.a.s.s.SolrDispatchFilter  ___      _       Welcome to Apache Solr? version 7.2.0
   [junit4]   2> 363655 INFO  (jetty-launcher-412-thread-1) [    ] o.a.s.s.SolrDispatchFilter / __| ___| |_ _   Starting in cloud mode on port null
   [junit4]   2> 363655 INFO  (jetty-launcher-412-thread-1) [    ] o.a.s.s.SolrDispatchFilter \__ \/ _ \ | '_|  Install dir: null, Default config dir: null
   [junit4]   2> 363655 INFO  (jetty-launcher-412-thread-1) [    ] o.a.s.s.SolrDispatchFilter |___/\___/_|_|    Start time: 2017-10-12T02:22:43.261Z
   [junit4]   2> 363656 INFO  (jetty-launcher-412-thread-1) [    ] o.a.s.s.SolrDispatchFilter solr.xml found in ZooKeeper. Loading...
   [junit4]   2> 363662 INFO  (jetty-launcher-412-thread-1) [    ] o.a.s.c.ZkContainer Zookeeper client=127.0.0.1:40319/solr
   [junit4]   2> 363688 INFO  (jetty-launcher-412-thread-1) [n:127.0.0.1:44045_solr    ] o.a.s.c.Overseer Overseer (id=null) closing
   [junit4]   2> 363688 INFO  (jetty-launcher-412-thread-1) [n:127.0.0.1:44045_solr    ] o.a.s.c.OverseerElectionContext I am going to be the leader 127.0.0.1:44045_solr
   [junit4]   2> 363688 INFO  (jetty-launcher-412-thread-1) [n:127.0.0.1:44045_solr    ] o.a.s.c.Overseer Overseer (id=98813539984408579-127.0.0.1:44045_solr-n_0000000000) starting
   [junit4]   2> 363692 INFO  (jetty-launcher-412-thread-1) [n:127.0.0.1:44045_solr    ] o.a.s.c.ZkController Register node as live in ZooKeeper:/live_nodes/127.0.0.1:44045_solr
   [junit4]   2> 363692 INFO  (zkCallback-419-thread-1-processing-n:127.0.0.1:44045_solr) [n:127.0.0.1:44045_solr    ] o.a.s.c.c.ZkStateReader Updated live nodes from ZooKeeper... (0) -> (1)
   [junit4]   2> 363745 INFO  (jetty-launcher-412-thread-1) [n:127.0.0.1:44045_solr    ] o.a.s.m.r.SolrJmxReporter JMX monitoring for 'solr_44045.solr.node' (registry 'solr.node') enabled at server: com.sun.jmx.mbeanserver.JmxMBeanServer@faa438
   [junit4]   2> 363750 INFO  (jetty-launcher-412-thread-1) [n:127.0.0.1:44045_solr    ] o.a.s.m.r.SolrJmxReporter JMX monitoring for 'solr_44045.solr.jvm' (registry 'solr.jvm') enabled at server: com.sun.jmx.mbeanserver.JmxMBeanServer@faa438
   [junit4]   2> 363750 INFO  (jetty-launcher-412-thread-1) [n:127.0.0.1:44045_solr    ] o.a.s.m.r.SolrJmxReporter JMX monitoring for 'solr_44045.solr.jetty' (registry 'solr.jetty') enabled at server: com.sun.jmx.mbeanserver.JmxMBeanServer@faa438
   [junit4]   2> 363751 INFO  (jetty-launcher-412-thread-1) [n:127.0.0.1:44045_solr    ] o.a.s.c.CorePropertiesLocator Found 0 core definitions underneath /home/jenkins/workspace/Lucene-Solr-7.x-Linux/solr/build/solr-core/test/J1/temp/solr.cloud.LeaderElectionContextKeyTest_8A077130F18ACC69-001/tempDir-001/node1/.
   [junit4]   2> 363764 INFO  (SUITE-LeaderElectionContextKeyTest-seed#[8A077130F18ACC69]-worker) [    ] o.a.s.c.c.ZkStateReader Updated live nodes from ZooKeeper... (0) -> (1)
   [junit4]   2> 363764 INFO  (SUITE-LeaderElectionContextKeyTest-seed#[8A077130F18ACC69]-worker) [    ] o.a.s.c.s.i.ZkClientClusterStateProvider Cluster at 127.0.0.1:40319/solr ready
   [junit4]   2> 363789 INFO  (qtp15582827-3913) [n:127.0.0.1:44045_solr    ] o.a.s.h.a.CollectionsHandler Invoked Collection Action :create with params replicationFactor=1&collection.configName=config&maxShardsPerNode=1000&name=testCollection1&nrtReplicas=1&action=CREATE&numShards=2&wt=javabin&version=2 and sendToOCPQueue=true
   [junit4]   2> 363791 INFO  (OverseerThreadFactory-1092-thread-1-processing-n:127.0.0.1:44045_solr) [n:127.0.0.1:44045_solr    ] o.a.s.c.CreateCollectionCmd Create collection testCollection1
   [junit4]   2> 363894 INFO  (OverseerStateUpdate-98813539984408579-127.0.0.1:44045_solr-n_0000000000) [n:127.0.0.1:44045_solr    ] o.a.s.c.o.SliceMutator createReplica() {
   [junit4]   2>   "operation":"ADDREPLICA",
   [junit4]   2>   "collection":"testCollection1",
   [junit4]   2>   "shard":"shard1",
   [junit4]   2>   "core":"testCollection1_shard1_replica_n1",
   [junit4]   2>   "state":"down",
   [junit4]   2>   "base_url":"https://127.0.0.1:44045/solr",
   [junit4]   2>   "type":"NRT"} 
   [junit4]   2> 363895 INFO  (OverseerStateUpdate-98813539984408579-127.0.0.1:44045_solr-n_0000000000) [n:127.0.0.1:44045_solr    ] o.a.s.c.o.SliceMutator createReplica() {
   [junit4]   2>   "operation":"ADDREPLICA",
   [junit4]   2>   "collection":"testCollection1",
   [junit4]   2>   "shard":"shard2",
   [junit4]   2>   "core":"testCollection1_shard2_replica_n2",
   [junit4]   2>   "state":"down",
   [junit4]   2>   "base_url":"https://127.0.0.1:44045/solr",
   [junit4]   2>   "type":"NRT"} 
   [junit4]   2> 364103 INFO  (qtp15582827-3945) [n:127.0.0.1:44045_solr    ] o.a.s.h.a.CoreAdminOperation core create command qt=/admin/cores&coreNodeName=core_node4&collection.configName=config&newCollection=true&name=testCollection1_shard2_replica_n2&action=CREATE&numShards=2&collection=testCollection1&shard=shard2&wt=javabin&version=2&replicaType=NRT
   [junit4]   2> 364104 INFO  (qtp15582827-3911) [n:127.0.0.1:44045_solr    ] o.a.s.h.a.CoreAdminOperation core create command qt=/admin/cores&coreNodeName=core_node3&collection.configName=config&newCollection=true&name=testCollection1_shard1_replica_n1&action=CREATE&numShards=2&collection=testCollection1&shard=shard1&wt=javabin&version=2&replicaType=NRT
   [junit4]   2> 364104 INFO  (qtp15582827-3945) [n:127.0.0.1:44045_solr    ] o.a.s.c.TransientSolrCoreCacheDefault Allocating transient cache for 2147483647 transient cores
   [junit4]   2> 364210 INFO  (zkCallback-419-thread-1-processing-n:127.0.0.1:44045_solr) [n:127.0.0.1:44045_solr    ] o.a.s.c.c.ZkStateReader A cluster state change: [WatchedEvent state:SyncConnected type:NodeDataChanged path:/collections/testCollection1/state.json] for collection [testCollection1] has occurred - updating... (live nodes size: [1])
   [junit4]   2> 364210 INFO  (zkCallback-419-thread-2-processing-n:127.0.0.1:44045_solr) [n:127.0.0.1:44045_solr    ] o.a.s.c.c.ZkStateReader A cluster state change: [WatchedEvent state:SyncConnected type:NodeDataChanged path:/collections/testCollection1/state.json] for collection [testCollection1] has occurred - updating... (live nodes size: [1])
   [junit4]   2> 365115 INFO  (qtp15582827-3911) [n:127.0.0.1:44045_solr c:testCollection1 s:shard1 r:core_node3 x:testCollection1_shard1_replica_n1] o.a.s.c.SolrConfig Using Lucene MatchVersion: 7.2.0
   [junit4]   2> 365119 INFO  (qtp15582827-3945) [n:127.0.0.1:44045_solr c:testCollection1 s:shard2 r:core_node4 x:testCollection1_shard2_replica_n2] o.a.s.c.SolrConfig Using Lucene MatchVersion: 7.2.0
   [junit4]   2> 365123 INFO  (qtp15582827-3911) [n:127.0.0.1:44045_solr c:testCollection1 s:shard1 r:core_node3 x:testCollection1_shard1_replica_n1] o.a.s.s.IndexSchema [testCollection1_shard1_replica_n1] Schema name=minimal
   [junit4]   2> 365125 INFO  (qtp15582827-3911) [n:127.0.0.1:44045_solr c:testCollection1 s:shard1 r:core_node3 x:testCollection1_shard1_replica_n1] o.a.s.s.IndexSchema Loaded schema minimal/1.1 with uniqueid field id
   [junit4]   2> 365125 INFO  (qtp15582827-3911) [n:127.0.0.1:44045_solr c:testCollection1 s:shard1 r:core_node3 x:testCollection1_shard1_replica_n1] o.a.s.c.CoreContainer Creating SolrCore 'testCollection1_shard1_replica_n1' using configuration from collection testCollection1, trusted=true
   [junit4]   2> 365128 INFO  (qtp15582827-3945) [n:127.0.0.1:44045_solr c:testCollection1 s:shard2 r:core_node4 x:testCollection1_shard2_replica_n2] o.a.s.s.IndexSchema [testCollection1_shard2_replica_n2] Schema name=minimal
   [junit4]   2> 365130 INFO  (qtp15582827-3945) [n:127.0.0.1:44045_solr c:testCollection1 s:shard2 r:core_node4 x:testCollection1_shard2_replica_n2] o.a.s.s.IndexSchema Loaded schema minimal/1.1 with uniqueid field id
   [junit4]   2> 365130 INFO  (qtp15582827-3945) [n:127.0.0.1:44045_solr c:testCollection1 s:shard2 r:core_node4 x:testCollection1_shard2_replica_n2] o.a.s.c.CoreContainer Creating SolrCore 'testCollection1_shard2_replica_n2' using configuration from collection testCollection1, trusted=true
   [junit4]   2> 365141 INFO  (qtp15582827-3911) [n:127.0.0.1:44045_solr c:testCollection1 s:shard1 r:core_node3 x:testCollection1_shard1_replica_n1] o.a.s.m.r.SolrJmxReporter JMX monitoring for 'solr_44045.solr.core.testCollection1.shard1.replica_n1' (registry 'solr.core.testCollection1.shard1.replica_n1') enabled at server: com.sun.jmx.mbeanserver.JmxMBeanServer@faa438
   [junit4]   2> 365141 INFO  (qtp15582827-3911) [n:127.0.0.1:44045_solr c:testCollection1 s:shard1 r:core_node3 x:testCollection1_shard1_replica_n1] o.a.s.c.SolrCore solr.RecoveryStrategy.Builder
   [junit4]   2> 365141 INFO  (qtp15582827-3911) [n:127.0.0.1:44045_solr c:testCollection1 s:shard1 r:core_node3 x:testCollection1_shard1_replica_n1] o.a.s.c.SolrCore [[testCollection1_shard1_replica_n1] ] Opening new SolrCore at [/home/jenkins/workspace/Lucene-Solr-7.x-Linux/solr/build/solr-core/test/J1/temp/solr.cloud.LeaderElectionContextKeyTest_8A077130F18ACC69-001/tempDir-001/node1/testCollection1_shard1_replica_n1], dataDir=[/home/jenkins/workspace/Lucene-Solr-7.x-Linux/solr/build/solr-core/test/J1/temp/solr.cloud.LeaderElectionContextKeyTest_8A077130F18ACC69-001/tempDir-001/node1/./testCollection1_shard1_replica_n1/data/]
   [junit4]   2> 365143 INFO  (qtp15582827-3945) [n:127.0.0.1:44045_solr c:testCollection1 s:shard2 r:core_node4 x:testCollection1_shard2_replica_n2] o.a.s.m.r.SolrJmxReporter JMX monitoring for 'solr_44045.solr.core.testCollection1.shard2.replica_n2' (registry 'solr.core.testCollection1.shard2.replica_n2') enabled at server: com.sun.jmx.mbeanserver.JmxMBeanServer@faa438
   [junit4]   2> 365143 INFO  (qtp15582827-3945) [n:127.0.0.1:44045_solr c:testCollection1 s:shard2 r:core_node4 x:testCollection1_shard2_replica_n2] o.a.s.c.SolrCore solr.RecoveryStrategy.Builder
   [junit4]   2> 365143 INFO  (qtp15582827-3945) [n:127.0.0.1:44045_solr c:testCollection1 s:shard2 r:core_node4 x:testCollection1_shard2_replica_n2] o.a.s.c.SolrCore [[testCollection1_shard2_replica_n2] ] Opening new SolrCore at [/home/jenkins/workspace/Lucene-Solr-7.x-Linux/solr/build/solr-core/test/J1/temp/solr.cloud.LeaderElectionContextKeyTest_8A077130F18ACC69-001/tempDir-001/node1/testCollection1_shard2_replica_n2], dataDir=[/home/jenkins/workspace/Lucene-Solr-7.x-Linux/solr/build/solr-core/test/J1/temp/solr.cloud.LeaderElectionContextKeyTest_8A077130F18ACC69-001/tempDir-001/node1/./testCollection1_shard2_replica_n2/data/]
   [junit4]   2> 365201 INFO  (qtp15582827-3945) [n:127.0.0.1:44045_solr c:testCollection1 s:shard2 r:core_node4 x:testCollection1_shard2_replica_n2] o.a.s.u.UpdateHandler Using UpdateLog implementation: org.apache.solr.update.UpdateLog
   [junit4]   2> 365201 INFO  (qtp15582827-3945) [n:127.0.0.1:44045_solr c:testCollection1 s:shard2 r:core_node4 x:testCollection1_shard2_replica_n2] o.a.s.u.UpdateLog Initializing UpdateLog: dataDir=null defaultSyncLevel=FLUSH numRecordsToKeep=100 maxNumLogsToKeep=10 numVersionBuckets=65536
   [junit4]   2> 365203 INFO  (qtp15582827-3945) [n:127.0.0.1:44045_solr c:testCollection1 s:shard2 r:core_node4 x:testCollection1_shard2_replica_n2] o.a.s.u.CommitTracker Hard AutoCommit: disabled
   [junit4]   2> 365203 INFO  (qtp15582827-3945) [n:127.0.0.1:44045_solr c:testCollection1 s:shard2 r:core_node4 x:testCollection1_shard2_replica_n2] o.a.s.u.CommitTracker Soft AutoCommit: disabled
   [junit4]   2> 365205 INFO  (qtp15582827-3945) [n:127.0.0.1:44045_solr c:testCollection1 s:shard2 r:core_node4 x:testCollection1_shard2_replica_n2] o.a.s.s.SolrIndexSearcher Opening [Searcher@4de0e2[testCollection1_shard2_replica_n2] main]
   [junit4]   2> 365206 INFO  (qtp15582827-3945) [n:127.0.0.1:44045_solr c:testCollection1 s:shard2 r:core_node4 x:testCollection1_shard2_replica_n2] o.a.s.r.ManagedResourceStorage Configured ZooKeeperStorageIO with znodeBase: /configs/config
   [junit4]   2> 365206 INFO  (qtp15582827-3945) [n:127.0.0.1:44045_solr c:testCollection1 s:shard2 r:core_node4 x:testCollection1_shard2_replica_n2] o.a.s.r.ManagedResourceStorage Loaded null at path _rest_managed.json using ZooKeeperStorageIO:path=/configs/config
   [junit4]   2> 365207 INFO  (qtp15582827-3945) [n:127.0.0.1:44045_solr c:testCollection1 s:shard2 r:core_node4 x:testCollection1_shard2_replica_n2] o.a.s.h.ReplicationHandler Commits will be reserved for 10000ms.
   [junit4]   2> 365207 INFO  (qtp15582827-3945) [n:127.0.0.1:44045_solr c:testCollection1 s:shard2 r:core_node4 x:testCollection1_shard2_replica_n2] o.a.s.u.UpdateLog Could not find max version in index or recent updates, using new clock 1581016641503756288
   [junit4]   2> 365208 INFO  (searcherExecutor-1096-thread-1-processing-n:127.0.0.1:44045_solr x:testCollection1_shard2_replica_n2 s:shard2 c:testCollection1 r:core_node4) [n:127.0.0.1:44045_solr c:testCollection1 s:shard2 r:core_node4 x:testCollection1_shard2_replica_n2] o.a.s.c.SolrCore [testCollection1_shard2_replica_n2] Registered new searcher Searcher@4de0e2[testCollection1_shard2_replica_n2] main{ExitableDirectoryReader(UninvertingDirectoryReader())}
   [junit4]   2> 365210 INFO  (qtp15582827-3945) [n:127.0.0.1:44045_solr c:testCollection1 s:shard2 r:core_node4 x:testCollection1_shard2_replica_n2] o.a.s.c.ShardLeaderElectionContext Enough replicas found to continue.
   [junit4]   2> 365210 INFO  (qtp15582827-3945) [n:127.0.0.1:44045_solr c:testCollection1 s:shard2 r:core_node4 x:testCollection1_shard2_replica_n2] o.a.s.c.ShardLeaderElectionContext I may be the new leader - try and sync
   [junit4]   2> 365210 INFO  (qtp15582827-3945) [n:127.0.0.1:44045_solr c:testCollection1 s:shard2 r:core_node4 x:testCollection1_shard2_replica_n2] o.a.s.c.SyncStrategy Sync replicas to https://127.0.0.1:44045/solr/testCollection1_shard2_replica_n2/
   [junit4]   2> 365210 INFO  (qtp15582827-3945) [n:127.0.0.1:44045_solr c:testCollection1 s:shard2 r:core_node4 x:testCollection1_shard2_replica_n2] o.a.s.c.SyncStrategy Sync Success - now sync replicas to me
   [junit4]   2> 365210 INFO  (qtp15582827-3945) [n:127.0.0.1:44045_solr c:testCollection1 s:shard2 r:core_node4 x:testCollection1_shard2_replica_n2] o.a.s.c.SyncStrategy https://127.0.0.1:44045/solr/testCollection1_shard2_replica_n2/ has no replicas
   [junit4]   2> 365210 INFO  (qtp15582827-3945) [n:127.0.0.1:44045_solr c:testCollection1 s:shard2 r:core_node4 x:testCollection1_shard2_replica_n2] o.a.s.c.ShardLeaderElectionContext Found all replicas participating in election, clear LIR
   [junit4]   2> 365211 INFO  (qtp15582827-3945) [n:127.0.0.1:44045_solr c:testCollection1 s:shard2 r:core_node4 x:testCollection1_shard2_replica_n2] o.a.s.c.ShardLeaderElectionContext I am the new leader: https://127.0.0.1:44045/solr/testCollection1_shard2_replica_n2/ shard2
   [junit4]   2> 365220 INFO  (qtp15582827-3911) [n:127.0.0.1:44045_solr c:testCollection1 s:shard1 r:core_node3 x:testCollection1_shard1_replica_n1] o.a.s.u.UpdateHandler Using UpdateLog implementation: org.apache.solr.update.UpdateLog
   [junit4]   2> 365220 INFO  (qtp15582827-3911) [n:127.0.0.1:44045_solr c:testCollection1 s:shard1 r:core_node3 x:testCollection1_shard1_replica_n1] o.a.s.u.UpdateLog Initializing UpdateLog: dataDir=null defaultSyncLevel=FLUSH numRecordsToKeep=100 maxNumLogsToKeep=10 numVersionBuckets=65536
   [junit4]   2> 365222 INFO  (qtp15582827-3911) [n:127.0.0.1:44045_solr c:testCollection1 s:shard1 r:core_node3 x:testCollection1_shard1_replica_n1] o.a.s.u.CommitTracker Hard AutoCommit: disabled
   [junit4]   2> 365222 INFO  (qtp15582827-3911) [n:127.0.0.1:44045_solr c:testCollection1 s:shard1 r:core_node3 x:testCollection1_shard1_replica_n1] o.a.s.u.CommitTracker Soft AutoCommit: disabled
   [junit4]   2> 365223 INFO  (qtp15582827-3911) [n:127.0.0.1:44045_solr c:testCollection1 s:shard1 r:core_node3 x:testCollection1_shard1_replica_n1] o.a.s.s.SolrIndexSearcher Opening [Searcher@27765f[testCollection1_shard1_replica_n1] main]
   [junit4]   2> 365224 INFO  (qtp15582827-3911) [n:127.0.0.1:44045_solr c:testCollection1 s:shard1 r:core_node3 x:testCollection1_shard1_replica_n1] o.a.s.r.ManagedResourceStorage Configured ZooKeeperStorageIO with znodeBase: /configs/config
   [junit4]   2> 365224 INFO  (qtp15582827-3911) [n:127.0.0.1:44045_solr c:testCollection1 s:shard1 r:core_node3 x:testCollection1_shard1_replica_n1] o.a.s.r.ManagedResourceStorage Loaded null at path _rest_managed.json using ZooKeeperStorageIO:path=/configs/config
   [junit4]   2> 365225 INFO  (qtp15582827-3911) [n:127.0.0.1:44045_solr c:testCollection1 s:shard1 r:core_node3 x:testCollection1_shard1_replica_n1] o.a.s.h.ReplicationHandler Commits will be reserved for 10000ms.
   [junit4]   2> 365225 INFO  (qtp15582827-3911) [n:127.0.0.1:44045_solr c:testCollection1 s:shard1 r:core_node3 x:testCollection1_shard1_replica_n1] o.a.s.u.UpdateLog Could not find max version in index or recent updates, using new clock 1581016641522630656
   [junit4]   2> 365228 INFO  (qtp15582827-3911) [n:127.0.0.1:44045_solr c:testCollection1 s:shard1 r:core_node3 x:testCollection1_shard1_replica_n1] o.a.s.c.ShardLeaderElectionContext Enough replicas found to continue.
   [junit4]   2> 365228 INFO  (qtp15582827-3911) [n:127.0.0.1:44045_solr c:testCollection1 s:shard1 r:core_node3 x:testCollection1_shard1_replica_n1] o.a.s.c.ShardLeaderElectionContext I may be the new leader - try and sync
   [junit4]   2> 365228 INFO  (qtp15582827-3911) [n:127.0.0.1:44045_solr c:testCollection1 s:shard1 r:core_node3 x:testCollection1_shard1_replica_n1] o.a.s.c.SyncStrategy Sync replicas to https://127.0.0.1:44045/solr/testCollection1_shard1_replica_n1/
   [junit4]   2> 365228 INFO  (qtp15582827-3911) [n:127.0.0.1:44045_solr c:testCollection1 s:shard1 r:core_node3 x:testCollection1_shard1_replica_n1] o.a.s.c.SyncStrategy Sync Success - now sync replicas to me
   [junit4]   2> 365228 INFO  (qtp15582827-3911) [n:127.0.0.1:44045_solr c:testCollection1 s:shard1 r:core_node3 x:testCollection1_shard1_replica_n1] o.a.s.c.SyncStrategy https://127.0.0.1:44045/solr/testCollection1_shard1_replica_n1/ has no replicas
   [junit4]   2> 365228 INFO  (qtp15582827-3911) [n:127.0.0.1:44045_solr c:testCollection1 s:shard1 r:core_node3 x:testCollection1_shard1_replica_n1] o.a.s.c.ShardLeaderElectionContext Found all replicas participating in election, clear LIR
   [junit4]   2> 365229 INFO  (qtp15582827-3911) [n:127.0.0.1:44045_solr c:testCollection1 s:shard1 r:core_node3 x:testCollection1_shard1_replica_n1] o.a.s.c.ShardLeaderElectionContext I am the new leader: https://127.0.0.1:44045/solr/testCollection1_shard1_replica_n1/ shard1
   [junit4]   2> 365229 INFO  (searcherExecutor-1095-thread-1-processing-n:127.0.0.1:44045_solr x:testCollection1_shard1_replica_n1 s:shard1 c:testCollection1 r:core_node3) [n:127.0.0.1:44045_solr c:testCollection1 s:shard1 r:core_node3 x:testCollection1_shard1_replica_n1] o.a.s.c.SolrCore [testCollection1_shard1_replica_n1] Registered new searcher Searcher@27765f[testCollection1_shard1_replica_n1] main{ExitableDirectoryReader(UninvertingDirectoryReader())}
   [junit4]   2> 365332 INFO  (zkCallback-419-thread-2-processing-n:127.0.0.1:44045_solr) [n:127.0.0.1:44045_solr    ] o.a.s.c.c.ZkStateReader A cluster state change: [WatchedEvent state:SyncConnected type:NodeDataChanged path:/collections/testCollection1/state.json] for collection [testCollection1] has occurred - updating... (live nodes size: [1])
   [junit4]   2> 365332 INFO  (zkCallback-419-thread-1-processing-n:127.0.0.1:44045_solr) [n:127.0.0.1:44045_solr    ] o.a.s.c.c.ZkStateReader A cluster state change: [WatchedEvent state:SyncConnected type:NodeDataChanged path:/collections/testCollection1/state.json] for collection [testCollection1] has occurred - updating... (live nodes size: [1])
   [junit4]   2> 365362 INFO  (qtp15582827-3945) [n:127.0.0.1:44045_solr c:testCollection1 s:shard2 r:core_node4 x:testCollection1_shard2_replica_n2] o.a.s.c.ZkController I am the leader, no recovery necessary
   [junit4]   2> 365363 INFO  (qtp15582827-3945) [n:127.0.0.1:44045_solr c:testCollection1 s:shard2 r:core_node4 x:testCollection1_shard2_replica_n2] o.a.s.s.HttpSolrCall [admin] webapp=null path=/admin/cores params={qt=/admin/cores&coreNodeName=core_node4&collection.configName=config&newCollection=true&name=testCollection1_shard2_replica_n2&action=CREATE&numShards=2&collection=testCollection1&shard=shard2&wt=javabin&version=2&replicaType=NRT} status=0 QTime=1259
   [junit4]   2> 365380 INFO  (qtp15582827-3911) [n:127.0.0.1:44045_solr c:testCollection1 s:shard1 r:core_node3 x:testCollection1_shard1_replica_n1] o.a.s.c.ZkController I am the leader, no recovery necessary
   [junit4]   2> 365381 INFO  (qtp15582827-3911) [n:127.0.0.1:44045_solr c:testCollection1 s:shard1 r:core_node3 x:testCollection1_shard1_replica_n1] o.a.s.s.HttpSolrCall [admin] webapp=null path=/admin/cores params={qt=/admin/cores&coreNodeName=core_node3&collection.configName=config&newCollection=true&name=testCollection1_shard1_replica_n1&action=CREATE&numShards=2&collection=testCollection1&shard=shard1&wt=javabin&version=2&replicaType=NRT} status=0 QTime=1277
   [junit4]   2> 365382 INFO  (qtp15582827-3913) [n:127.0.0.1:44045_solr    ] o.a.s.h.a.CollectionsHandler Wait for new collection to be active for at most 30 seconds. Check all shard replicas
   [junit4]   2> 365483 INFO  (zkCallback-419-thread-2-processing-n:127.0.0.1:44045_solr) [n:127.0.0.1:44045_solr    ] o.a.s.c.c.ZkStateReader A cluster state change: [WatchedEvent state:SyncConnected type:NodeDataChanged path:/collections/testCollection1/state.json] for collection [testCollection1] has occurred - updating... (live nodes size: [1])
   [junit4]   2> 365483 INFO  (zkCallback-419-thread-1-processing-n:127.0.0.1:44045_solr) [n:127.0.0.1:44045_solr    ] o.a.s.c.c.ZkStateReader A cluster state change: [WatchedEvent state:SyncConnected type:NodeDataChanged path:/collections/testCollection1/state.json] for collection [testCollection1] has occurred - updating... (live nodes size: [1])
   [junit4]   2> 365791 INFO  (OverseerCollectionConfigSetProcessor-98813539984408579-127.0.0.1:44045_solr-n_0000000000) [n:127.0.0.1:44045_solr    ] o.a.s.c.OverseerTaskQueue Response ZK path: /overseer/collection-queue-work/qnr-0000000000 doesn't exist.  Requestor may have disconnected from ZooKeeper
   [junit4]   2> 366383 INFO  (qtp15582827-3913) [n:127.0.0.1:44045_solr    ] o.a.s.s.HttpSolrCall [admin] webapp=null path=/admin/collections params={replicationFactor=1&collection.configName=config&maxShardsPerNode=1000&name=testCollection1&nrtReplicas=1&action=CREATE&numShards=2&wt=javabin&version=2} status=0 QTime=2593
   [junit4]   2> 366383 INFO  (qtp15582827-3906) [n:127.0.0.1:44045_solr    ] o.a.s.h.a.CollectionsHandler Invoked Collection Action :create with params replicationFactor=1&collection.configName=config&maxShardsPerNode=1000&name=testCollection2&nrtReplicas=1&action=CREATE&numShards=2&wt=javabin&version=2 and sendToOCPQueue=true
   [junit4]   2> 366384 INFO  (OverseerThreadFactory-1092-thread-2-processing-n:127.0.0.1:44045_solr) [n:127.0.0.1:44045_solr    ] o.a.s.c.CreateCollectionCmd Create collection testCollection2
   [junit4]   2> 366591 INFO  (OverseerStateUpdate-98813539984408579-127.0.0.1:44045_solr-n_0000000000) [n:127.0.0.1:44045_solr    ] o.a.s.c.o.SliceMutator createReplica() {
   [junit4]   2>   "operation":"ADDREPLICA",
   [junit4]   2>   "collection":"testCollection2",
   [junit4]   2>   "shard":"shard1",
   [junit4]   2>   "core":"testCollection2_shard1_replica_n1",
   [junit4]   2>   "state":"down",
   [junit4]   2>   "base_url":"https://127.0.0.1:44045/solr",
   [junit4]   2>   "type":"NRT"} 
   [junit4]   2> 366593 INFO  (OverseerStateUpdate-98813539984408579-127.0.0.1:44045_solr-n_0000000000) [n:127.0.0.1:44045_solr    ] o.a.s.c.o.SliceMutator createReplica() {
   [junit4]   2>   "operation":"ADDREPLICA",
   [junit4]   2>   "collection":"testCollection2",
   [junit4]   2>   "shard":"shard2",
   [junit4]   2>   "core":"testCollection2_shard2_replica_n3",
   [junit4]   2>   "state":"down",
   [junit4]   2>   "base_url":"https://127.0.0.1:44045/solr",
   [junit4]   2>   "type":"NRT"} 
   [junit4]   2> 366795 INFO  (qtp15582827-3944) [n:127.0.0.1:44045_solr    ] o.a.s.h.a.CoreAdminOperation core create command qt=/admin/cores&coreNodeName=core_node4&collection.configName=config&newCollection=true&name=testCollection2_shard2_replica_n3&action=CREATE&numShards=2&collection=testCollection2&shard=shard2&wt=javabin&version=2&replicaType=NRT
   [junit4]   2> 366795 INFO  (qtp15582827-3908) [n:127.0.0.1:44045_solr    ] o.a.s.h.a.CoreAdminOperation core create command qt=/admin/cores&coreNodeName=core_node2&collection.configName=config&newCollection=true&name=testCollection2_shard1_replica_n1&action=CREATE&numShards=2&collection=testCollection2&shard=shard1&wt=javabin&version=2&replicaType=NRT
   [junit4]   2> 366899 INFO  (zkCallback-419-thread-1-processing-n:127.0.0.1:44045_solr) [n:127.0.0.1:44045_solr    ] o.a.s.c.c.ZkStateReader A cluster state change: [WatchedEvent state:SyncConnected type:NodeDataChanged path:/collections/testCollection2/state.json] for collection [testCollection2] has occurred - updating... (live nodes size: [1])
   [junit4]   2> 366899 INFO  (zkCallback-419-thread-2-processing-n:127.0.0.1:44045_solr) [n:127.0.0.1:44045_solr    ] o.a.s.c.c.ZkStateReader A cluster state change: [WatchedEvent state:SyncConnected type:NodeDataChanged path:/collections/testCollection2/state.json] for collection [testCollection2] has occurred - updating... (live nodes size: [1])
   [junit4]   2> 367809 INFO  (qtp15582827-3944) [n:127.0.0.1:44045_solr c:testCollection2 s:shard2 r:core_node4 x:testCollection2_shard2_replica_n3] o.a.s.c.SolrConfig Using Lucene MatchVersion: 7.2.0
   [junit4]   2> 367809 INFO  (qtp15582827-3908) [n:127.0.0.1:44045_solr c:testCollection2 s:shard1 r:core_node2 x:testCollection2_shard1_replica_n1] o.a.s.c.SolrConfig Using Lucene MatchVersion: 7.2.0
   [junit4]   2> 367816 INFO  (qtp15582827-3944) [n:127.0.0.1:44045_solr c:testCollection2 s:shard2 r:core_node4 x:testCollection2_shard2_replica_n3] o.a.s.s.IndexSchema [testCollection2_shard2_replica_n3] Schema name=minimal
   [junit4]   2> 367816 INFO  (qtp15582827-3908) [n:127.0.0.1:44045_solr c:testCollection2 s:shard1 r:core_node2 x:testCollection2_shard1_replica_n1] o.a.s.s.IndexSchema [testCollection2_shard1_replica_n1] Schema name=minimal
   [junit4]   2> 367819 INFO  (qtp15582827-3944) [n:127.0.0.1:44045_solr c:testCollection2 s:shard2 r:core_node4 x:testCollection2_shard2_replica_n3] o.a.s.s.IndexSchema Loaded schema minimal/1.1 with uniqueid field id
   [junit4]   2> 367819 INFO  (qtp15582827-3944) [n:127.0.0.1:44045_solr c:testCollection2 s:shard2 r:core_node4 x:testCollection2_shard2_replica_n3] o.a.s.c.CoreContainer Creating SolrCore 'testCollection2_shard2_replica_n3' using configuration from collection testCollection2, trusted=true
   [junit4]   2> 367820 INFO  (qtp15582827-3908) [n:127.0.0.1:44045_solr c:testCollection2 s:shard1 r:core_node2 x:testCollection2_shard1_replica_n1] o.a.s.s.IndexSchema Loaded schema minimal/1.1 with uniqueid field id
   [junit4]   2> 367820 INFO  (qtp15582827-3908) [n:127.0.0.1:44045_solr c:testCollection2 s:shard1 r:core_node2 x:testCollection2_shard1_replica_n1] o.a.s.c.CoreContainer Creating SolrCore 'testCollection2_shard1_replica_n1' using configuration from collection testCollection2, trusted=true
   [junit4]   2> 367820 INFO  (qtp15582827-3944) [n:127.0.0.1:44045_solr c:testCollection2 s:shard2 r:core_node4 x:testCollection2_shard2_replica_n3] o.a.s.m.r.SolrJmxReporter JMX monitoring for 'solr_44045.solr.core.testCollection2.shard2.replica_n3' (registry 'solr.core.testCollection2.shard2.replica_n3') enabled at server: com.sun.jmx.mbeanserver.JmxMBeanServer@faa438
   [junit4]   2> 367820 INFO  (qtp15582827-3944) [n:127.0.0.1:44045_solr c:testCollection2 s:shard2 r:core_node4 x:testCollection2_shard2_replica_n3] o.a.s.c.SolrCore solr.RecoveryStrategy.Builder
   [junit4]   2> 367820 INFO  (qtp15582827-3944) [n:127.0.0.1:44045_solr c:testCollection2 s:shard2 r:core_node4 x:testCollection2_shard2_replica_n3] o.a.s.c.SolrCore [[testCollection2_shard2_replica_n3] ] Opening new SolrCore at [/home/jenkins/workspace/Lucene-Solr-7.x-Linux/solr/build/solr-core/test/J1/temp/solr.cloud.LeaderElectionContextKeyTest_8A077130F18ACC69-001/tempDir-001/node1/testCollection2_shard2_replica_n3], dataDir=[/home/jenkins/workspace/Lucene-Solr-7.x-Linux/solr/build/solr-core/test/J1/temp/solr.cloud.LeaderElectionContextKeyTest_8A077130F18ACC69-001/tempDir-001/node1/./testCollection2_shard2_replica_n3/data/]
   [junit4]   2> 367821 INFO  (qtp15582827-3908) [n:127.0.0.1:44045_solr c:testCollection2 s:shard1 r:core_node2 x:testCollection2_shard1_replica_n1] o.a.s.m.r.SolrJmxReporter JMX monitoring for 'solr_44045.solr.core.testCollection2.shard1.replica_n1' (registry 'solr.core.testCollection2.shard1.replica_n1') enabled at server: com.sun.jmx.mbeanserver.JmxMBeanServer@faa438
   [junit4]   2> 367821 INFO  (qtp15582827-3908) [n:127.0.0.1:44045_solr c:testCollection2 s:shard1 r:core_node2 x:testCollection2_shard1_replica_n1] o.a.s.c.SolrCore solr.RecoveryStrategy.Builder
   [junit4]   2> 367821 INFO  (qtp15582827-3908) [n:127.0.0.1:44045_solr c:testCollection2 s:shard1 r:core_node2 x:testCollection2_shard1_replica_n1] o.a.s.c.SolrCore [[testCollection2_shard1_replica_n1] ] Opening new SolrCore at [/home/jenkins/workspace/Lucene-Solr-7.x-Linux/solr/build/solr-core/test/J1/temp/solr.cloud.LeaderElectionContextKeyTest_8A077130F18ACC69-001/tempDir-001/node1/testCollection2_shard1_replica_n1], dataDir=[/home/jenkins/workspace/Lucene-Solr-7.x-Linux/solr/build/solr-core/test/J1/temp/solr.cloud.LeaderElectionContextKeyTest_8A077130F18ACC69-001/tempDir-001/node1/./testCollection2_shard1_replica_n1/data/]
   [junit4]   2> 367880 INFO  (qtp15582827-3944) [n:127.0.0.1:44045_solr c:testCollection2 s:shard2 r:core_node4 x:testCollection2_shard2_replica_n3] o.a.s.u.UpdateHandler Using UpdateLog implementation: org.apache.solr.update.UpdateLog
   [junit4]   2> 367880 INFO  (qtp15582827-3944) [n:127.0.0.1:44045_solr c:testCollection2 s:shard2 r:core_node4 x:testCollection2_shard2_replica_n3] o.a.s.u.UpdateLog Initializing UpdateLog: dataDir=null defaultSyncLevel=FLUSH numRecordsToKeep=100 maxNumLogsToKeep=10 numVersionBuckets=65536
   [junit4]   2> 367880 INFO  (qtp15582827-3908) [n:127.0.0.1:44045_solr c:testCollection2 s:shard1 r:core_node2 x:testCollection2_shard1_replica_n1] o.a.s.u.UpdateHandler Using UpdateLog implementation: org.apache.solr.update.UpdateLog
   [junit4]   2> 367880 INFO  (qtp15582827-3908) [n:127.0.0.1:44045_solr c:testCollection2 s:shard1 r:core_node2 x:testCollection2_shard1_replica_n1] o.a.s.u.UpdateLog Initializing UpdateLog: dataDir=null defaultSyncLevel=FLUSH numRecordsToKeep=100 maxNumLogsToKeep=10 numVersionBuckets=65536
   [junit4]   2> 367881 INFO  (qtp15582827-3944) [n:127.0.0.1:44045_solr c:testCollection2 s:shard2 r:core_node4 x:testCollection2_shard2_replica_n3] o.a.s.u.CommitTracker Hard AutoCommit: disabled
   [junit4]   2> 367881 INFO  (qtp15582827-3944) [n:127.0.0.1:44045_solr c:testCollection2 s:shard2 r:core_node4 x:testCollection2_shard2_replica_n3] o.a.s.u.CommitTracker Soft AutoCommit: disabled
   [junit4]   2> 367881 INFO  (qtp15582827-3908) [n:127.0.0.1:44045_solr c:testCollection2 s:shard1 r:core_node2 x:testCollection2_shard1_replica_n1] o.a.s.u.CommitTracker Hard AutoCommit: disabled
   [junit4]   2> 367881 INFO  (qtp15582827-3908) [n:127.0.0.1:44045_solr c:testCollection2 s:shard1 r:core_node2 x:testCollection2_shard1_replica_n1] o.a.s.u.CommitTracker Soft AutoCommit: disabled
   [junit4]   2> 367882 INFO  (qtp15582827-3908) [n:127.0.0.1:44045_solr c:testCollection2 s:shard1 r:core_node2 x:testCollection2_shard1_replica_n1] o.a.s.s.SolrIndexSearcher Opening [Searcher@276223[testCollection2_shard1_replica_n1] main]
   [junit4]   2> 367882 INFO  (qtp15582827-3944) [n:127.0.0.1:44045_solr c:testCollection2 s:shard2 r:core_node4 x:testCollection2_shard2_replica_n3] o.a.s.s.SolrIndexSearcher Opening [Searcher@17eea2b[testCollection2_shard2_replica_n3] main]
   [junit4]   2> 367883 INFO  (qtp15582827-3908) [n:127.0.0.1:44045_solr c:testCollection2 s:shard1 r:core_node2 x:testCollection2_shard1_replica_n1] o.a.s.r.ManagedResourceStorage Configured ZooKeeperStorageIO with znodeBase: /configs/config
   [junit4]   2> 367883 INFO  (qtp15582827-3944) [n:127.0.0.1:44045_solr c:testCollection2 s:shard2 r:core_node4 x:testCollection2_shard2_replica_n3] o.a.s.r.ManagedResourceStorage Configured ZooKeeperStorageIO with znodeBase: /configs/config
   [junit4]   2> 367883 INFO  (qtp15582827-3908) [n:127.0.0.1:44045_solr c:testCollection2 s:shard1 r:core_node2 x:testCollection2_shard1_replica_n1] o.a.s.r.ManagedResourceStorage Loaded null at path _rest_managed.json using ZooKeeperStorageIO:path=/configs/config
   [junit4]   2> 367883 INFO  (qtp15582827-3944) [n:127.0.0.1:44045_solr c:testCollection2 s:shard2 r:core_node4 x:testCollection2_shard2_replica_n3] o.a.s.r.ManagedResourceStorage Loaded null at path _rest_managed.json using ZooKeeperStorageIO:path=/configs/config
   [junit4]   2> 367884 INFO  (qtp15582827-3908) [n:127.0.0.1:44045_solr c:testCollection2 s:shard1 r:core_node2 x:testCollection2_shard1_replica_n1] o.a.s.h.ReplicationHandler Commits will be reserved for 10000ms.
   [junit4]   2> 367884 INFO  (qtp15582827-3944) [n:127.0.0.1:44045_solr c:testCollection2 s:shard2 r:core_node4 x:testCollection2_shard2_replica_n3] o.a.s.h.ReplicationHandler Commits will be reserved for 10000ms.
   [junit4]   2> 367884 INFO  (searcherExecutor-1105-thread-1-processing-n:127.0.0.1:44045_solr x:testCollection2_shard2_replica_n3 s:shard2 c:testCollection2 r:core_node4) [n:127.0.0.1:44045_solr c:testCollection2 s:shard2 r:core_node4 x:testCollection2_shard2_replica_n3] o.a.s.c.SolrCore [testCollection2_shard2_replica_n3] Registered new searcher Searcher@17eea2b[testCollection2_shard2_replica_n3] main{ExitableDirectoryReader(UninvertingDirectoryReader())}
   [junit4]   2> 367884 INFO  (searcherExecutor-1106-thread-1-processing-n:127.0.0.1:44045_solr x:testCollection2_shard1_replica_n1 s:shard1 c:testCollection2 r:core_node2) [n:127.0.0.1:44045_solr c:testCollection2 s:shard1 r:core_node2 x:testCollection2_shard1_replica_n1] o.a.s.c.SolrCore [testCollection2_shard1_replica_n1] Registered new searcher Searcher@276223[testCollection2_shard1_replica_n1] main{ExitableDirectoryReader(UninvertingDirectoryReader())}
   [junit4]   2> 367884 INFO  (qtp15582827-3944) [n:127.0.0.1:44045_solr c:testCollection2 s:shard2 r:core_node4 x:testCollection2_shard2_replica_n3] o.a.s.u.UpdateLog Could not find max version in index or recent updates, using new clock 1581016644310794240
   [junit4]   2> 367884 INFO  (qtp15582827-3908) [n:127.0.0.1:44045_solr c:testCollection2 s:shard1 r:core_node2 x:testCollection2_shard1_replica_n1] o.a.s.u.UpdateLog Could not find max version in index or recent updates, using new clock 1581016644310794240
   [junit4]   2> 367887 INFO  (qtp15582827-3944) [n:127.0.0.1:44045_solr c:testCollection2 s:shard2 r:core_node4 x:testCollection2_shard2_replica_n3] o.a.s.c.ShardLeaderElectionContext Enough replicas found to continue.
   [junit4]   2> 367887 INFO  (qtp15582827-3944) [n:127.0.0.1:44045_solr c:testCollection2 s:shard2 r:core_node4 x:testCollection2_shard2_replica_n3] o.a.s.c.ShardLeaderElectionContext I may be the new leader - try and sync
   [junit4]   2> 367887 INFO  (qtp15582827-3944) [n:127.0.0.1:44045_solr c:testCollection2 s:shard2 r:core_node4 x:testCollection2_shard2_replica_n3] o.a.s.c.SyncStrategy Sync replicas to https://127.0.0.1:44045/solr/testCollection2_shard2_replica_n3/
   [junit4]   2> 367887 INFO  (qtp15582827-3944) [n:127.0.0.1:44045_solr c:testCollection2 s:shard2 r:core_node4 x:testCollection2_shard2_replica_n3] o.a.s.c.SyncStrategy Sync Success - now sync replicas to me
   [junit4]   2> 367887 INFO  (qtp15582827-3908) [n:127.0.0.1:44045_solr c:testCollection2 s:shard1 r:core_node2 x:testCollection2_shard1_replica_n1] o.a.s.c.ShardLeaderElectionContext Enough replicas found to continue.
   [junit4]   2> 367887 INFO  (qtp15582827-3908) [n:127.0.0.1:44045_solr c:testCollection2 s:shard1 r:core_node2 x:testCollection2_shard1_replica_n1] o.a.s.c.ShardLeaderElectionContext I may be the new leader - try and sync
   [junit4]   2> 367887 INFO  (qtp15582827-3944) [n:127.0.0.1:44045_solr c:testCollection2 s:shard2 r:core_node4 x:testCollection2_shard2_replica_n3] o.a.s.c.SyncStrategy https://127.0.0.1:44045/solr/testCollection2_shard2_replica_n3/ has no replicas
   [junit4]   2> 367887 INFO  (qtp15582827-3908) [n:127.0.0.1:44045_solr c:testCollection2 s:shard1 r:core_node2 x:testCollection2_shard1_replica_n1] o.a.s.c.SyncStrategy Sync replicas to https://127.0.0.1:44045/solr/testCollection2_shard1_replica_n1/
   [junit4]   2> 367887 INFO  (qtp15582827-3944) [n:127.0.0.1:44045_solr c:testCollection2 s:shard2 r:core_node4 x:testCollection2_shard2_replica_n3] o.a.s.c.ShardLeaderElectionContext Found all replicas participating in election, clear LIR
   [junit4]   2> 367887 INFO  (qtp15582827-3908) [n:127.0.0.1:44045_solr c:testCollection2 s:shard1 r:core_node2 x:testCollection2_shard1_replica_n1] o.a.s.c.SyncStrategy Sync Success - now sync replicas to me
   [junit4]   2> 367887 INFO  (qtp15582827-3908) [n:127.0.0.1:44045_solr c:testCollection2 s:shard1 r:core_node2 x:testCollection2_shard1_replica_n1] o.a.s.c.SyncStrategy https://127.0.0.1:44045/solr/testCollection2_shard1_replica_n1/ has no replicas
   [junit4]   2> 367887 INFO  (qtp15582827-3908) [n:127.0.0.1:44045_solr c:testCollection2 s:shard1 r:core_node2 x:testCollection2_shard1_replica_n1] o.a.s.c.ShardLeaderElectionContext Found all replicas participating in election, clear LIR
   [junit4]   2> 367888 INFO  (qtp15582827-3944) [n:127.0.0.1:44045_solr c:testCollection2 s:shard2 r:core_node4 x:testCollection2_shard2_replica_n3] o.a.s.c.ShardLeaderElectionContext I am the new leader: https://127.0.0.1:44045/solr/testCollection2_shard2_replica_n3/ shard2
   [junit4]   2> 367889 INFO  (qtp15582827-3908) [n:127.0.0.1:44045_solr c:testCollection2 s:shard1 r:core_node2 x:testCollection2_shard1_replica_n1] o.a.s.c.ShardLeaderElectionContext I am the new leader: https://127.0.0.1:44045/solr/testCollection2_shard1_replica_n1/ shard1
   [junit4]   2> 367991 INFO  (zkCallback-419-thread-1-processing-n:127.0.0.1:44045_solr) [n:127.0.0.1:44045_solr    ] o.a.s.c.c.ZkStateReader A cluster state change: [WatchedEvent state:SyncConnected type:NodeDataChanged path:/collections/testCollection2/state.json] for collection [testCollection2] has occurred - updating... (live nodes size: [1])
   [junit4]   2> 367991 INFO  (zkCallback-419-thread-2-processing-n:127.0.0.1:44045_solr) [n:127.0.0.1:44045_solr    ] o.a.s.c.c.ZkStateReader A cluster state change: [WatchedEvent state:SyncConnected type:NodeDataChanged path:/collections/testCollection2/state.json] for collection [testCollection2] has occurred - updating... (live nodes size: [1])
   [junit4]   2> 368039 INFO  (qtp15582827-3944) [n:127.0.0.1:44045_solr c:testCollection2 s:shard2 r:core_node4 x:testCollection2_shard2_replica_n3] o.a.s.c.ZkController I am the leader, no recovery necessary
   [junit4]   2> 368039 INFO  (qtp15582827-3908) [n:127.0.0.1:44045_solr c:testCollection2 s:shard1 r:core_node2 x:testCollection2_shard1_replica_n1] o.a.s.c.ZkController I am the leader, no recovery necessary
   [junit4]   2> 368041 INFO  (qtp15582827-3944) [n:127.0.0.1:44045_solr c:testCollection2 s:shard2 r:core_node4 x:testCollection2_shard2_replica_n3] o.a.s.s.HttpSolrCall [admin] webapp=null path=/admin/cores params={qt=/admin/cores&coreNodeName=core_node4&collection.configName=config&newCollection=true&name=testCollection2_shard2_replica_n3&action=CREATE&numShards=2&collection=testCollection2&shard=shard2&wt=javabin&version=2&replicaType=NRT} status=0 QTime=1245
   [junit4]   2> 368041 INFO  (qtp15582827-3908) [n:127.0.0.1:44045_solr c:testCollection2 s:shard1 r:core_node2 x:testCollection2_shard1_replica_n1] o.a.s.s.HttpSolrCall [admin] webapp=null path=/admin/cores params={qt=/admin/cores&coreNodeName=core_node2&collection.configName=config&newCollection=true&name=testCollection2_shard1_replica_n1&action=CREATE&numShards=2&collection=testCollection2&shard=shard1&wt=javabin&version=2&replicaType=NRT} status=0 QTime=1246
   [junit4]   2> 368043 INFO  (qtp15582827-3906) [n:127.0.0.1:44045_solr    ] o.a.s.h.a.CollectionsHandler Wait for new collection to be active for at most 30 seconds. Check all shard replicas
   [junit4]   2> 368144 INFO  (zkCallback-419-thread-1-processing-n:127.0.0.1:44045_solr) [n:127.0.0.1:44045_solr    ] o.a.s.c.c.ZkStateReader A cluster state change: [WatchedEvent state:SyncConnected type:NodeDataChanged path:/collections/testCollection2/state.json] for collection [testCollection2] has occurred - updating... (live nodes size: [1])
   [junit4]   2> 368144 INFO  (zkCallback-419-thread-2-processing-n:127.0.0.1:44045_solr) [n:127.0.0.1:44045_solr    ] o.a.s.c.c.ZkStateReader A cluster state change: [WatchedEvent state:SyncConnected type:NodeDataChanged path:/collections/testCollection2/state.json] for collection [testCollection2] has occurred - updating... (live nodes size: [1])
   [junit4]   2> 368387 INFO  (OverseerCollectionConfigSetProcessor-98813539984408579-127.0.0.1:44045_solr-n_0000000000) [n:127.0.0.1:44045_solr    ] o.a.s.c.OverseerTaskQueue Response ZK path: /overseer/collection-queue-work/qnr-0000000002 doesn't exist.  Requestor may have disconnected from ZooKeeper
   [junit4]   2> 369043 INFO  (qtp15582827-3906) [n:127.0.0.1:44045_solr    ] o.a.s.s.HttpSolrCall [admin] webapp=null path=/admin/collections params={replicationFactor=1&collection.configName=config&maxShardsPerNode=1000&name=testCollection2&nrtReplicas=1&action=CREATE&numShards=2&wt=javabin&version=2} status=0 QTime=2660
   [junit4]   2> 369044 INFO  (SUITE-LeaderElectionContextKeyTest-seed#[8A077130F18ACC69]-worker) [    ] o.a.s.c.AbstractDistribZkTestBase Wait for recoveries to finish - collection: testCollection1 failOnTimeout:true timeout (sec):30
   [junit4]   2> 369045 INFO  (SUITE-LeaderElectionContextKeyTest-seed#[8A077130F18ACC69]-worker) [    ] o.a.s.c.AbstractDistribZkTestBase Recoveries finished - collection: testCollection1
   [junit4]   2> 369045 INFO  (SUITE-LeaderElectionContextKeyTest-seed#[8A077130F18ACC69]-worker) [    ] o.a.s.c.AbstractDistribZkTestBase Wait for recoveries to finish - collection: testCollection2 failOnTimeout:true timeout (sec):30
   [junit4]   2> 369045 INFO  (SUITE-LeaderElectionContextKeyTest-seed#[8A077130F18ACC69]-worker) [    ] o.a.s.c.AbstractDistribZkTestBase Recoveries finished - collection: testCollection2
   [junit4]   2> 369059 INFO  (TEST-LeaderElectionContextKeyTest.test-seed#[8A077130F18ACC69]) [    ] o.a.s.SolrTestCaseJ4 ###Starting test
   [junit4]   2> 369069 INFO  (qtp15582827-3944) [n:127.0.0.1:44045_solr    ] o.a.s.m.SolrMetricManager Closing metric reporters for registry=solr.core.testCollection1.shard2.replica_n2, tag=null
   [junit4]   2> 369069 INFO  (qtp15582827-3944) [n:127.0.0.1:44045_solr    ] o.a.s.m.r.SolrJmxReporter Closing reporter [org.apache.solr.metrics.reporters.SolrJmxReporter@18ec537: rootName = solr_44045, domain = solr.core.testCollection1.shard2.replica_n2, service url = null, agent id = null] for registry solr.core.testCollection1.shard2.replica_n2 / com.codahale.metrics.MetricRegistry@916db2
   [junit4]   2> 369083 INFO  (qtp15582827-3944) [n:127.0.0.1:44045_solr    ] o.a.s.c.SolrCore [testCollection1_shard2_replica_n2]  CLOSING SolrCore org.apache.solr.core.SolrCore@16afe20
   [junit4]   2> 369083 INFO  (qtp15582827-3944) [n:127.0.0.1:44045_solr    ] o.a.s.m.SolrMetricManager Closing metric reporters for registry=solr.core.testCollection1.shard2.replica_n2, tag=23789088
   [junit4]   2> 369083 INFO  (qtp15582827-3944) [n:127.0.0.1:44045_solr    ] o.a.s.m.SolrMetricManager Closing metric reporters for registry=solr.collection.testCollection1.shard2.leader, tag=23789088
   [junit4]   2> 369086 INFO  (qtp15582827-3944) [n:127.0.0.1:44045_solr    ] o.a.s.s.HttpSolrCall [admin] webapp=null path=/admin/cores params={deleteInstanceDir=false&core=testCollection1_shard2_replica_n2&deleteDataDir=false&action=UNLOAD&indexInfo=true&wt=javabin&version=2&deleteIndex=false} status=0 QTime=17
   [junit4]   2> 369087 INFO  (TEST-LeaderElectionContextKeyTest.test-seed#[8A077130F18ACC69]) [    ] o.a.s.SolrTestCaseJ4 ###Ending test
   [junit4]   2> NOTE: reproduce with: ant test  -Dtestcase=LeaderElectionContextKeyTest -Dtests.method=test -Dtests.seed=8A077130F18ACC69 -Dtests.multiplier=3 -Dtests.slow=true -Dtests.locale=nl -Dtests.timezone=Europe/Lisbon -Dtests.asserts=true -Dtests.file.encoding=ISO-8859-1
   [junit4] FAILURE 0.04s J1 | LeaderElectionContextKeyTest.test <<<
   [junit4]    > Throwable #1: java.lang.AssertionError
   [junit4]    > 	at __randomizedtesting.SeedInfo.seed([8A077130F18ACC69:2534EEA5F76A191]:0)
   [junit4]    > 	at org.apache.solr.cloud.LeaderElectionContextKeyTest.test(LeaderElectionContextKeyTest.java:88)
   [junit4]    > 	at java.lang.Thread.run(Thread.java:748)
   [junit4]   2> 369090 INFO  (jetty-closer-413-thread-1) [    ] o.e.j.s.AbstractConnector Stopped ServerConnector@11282d1{SSL,[ssl, http/1.1]}{127.0.0.1:0}
   [junit4]   2> 369090 INFO  (jetty-closer-413-thread-1) [    ] o.a.s.c.CoreContainer Shutting down CoreContainer instance=33436485
   [junit4]   2> 369090 INFO  (jetty-closer-413-thread-1) [    ] o.a.s.m.SolrMetricManager Closing metric reporters for registry=solr.node, tag=null
   [junit4]   2> 369090 INFO  (jetty-closer-413-thread-1) [    ] o.a.s.m.r.SolrJmxReporter Closing reporter [org.apache.solr.metrics.reporters.SolrJmxReporter@7c8930: rootName = solr_44045, domain = solr.node, service url = null, agent id = null] for registry solr.node / com.codahale.metrics.MetricRegistry@6007ba
   [junit4]   2> 369094 INFO  (jetty-closer-413-thread-1) [    ] o.a.s.m.SolrMetricManager Closing metric reporters for registry=solr.jvm, tag=null
   [junit4]   2> 369094 INFO  (jetty-closer-413-thread-1) [    ] o.a.s.m.r.SolrJmxReporter Closing reporter [org.apache.solr.metrics.reporters.SolrJmxReporter@4f7e4d: rootName = solr_44045, domain = solr.jvm, service url = null, agent id = null] for registry solr.jvm / com.codahale.metrics.MetricRegistry@e10d86
   [junit4]   2> 369097 INFO  (jetty-closer-413-thread-1) [    ] o.a.s.m.SolrMetricManager Closing metric reporters for registry=solr.jetty, tag=null
   [junit4]   2> 369097 INFO  (jetty-closer-413-thread-1) [    ] o.a.s.m.r.SolrJmxReporter Closing reporter [org.apache.solr.metrics.reporters.SolrJmxReporter@968a31: rootName = solr_44045, domain = solr.jetty, service url = null, agent id = null] for registry solr.jetty / com.codahale.metrics.MetricRegistry@1400124
   [junit4]   2> 369097 INFO  (jetty-closer-413-thread-1) [    ] o.a.s.m.SolrMetricManager Closing metric reporters for registry=solr.cluster, tag=null
   [junit4]   2> 369098 INFO  (coreCloseExecutor-1115-thread-1) [n:127.0.0.1:44045_solr c:testCollection1 s:shard1 r:core_node3 x:testCollection1_shard1_replica_n1] o.a.s.c.SolrCore [testCollection1_shard1_replica_n1]  CLOSING SolrCore org.apache.solr.core.SolrCore@3e66d
   [junit4]   2> 369098 INFO  (coreCloseExecutor-1115-thread-1) [n:127.0.0.1:44045_solr c:testCollection1 s:shard1 r:core_node3 x:testCollection1_shard1_replica_n1] o.a.s.m.SolrMetricManager Closing metric reporters for registry=solr.core.testCollection1.shard1.replica_n1, tag=255597
   [junit4]   2> 369098 INFO  (coreCloseExecutor-1115-thread-2) [n:127.0.0.1:44045_solr c:testCollection2 s:shard2 r:core_node4 x:testCollection2_shard2_replica_n3] o.a.s.c.SolrCore [testCollection2_shard2_replica_n3]  CLOSING SolrCore org.apache.solr.core.SolrCore@5ee944
   [junit4]   2> 369098 INFO  (coreCloseExecutor-1115-thread-3) [n:127.0.0.1:44045_solr c:testCollection2 s:shard1 r:core_node2 x:testCollection2_shard1_replica_n1] o.a.s.c.SolrCore [testCollection2_shard1_replica_n1]  CLOSING SolrCore org.apache.solr.core.SolrCore@1aa02e
   [junit4]   2> 369098 INFO  (coreCloseExecutor-1115-thread-1) [n:127.0.0.1:44045_solr c:testCollection1 s:shard1 r:core_node3 x:testCollection1_shard1_replica_n1] o.a.s.m.r.SolrJmxReporter Closing reporter [org.apache.solr.metrics.reporters.SolrJmxReporter@1946e80: rootName = solr_44045, domain = solr.core.testCollection1.shard1.replica_n1, service url = null, agent id = null] for registry solr.core.testCollection1.shard1.replica_n1 / com.codahale.metrics.MetricRegistry@c54b2c
   [junit4]   2> 369103 INFO  (coreCloseExecutor-1115-thread-1) [n:127.0.0.1:44045_solr c:testCollection1 s:shard1 r:core_node3 x:testCollection1_shard1_replica_n1] o.a.s.m.SolrMetricManager Closing metric reporters for registry=solr.collection.testCollection1.shard1.leader, tag=255597
   [junit4]   2> 369103 INFO  (coreCloseExecutor-1115-thread-2) [n:127.0.0.1:44045_solr c:testCollection2 s:shard2 r:core_node4 x:testCollection2_shard2_replica_n3] o.a.s.m.SolrMetricManager Closing metric reporters for registry=solr.core.testCollection2.shard2.replica_n3, tag=6220100
   [junit4]   2> 369103 INFO  (coreCloseExecutor-1115-thread-2) [n:127.0.0.1:44045_solr c:testCollection2 s:shard2 r:core_node4 x:testCollection2_shard2_replica_n3] o.a.s.m.r.SolrJmxReporter Closing reporter [org.apache.solr.metrics.reporters.SolrJmxReporter@10a7f85: rootName = solr_44045, domain = solr.core.testCollection2.shard2.replica_n3, service url = null, agent id = null] for registry solr.core.testCollection2.shard2.replica_n3 / com.codahale.metrics.MetricRegistry@945652
   [junit4]   2> 369110 INFO  (coreCloseExecutor-1115-thread-3) [n:127.0.0.1:44045_solr c:testCollection2 s:shard1 r:core_node2 x:testCollection2_shard1_replica_n1] o.a.s.m.SolrMetricManager Closing metric reporters for registry=solr.core.testCollection2.shard1.replica_n1, tag=1744942
   [junit4]   2> 369110 INFO  (coreCloseExecutor-1115-thread-3) [n:127.0.0.1:44045_solr c:testCollection2 s:shard1 r:core_node2 x:testCollection2_shard1_replica_n1] o.a.s.m.r.SolrJmxReporter Closing reporter [org.apache.solr.metrics.reporters.SolrJmxReporter@902d21: rootName = solr_44045, domain = solr.core.testCollection2.shard1.replica_n1, service url = null, agent id = null] for registry solr.core.testCollection2.shard1.replica_n1 / com.codahale.metrics.MetricRegistry@1e63fe1
   [junit4]   2> 369115 INFO  (coreCloseExecutor-1115-thread-2) [n:127.0.0.1:44045_solr c:testCollection2 s:shard2 r:core_node4 x:testCollection2_shard2_replica_n3] o.a.s.m.SolrMetricManager Closing metric reporters for registry=solr.collection.testCollection2.shard2.leader, tag=6220100
   [junit4]   2> 369115 INFO  (coreCloseExecutor-1115-thread-3) [n:127.0.0.1:44045_solr c:testCollection2 s:shard1 r:core_node2 x:testCollection2_shard1_replica_n1] o.a.s.m.SolrMetricManager Closing metric reporters for registry=solr.collection.testCollection2.shard1.leader, tag=1744942
   [junit4]   2> 369116 INFO  (jetty-closer-413-thread-1) [    ] o.a.s.c.Overseer Overseer (id=98813539984408579-127.0.0.1:44045_solr-n_0000000000) closing
   [junit4]   2> 369116 INFO  (OverseerStateUpdate-98813539984408579-127.0.0.1:44045_solr-n_0000000000) [n:127.0.0.1:44045_solr    ] o.a.s.c.Overseer Overseer Loop exiting : 127.0.0.1:44045_solr
   [junit4]   2> 369116 WARN  (OverseerAutoScalingTriggerThread-98813539984408579-127.0.0.1:44045_solr-n_0000000000) [n:127.0.0.1:44045_solr    ] o.a.s.c.a.OverseerTriggerThread OverseerTriggerThread woken up but we are closed, exiting.
   [junit4]   2> 369117 WARN  (zkCallback-419-thread-2-processing-n:127.0.0.1:44045_solr) [n:127.0.0.1:44045_solr    ] o.a.s.c.c.ZkStateReader ZooKeeper watch triggered, but Solr cannot talk to ZK: [KeeperErrorCode = Session expired for /live_nodes]
   [junit4]   2> 369117 INFO  (jetty-closer-413-thread-1) [    ] o.e.j.s.h.ContextHandler Stopped o.e.j.s.ServletContextHandler@18d28a1{/solr,null,UNAVAILABLE}
   [junit4]   2> 369117 ERROR (SUITE-LeaderElectionContextKeyTest-seed#[8A077130F18ACC69]-worker) [    ] o.a.z.s.ZooKeeperServer ZKShutdownHandler is not registered, so ZooKeeper server won't take any action on ERROR or SHUTDOWN server state changes
   [junit4]   2> 369117 INFO  (SUITE-LeaderElectionContextKeyTest-seed#[8A077130F18ACC69]-worker) [    ] o.a.s.c.ZkTestServer connecting to 127.0.0.1:40319 40319
   [junit4]   2> 369155 INFO  (Thread-1928) [    ] o.a.s.c.ZkTestServer connecting to 127.0.0.1:40319 40319
   [junit4]   2> 369155 WARN  (Thread-1928) [    ] o.a.s.c.ZkTestServer Watch limit violations: 
   [junit4]   2> Maximum concurrent create/delete watches above limit:
   [junit4]   2> 
   [junit4]   2> 	2	/solr/aliases.json
   [junit4]   2> 
   [junit4]   2> Maximum concurrent data watches above limit:
   [junit4]   2> 
   [junit4]   2> 	5	/solr/collections/testCollection2/state.json
   [junit4]   2> 	5	/solr/collections/testCollection1/state.json
   [junit4]   2> 	2	/solr/clusterstate.json
   [junit4]   2> 	2	/solr/clusterprops.json
   [junit4]   2> 
   [junit4]   2> Maximum concurrent children watches above limit:
   [junit4]   2> 
   [junit4]   2> 	2	/solr/live_nodes
   [junit4]   2> 	2	/solr/collections
   [junit4]   2> 
   [junit4]   2> NOTE: leaving temporary files on disk at: /home/jenkins/workspace/Lucene-Solr-7.x-Linux/solr/build/solr-core/test/J1/temp/solr.cloud.LeaderElectionContextKeyTest_8A077130F18ACC69-001
   [junit4]   2> Oct 12, 2017 2:22:48 AM com.carrotsearch.randomizedtesting.ThreadLeakControl checkThreadLeaks
   [junit4]   2> WARNING: Will linger awaiting termination of 3 leaked thread(s).
   [junit4]   2> NOTE: test params are: codec=Asserting(Lucene70): {}, docValues:{}, maxPointsInLeafNode=75, maxMBSortInHeap=7.927680811395881, sim=RandomSimilarity(queryNorm=false): {}, locale=nl, timezone=Europe/Lisbon
   [junit4]   2> NOTE: Linux 4.10.0-33-generic i386/Oracle Corporation 1.8.0_144 (32-bit)/cpus=8,threads=1,free=278819200,total=536870912
   [junit4]   2> NOTE: All tests run in this JVM: [TestDynamicFieldCollectionResource, TestRestoreCore, TestMaxScoreQueryParser, TestFuzzyAnalyzedSuggestions, CheckHdfsIndexTest, TestSchemaVersionResource, HdfsRestartWhileUpdatingTest, QueryResultKeyTest, AliasIntegrationTest, AnalysisAfterCoreReloadTest, ChaosMonkeySafeLeaderTest, CollectionsAPIAsyncDistributedZkTest, MissingSegmentRecoveryTest, ConvertedLegacyTest, SortSpecParsingTest, TestRawTransformer, TestLeaderElectionWithEmptyReplica, BasicAuthIntegrationTest, TestJavabinTupleStreamParser, ConfigSetsAPITest, NoCacheHeaderTest, TestPayloadScoreQParserPlugin, SpatialFilterTest, TestRebalanceLeaders, TestPartialUpdateDeduplication, DirectSolrSpellCheckerTest, DistanceFunctionTest, LukeRequestHandlerTest, DirectSolrConnectionTest, TestConfigSetImmutable, StatelessScriptUpdateProcessorFactoryTest, SimpleCollectionCreateDeleteTest, TestAtomicUpdateErrorCases, OverseerModifyCollectionTest, DOMUtilTest, TestJettySolrRunner, TestStressRecovery, BlockDirectoryTest, TestOrdValues, TestSweetSpotSimilarityFactory, TestTrieFacet, LeaderElectionContextKeyTest]
   [junit4] Completed [91/744 (1!)] on J1 in 5.89s, 1 test, 1 failure <<< FAILURES!

[...truncated 44996 lines...]

Mime
View raw message