lucene-dev mailing list archives

Site index · List index
Message view « Date » · « Thread »
Top « Date » · « Thread »
From Policeman Jenkins Server <jenk...@thetaphi.de>
Subject [JENKINS] Lucene-Solr-master-Solaris (64bit/jdk1.8.0) - Build # 1464 - Still Unstable!
Date Tue, 10 Oct 2017 17:08:12 GMT
Build: https://jenkins.thetaphi.de/job/Lucene-Solr-master-Solaris/1464/
Java: 64bit/jdk1.8.0 -XX:-UseCompressedOops -XX:+UseConcMarkSweepGC

1 tests failed.
FAILED:  junit.framework.TestSuite.org.apache.solr.security.hadoop.TestImpersonationWithHadoopAuth

Error Message:
2 threads leaked from SUITE scope at org.apache.solr.security.hadoop.TestImpersonationWithHadoopAuth:     1) Thread[id=40816, name=jetty-launcher-6315-thread-1-EventThread, state=TIMED_WAITING, group=TGRP-TestImpersonationWithHadoopAuth]         at sun.misc.Unsafe.park(Native Method)         at java.util.concurrent.locks.LockSupport.parkNanos(LockSupport.java:215)         at java.util.concurrent.locks.AbstractQueuedSynchronizer.doAcquireSharedNanos(AbstractQueuedSynchronizer.java:1037)         at java.util.concurrent.locks.AbstractQueuedSynchronizer.tryAcquireSharedNanos(AbstractQueuedSynchronizer.java:1328)         at java.util.concurrent.CountDownLatch.await(CountDownLatch.java:277)         at org.apache.curator.CuratorZookeeperClient.internalBlockUntilConnectedOrTimedOut(CuratorZookeeperClient.java:323)         at org.apache.curator.RetryLoop.callWithRetry(RetryLoop.java:105)         at org.apache.curator.framework.imps.GetDataBuilderImpl.pathInForeground(GetDataBuilderImpl.java:288)         at org.apache.curator.framework.imps.GetDataBuilderImpl.forPath(GetDataBuilderImpl.java:279)         at org.apache.curator.framework.imps.GetDataBuilderImpl.forPath(GetDataBuilderImpl.java:41)         at org.apache.curator.framework.recipes.shared.SharedValue.readValue(SharedValue.java:244)         at org.apache.curator.framework.recipes.shared.SharedValue.access$100(SharedValue.java:44)         at org.apache.curator.framework.recipes.shared.SharedValue$1.process(SharedValue.java:61)         at org.apache.curator.framework.imps.NamespaceWatcher.process(NamespaceWatcher.java:67)         at org.apache.zookeeper.ClientCnxn$EventThread.processEvent(ClientCnxn.java:530)         at org.apache.zookeeper.ClientCnxn$EventThread.run(ClientCnxn.java:505)    2) Thread[id=40818, name=jetty-launcher-6315-thread-2-EventThread, state=TIMED_WAITING, group=TGRP-TestImpersonationWithHadoopAuth]         at sun.misc.Unsafe.park(Native Method)         at java.util.concurrent.locks.LockSupport.parkNanos(LockSupport.java:215)         at java.util.concurrent.locks.AbstractQueuedSynchronizer.doAcquireSharedNanos(AbstractQueuedSynchronizer.java:1037)         at java.util.concurrent.locks.AbstractQueuedSynchronizer.tryAcquireSharedNanos(AbstractQueuedSynchronizer.java:1328)         at java.util.concurrent.CountDownLatch.await(CountDownLatch.java:277)         at org.apache.curator.CuratorZookeeperClient.internalBlockUntilConnectedOrTimedOut(CuratorZookeeperClient.java:323)         at org.apache.curator.RetryLoop.callWithRetry(RetryLoop.java:105)         at org.apache.curator.framework.imps.GetDataBuilderImpl.pathInForeground(GetDataBuilderImpl.java:288)         at org.apache.curator.framework.imps.GetDataBuilderImpl.forPath(GetDataBuilderImpl.java:279)         at org.apache.curator.framework.imps.GetDataBuilderImpl.forPath(GetDataBuilderImpl.java:41)         at org.apache.curator.framework.recipes.shared.SharedValue.readValue(SharedValue.java:244)         at org.apache.curator.framework.recipes.shared.SharedValue.access$100(SharedValue.java:44)         at org.apache.curator.framework.recipes.shared.SharedValue$1.process(SharedValue.java:61)         at org.apache.curator.framework.imps.NamespaceWatcher.process(NamespaceWatcher.java:67)         at org.apache.zookeeper.ClientCnxn$EventThread.processEvent(ClientCnxn.java:530)         at org.apache.zookeeper.ClientCnxn$EventThread.run(ClientCnxn.java:505)

Stack Trace:
com.carrotsearch.randomizedtesting.ThreadLeakError: 2 threads leaked from SUITE scope at org.apache.solr.security.hadoop.TestImpersonationWithHadoopAuth: 
   1) Thread[id=40816, name=jetty-launcher-6315-thread-1-EventThread, state=TIMED_WAITING, group=TGRP-TestImpersonationWithHadoopAuth]
        at sun.misc.Unsafe.park(Native Method)
        at java.util.concurrent.locks.LockSupport.parkNanos(LockSupport.java:215)
        at java.util.concurrent.locks.AbstractQueuedSynchronizer.doAcquireSharedNanos(AbstractQueuedSynchronizer.java:1037)
        at java.util.concurrent.locks.AbstractQueuedSynchronizer.tryAcquireSharedNanos(AbstractQueuedSynchronizer.java:1328)
        at java.util.concurrent.CountDownLatch.await(CountDownLatch.java:277)
        at org.apache.curator.CuratorZookeeperClient.internalBlockUntilConnectedOrTimedOut(CuratorZookeeperClient.java:323)
        at org.apache.curator.RetryLoop.callWithRetry(RetryLoop.java:105)
        at org.apache.curator.framework.imps.GetDataBuilderImpl.pathInForeground(GetDataBuilderImpl.java:288)
        at org.apache.curator.framework.imps.GetDataBuilderImpl.forPath(GetDataBuilderImpl.java:279)
        at org.apache.curator.framework.imps.GetDataBuilderImpl.forPath(GetDataBuilderImpl.java:41)
        at org.apache.curator.framework.recipes.shared.SharedValue.readValue(SharedValue.java:244)
        at org.apache.curator.framework.recipes.shared.SharedValue.access$100(SharedValue.java:44)
        at org.apache.curator.framework.recipes.shared.SharedValue$1.process(SharedValue.java:61)
        at org.apache.curator.framework.imps.NamespaceWatcher.process(NamespaceWatcher.java:67)
        at org.apache.zookeeper.ClientCnxn$EventThread.processEvent(ClientCnxn.java:530)
        at org.apache.zookeeper.ClientCnxn$EventThread.run(ClientCnxn.java:505)
   2) Thread[id=40818, name=jetty-launcher-6315-thread-2-EventThread, state=TIMED_WAITING, group=TGRP-TestImpersonationWithHadoopAuth]
        at sun.misc.Unsafe.park(Native Method)
        at java.util.concurrent.locks.LockSupport.parkNanos(LockSupport.java:215)
        at java.util.concurrent.locks.AbstractQueuedSynchronizer.doAcquireSharedNanos(AbstractQueuedSynchronizer.java:1037)
        at java.util.concurrent.locks.AbstractQueuedSynchronizer.tryAcquireSharedNanos(AbstractQueuedSynchronizer.java:1328)
        at java.util.concurrent.CountDownLatch.await(CountDownLatch.java:277)
        at org.apache.curator.CuratorZookeeperClient.internalBlockUntilConnectedOrTimedOut(CuratorZookeeperClient.java:323)
        at org.apache.curator.RetryLoop.callWithRetry(RetryLoop.java:105)
        at org.apache.curator.framework.imps.GetDataBuilderImpl.pathInForeground(GetDataBuilderImpl.java:288)
        at org.apache.curator.framework.imps.GetDataBuilderImpl.forPath(GetDataBuilderImpl.java:279)
        at org.apache.curator.framework.imps.GetDataBuilderImpl.forPath(GetDataBuilderImpl.java:41)
        at org.apache.curator.framework.recipes.shared.SharedValue.readValue(SharedValue.java:244)
        at org.apache.curator.framework.recipes.shared.SharedValue.access$100(SharedValue.java:44)
        at org.apache.curator.framework.recipes.shared.SharedValue$1.process(SharedValue.java:61)
        at org.apache.curator.framework.imps.NamespaceWatcher.process(NamespaceWatcher.java:67)
        at org.apache.zookeeper.ClientCnxn$EventThread.processEvent(ClientCnxn.java:530)
        at org.apache.zookeeper.ClientCnxn$EventThread.run(ClientCnxn.java:505)
	at __randomizedtesting.SeedInfo.seed([A020033BF1C8718A]:0)




Build Log:
[...truncated 13828 lines...]
   [junit4] Suite: org.apache.solr.security.hadoop.TestImpersonationWithHadoopAuth
   [junit4]   2> 4396859 INFO  (SUITE-TestImpersonationWithHadoopAuth-seed#[A020033BF1C8718A]-worker) [    ] o.a.s.SolrTestCaseJ4 SecureRandom sanity checks: test.solr.allowed.securerandom=null & java.security.egd=file:/dev/./urandom
   [junit4]   2> Creating dataDir: /export/home/jenkins/workspace/Lucene-Solr-master-Solaris/solr/build/solr-core/test/J0/temp/solr.security.hadoop.TestImpersonationWithHadoopAuth_A020033BF1C8718A-001/init-core-data-001
   [junit4]   2> 4396860 INFO  (SUITE-TestImpersonationWithHadoopAuth-seed#[A020033BF1C8718A]-worker) [    ] o.a.s.SolrTestCaseJ4 Using PointFields (NUMERIC_POINTS_SYSPROP=true) w/NUMERIC_DOCVALUES_SYSPROP=true
   [junit4]   2> 4396861 INFO  (SUITE-TestImpersonationWithHadoopAuth-seed#[A020033BF1C8718A]-worker) [    ] o.a.s.SolrTestCaseJ4 Randomized ssl (false) and clientAuth (false) via: @org.apache.solr.util.RandomizeSSL(reason=, value=NaN, ssl=NaN, clientAuth=NaN)
   [junit4]   2> 4396927 INFO  (SUITE-TestImpersonationWithHadoopAuth-seed#[A020033BF1C8718A]-worker) [    ] o.a.s.c.MiniSolrCloudCluster Starting cluster of 2 servers in /export/home/jenkins/workspace/Lucene-Solr-master-Solaris/solr/build/solr-core/test/J0/temp/solr.security.hadoop.TestImpersonationWithHadoopAuth_A020033BF1C8718A-001/tempDir-001
   [junit4]   2> 4396928 INFO  (SUITE-TestImpersonationWithHadoopAuth-seed#[A020033BF1C8718A]-worker) [    ] o.a.s.c.ZkTestServer STARTING ZK TEST SERVER
   [junit4]   2> 4396928 INFO  (Thread-11186) [    ] o.a.s.c.ZkTestServer client port:0.0.0.0/0.0.0.0:0
   [junit4]   2> 4396928 INFO  (Thread-11186) [    ] o.a.s.c.ZkTestServer Starting server
   [junit4]   2> 4396934 ERROR (Thread-11186) [    ] o.a.z.s.ZooKeeperServer ZKShutdownHandler is not registered, so ZooKeeper server won't take any action on ERROR or SHUTDOWN server state changes
   [junit4]   2> 4397030 INFO  (SUITE-TestImpersonationWithHadoopAuth-seed#[A020033BF1C8718A]-worker) [    ] o.a.s.c.ZkTestServer start zk server on port:59478
   [junit4]   2> 4397094 INFO  (jetty-launcher-6315-thread-1) [    ] o.e.j.s.Server jetty-9.3.20.v20170531
   [junit4]   2> 4397095 INFO  (jetty-launcher-6315-thread-1) [    ] o.e.j.s.h.ContextHandler Started o.e.j.s.ServletContextHandler@1a33729e{/solr,null,AVAILABLE}
   [junit4]   2> 4397096 INFO  (jetty-launcher-6315-thread-1) [    ] o.e.j.s.AbstractConnector Started ServerConnector@460cdb9d{HTTP/1.1,[http/1.1]}{127.0.0.1:58529}
   [junit4]   2> 4397096 INFO  (jetty-launcher-6315-thread-1) [    ] o.e.j.s.Server Started @4400373ms
   [junit4]   2> 4397096 INFO  (jetty-launcher-6315-thread-1) [    ] o.a.s.c.s.e.JettySolrRunner Jetty properties: {hostContext=/solr, hostPort=58529}
   [junit4]   2> 4397096 ERROR (jetty-launcher-6315-thread-1) [    ] o.a.s.u.StartupLoggingUtils Missing Java Option solr.log.dir. Logging may be missing or incomplete.
   [junit4]   2> 4397097 INFO  (jetty-launcher-6315-thread-1) [    ] o.a.s.s.SolrDispatchFilter  ___      _       Welcome to Apache Solr? version 8.0.0
   [junit4]   2> 4397097 INFO  (jetty-launcher-6315-thread-1) [    ] o.a.s.s.SolrDispatchFilter / __| ___| |_ _   Starting in cloud mode on port null
   [junit4]   2> 4397097 INFO  (jetty-launcher-6315-thread-1) [    ] o.a.s.s.SolrDispatchFilter \__ \/ _ \ | '_|  Install dir: null, Default config dir: null
   [junit4]   2> 4397097 INFO  (jetty-launcher-6315-thread-1) [    ] o.a.s.s.SolrDispatchFilter |___/\___/_|_|    Start time: 2017-10-10T16:43:25.325Z
   [junit4]   2> 4397101 INFO  (jetty-launcher-6315-thread-2) [    ] o.e.j.s.Server jetty-9.3.20.v20170531
   [junit4]   2> 4397124 INFO  (jetty-launcher-6315-thread-2) [    ] o.e.j.s.h.ContextHandler Started o.e.j.s.ServletContextHandler@7abb92db{/solr,null,AVAILABLE}
   [junit4]   2> 4397124 INFO  (jetty-launcher-6315-thread-2) [    ] o.e.j.s.AbstractConnector Started ServerConnector@2230c72b{HTTP/1.1,[http/1.1]}{127.0.0.1:34247}
   [junit4]   2> 4397124 INFO  (jetty-launcher-6315-thread-2) [    ] o.e.j.s.Server Started @4400401ms
   [junit4]   2> 4397124 INFO  (jetty-launcher-6315-thread-2) [    ] o.a.s.c.s.e.JettySolrRunner Jetty properties: {hostContext=/solr, hostPort=34247}
   [junit4]   2> 4397124 ERROR (jetty-launcher-6315-thread-2) [    ] o.a.s.u.StartupLoggingUtils Missing Java Option solr.log.dir. Logging may be missing or incomplete.
   [junit4]   2> 4397125 INFO  (jetty-launcher-6315-thread-2) [    ] o.a.s.s.SolrDispatchFilter  ___      _       Welcome to Apache Solr? version 8.0.0
   [junit4]   2> 4397125 INFO  (jetty-launcher-6315-thread-2) [    ] o.a.s.s.SolrDispatchFilter / __| ___| |_ _   Starting in cloud mode on port null
   [junit4]   2> 4397125 INFO  (jetty-launcher-6315-thread-2) [    ] o.a.s.s.SolrDispatchFilter \__ \/ _ \ | '_|  Install dir: null, Default config dir: null
   [junit4]   2> 4397125 INFO  (jetty-launcher-6315-thread-2) [    ] o.a.s.s.SolrDispatchFilter |___/\___/_|_|    Start time: 2017-10-10T16:43:25.353Z
   [junit4]   2> 4397139 INFO  (jetty-launcher-6315-thread-1) [    ] o.a.s.s.SolrDispatchFilter solr.xml found in ZooKeeper. Loading...
   [junit4]   2> 4397147 INFO  (jetty-launcher-6315-thread-1) [    ] o.a.s.c.ZkContainer Zookeeper client=127.0.0.1:59478/solr
   [junit4]   2> 4397170 INFO  (jetty-launcher-6315-thread-2) [    ] o.a.s.s.SolrDispatchFilter solr.xml found in ZooKeeper. Loading...
   [junit4]   2> 4397181 INFO  (jetty-launcher-6315-thread-2) [    ] o.a.s.c.ZkContainer Zookeeper client=127.0.0.1:59478/solr
   [junit4]   2> 4397550 INFO  (jetty-launcher-6315-thread-2) [n:127.0.0.1:34247_solr    ] o.a.s.c.Overseer Overseer (id=null) closing
   [junit4]   2> 4397557 INFO  (jetty-launcher-6315-thread-1) [n:127.0.0.1:58529_solr    ] o.a.s.c.Overseer Overseer (id=null) closing
   [junit4]   2> 4397558 INFO  (jetty-launcher-6315-thread-1) [n:127.0.0.1:58529_solr    ] o.a.s.c.OverseerElectionContext I am going to be the leader 127.0.0.1:58529_solr
   [junit4]   2> 4397576 INFO  (jetty-launcher-6315-thread-2) [n:127.0.0.1:34247_solr    ] o.a.s.c.ZkController Register node as live in ZooKeeper:/live_nodes/127.0.0.1:34247_solr
   [junit4]   2> 4397582 INFO  (zkCallback-6328-thread-1-processing-n:127.0.0.1:34247_solr) [n:127.0.0.1:34247_solr    ] o.a.s.c.c.ZkStateReader Updated live nodes from ZooKeeper... (0) -> (1)
   [junit4]   2> 4397587 INFO  (zkCallback-6323-thread-1-processing-n:127.0.0.1:58529_solr) [n:127.0.0.1:58529_solr    ] o.a.s.c.c.ZkStateReader Updated live nodes from ZooKeeper... (0) -> (1)
   [junit4]   2> 4397598 INFO  (jetty-launcher-6315-thread-1) [n:127.0.0.1:58529_solr    ] o.a.s.c.Overseer Overseer (id=98805599774769155-127.0.0.1:58529_solr-n_0000000000) starting
   [junit4]   2> 4397682 INFO  (jetty-launcher-6315-thread-1) [n:127.0.0.1:58529_solr    ] o.a.s.c.ZkController Register node as live in ZooKeeper:/live_nodes/127.0.0.1:58529_solr
   [junit4]   2> 4397686 INFO  (zkCallback-6328-thread-1-processing-n:127.0.0.1:34247_solr) [n:127.0.0.1:34247_solr    ] o.a.s.c.c.ZkStateReader Updated live nodes from ZooKeeper... (1) -> (2)
   [junit4]   2> 4397687 INFO  (OverseerStateUpdate-98805599774769155-127.0.0.1:58529_solr-n_0000000000) [n:127.0.0.1:58529_solr    ] o.a.s.c.c.ZkStateReader Updated live nodes from ZooKeeper... (1) -> (2)
   [junit4]   2> 4397782 INFO  (jetty-launcher-6315-thread-2) [n:127.0.0.1:34247_solr    ] o.a.s.c.CoreContainer Initializing authentication plugin: org.apache.solr.security.HadoopAuthPlugin
   [junit4]   2> 4397791 INFO  (jetty-launcher-6315-thread-2) [n:127.0.0.1:34247_solr    ] o.a.s.s.HadoopAuthPlugin Params: {proxyuser.anyHostUsersGroup.hosts=*, proxyuser.wrongHost.hosts=1.1.1.1.1.1, proxyuser.bogusGroup.groups=__some_bogus_group, proxyuser.localHostAnyGroup.groups=*, cookie.domain=127.0.0.1, proxyuser.wrongHost.groups=*, type=simple, proxyuser.noHosts.groups=*, proxyuser.anyHostUsersGroup.groups=staff, proxyuser.noGroups.hosts=*, proxyuser.anyHostAnyUser.groups=*, delegation-token.token-kind=solr-dt, proxyuser.bogusGroup.hosts=*, zk-dt-secret-manager.znodeWorkingPath=solr/security/zkdtsm, signer.secret.provider.zookeeper.path=/token, zk-dt-secret-manager.enable=true, proxyuser.localHostAnyGroup.hosts=serv1-vm3,localhost,127.0.0.1, proxyuser.anyHostAnyUser.hosts=*, signer.secret.provider=zookeeper}
   [junit4]   2> 4397931 INFO  (jetty-launcher-6315-thread-1) [n:127.0.0.1:58529_solr    ] o.a.s.c.CoreContainer Initializing authentication plugin: org.apache.solr.security.HadoopAuthPlugin
   [junit4]   2> 4397931 INFO  (jetty-launcher-6315-thread-1) [n:127.0.0.1:58529_solr    ] o.a.s.s.HadoopAuthPlugin Params: {proxyuser.anyHostUsersGroup.hosts=*, proxyuser.wrongHost.hosts=1.1.1.1.1.1, proxyuser.bogusGroup.groups=__some_bogus_group, proxyuser.localHostAnyGroup.groups=*, cookie.domain=127.0.0.1, proxyuser.wrongHost.groups=*, type=simple, proxyuser.noHosts.groups=*, proxyuser.anyHostUsersGroup.groups=staff, proxyuser.noGroups.hosts=*, proxyuser.anyHostAnyUser.groups=*, delegation-token.token-kind=solr-dt, proxyuser.bogusGroup.hosts=*, zk-dt-secret-manager.znodeWorkingPath=solr/security/zkdtsm, signer.secret.provider.zookeeper.path=/token, zk-dt-secret-manager.enable=true, proxyuser.localHostAnyGroup.hosts=serv1-vm3,localhost,127.0.0.1, proxyuser.anyHostAnyUser.hosts=*, signer.secret.provider=zookeeper}
   [junit4]   2> 4398020 INFO  (jetty-launcher-6315-thread-1) [n:127.0.0.1:58529_solr    ] o.a.c.f.i.CuratorFrameworkImpl Starting
   [junit4]   2> 4398026 INFO  (jetty-launcher-6315-thread-2) [n:127.0.0.1:34247_solr    ] o.a.c.f.i.CuratorFrameworkImpl Starting
   [junit4]   2> 4398073 INFO  (jetty-launcher-6315-thread-2-EventThread) [n:127.0.0.1:34247_solr    ] o.a.c.f.s.ConnectionStateManager State change: CONNECTED
   [junit4]   2> 4398073 INFO  (jetty-launcher-6315-thread-1-EventThread) [n:127.0.0.1:58529_solr    ] o.a.c.f.s.ConnectionStateManager State change: CONNECTED
   [junit4]   2> 4398249 INFO  (jetty-launcher-6315-thread-1) [n:127.0.0.1:58529_solr    ] o.a.s.c.CoreContainer PKIAuthenticationPlugin is managing internode requests
   [junit4]   2> 4398254 INFO  (jetty-launcher-6315-thread-2) [n:127.0.0.1:34247_solr    ] o.a.s.c.CoreContainer PKIAuthenticationPlugin is managing internode requests
   [junit4]   2> 4398456 INFO  (jetty-launcher-6315-thread-1) [n:127.0.0.1:58529_solr    ] o.a.s.m.r.SolrJmxReporter JMX monitoring for 'solr_58529.solr.node' (registry 'solr.node') enabled at server: com.sun.jmx.mbeanserver.JmxMBeanServer@2a6a1a63
   [junit4]   2> 4398461 INFO  (jetty-launcher-6315-thread-2) [n:127.0.0.1:34247_solr    ] o.a.s.m.r.SolrJmxReporter JMX monitoring for 'solr_34247.solr.node' (registry 'solr.node') enabled at server: com.sun.jmx.mbeanserver.JmxMBeanServer@2a6a1a63
   [junit4]   2> 4398466 INFO  (jetty-launcher-6315-thread-1) [n:127.0.0.1:58529_solr    ] o.a.s.m.r.SolrJmxReporter JMX monitoring for 'solr_58529.solr.jvm' (registry 'solr.jvm') enabled at server: com.sun.jmx.mbeanserver.JmxMBeanServer@2a6a1a63
   [junit4]   2> 4398466 INFO  (jetty-launcher-6315-thread-1) [n:127.0.0.1:58529_solr    ] o.a.s.m.r.SolrJmxReporter JMX monitoring for 'solr_58529.solr.jetty' (registry 'solr.jetty') enabled at server: com.sun.jmx.mbeanserver.JmxMBeanServer@2a6a1a63
   [junit4]   2> 4398467 INFO  (jetty-launcher-6315-thread-1) [n:127.0.0.1:58529_solr    ] o.a.s.c.CorePropertiesLocator Found 0 core definitions underneath /export/home/jenkins/workspace/Lucene-Solr-master-Solaris/solr/build/solr-core/test/J0/temp/solr.security.hadoop.TestImpersonationWithHadoopAuth_A020033BF1C8718A-001/tempDir-001/node1/.
   [junit4]   2> 4398470 INFO  (jetty-launcher-6315-thread-2) [n:127.0.0.1:34247_solr    ] o.a.s.m.r.SolrJmxReporter JMX monitoring for 'solr_34247.solr.jvm' (registry 'solr.jvm') enabled at server: com.sun.jmx.mbeanserver.JmxMBeanServer@2a6a1a63
   [junit4]   2> 4398470 INFO  (jetty-launcher-6315-thread-2) [n:127.0.0.1:34247_solr    ] o.a.s.m.r.SolrJmxReporter JMX monitoring for 'solr_34247.solr.jetty' (registry 'solr.jetty') enabled at server: com.sun.jmx.mbeanserver.JmxMBeanServer@2a6a1a63
   [junit4]   2> 4398471 INFO  (jetty-launcher-6315-thread-2) [n:127.0.0.1:34247_solr    ] o.a.s.c.CorePropertiesLocator Found 0 core definitions underneath /export/home/jenkins/workspace/Lucene-Solr-master-Solaris/solr/build/solr-core/test/J0/temp/solr.security.hadoop.TestImpersonationWithHadoopAuth_A020033BF1C8718A-001/tempDir-001/node2/.
   [junit4]   2> 4398540 INFO  (SUITE-TestImpersonationWithHadoopAuth-seed#[A020033BF1C8718A]-worker) [    ] o.a.s.c.c.ZkStateReader Updated live nodes from ZooKeeper... (0) -> (2)
   [junit4]   2> 4398541 INFO  (SUITE-TestImpersonationWithHadoopAuth-seed#[A020033BF1C8718A]-worker) [    ] o.a.s.c.s.i.ZkClientClusterStateProvider Cluster at 127.0.0.1:59478/solr ready
   [junit4]   2> 4398608 INFO  (TEST-TestImpersonationWithHadoopAuth.testProxyWrongHost-seed#[A020033BF1C8718A]) [    ] o.a.s.SolrTestCaseJ4 ###Starting testProxyWrongHost
   [junit4]   2> 4413702 WARN  (jetty-launcher-6315-thread-2-SendThread(127.0.0.1:59478)) [n:127.0.0.1:34247_solr    ] o.a.z.ClientCnxn Client session timed out, have not heard from server in 15230ms for sessionid 0x15f072b64650006
   [junit4]   2> 4413703 WARN  (jetty-launcher-6315-thread-1-SendThread(127.0.0.1:59478)) [n:127.0.0.1:58529_solr    ] o.a.z.ClientCnxn Client session timed out, have not heard from server in 15235ms for sessionid 0x15f072b64650003
   [junit4]   2> 4413703 WARN  (jetty-launcher-6315-thread-1-SendThread(127.0.0.1:59478)) [n:127.0.0.1:58529_solr    ] o.a.z.ClientCnxn Client session timed out, have not heard from server in 15364ms for sessionid 0x15f072b64650008
   [junit4]   2> 4413702 WARN  (jetty-launcher-6315-thread-2-SendThread(127.0.0.1:59478)) [n:127.0.0.1:34247_solr    ] o.a.z.ClientCnxn Client session timed out, have not heard from server in 15295ms for sessionid 0x15f072b64650007
   [junit4]   2> 4413703 WARN  (NIOServerCxn.Factory:0.0.0.0/0.0.0.0:0) [    ] o.a.z.s.NIOServerCnxn caught end of stream exception
   [junit4]   2> EndOfStreamException: Unable to read additional data from client sessionid 0x15f072b64650006, likely client has closed socket
   [junit4]   2> 	at org.apache.zookeeper.server.NIOServerCnxn.doIO(NIOServerCnxn.java:239)
   [junit4]   2> 	at org.apache.zookeeper.server.NIOServerCnxnFactory.run(NIOServerCnxnFactory.java:203)
   [junit4]   2> 	at java.lang.Thread.run(Thread.java:748)
   [junit4]   2> 4413704 WARN  (NIOServerCxn.Factory:0.0.0.0/0.0.0.0:0) [    ] o.a.z.s.NIOServerCnxn caught end of stream exception
   [junit4]   2> EndOfStreamException: Unable to read additional data from client sessionid 0x15f072b64650008, likely client has closed socket
   [junit4]   2> 	at org.apache.zookeeper.server.NIOServerCnxn.doIO(NIOServerCnxn.java:239)
   [junit4]   2> 	at org.apache.zookeeper.server.NIOServerCnxnFactory.run(NIOServerCnxnFactory.java:203)
   [junit4]   2> 	at java.lang.Thread.run(Thread.java:748)
   [junit4]   2> 4413706 WARN  (NIOServerCxn.Factory:0.0.0.0/0.0.0.0:0) [    ] o.a.z.s.NIOServerCnxn Exception causing close of session 0x15f072b64650003 due to java.io.IOException: Connection reset by peer
   [junit4]   2> 4413706 WARN  (NIOServerCxn.Factory:0.0.0.0/0.0.0.0:0) [    ] o.a.z.s.NIOServerCnxn caught end of stream exception
   [junit4]   2> EndOfStreamException: Unable to read additional data from client sessionid 0x15f072b64650007, likely client has closed socket
   [junit4]   2> 	at org.apache.zookeeper.server.NIOServerCnxn.doIO(NIOServerCnxn.java:239)
   [junit4]   2> 	at org.apache.zookeeper.server.NIOServerCnxnFactory.run(NIOServerCnxnFactory.java:203)
   [junit4]   2> 	at java.lang.Thread.run(Thread.java:748)
   [junit4]   2> 4413729 INFO  (TEST-TestImpersonationWithHadoopAuth.testProxyWrongHost-seed#[A020033BF1C8718A]) [    ] o.a.s.SolrTestCaseJ4 ###Ending testProxyWrongHost
   [junit4]   2> 4413799 INFO  (TEST-TestImpersonationWithHadoopAuth.testProxyNoConfigGroups-seed#[A020033BF1C8718A]) [    ] o.a.s.SolrTestCaseJ4 ###Starting testProxyNoConfigGroups
   [junit4]   2> 4413808 WARN  (zkCallback-6323-thread-10-processing-n:127.0.0.1:58529_solr) [n:127.0.0.1:58529_solr    ] o.a.s.c.c.ConnectionManager Watcher org.apache.solr.common.cloud.ConnectionManager@6d5a4501 name: ZooKeeperConnection Watcher:127.0.0.1:59478/solr got event WatchedEvent state:Disconnected type:None path:null path: null type: None
   [junit4]   2> 4413808 WARN  (zkCallback-6323-thread-10-processing-n:127.0.0.1:58529_solr) [n:127.0.0.1:58529_solr    ] o.a.s.c.c.ConnectionManager zkClient has disconnected
   [junit4]   2> 4413810 WARN  (zkCallback-6333-thread-1) [    ] o.a.s.c.c.ConnectionManager Watcher org.apache.solr.common.cloud.ConnectionManager@50e7a165 name: ZooKeeperConnection Watcher:127.0.0.1:59478/solr got event WatchedEvent state:Disconnected type:None path:null path: null type: None
   [junit4]   2> 4413810 WARN  (zkCallback-6333-thread-1) [    ] o.a.s.c.c.ConnectionManager zkClient has disconnected
   [junit4]   2> 4413812 WARN  (zkCallback-6328-thread-5-processing-n:127.0.0.1:34247_solr) [n:127.0.0.1:34247_solr    ] o.a.s.c.c.ConnectionManager Watcher org.apache.solr.common.cloud.ConnectionManager@39ccbce7 name: ZooKeeperConnection Watcher:127.0.0.1:59478/solr got event WatchedEvent state:Disconnected type:None path:null path: null type: None
   [junit4]   2> 4413814 WARN  (zkCallback-6328-thread-5-processing-n:127.0.0.1:34247_solr) [n:127.0.0.1:34247_solr    ] o.a.s.c.c.ConnectionManager zkClient has disconnected
   [junit4]   2> 4413819 INFO  (TEST-TestImpersonationWithHadoopAuth.testProxyNoConfigGroups-seed#[A020033BF1C8718A]) [    ] o.a.s.SolrTestCaseJ4 ###Ending testProxyNoConfigGroups
   [junit4] IGNOR/A 0.00s J0 | TestImpersonationWithHadoopAuth.testForwarding
   [junit4]    > Assumption #1: 'awaitsfix' test group is disabled (@AwaitsFix(bugUrl=https://issues.apache.org/jira/browse/HADOOP-9893))
   [junit4]   2> 4413881 INFO  (TEST-TestImpersonationWithHadoopAuth.testProxyValidateHost-seed#[A020033BF1C8718A]) [    ] o.a.s.SolrTestCaseJ4 ###Starting testProxyValidateHost
   [junit4]   2> 4413887 INFO  (qtp1524710762-40784) [n:127.0.0.1:34247_solr    ] o.a.s.h.a.CollectionsHandler Invoked Collection Action :list with params doAs=bar&action=LIST&user.name=localHostAnyGroup&wt=javabin&version=2 and sendToOCPQueue=true
   [junit4]   2> 4413887 INFO  (qtp1524710762-40784) [n:127.0.0.1:34247_solr    ] o.a.s.s.HttpSolrCall [admin] webapp=null path=/admin/collections params={doAs=bar&action=LIST&user.name=localHostAnyGroup&wt=javabin&version=2} status=0 QTime=0
   [junit4]   2> 4413888 INFO  (TEST-TestImpersonationWithHadoopAuth.testProxyValidateHost-seed#[A020033BF1C8718A]) [    ] o.a.s.SolrTestCaseJ4 ###Ending testProxyValidateHost
   [junit4]   2> 4413933 INFO  (TEST-TestImpersonationWithHadoopAuth.testProxyValidateAnyHostAnyUser-seed#[A020033BF1C8718A]) [    ] o.a.s.SolrTestCaseJ4 ###Starting testProxyValidateAnyHostAnyUser
   [junit4]   2> 4413935 INFO  (qtp1524710762-40785) [n:127.0.0.1:34247_solr    ] o.a.s.h.a.CollectionsHandler Invoked Collection Action :list with params doAs=bar&action=LIST&user.name=anyHostAnyUser&wt=javabin&version=2 and sendToOCPQueue=true
   [junit4]   2> 4413935 INFO  (qtp1524710762-40785) [n:127.0.0.1:34247_solr    ] o.a.s.s.HttpSolrCall [admin] webapp=null path=/admin/collections params={doAs=bar&action=LIST&user.name=anyHostAnyUser&wt=javabin&version=2} status=0 QTime=0
   [junit4]   2> 4413935 INFO  (TEST-TestImpersonationWithHadoopAuth.testProxyValidateAnyHostAnyUser-seed#[A020033BF1C8718A]) [    ] o.a.s.SolrTestCaseJ4 ###Ending testProxyValidateAnyHostAnyUser
   [junit4]   2> 4413982 INFO  (TEST-TestImpersonationWithHadoopAuth.testProxyNoConfigHosts-seed#[A020033BF1C8718A]) [    ] o.a.s.SolrTestCaseJ4 ###Starting testProxyNoConfigHosts
   [junit4]   2> 4413987 INFO  (TEST-TestImpersonationWithHadoopAuth.testProxyNoConfigHosts-seed#[A020033BF1C8718A]) [    ] o.a.s.SolrTestCaseJ4 ###Ending testProxyNoConfigHosts
   [junit4]   2> 4414036 INFO  (TEST-TestImpersonationWithHadoopAuth.testProxyValidateGroup-seed#[A020033BF1C8718A]) [    ] o.a.s.SolrTestCaseJ4 ###Starting testProxyValidateGroup
   [junit4]   2> 4414065 INFO  (qtp1524710762-40784) [n:127.0.0.1:34247_solr    ] o.a.s.h.a.CollectionsHandler Invoked Collection Action :list with params doAs=jenkins&action=LIST&user.name=anyHostUsersGroup&wt=javabin&version=2 and sendToOCPQueue=true
   [junit4]   2> 4414065 INFO  (qtp1524710762-40784) [n:127.0.0.1:34247_solr    ] o.a.s.s.HttpSolrCall [admin] webapp=null path=/admin/collections params={doAs=jenkins&action=LIST&user.name=anyHostUsersGroup&wt=javabin&version=2} status=0 QTime=0
   [junit4]   2> 4414066 INFO  (TEST-TestImpersonationWithHadoopAuth.testProxyValidateGroup-seed#[A020033BF1C8718A]) [    ] o.a.s.SolrTestCaseJ4 ###Ending testProxyValidateGroup
   [junit4]   2> 4414108 INFO  (TEST-TestImpersonationWithHadoopAuth.testProxyInvalidProxyUser-seed#[A020033BF1C8718A]) [    ] o.a.s.SolrTestCaseJ4 ###Starting testProxyInvalidProxyUser
   [junit4]   2> 4414111 INFO  (TEST-TestImpersonationWithHadoopAuth.testProxyInvalidProxyUser-seed#[A020033BF1C8718A]) [    ] o.a.s.SolrTestCaseJ4 ###Ending testProxyInvalidProxyUser
   [junit4]   2> 4414146 INFO  (TEST-TestImpersonationWithHadoopAuth.testProxyInvalidGroup-seed#[A020033BF1C8718A]) [    ] o.a.s.SolrTestCaseJ4 ###Starting testProxyInvalidGroup
   [junit4]   2> 4414193 WARN  (qtp1524710762-40781) [    ] o.a.h.s.ShellBasedUnixGroupsMapping got exception trying to get groups for user bar: id: invalid user name: "bar"
   [junit4]   2> id: invalid user name: "bar"
   [junit4]   2> 
   [junit4]   2> 4414195 INFO  (TEST-TestImpersonationWithHadoopAuth.testProxyInvalidGroup-seed#[A020033BF1C8718A]) [    ] o.a.s.SolrTestCaseJ4 ###Ending testProxyInvalidGroup
   [junit4]   2> 4414242 INFO  (TEST-TestImpersonationWithHadoopAuth.testProxyNullProxyUser-seed#[A020033BF1C8718A]) [    ] o.a.s.SolrTestCaseJ4 ###Starting testProxyNullProxyUser
   [junit4]   2> 4414244 INFO  (qtp1524710762-40780) [    ] o.a.s.s.SolrDispatchFilter Error authenticating
   [junit4]   2> java.lang.IllegalArgumentException: userName is NULL, empty or contains a '&'
   [junit4]   2> 	at org.apache.hadoop.security.authentication.util.AuthToken.checkForIllegalArgument(AuthToken.java:87)
   [junit4]   2> 	at org.apache.hadoop.security.authentication.util.AuthToken.<init>(AuthToken.java:70)
   [junit4]   2> 	at org.apache.hadoop.security.authentication.server.AuthenticationToken.<init>(AuthenticationToken.java:58)
   [junit4]   2> 	at org.apache.hadoop.security.authentication.server.PseudoAuthenticationHandler.authenticate(PseudoAuthenticationHandler.java:195)
   [junit4]   2> 	at org.apache.hadoop.security.token.delegation.web.DelegationTokenAuthenticationHandler.authenticate(DelegationTokenAuthenticationHandler.java:348)
   [junit4]   2> 	at org.apache.solr.security.RequestContinuesRecorderAuthenticationHandler.authenticate(RequestContinuesRecorderAuthenticationHandler.java:69)
   [junit4]   2> 	at org.apache.hadoop.security.authentication.server.AuthenticationFilter.doFilter(AuthenticationFilter.java:518)
   [junit4]   2> 	at org.apache.solr.security.HadoopAuthFilter.doFilter(HadoopAuthFilter.java:110)
   [junit4]   2> 	at org.apache.solr.security.HadoopAuthPlugin.doAuthenticate(HadoopAuthPlugin.java:245)
   [junit4]   2> 	at org.apache.solr.servlet.SolrDispatchFilter.authenticateRequest(SolrDispatchFilter.java:451)
   [junit4]   2> 	at org.apache.solr.servlet.SolrDispatchFilter.doFilter(SolrDispatchFilter.java:347)
   [junit4]   2> 	at org.apache.solr.servlet.SolrDispatchFilter.doFilter(SolrDispatchFilter.java:326)
   [junit4]   2> 	at org.eclipse.jetty.servlet.ServletHandler$CachedChain.doFilter(ServletHandler.java:1759)
   [junit4]   2> 	at org.apache.solr.client.solrj.embedded.JettySolrRunner$DebugFilter.doFilter(JettySolrRunner.java:139)
   [junit4]   2> 	at org.eclipse.jetty.servlet.ServletHandler$CachedChain.doFilter(ServletHandler.java:1759)
   [junit4]   2> 	at org.eclipse.jetty.servlet.ServletHandler.doHandle(ServletHandler.java:582)
   [junit4]   2> 	at org.eclipse.jetty.server.session.SessionHandler.doHandle(SessionHandler.java:224)
   [junit4]   2> 	at org.eclipse.jetty.server.handler.ContextHandler.doHandle(ContextHandler.java:1180)
   [junit4]   2> 	at org.eclipse.jetty.servlet.ServletHandler.doScope(ServletHandler.java:512)
   [junit4]   2> 	at org.eclipse.jetty.server.session.SessionHandler.doScope(SessionHandler.java:185)
   [junit4]   2> 	at org.eclipse.jetty.server.handler.ContextHandler.doScope(ContextHandler.java:1112)
   [junit4]   2> 	at org.eclipse.jetty.server.handler.ScopedHandler.handle(ScopedHandler.java:141)
   [junit4]   2> 	at org.eclipse.jetty.server.handler.gzip.GzipHandler.handle(GzipHandler.java:493)
   [junit4]   2> 	at org.eclipse.jetty.server.handler.HandlerWrapper.handle(HandlerWrapper.java:134)
   [junit4]   2> 	at org.eclipse.jetty.server.Server.handle(Server.java:534)
   [junit4]   2> 	at org.eclipse.jetty.server.HttpChannel.handle(HttpChannel.java:320)
   [junit4]   2> 	at org.eclipse.jetty.server.HttpConnection.onFillable(HttpConnection.java:251)
   [junit4]   2> 	at org.eclipse.jetty.io.AbstractConnection$ReadCallback.succeeded(AbstractConnection.java:283)
   [junit4]   2> 	at org.eclipse.jetty.io.FillInterest.fillable(FillInterest.java:108)
   [junit4]   2> 	at org.eclipse.jetty.io.SelectChannelEndPoint$2.run(SelectChannelEndPoint.java:93)
   [junit4]   2> 	at org.eclipse.jetty.util.thread.strategy.ExecuteProduceConsume.executeProduceConsume(ExecuteProduceConsume.java:303)
   [junit4]   2> 	at org.eclipse.jetty.util.thread.strategy.ExecuteProduceConsume.produceConsume(ExecuteProduceConsume.java:148)
   [junit4]   2> 	at org.eclipse.jetty.util.thread.strategy.ExecuteProduceConsume.run(ExecuteProduceConsume.java:136)
   [junit4]   2> 	at org.eclipse.jetty.util.thread.QueuedThreadPool.runJob(QueuedThreadPool.java:671)
   [junit4]   2> 	at org.eclipse.jetty.util.thread.QueuedThreadPool$2.run(QueuedThreadPool.java:589)
   [junit4]   2> 	at java.lang.Thread.run(Thread.java:748)
   [junit4]   2> 4414245 WARN  (qtp1524710762-40780) [    ] o.e.j.s.ServletHandler /solr/admin/collections
   [junit4]   2> org.apache.solr.common.SolrException: Error during request authentication, 
   [junit4]   2> 	at org.apache.solr.servlet.SolrDispatchFilter.authenticateRequest(SolrDispatchFilter.java:457)
   [junit4]   2> 	at org.apache.solr.servlet.SolrDispatchFilter.doFilter(SolrDispatchFilter.java:347)
   [junit4]   2> 	at org.apache.solr.servlet.SolrDispatchFilter.doFilter(SolrDispatchFilter.java:326)
   [junit4]   2> 	at org.eclipse.jetty.servlet.ServletHandler$CachedChain.doFilter(ServletHandler.java:1759)
   [junit4]   2> 	at org.apache.solr.client.solrj.embedded.JettySolrRunner$DebugFilter.doFilter(JettySolrRunner.java:139)
   [junit4]   2> 	at org.eclipse.jetty.servlet.ServletHandler$CachedChain.doFilter(ServletHandler.java:1759)
   [junit4]   2> 	at org.eclipse.jetty.servlet.ServletHandler.doHandle(ServletHandler.java:582)
   [junit4]   2> 	at org.eclipse.jetty.server.session.SessionHandler.doHandle(SessionHandler.java:224)
   [junit4]   2> 	at org.eclipse.jetty.server.handler.ContextHandler.doHandle(ContextHandler.java:1180)
   [junit4]   2> 	at org.eclipse.jetty.servlet.ServletHandler.doScope(ServletHandler.java:512)
   [junit4]   2> 	at org.eclipse.jetty.server.session.SessionHandler.doScope(SessionHandler.java:185)
   [junit4]   2> 	at org.eclipse.jetty.server.handler.ContextHandler.doScope(ContextHandler.java:1112)
   [junit4]   2> 	at org.eclipse.jetty.server.handler.ScopedHandler.handle(ScopedHandler.java:141)
   [junit4]   2> 	at org.eclipse.jetty.server.handler.gzip.GzipHandler.handle(GzipHandler.java:493)
   [junit4]   2> 	at org.eclipse.jetty.server.handler.HandlerWrapper.handle(HandlerWrapper.java:134)
   [junit4]   2> 	at org.eclipse.jetty.server.Server.handle(Server.java:534)
   [junit4]   2> 	at org.eclipse.jetty.server.HttpChannel.handle(HttpChannel.java:320)
   [junit4]   2> 	at org.eclipse.jetty.server.HttpConnection.onFillable(HttpConnection.java:251)
   [junit4]   2> 	at org.eclipse.jetty.io.AbstractConnection$ReadCallback.succeeded(AbstractConnection.java:283)
   [junit4]   2> 	at org.eclipse.jetty.io.FillInterest.fillable(FillInterest.java:108)
   [junit4]   2> 	at org.eclipse.jetty.io.SelectChannelEndPoint$2.run(SelectChannelEndPoint.java:93)
   [junit4]   2> 	at org.eclipse.jetty.util.thread.strategy.ExecuteProduceConsume.executeProduceConsume(ExecuteProduceConsume.java:303)
   [junit4]   2> 	at org.eclipse.jetty.util.thread.strategy.ExecuteProduceConsume.produceConsume(ExecuteProduceConsume.java:148)
   [junit4]   2> 	at org.eclipse.jetty.util.thread.strategy.ExecuteProduceConsume.run(ExecuteProduceConsume.java:136)
   [junit4]   2> 	at org.eclipse.jetty.util.thread.QueuedThreadPool.runJob(QueuedThreadPool.java:671)
   [junit4]   2> 	at org.eclipse.jetty.util.thread.QueuedThreadPool$2.run(QueuedThreadPool.java:589)
   [junit4]   2> 	at java.lang.Thread.run(Thread.java:748)
   [junit4]   2> Caused by: java.lang.IllegalArgumentException: userName is NULL, empty or contains a '&'
   [junit4]   2> 	at org.apache.hadoop.security.authentication.util.AuthToken.checkForIllegalArgument(AuthToken.java:87)
   [junit4]   2> 	at org.apache.hadoop.security.authentication.util.AuthToken.<init>(AuthToken.java:70)
   [junit4]   2> 	at org.apache.hadoop.security.authentication.server.AuthenticationToken.<init>(AuthenticationToken.java:58)
   [junit4]   2> 	at org.apache.hadoop.security.authentication.server.PseudoAuthenticationHandler.authenticate(PseudoAuthenticationHandler.java:195)
   [junit4]   2> 	at org.apache.hadoop.security.token.delegation.web.DelegationTokenAuthenticationHandler.authenticate(DelegationTokenAuthenticationHandler.java:348)
   [junit4]   2> 	at org.apache.solr.security.RequestContinuesRecorderAuthenticationHandler.authenticate(RequestContinuesRecorderAuthenticationHandler.java:69)
   [junit4]   2> 	at org.apache.hadoop.security.authentication.server.AuthenticationFilter.doFilter(AuthenticationFilter.java:518)
   [junit4]   2> 	at org.apache.solr.security.HadoopAuthFilter.doFilter(HadoopAuthFilter.java:110)
   [junit4]   2> 	at org.apache.solr.security.HadoopAuthPlugin.doAuthenticate(HadoopAuthPlugin.java:245)
   [junit4]   2> 	at org.apache.solr.servlet.SolrDispatchFilter.authenticateRequest(SolrDispatchFilter.java:451)
   [junit4]   2> 	... 26 more
   [junit4]   2> 4414246 INFO  (TEST-TestImpersonationWithHadoopAuth.testProxyNullProxyUser-seed#[A020033BF1C8718A]) [    ] o.a.s.SolrTestCaseJ4 ###Ending testProxyNullProxyUser
   [junit4]   2> 4415187 WARN  (SUITE-TestImpersonationWithHadoopAuth-seed#[A020033BF1C8718A]-worker-SendThread(127.0.0.1:59478)) [    ] o.a.z.ClientCnxn Unable to reconnect to ZooKeeper service, session 0x15f072b6465000a has expired
   [junit4]   2> 4415188 WARN  (zkCallback-6333-thread-3) [    ] o.a.s.c.c.ConnectionManager Watcher org.apache.solr.common.cloud.ConnectionManager@50e7a165 name: ZooKeeperConnection Watcher:127.0.0.1:59478/solr got event WatchedEvent state:Expired type:None path:null path: null type: None
   [junit4]   2> 4415188 WARN  (zkCallback-6333-thread-3) [    ] o.a.s.c.c.ConnectionManager Our previous ZooKeeper session was expired. Attempting to reconnect to recover relationship with ZooKeeper...
   [junit4]   2> 4415188 WARN  (zkCallback-6333-thread-3) [    ] o.a.s.c.c.DefaultConnectionStrategy Connection expired - starting a new one...
   [junit4]   2> 4415191 INFO  (zkCallback-6333-thread-3) [    ] o.a.s.c.c.ConnectionManager Connection with ZooKeeper reestablished.
   [junit4]   2> 4415289 ERROR (zkCallback-6333-thread-3) [    ] o.a.s.c.c.ZkStateReader A ZK error has occurred
   [junit4]   2> org.apache.zookeeper.KeeperException$SessionExpiredException: KeeperErrorCode = Session expired for /clusterstate.json
   [junit4]   2> 	at org.apache.zookeeper.KeeperException.create(KeeperException.java:127)
   [junit4]   2> 	at org.apache.zookeeper.KeeperException.create(KeeperException.java:51)
   [junit4]   2> 	at org.apache.zookeeper.ZooKeeper.exists(ZooKeeper.java:1102)
   [junit4]   2> 	at org.apache.solr.common.cloud.SolrZkClient$5.execute(SolrZkClient.java:323)
   [junit4]   2> 	at org.apache.solr.common.cloud.SolrZkClient$5.execute(SolrZkClient.java:320)
   [junit4]   2> 	at org.apache.solr.common.cloud.ZkCmdExecutor.retryOperation(ZkCmdExecutor.java:60)
   [junit4]   2> 	at org.apache.solr.common.cloud.SolrZkClient.exists(SolrZkClient.java:320)
   [junit4]   2> 	at org.apache.solr.common.cloud.ZkStateReader.createClusterStateWatchersAndUpdate(ZkStateReader.java:426)
   [junit4]   2> 	at org.apache.solr.common.cloud.ZkStateReader$1.command(ZkStateReader.java:283)
   [junit4]   2> 	at org.apache.solr.common.cloud.ConnectionManager$1.update(ConnectionManager.java:168)
   [junit4]   2> 	at org.apache.solr.common.cloud.DefaultConnectionStrategy.reconnect(DefaultConnectionStrategy.java:57)
   [junit4]   2> 	at org.apache.solr.common.cloud.ConnectionManager.process(ConnectionManager.java:142)
   [junit4]   2> 	at org.apache.solr.common.cloud.SolrZkClient$3.lambda$process$0(SolrZkClient.java:269)
   [junit4]   2> 	at java.util.concurrent.Executors$RunnableAdapter.call(Executors.java:511)
   [junit4]   2> 	at java.util.concurrent.FutureTask.run(FutureTask.java:266)
   [junit4]   2> 	at org.apache.solr.common.util.ExecutorUtil$MDCAwareThreadPoolExecutor.lambda$execute$0(ExecutorUtil.java:188)
   [junit4]   2> 	at java.util.concurrent.ThreadPoolExecutor.runWorker(ThreadPoolExecutor.java:1149)
   [junit4]   2> 	at java.util.concurrent.ThreadPoolExecutor$Worker.run(ThreadPoolExecutor.java:624)
   [junit4]   2> 	at java.lang.Thread.run(Thread.java:748)
   [junit4]   2> 4415291 ERROR (zkCallback-6333-thread-3) [    ] o.a.s.c.c.DefaultConnectionStrategy Reconnect to ZooKeeper failed:org.apache.solr.common.cloud.ZooKeeperException: A ZK error has occurred
   [junit4]   2> 	at org.apache.solr.common.cloud.ZkStateReader$1.command(ZkStateReader.java:286)
   [junit4]   2> 	at org.apache.solr.common.cloud.ConnectionManager$1.update(ConnectionManager.java:168)
   [junit4]   2> 	at org.apache.solr.common.cloud.DefaultConnectionStrategy.reconnect(DefaultConnectionStrategy.java:57)
   [junit4]   2> 	at org.apache.solr.common.cloud.ConnectionManager.process(ConnectionManager.java:142)
   [junit4]   2> 	at org.apache.solr.common.cloud.SolrZkClient$3.lambda$process$0(SolrZkClient.java:269)
   [junit4]   2> 	at java.util.concurrent.Executors$RunnableAdapter.call(Executors.java:511)
   [junit4]   2> 	at java.util.concurrent.FutureTask.run(FutureTask.java:266)
   [junit4]   2> 	at org.apache.solr.common.util.ExecutorUtil$MDCAwareThreadPoolExecutor.lambda$execute$0(ExecutorUtil.java:188)
   [junit4]   2> 	at java.util.concurrent.ThreadPoolExecutor.runWorker(ThreadPoolExecutor.java:1149)
   [junit4]   2> 	at java.util.concurrent.ThreadPoolExecutor$Worker.run(ThreadPoolExecutor.java:624)
   [junit4]   2> 	at java.lang.Thread.run(Thread.java:748)
   [junit4]   2> Caused by: org.apache.zookeeper.KeeperException$SessionExpiredException: KeeperErrorCode = Session expired for /clusterstate.json
   [junit4]   2> 	at org.apache.zookeeper.KeeperException.create(KeeperException.java:127)
   [junit4]   2> 	at org.apache.zookeeper.KeeperException.create(KeeperException.java:51)
   [junit4]   2> 	at org.apache.zookeeper.ZooKeeper.exists(ZooKeeper.java:1102)
   [junit4]   2> 	at org.apache.solr.common.cloud.SolrZkClient$5.execute(SolrZkClient.java:323)
   [junit4]   2> 	at org.apache.solr.common.cloud.SolrZkClient$5.execute(SolrZkClient.java:320)
   [junit4]   2> 	at org.apache.solr.common.cloud.ZkCmdExecutor.retryOperation(ZkCmdExecutor.java:60)
   [junit4]   2> 	at org.apache.solr.common.cloud.SolrZkClient.exists(SolrZkClient.java:320)
   [junit4]   2> 	at org.apache.solr.common.cloud.ZkStateReader.createClusterStateWatchersAndUpdate(ZkStateReader.java:426)
   [junit4]   2> 	at org.apache.solr.common.cloud.ZkStateReader$1.command(ZkStateReader.java:283)
   [junit4]   2> 	... 10 more
   [junit4]   2> 
   [junit4]   2> 4415298 WARN  (zkCallback-6333-thread-3) [    ] o.a.s.c.c.DefaultConnectionStrategy Reconnect to ZooKeeper failed
   [junit4]   2> 4415299 INFO  (zkCallback-6333-thread-3) [    ] o.a.s.c.c.ConnectionManager Connected:true
   [junit4]   2> 4415300 INFO  (jetty-closer-6316-thread-1) [    ] o.e.j.s.AbstractConnector Stopped ServerConnector@2230c72b{HTTP/1.1,[http/1.1]}{127.0.0.1:0}
   [junit4]   2> 4415300 INFO  (jetty-closer-6316-thread-2) [    ] o.e.j.s.AbstractConnector Stopped ServerConnector@460cdb9d{HTTP/1.1,[http/1.1]}{127.0.0.1:0}
   [junit4]   2> 4415301 INFO  (jetty-closer-6316-thread-2) [    ] o.a.s.c.CoreContainer Shutting down CoreContainer instance=725768991
   [junit4]   2> 4415301 INFO  (jetty-closer-6316-thread-1) [    ] o.a.s.c.CoreContainer Shutting down CoreContainer instance=227207778
   [junit4]   2> 4415302 INFO  (jetty-closer-6316-thread-1) [    ] o.a.s.m.SolrMetricManager Closing metric reporters for registry=solr.node, tag=null
   [junit4]   2> 4415302 INFO  (jetty-closer-6316-thread-1) [    ] o.a.s.m.r.SolrJmxReporter Closing reporter [org.apache.solr.metrics.reporters.SolrJmxReporter@20d985e: rootName = solr_34247, domain = solr.node, service url = null, agent id = null] for registry solr.node / com.codahale.metrics.MetricRegistry@21ea5c3
   [junit4]   2> 4415306 INFO  (jetty-closer-6316-thread-2) [    ] o.a.s.m.SolrMetricManager Closing metric reporters for registry=solr.node, tag=null
   [junit4]   2> 4415306 INFO  (jetty-closer-6316-thread-2) [    ] o.a.s.m.r.SolrJmxReporter Closing reporter [org.apache.solr.metrics.reporters.SolrJmxReporter@5d85f871: rootName = solr_58529, domain = solr.node, service url = null, agent id = null] for registry solr.node / com.codahale.metrics.MetricRegistry@66301aac
   [junit4]   2> 4415308 INFO  (jetty-closer-6316-thread-1) [    ] o.a.s.m.SolrMetricManager Closing metric reporters for registry=solr.jvm, tag=null
   [junit4]   2> 4415308 INFO  (jetty-closer-6316-thread-1) [    ] o.a.s.m.r.SolrJmxReporter Closing reporter [org.apache.solr.metrics.reporters.SolrJmxReporter@6e87b84c: rootName = solr_34247, domain = solr.jvm, service url = null, agent id = null] for registry solr.jvm / com.codahale.metrics.MetricRegistry@2b230ec2
   [junit4]   2> 4415321 INFO  (jetty-closer-6316-thread-1) [    ] o.a.s.m.SolrMetricManager Closing metric reporters for registry=solr.jetty, tag=null
   [junit4]   2> 4415322 INFO  (jetty-closer-6316-thread-1) [    ] o.a.s.m.r.SolrJmxReporter Closing reporter [org.apache.solr.metrics.reporters.SolrJmxReporter@3b3dc47b: rootName = solr_34247, domain = solr.jetty, service url = null, agent id = null] for registry solr.jetty / com.codahale.metrics.MetricRegistry@77908dbe
   [junit4]   2> 4415323 INFO  (jetty-closer-6316-thread-2) [    ] o.a.s.m.SolrMetricManager Closing metric reporters for registry=solr.jvm, tag=null
   [junit4]   2> 4415323 INFO  (jetty-closer-6316-thread-2) [    ] o.a.s.m.r.SolrJmxReporter Closing reporter [org.apache.solr.metrics.reporters.SolrJmxReporter@359bcc12: rootName = solr_58529, domain = solr.jvm, service url = null, agent id = null] for registry solr.jvm / com.codahale.metrics.MetricRegistry@2b230ec2
   [junit4]   2> 4415327 INFO  (jetty-closer-6316-thread-2) [    ] o.a.s.m.SolrMetricManager Closing metric reporters for registry=solr.jetty, tag=null
   [junit4]   2> 4415327 INFO  (jetty-closer-6316-thread-2) [    ] o.a.s.m.r.SolrJmxReporter Closing reporter [org.apache.solr.metrics.reporters.SolrJmxReporter@5bc65ecf: rootName = solr_58529, domain = solr.jetty, service url = null, agent id = null] for registry solr.jetty / com.codahale.metrics.MetricRegistry@77908dbe
   [junit4]   2> 4415520 INFO  (jetty-launcher-6315-thread-1-EventThread) [n:127.0.0.1:58529_solr    ] o.a.c.f.s.ConnectionStateManager State change: SUSPENDED
   [junit4]   2> 4415522 INFO  (jetty-launcher-6315-thread-2-EventThread) [n:127.0.0.1:34247_solr    ] o.a.c.f.s.ConnectionStateManager State change: SUSPENDED
   [junit4]   2> 4415591 INFO  (jetty-closer-6316-thread-2) [    ] o.a.s.m.SolrMetricManager Closing metric reporters for registry=solr.cluster, tag=null
   [junit4]   2> 4415592 INFO  (jetty-closer-6316-thread-2) [    ] o.a.s.c.TransientSolrCoreCacheDefault Allocating transient cache for 2147483647 transient cores
   [junit4]   2> 4415592 INFO  (jetty-closer-6316-thread-2) [    ] o.a.s.c.Overseer Overseer (id=98805599774769155-127.0.0.1:58529_solr-n_0000000000) closing
   [junit4]   2> 4415593 INFO  (OverseerStateUpdate-98805599774769155-127.0.0.1:58529_solr-n_0000000000) [n:127.0.0.1:58529_solr    ] o.a.s.c.Overseer Overseer Loop exiting : 127.0.0.1:58529_solr
   [junit4]   2> 4415593 WARN  (OverseerAutoScalingTriggerThread-98805599774769155-127.0.0.1:58529_solr-n_0000000000) [n:127.0.0.1:58529_solr    ] o.a.s.c.a.OverseerTriggerThread OverseerTriggerThread woken up but we are closed, exiting.
   [junit4]   2> 4415698 INFO  (zkCallback-6328-thread-4-processing-n:127.0.0.1:34247_solr) [n:127.0.0.1:34247_solr    ] o.a.s.c.c.ZkStateReader Updated live nodes from ZooKeeper... (2) -> (1)
   [junit4]   2> 4415698 INFO  (zkCallback-6328-thread-1-processing-n:127.0.0.1:34247_solr) [n:127.0.0.1:34247_solr    ] o.a.s.c.OverseerElectionContext I am going to be the leader 127.0.0.1:34247_solr
   [junit4]   2> 4415700 INFO  (jetty-closer-6316-thread-1) [    ] o.a.s.m.SolrMetricManager Closing metric reporters for registry=solr.cluster, tag=null
   [junit4]   2> 4415700 INFO  (jetty-closer-6316-thread-1) [    ] o.a.s.c.TransientSolrCoreCacheDefault Allocating transient cache for 2147483647 transient cores
   [junit4]   2> 4417112 WARN  (zkCallback-6323-thread-11-processing-n:127.0.0.1:58529_solr) [n:127.0.0.1:58529_solr    ] o.a.s.c.c.ZkStateReader ZooKeeper watch triggered, but Solr cannot talk to ZK: [KeeperErrorCode = Session expired for /live_nodes]
   [junit4]   2> 4417113 ERROR (Thread[Thread-11208,5,TGRP-TestImpersonationWithHadoopAuth]) [n:127.0.0.1:58529_solr    ] o.a.h.s.t.d.AbstractDelegationTokenSecretManager ExpiredTokenRemover received java.lang.InterruptedException: sleep interrupted
   [junit4]   2> 4417122 INFO  (jetty-closer-6316-thread-2) [    ] o.e.j.s.h.ContextHandler Stopped o.e.j.s.ServletContextHandler@1a33729e{/solr,null,UNAVAILABLE}
   [junit4]   2> 4417201 WARN  (zkCallback-6328-thread-4-processing-n:127.0.0.1:34247_solr) [n:127.0.0.1:34247_solr    ] o.a.s.c.c.ZkStateReader ZooKeeper watch triggered, but Solr cannot talk to ZK: [KeeperErrorCode = Session expired for /live_nodes]
   [junit4]   2> 4417202 ERROR (Thread[Thread-11206,5,TGRP-TestImpersonationWithHadoopAuth]) [n:127.0.0.1:34247_solr    ] o.a.h.s.t.d.AbstractDelegationTokenSecretManager ExpiredTokenRemover received java.lang.InterruptedException: sleep interrupted
   [junit4]   2> 4417205 INFO  (jetty-closer-6316-thread-1) [    ] o.e.j.s.h.ContextHandler Stopped o.e.j.s.ServletContextHandler@7abb92db{/solr,null,UNAVAILABLE}
   [junit4]   2> 4417207 ERROR (SUITE-TestImpersonationWithHadoopAuth-seed#[A020033BF1C8718A]-worker) [    ] o.a.z.s.ZooKeeperServer ZKShutdownHandler is not registered, so ZooKeeper server won't take any action on ERROR or SHUTDOWN server state changes
   [junit4]   2> 4417208 INFO  (SUITE-TestImpersonationWithHadoopAuth-seed#[A020033BF1C8718A]-worker) [    ] o.a.s.c.ZkTestServer connecting to 127.0.0.1:59478 59478
   [junit4]   2> 4420726 INFO  (Thread-11186) [    ] o.a.s.c.ZkTestServer connecting to 127.0.0.1:59478 59478
   [junit4]   2> 4420727 WARN  (Thread-11186) [    ] o.a.s.c.ZkTestServer Watch limit violations: 
   [junit4]   2> Maximum concurrent create/delete watches above limit:
   [junit4]   2> 
   [junit4]   2> 	3	/solr/aliases.json
   [junit4]   2> 	3	/solr/clusterprops.json
   [junit4]   2> 	2	/solr/security.json
   [junit4]   2> 
   [junit4]   2> Maximum concurrent data watches above limit:
   [junit4]   2> 
   [junit4]   2> 	5	/solr/security/zkdtsm/ZKDTSMRoot/ZKDTSMKeyIdRoot
   [junit4]   2> 	4	/solr/security/zkdtsm/ZKDTSMRoot/ZKDTSMSeqNumRoot
   [junit4]   2> 	3	/solr/clusterstate.json
   [junit4]   2> 	2	/solr/security/zkdtsm/ZKDTSMRoot/ZKDTSMMasterKeyRoot/DK_1
   [junit4]   2> 	2	/solr/security/zkdtsm/ZKDTSMRoot/ZKDTSMMasterKeyRoot/DK_3
   [junit4]   2> 	2	/solr/security/zkdtsm/ZKDTSMRoot/ZKDTSMMasterKeyRoot/DK_2
   [junit4]   2> 	2	/solr/security/zkdtsm/ZKDTSMRoot/ZKDTSMMasterKeyRoot/DK_4
   [junit4]   2> 
   [junit4]   2> Maximum concurrent children watches above limit:
   [junit4]   2> 
   [junit4]   2> 	3	/solr/live_nodes
   [junit4]   2> 	3	/solr/collections
   [junit4]   2> 	3	/solr/security/zkdtsm/ZKDTSMRoot/ZKDTSMTokensRoot
   [junit4]   2> 	2	/solr/security/zkdtsm/ZKDTSMRoot/ZKDTSMMasterKeyRoot
   [junit4]   2> 
   [junit4]   2> 4420728 INFO  (SUITE-TestImpersonationWithHadoopAuth-seed#[A020033BF1C8718A]-worker) [    ] o.a.s.SolrTestCaseJ4 ------------------------------------------------------- Done waiting for tracked resources to be released
   [junit4]   2> Oct 10, 2017 4:43:48 PM com.carrotsearch.randomizedtesting.ThreadLeakControl checkThreadLeaks
   [junit4]   2> WARNING: Will linger awaiting termination of 2 leaked thread(s).
   [junit4]   2> Oct 10, 2017 4:44:09 PM com.carrotsearch.randomizedtesting.ThreadLeakControl checkThreadLeaks
   [junit4]   2> SEVERE: 2 threads leaked from SUITE scope at org.apache.solr.security.hadoop.TestImpersonationWithHadoopAuth: 
   [junit4]   2>    1) Thread[id=40816, name=jetty-launcher-6315-thread-1-EventThread, state=TIMED_WAITING, group=TGRP-TestImpersonationWithHadoopAuth]
   [junit4]   2>         at sun.misc.Unsafe.park(Native Method)
   [junit4]   2>         at java.util.concurrent.locks.LockSupport.parkNanos(LockSupport.java:215)
   [junit4]   2>         at java.util.concurrent.locks.AbstractQueuedSynchronizer.doAcquireSharedNanos(AbstractQueuedSynchronizer.java:1037)
   [junit4]   2>         at java.util.concurrent.locks.AbstractQueuedSynchronizer.tryAcquireSharedNanos(AbstractQueuedSynchronizer.java:1328)
   [junit4]   2>         at java.util.concurrent.CountDownLatch.await(CountDownLatch.java:277)
   [junit4]   2>         at org.apache.curator.CuratorZookeeperClient.internalBlockUntilConnectedOrTimedOut(CuratorZookeeperClient.java:323)
   [junit4]   2>         at org.apache.curator.RetryLoop.callWithRetry(RetryLoop.java:105)
   [junit4]   2>         at org.apache.curator.framework.imps.GetDataBuilderImpl.pathInForeground(GetDataBuilderImpl.java:288)
   [junit4]   2>         at org.apache.curator.framework.imps.GetDataBuilderImpl.forPath(GetDataBuilderImpl.java:279)
   [junit4]   2>         at org.apache.curator.framework.imps.GetDataBuilderImpl.forPath(GetDataBuilderImpl.java:41)
   [junit4]   2>         at org.apache.curator.framework.recipes.shared.SharedValue.readValue(SharedValue.java:244)
   [junit4]   2>         at org.apache.curator.framework.recipes.shared.SharedValue.access$100(SharedValue.java:44)
   [junit4]   2>         at org.apache.curator.framework.recipes.shared.SharedValue$1.process(SharedValue.java:61)
   [junit4]   2>         at org.apache.curator.framework.imps.NamespaceWatcher.process(NamespaceWatcher.java:67)
   [junit4]   2>         at org.apache.zookeeper.ClientCnxn$EventThread.processEvent(ClientCnxn.java:530)
   [junit4]   2>         at org.apache.zookeeper.ClientCnxn$EventThread.run(ClientCnxn.java:505)
   [junit4]   2>    2) Thread[id=40818, name=jetty-launcher-6315-thread-2-EventThread, state=TIMED_WAITING, group=TGRP-TestImpersonationWithHadoopAuth]
   [junit4]   2>         at sun.misc.Unsafe.park(Native Method)
   [junit4]   2>         at java.util.concurrent.locks.LockSupport.parkNanos(LockSupport.java:215)
   [junit4]   2>         at java.util.concurrent.locks.AbstractQueuedSynchronizer.doAcquireSharedNanos(AbstractQueuedSynchronizer.java:1037)
   [junit4]   2>         at java.util.concurrent.locks.AbstractQueuedSynchronizer.tryAcquireSharedNanos(AbstractQueuedSynchronizer.java:1328)
   [junit4]   2>         at java.util.concurrent.CountDownLatch.await(CountDownLatch.java:277)
   [junit4]   2>         at org.apache.curator.CuratorZookeeperClient.internalBlockUntilConnectedOrTimedOut(CuratorZookeeperClient.java:323)
   [junit4]   2>         at org.apache.curator.RetryLoop.callWithRetry(RetryLoop.java:105)
   [junit4]   2>         at org.apache.curator.framework.imps.GetDataBuilderImpl.pathInForeground(GetDataBuilderImpl.java:288)
   [junit4]   2>         at org.apache.curator.framework.imps.GetDataBuilderImpl.forPath(GetDataBuilderImpl.java:279)
   [junit4]   2>         at org.apache.curator.framework.imps.GetDataBuilderImpl.forPath(GetDataBuilderImpl.java:41)
   [junit4]   2>         at org.apache.curator.framework.recipes.shared.SharedValue.readValue(SharedValue.java:244)
   [junit4]   2>         at org.apache.curator.framework.recipes.shared.SharedValue.access$100(SharedValue.java:44)
   [junit4]   2>         at org.apache.curator.framework.recipes.shared.SharedValue$1.process(SharedValue.java:61)
   [junit4]   2>         at org.apache.curator.framework.imps.NamespaceWatcher.process(NamespaceWatcher.java:67)
   [junit4]   2>         at org.apache.zookeeper.ClientCnxn$EventThread.processEvent(ClientCnxn.java:530)
   [junit4]   2>         at org.apache.zookeeper.ClientCnxn$EventThread.run(ClientCnxn.java:505)
   [junit4]   2> Oct 10, 2017 4:44:09 PM com.carrotsearch.randomizedtesting.ThreadLeakControl tryToInterruptAll
   [junit4]   2> INFO: Starting to interrupt leaked threads:
   [junit4]   2>    1) Thread[id=40816, name=jetty-launcher-6315-thread-1-EventThread, state=TIMED_WAITING, group=TGRP-TestImpersonationWithHadoopAuth]
   [junit4]   2>    2) Thread[id=40818, name=jetty-launcher-6315-thread-2-EventThread, state=TIMED_WAITING, group=TGRP-TestImpersonationWithHadoopAuth]
   [junit4]   2> 4440914 ERROR (jetty-launcher-6315-thread-1-EventThread) [n:127.0.0.1:58529_solr    ] o.a.c.f.i.CuratorFrameworkImpl Watcher exception
   [junit4]   2> java.lang.InterruptedException
   [junit4]   2> 	at java.util.concurrent.locks.AbstractQueuedSynchronizer.doAcquireSharedNanos(AbstractQueuedSynchronizer.java:1039)
   [junit4]   2> 	at java.util.concurrent.locks.AbstractQueuedSynchronizer.tryAcquireSharedNanos(AbstractQueuedSynchronizer.java:1328)
   [junit4]   2> 	at java.util.concurrent.CountDownLatch.await(CountDownLatch.java:277)
   [junit4]   2> 	at org.apache.curator.CuratorZookeeperClient.internalBlockUntilConnectedOrTimedOut(CuratorZookeeperClient.java:323)
   [junit4]   2> 	at org.apache.curator.RetryLoop.callWithRetry(RetryLoop.java:105)
   [junit4]   2> 	at org.apache.curator.framework.imps.GetDataBuilderImpl.pathInForeground(GetDataBuilderImpl.java:288)
   [junit4]   2> 	at org.apache.curator.framework.imps.GetDataBuilderImpl.forPath(GetDataBuilderImpl.java:279)
   [junit4]   2> 	at org.apache.curator.framework.imps.GetDataBuilderImpl.forPath(GetDataBuilderImpl.java:41)
   [junit4]   2> 	at org.apache.curator.framework.recipes.shared.SharedValue.readValue(SharedValue.java:244)
   [junit4]   2> 	at org.apache.curator.framework.recipes.shared.SharedValue.access$100(SharedValue.java:44)
   [junit4]   2> 	at org.apache.curator.framework.recipes.shared.SharedValue$1.process(SharedValue.java:61)
   [junit4]   2> 	at org.apache.curator.framework.imps.NamespaceWatcher.process(NamespaceWatcher.java:67)
   [junit4]   2> 	at org.apache.zookeeper.ClientCnxn$EventThread.processEvent(ClientCnxn.java:530)
   [junit4]   2> 	at org.apache.zookeeper.ClientCnxn$EventThread.run(ClientCnxn.java:505)
   [junit4]   2> 4440918 ERROR (jetty-launcher-6315-thread-2-EventThread) [n:127.0.0.1:34247_solr    ] o.a.c.f.i.CuratorFrameworkImpl Watcher exception
   [junit4]   2> java.lang.InterruptedException
   [junit4]   2> 	at java.util.concurrent.locks.AbstractQueuedSynchronizer.doAcquireSharedNanos(AbstractQueuedSynchronizer.java:1039)
   [junit4]   2> 	at java.util.concurrent.locks.AbstractQueuedSynchronizer.tryAcquireSharedNanos(AbstractQueuedSynchronizer.java:1328)
   [junit4]   2> 	at java.util.concurrent.CountDownLatch.await(CountDownLatch.java:277)
   [junit4]   2> 	at org.apache.curator.CuratorZookeeperClient.internalBlockUntilConnectedOrTimedOut(CuratorZookeeperClient.java:323)
   [junit4]   2> 	at org.apache.curator.RetryLoop.callWithRetry(RetryLoop.java:105)
   [junit4]   2> 	at org.apache.curator.framework.imps.GetDataBuilderImpl.pathInForeground(GetDataBuilderImpl.java:288)
   [junit4]   2> 	at org.apache.curator.framework.imps.GetDataBuilderImpl.forPath(GetDataBuilderImpl.java:279)
   [junit4]   2> 	at org.apache.curator.framework.imps.GetDataBuilderImpl.forPath(GetDataBuilderImpl.java:41)
   [junit4]   2> 	at org.apache.curator.framework.recipes.shared.SharedValue.readValue(SharedValue.java:244)
   [junit4]   2> 	at org.apache.curator.framework.recipes.shared.SharedValue.access$100(SharedValue.java:44)
   [junit4]   2> 	at org.apache.curator.framework.recipes.shared.SharedValue$1.process(SharedValue.java:61)
   [junit4]   2> 	at org.apache.curator.framework.imps.NamespaceWatcher.process(NamespaceWatcher.java:67)
   [junit4]   2> 	at org.apache.zookeeper.ClientCnxn$EventThread.processEvent(ClientCnxn.java:530)
   [junit4]   2> 	at org.apache.zookeeper.ClientCnxn$EventThread.run(ClientCnxn.java:505)
   [junit4]   2> Oct 10, 2017 4:44:09 PM com.carrotsearch.randomizedtesting.ThreadLeakControl tryToInterruptAll
   [junit4]   2> INFO: All leaked threads terminated.
   [junit4]   2> NOTE: test params are: codec=Asserting(Lucene70), sim=RandomSimilarity(queryNorm=true): {}, locale=it, timezone=Brazil/Acre
   [junit4]   2> NOTE: SunOS 5.11 amd64/Oracle Corporation 1.8.0_141 (64-bit)/cpus=3,threads=1,free=116979640,total=518979584
   [junit4]   2> NOTE: All tests run in this JVM: [UniqFieldsUpdateProcessorFactoryTest, TestFuzzyAnalyzedSuggestions, TestPushWriter, TestSolrCoreSnapshots, DirectoryFactoryTest, TestSchemaSimilarityResource, MoveReplicaHDFSTest, TestStressLiveNodes, NotRequiredUniqueKeyTest, TestFilteredDocIdSet, PrimUtilsTest, TestDistributedSearch, HardAutoCommitTest, V2ApiIntegrationTest, TestQuerySenderListener, TestDistribDocBasedVersion, TestAddFieldRealTimeGet, HdfsDirectoryFactoryTest, TestQueryWrapperFilter, SolrTestCaseJ4Test, GraphQueryTest, ResourceLoaderTest, NodeLostTriggerTest, CircularListTest, TestTrackingShardHandlerFactory, PrimitiveFieldTypeTest, TestApiFramework, TestFaceting, UUIDUpdateProcessorFallbackTest, TestSchemaNameResource, TestFoldingMultitermQuery, ResponseLogComponentTest, OutOfBoxZkACLAndCredentialsProvidersTest, DistributedSuggestComponentTest, TestSolrCloudWithKerberosAlt, TestClassicSimilarityFactory, BigEndianAscendingWordSerializerTest, TestBinaryResponseWriter, TestSubQueryTransformerDistrib, OverseerCollectionConfigSetProcessorTest, ChaosMonkeyNothingIsSafeWithPullReplicasTest, TestConfigSetImmutable, SimpleCollectionCreateDeleteTest, TestGroupingSearch, LargeFieldTest, UUIDFieldTest, TestRandomFlRTGCloud, CollectionStateFormat2Test, CSVRequestHandlerTest, LeaderFailureAfterFreshStartTest, SSLMigrationTest, DisMaxRequestHandlerTest, TestLazyCores, DocValuesMissingTest, TestExactStatsCache, DirectUpdateHandlerOptimizeTest, HdfsBasicDistributedZk2Test, SolrCloudReportersTest, DocValuesNotIndexedTest, TestTolerantSearch, OverseerTaskQueueTest, ClassificationUpdateProcessorFactoryTest, PeerSyncTest, VMParamsZkACLAndCredentialsProvidersTest, CloudMLTQParserTest, TestBinaryField, SolrIndexSplitterTest, PKIAuthenticationIntegrationTest, TestMultiValuedNumericRangeQuery, ImplicitSnitchTest, InfixSuggestersTest, TestPayloadCheckQParserPlugin, ClusterStateTest, ResponseHeaderTest, TestSweetSpotSimilarityFactory, TestStressCloudBlindAtomicUpdates, UnloadDistributedZkTest, XmlUpdateRequestHandlerTest, TestBulkSchemaAPI, TestInitParams, RAMDirectoryFactoryTest, DefaultValueUpdateProcessorTest, TestMaxTokenLenTokenizer, AutoscalingHistoryHandlerTest, HttpTriggerListenerTest, TestLegacyNumericUtils, HdfsCollectionsAPIDistributedZkTest, TestJmxIntegration, CdcrReplicationDistributedZkTest, HLLSerializationTest, CursorPagingTest, LeaderInitiatedRecoveryOnShardRestartTest, TestStressReorder, TestSolrConfigHandlerConcurrent, SubstringBytesRefFilterTest, WordBreakSolrSpellCheckerTest, ReplaceNodeTest, CloudExitableDirectoryReaderTest, JSONWriterTest, TestSerializedLuceneMatchVersion, TestXIncludeConfig, TestReversedWildcardFilterFactory, HighlighterTest, ZkStateReaderTest, SearchHandlerTest, TestExtendedDismaxParser, TestPKIAuthenticationPlugin, TestRandomDVFaceting, ExplicitHLLTest, TestLeaderElectionWithEmptyReplica, HdfsLockFactoryTest, BlockCacheTest, SuggesterTest, SimplePostToolTest, ConfigureRecoveryStrategyTest, TestOrdValues, TestFieldCacheVsDocValues, OutputWriterTest, HdfsRestartWhileUpdatingTest, TestFieldCollectionResource, TestLegacyNumericRangeQueryBuilder, TestFreeTextSuggestions, LeaderElectionTest, TestSearcherReuse, FastVectorHighlighterTest, SolrMetricsIntegrationTest, SyncSliceTest, TestHashQParserPlugin, TestDocBasedVersionConstraints, TestConfigsApi, AddBlockUpdateTest, SolrCloudExampleTest, TestCoreContainer, TimeZoneUtilsTest, SimpleFacetsTest, TestNoOpRegenerator, TestNumericRangeQuery64, TestHighlightDedupGrouping, ConnectionManagerTest, SparseHLLTest, SoftAutoCommitTest, TestSmileRequest, MultiTermTest, TestRestoreCore, TestHashPartitioner, TestDistributedStatsComponentCardinality, CdcrUpdateLogTest, TestUpdate, TestReloadAndDeleteDocs, RequiredFieldsTest, TestShortCircuitedRequests, TestExportWriter, RulesTest, TestSchemalessBufferedUpdates, TestDynamicFieldCollectionResource, ClusterStateUpdateTest, TestIBSimilarityFactory, TestPolicyCloud, TestPseudoReturnFields, TestRebalanceLeaders, FieldAnalysisRequestHandlerTest, TestNamedUpdateProcessors, TestLegacyFieldCache, CoreAdminRequestStatusTest, TestMissingGroups, DistributedQueryComponentCustomSortTest, StressHdfsTest, RegexBoostProcessorTest, TestStandardQParsers, DeleteStatusTest, TestFunctionQuery, TestManagedStopFilterFactory, TestLFUCache, ConnectionReuseTest, TestCloudPivotFacet, DirectUpdateHandlerTest, HdfsUnloadDistributedZkTest, DistributedDebugComponentTest, TestCSVResponseWriter, TestUtils, IndexBasedSpellCheckerTest, TestStressRecovery, BasicDistributedZkTest, ShardRoutingTest, RecoveryZkTest, FullSolrCloudDistribCmdsTest, TestReplicationHandler, ShardRoutingCustomTest, DistributedSpellCheckComponentTest, TestRealTimeGet, TestReload, TestRangeQuery, SolrCoreTest, SpellCheckComponentTest, SolrCmdDistributorTest, QueryElevationComponentTest, BasicFunctionalityTest, DistributedQueryElevationComponentTest, SpellCheckCollatorTest, CoreAdminHandlerTest, TestStressLucene, TestTrie, SpatialFilterTest, SuggesterWFSTTest, NoCacheHeaderTest, SchemaVersionSpecificBehaviorTest, SolrCoreCheckLockOnStartupTest, FieldMutatingUpdateProcessorTest, TestAtomicUpdateErrorCases, QueryEqualityTest, TestRemoteStreaming, DistanceFunctionTest, XsltUpdateRequestHandlerTest, CacheHeaderTest, TestSurroundQueryParser, TestQueryUtils, TestWriterPerf, TestQueryTypes, RequestHandlersTest, PathHierarchyTokenizerFactoryTest, TestIndexingPerformance, IndexSchemaRuntimeFieldTest, TestCollationField, MBeansHandlerTest, TestPhraseSuggestions, TestDFRSimilarityFactory, TestLMDirichletSimilarityFactory, TestFastWriter, ScriptEngineTest, URLClassifyProcessorTest, ChaosMonkeyNothingIsSafeTest, BaseCdcrDistributedZkTest, CdcrBootstrapTest, CollectionsAPIAsyncDistributedZkTest, ConcurrentDeleteAndCreateCollectionTest, ConfigSetsAPITest, CustomCollectionTest, DeleteReplicaTest, DistributedQueueTest, ForceLeaderTest, MoveReplicaTest, MultiThreadedOCPTest, OverseerModifyCollectionTest, OverseerRolesTest, OverseerStatusTest, RecoveryAfterSoftCommitTest, SharedFSAutoReplicaFailoverTest, SolrCLIZkUtilsTest, TestAuthenticationFramework, TestCloudDeleteByQuery, TestCloudInspectUtil, TestCloudPseudoReturnFields, TestCloudRecovery, TestCloudSearcherWarming, TestClusterProperties, TestCollectionsAPIViaSolrCloudCluster, TestConfigSetsAPIExclusivity, TestConfigSetsAPIZkFailure, TestCryptoKeys, TestDeleteCollectionOnDownNodes, TestExclusionRuleCollectionAccess, TestHdfsCloudBackupRestore, TestLeaderInitiatedRecoveryThread, TestLockTree, TestMiniSolrCloudClusterSSL, TestRandomRequestDistribution, TestRequestForwarding, TestRequestStatusCollectionAPI, TestSkipOverseerOperations, TestTlogReplica, AutoScalingHandlerTest, ExecutePlanActionTest, SystemLogListenerTest, HdfsChaosMonkeyNothingIsSafeTest, HdfsNNFailoverTest, HdfsRecoverLeaseTest, HdfsThreadLeakTest, HdfsWriteToMultipleCollectionsTest, TestClusterStateMutator, RuleEngineTest, QueryResultKeyTest, TestBackupRepositoryFactory, TestConfigOverlay, TestConfigSetProperties, TestConfigSets, TestCustomStream, TestImplicitCoreProperties, TestNRTOpen, TestShardHandlerFactory, TestSimpleTextCodec, TestSolrConfigHandler, TestConfigReload, TestSQLHandlerNonCloud, CoreMergeIndexesAdminHandlerTest, PropertiesRequestHandlerTest, SegmentsInfoRequestHandlerTest, DistributedFacetExistsSmallTest, DistributedFacetPivotLongTailTest, FacetPivotSmallTest, ReplicaListTransformerTest, ShufflingReplicaListTransformerTest, SpatialHeatmapFacetsTest, SolrJmxReporterTest, SolrSlf4jReporterTest, TestIntervalFaceting, TestSchemaResource, TestManagedSynonymGraphFilterFactory, ManagedSchemaRoundRobinCloudTest, TestCloudSchemaless, TestUseDocValuesAsStored2, AnalyticsQueryTest, RankQueryTest, TestComplexPhraseLeadingWildcard, TestCustomSort, TestGraphTermsQParserPlugin, TestInitQParser, TestMultiWordSynonyms, TestRandomCollapseQParserPlugin, TestReloadDeadlock, TestSimpleQParserPlugin, TestSolr4Spatial2, TestSolrCoreParser, TestStressUserVersions, TestTrieFacet, TestXmlQParser, TestXmlQParserPlugin, TestJsonFacets, BJQParserTest, BlockJoinFacetDistribTest, TestCloudNestedDocsSort, TestLRUStatsCache, BasicAuthIntegrationTest, BasicAuthStandaloneTest, TestRuleBasedAuthorizationPlugin, TestSha256AuthenticationProvider, TestImpersonationWithHadoopAuth]
   [junit4]   2> NOTE: reproduce with: ant test  -Dtestcase=TestImpersonationWithHadoopAuth -Dtests.seed=A020033BF1C8718A -Dtests.slow=true -Dtests.locale=it -Dtests.timezone=Brazil/Acre -Dtests.asserts=true -Dtests.file.encoding=ISO-8859-1
   [junit4] ERROR   0.00s J0 | TestImpersonationWithHadoopAuth (suite) <<<
   [junit4]    > Throwable #1: com.carrotsearch.randomizedtesting.ThreadLeakError: 2 threads leaked from SUITE scope at org.apache.solr.security.hadoop.TestImpersonationWithHadoopAuth: 
   [junit4]    >    1) Thread[id=40816, name=jetty-launcher-6315-thread-1-EventThread, state=TIMED_WAITING, group=TGRP-TestImpersonationWithHadoopAuth]
   [junit4]    >         at sun.misc.Unsafe.park(Native Method)
   [junit4]    >         at java.util.concurrent.locks.LockSupport.parkNanos(LockSupport.java:215)
   [junit4]    >         at java.util.concurrent.locks.AbstractQueuedSynchronizer.doAcquireSharedNanos(AbstractQueuedSynchronizer.java:1037)
   [junit4]    >         at java.util.concurrent.locks.AbstractQueuedSynchronizer.tryAcquireSharedNanos(AbstractQueuedSynchronizer.java:1328)
   [junit4]    >         at java.util.concurrent.CountDownLatch.await(CountDownLatch.java:277)
   [junit4]    >         at org.apache.curator.CuratorZookeeperClient.internalBlockUntilConnectedOrTimedOut(CuratorZookeeperClient.java:323)
   [junit4]    >         at org.apache.curator.RetryLoop.callWithRetry(RetryLoop.java:105)
   [junit4]    >         at org.apache.curator.framework.imps.GetDataBuilderImpl.pathInForeground(GetDataBuilderImpl.java:288)
   [junit4]    >         at org.apache.curator.framework.imps.GetDataBuilderImpl.forPath(GetDataBuilderImpl.java:279)
   [junit4]    >         at org.apache.curator.framework.imps.GetDataBuilderImpl.forPath(GetDataBuilderImpl.java:41)
   [junit4]    >         at org.apache.curator.framework.recipes.shared.SharedValue.readValue(SharedValue.java:244)
   [junit4]    >         at org.apache.curator.framework.recipes.shared.SharedValue.access$100(SharedValue.java:44)
   [junit4]    >         at org.apache.curator.framework.recipes.shared.SharedValue$1.process(SharedValue.java:61)
   [junit4]    >         at org.apache.curator.framework.imps.NamespaceWatcher.process(NamespaceWatcher.java:67)
   [junit4]    >         at org.apache.zookeeper.ClientCnxn$EventThread.processEvent(ClientCnxn.java:530)
   [junit4]    >         at org.apache.zookeeper.ClientCnxn$EventThread.run(ClientCnxn.java:505)
   [junit4]    >    2) Thread[id=40818, name=jetty-launcher-6315-thread-2-EventThread, state=TIMED_WAITING, group=TGRP-TestImpersonationWithHadoopAuth]
   [junit4]    >         at sun.misc.Unsafe.park(Native Method)
   [junit4]    >         at java.util.concurrent.locks.LockSupport.parkNanos(LockSupport.java:215)
   [junit4]    >         at java.util.concurrent.locks.AbstractQueuedSynchronizer.doAcquireSharedNanos(AbstractQueuedSynchronizer.java:1037)
   [junit4]    >         at java.util.concurrent.locks.AbstractQueuedSynchronizer.tryAcquireSharedNanos(AbstractQueuedSynchronizer.java:1328)
   [junit4]    >         at java.util.concurrent.CountDownLatch.await(CountDownLatch.java:277)
   [junit4]    >         at org.apache.curator.CuratorZookeeperClient.internalBlockUntilConnectedOrTimedOut(CuratorZookeeperClient.java:323)
   [junit4]    >         at org.apache.curator.RetryLoop.callWithRetry(RetryLoop.java:105)
   [junit4]    >         at org.apache.curator.framework.imps.GetDataBuilderImpl.pathInForeground(GetDataBuilderImpl.java:288)
   [junit4]    >         at org.apache.curator.framework.imps.GetDataBuilderImpl.forPath(GetDataBuilderImpl.java:279)
   [junit4]    >         at org.apache.curator.framework.imps.GetDataBuilderImpl.forPath(GetDataBuilderImpl.java:41)
   [junit4]    >         at org.apache.curator.framework.recipes.shared.SharedValue.readValue(SharedValue.java:244)
   [junit4]    >         at org.apache.curator.framework.recipes.shared.SharedValue.access$100(SharedValue.java:44)
   [junit4]    >         at org.apache.curator.framework.recipes.shared.SharedValue$1.process(SharedValue.java:61)
   [junit4]    >         at org.apache.curator.framework.imps.NamespaceWatcher.process(NamespaceWatcher.java:67)
   [junit4]    >         at org.apache.zookeeper.ClientCnxn$EventThread.processEvent(ClientCnxn.java:530)
   [junit4]    >         at org.apache.zookeeper.ClientCnxn$EventThread.run(ClientCnxn.java:505)
   [junit4]    > 	at __randomizedtesting.SeedInfo.seed([A020033BF1C8718A]:0)
   [junit4] Completed [717/745 (1!)] on J0 in 44.08s, 10 tests, 1 error, 1 skipped <<< FAILURES!

[...truncated 46973 lines...]

Mime
View raw message