lucene-dev mailing list archives

Site index · List index
Message view « Date » · « Thread »
Top « Date » · « Thread »
From Policeman Jenkins Server <jenk...@thetaphi.de>
Subject [JENKINS] Lucene-Solr-master-Solaris (64bit/jdk1.8.0) - Build # 1467 - Still Unstable!
Date Thu, 12 Oct 2017 00:46:42 GMT
Build: https://jenkins.thetaphi.de/job/Lucene-Solr-master-Solaris/1467/
Java: 64bit/jdk1.8.0 -XX:-UseCompressedOops -XX:+UseG1GC

2 tests failed.
FAILED:  junit.framework.TestSuite.org.apache.solr.cloud.TestSolrCloudWithSecureImpersonation

Error Message:
3 threads leaked from SUITE scope at org.apache.solr.cloud.TestSolrCloudWithSecureImpersonation:     1) Thread[id=25941, name=jetty-launcher-3392-thread-1-EventThread, state=TIMED_WAITING, group=TGRP-TestSolrCloudWithSecureImpersonation]         at sun.misc.Unsafe.park(Native Method)         at java.util.concurrent.locks.LockSupport.parkNanos(LockSupport.java:215)         at java.util.concurrent.locks.AbstractQueuedSynchronizer.doAcquireSharedNanos(AbstractQueuedSynchronizer.java:1037)         at java.util.concurrent.locks.AbstractQueuedSynchronizer.tryAcquireSharedNanos(AbstractQueuedSynchronizer.java:1328)         at java.util.concurrent.CountDownLatch.await(CountDownLatch.java:277)         at org.apache.curator.CuratorZookeeperClient.internalBlockUntilConnectedOrTimedOut(CuratorZookeeperClient.java:323)         at org.apache.curator.RetryLoop.callWithRetry(RetryLoop.java:105)         at org.apache.curator.framework.imps.GetDataBuilderImpl.pathInForeground(GetDataBuilderImpl.java:288)         at org.apache.curator.framework.imps.GetDataBuilderImpl.forPath(GetDataBuilderImpl.java:279)         at org.apache.curator.framework.imps.GetDataBuilderImpl.forPath(GetDataBuilderImpl.java:41)         at org.apache.curator.framework.recipes.shared.SharedValue.readValue(SharedValue.java:244)         at org.apache.curator.framework.recipes.shared.SharedValue.access$100(SharedValue.java:44)         at org.apache.curator.framework.recipes.shared.SharedValue$1.process(SharedValue.java:61)         at org.apache.curator.framework.imps.NamespaceWatcher.process(NamespaceWatcher.java:67)         at org.apache.zookeeper.ClientCnxn$EventThread.processEvent(ClientCnxn.java:530)         at org.apache.zookeeper.ClientCnxn$EventThread.run(ClientCnxn.java:505)    2) Thread[id=26004, name=jetty-launcher-3392-thread-2-SendThread(127.0.0.1:57299), state=TIMED_WAITING, group=TGRP-TestSolrCloudWithSecureImpersonation]         at java.lang.Thread.sleep(Native Method)         at org.apache.zookeeper.client.StaticHostProvider.next(StaticHostProvider.java:101)         at org.apache.zookeeper.ClientCnxn$SendThread.startConnect(ClientCnxn.java:997)         at org.apache.zookeeper.ClientCnxn$SendThread.run(ClientCnxn.java:1060)    3) Thread[id=26005, name=jetty-launcher-3392-thread-2-EventThread, state=WAITING, group=TGRP-TestSolrCloudWithSecureImpersonation]         at sun.misc.Unsafe.park(Native Method)         at java.util.concurrent.locks.LockSupport.park(LockSupport.java:175)         at java.util.concurrent.locks.AbstractQueuedSynchronizer$ConditionObject.await(AbstractQueuedSynchronizer.java:2039)         at java.util.concurrent.LinkedBlockingQueue.take(LinkedBlockingQueue.java:442)         at org.apache.zookeeper.ClientCnxn$EventThread.run(ClientCnxn.java:501)

Stack Trace:
com.carrotsearch.randomizedtesting.ThreadLeakError: 3 threads leaked from SUITE scope at org.apache.solr.cloud.TestSolrCloudWithSecureImpersonation: 
   1) Thread[id=25941, name=jetty-launcher-3392-thread-1-EventThread, state=TIMED_WAITING, group=TGRP-TestSolrCloudWithSecureImpersonation]
        at sun.misc.Unsafe.park(Native Method)
        at java.util.concurrent.locks.LockSupport.parkNanos(LockSupport.java:215)
        at java.util.concurrent.locks.AbstractQueuedSynchronizer.doAcquireSharedNanos(AbstractQueuedSynchronizer.java:1037)
        at java.util.concurrent.locks.AbstractQueuedSynchronizer.tryAcquireSharedNanos(AbstractQueuedSynchronizer.java:1328)
        at java.util.concurrent.CountDownLatch.await(CountDownLatch.java:277)
        at org.apache.curator.CuratorZookeeperClient.internalBlockUntilConnectedOrTimedOut(CuratorZookeeperClient.java:323)
        at org.apache.curator.RetryLoop.callWithRetry(RetryLoop.java:105)
        at org.apache.curator.framework.imps.GetDataBuilderImpl.pathInForeground(GetDataBuilderImpl.java:288)
        at org.apache.curator.framework.imps.GetDataBuilderImpl.forPath(GetDataBuilderImpl.java:279)
        at org.apache.curator.framework.imps.GetDataBuilderImpl.forPath(GetDataBuilderImpl.java:41)
        at org.apache.curator.framework.recipes.shared.SharedValue.readValue(SharedValue.java:244)
        at org.apache.curator.framework.recipes.shared.SharedValue.access$100(SharedValue.java:44)
        at org.apache.curator.framework.recipes.shared.SharedValue$1.process(SharedValue.java:61)
        at org.apache.curator.framework.imps.NamespaceWatcher.process(NamespaceWatcher.java:67)
        at org.apache.zookeeper.ClientCnxn$EventThread.processEvent(ClientCnxn.java:530)
        at org.apache.zookeeper.ClientCnxn$EventThread.run(ClientCnxn.java:505)
   2) Thread[id=26004, name=jetty-launcher-3392-thread-2-SendThread(127.0.0.1:57299), state=TIMED_WAITING, group=TGRP-TestSolrCloudWithSecureImpersonation]
        at java.lang.Thread.sleep(Native Method)
        at org.apache.zookeeper.client.StaticHostProvider.next(StaticHostProvider.java:101)
        at org.apache.zookeeper.ClientCnxn$SendThread.startConnect(ClientCnxn.java:997)
        at org.apache.zookeeper.ClientCnxn$SendThread.run(ClientCnxn.java:1060)
   3) Thread[id=26005, name=jetty-launcher-3392-thread-2-EventThread, state=WAITING, group=TGRP-TestSolrCloudWithSecureImpersonation]
        at sun.misc.Unsafe.park(Native Method)
        at java.util.concurrent.locks.LockSupport.park(LockSupport.java:175)
        at java.util.concurrent.locks.AbstractQueuedSynchronizer$ConditionObject.await(AbstractQueuedSynchronizer.java:2039)
        at java.util.concurrent.LinkedBlockingQueue.take(LinkedBlockingQueue.java:442)
        at org.apache.zookeeper.ClientCnxn$EventThread.run(ClientCnxn.java:501)
	at __randomizedtesting.SeedInfo.seed([6595348457A40AF6]:0)


FAILED:  junit.framework.TestSuite.org.apache.solr.cloud.TestSolrCloudWithSecureImpersonation

Error Message:
There are still zombie threads that couldn't be terminated:    1) Thread[id=26004, name=jetty-launcher-3392-thread-2-SendThread(127.0.0.1:57299), state=TIMED_WAITING, group=TGRP-TestSolrCloudWithSecureImpersonation]         at java.lang.Thread.sleep(Native Method)         at org.apache.zookeeper.client.StaticHostProvider.next(StaticHostProvider.java:101)         at org.apache.zookeeper.ClientCnxn$SendThread.startConnect(ClientCnxn.java:997)         at org.apache.zookeeper.ClientCnxn$SendThread.run(ClientCnxn.java:1060)

Stack Trace:
com.carrotsearch.randomizedtesting.ThreadLeakError: There are still zombie threads that couldn't be terminated:
   1) Thread[id=26004, name=jetty-launcher-3392-thread-2-SendThread(127.0.0.1:57299), state=TIMED_WAITING, group=TGRP-TestSolrCloudWithSecureImpersonation]
        at java.lang.Thread.sleep(Native Method)
        at org.apache.zookeeper.client.StaticHostProvider.next(StaticHostProvider.java:101)
        at org.apache.zookeeper.ClientCnxn$SendThread.startConnect(ClientCnxn.java:997)
        at org.apache.zookeeper.ClientCnxn$SendThread.run(ClientCnxn.java:1060)
	at __randomizedtesting.SeedInfo.seed([6595348457A40AF6]:0)




Build Log:
[...truncated 13251 lines...]
   [junit4] Suite: org.apache.solr.cloud.TestSolrCloudWithSecureImpersonation
   [junit4]   2> 3166091 INFO  (SUITE-TestSolrCloudWithSecureImpersonation-seed#[6595348457A40AF6]-worker) [    ] o.a.s.SolrTestCaseJ4 SecureRandom sanity checks: test.solr.allowed.securerandom=null & java.security.egd=file:/dev/./urandom
   [junit4]   2> Creating dataDir: /export/home/jenkins/workspace/Lucene-Solr-master-Solaris/solr/build/solr-core/test/J0/temp/solr.cloud.TestSolrCloudWithSecureImpersonation_6595348457A40AF6-001/init-core-data-001
   [junit4]   2> 3166092 INFO  (SUITE-TestSolrCloudWithSecureImpersonation-seed#[6595348457A40AF6]-worker) [    ] o.a.s.SolrTestCaseJ4 Using PointFields (NUMERIC_POINTS_SYSPROP=true) w/NUMERIC_DOCVALUES_SYSPROP=true
   [junit4]   2> 3166095 INFO  (SUITE-TestSolrCloudWithSecureImpersonation-seed#[6595348457A40AF6]-worker) [    ] o.a.s.SolrTestCaseJ4 Randomized ssl (false) and clientAuth (true) via: @org.apache.solr.util.RandomizeSSL(reason=, value=NaN, ssl=NaN, clientAuth=NaN)
   [junit4]   2> 3166141 INFO  (SUITE-TestSolrCloudWithSecureImpersonation-seed#[6595348457A40AF6]-worker) [    ] o.a.s.c.MiniSolrCloudCluster Starting cluster of 2 servers in /export/home/jenkins/workspace/Lucene-Solr-master-Solaris/solr/build/solr-core/test/J0/temp/solr.cloud.TestSolrCloudWithSecureImpersonation_6595348457A40AF6-001/tempDir-001
   [junit4]   2> 3166141 INFO  (SUITE-TestSolrCloudWithSecureImpersonation-seed#[6595348457A40AF6]-worker) [    ] o.a.s.c.ZkTestServer STARTING ZK TEST SERVER
   [junit4]   2> 3166141 INFO  (Thread-7263) [    ] o.a.s.c.ZkTestServer client port:0.0.0.0/0.0.0.0:0
   [junit4]   2> 3166141 INFO  (Thread-7263) [    ] o.a.s.c.ZkTestServer Starting server
   [junit4]   2> 3166143 ERROR (Thread-7263) [    ] o.a.z.s.ZooKeeperServer ZKShutdownHandler is not registered, so ZooKeeper server won't take any action on ERROR or SHUTDOWN server state changes
   [junit4]   2> 3166241 INFO  (SUITE-TestSolrCloudWithSecureImpersonation-seed#[6595348457A40AF6]-worker) [    ] o.a.s.c.ZkTestServer start zk server on port:57299
   [junit4]   2> 3166270 INFO  (jetty-launcher-3392-thread-1) [    ] o.e.j.s.Server jetty-9.3.20.v20170531
   [junit4]   2> 3166270 INFO  (jetty-launcher-3392-thread-2) [    ] o.e.j.s.Server jetty-9.3.20.v20170531
   [junit4]   2> 3166277 INFO  (jetty-launcher-3392-thread-1) [    ] o.e.j.s.h.ContextHandler Started o.e.j.s.ServletContextHandler@105007f1{/solr,null,AVAILABLE}
   [junit4]   2> 3166278 INFO  (jetty-launcher-3392-thread-1) [    ] o.e.j.s.AbstractConnector Started ServerConnector@6b6dff6d{HTTP/1.1,[http/1.1]}{127.0.0.1:58171}
   [junit4]   2> 3166278 INFO  (jetty-launcher-3392-thread-1) [    ] o.e.j.s.Server Started @3168637ms
   [junit4]   2> 3166278 INFO  (jetty-launcher-3392-thread-2) [    ] o.e.j.s.h.ContextHandler Started o.e.j.s.ServletContextHandler@12a92327{/solr,null,AVAILABLE}
   [junit4]   2> 3166278 INFO  (jetty-launcher-3392-thread-1) [    ] o.a.s.c.s.e.JettySolrRunner Jetty properties: {hostContext=/solr, hostPort=58171}
   [junit4]   2> 3166279 INFO  (jetty-launcher-3392-thread-2) [    ] o.e.j.s.AbstractConnector Started ServerConnector@60ba47e5{HTTP/1.1,[http/1.1]}{127.0.0.1:35132}
   [junit4]   2> 3166279 INFO  (jetty-launcher-3392-thread-2) [    ] o.e.j.s.Server Started @3168638ms
   [junit4]   2> 3166279 ERROR (jetty-launcher-3392-thread-1) [    ] o.a.s.u.StartupLoggingUtils Missing Java Option solr.log.dir. Logging may be missing or incomplete.
   [junit4]   2> 3166279 INFO  (jetty-launcher-3392-thread-2) [    ] o.a.s.c.s.e.JettySolrRunner Jetty properties: {hostContext=/solr, hostPort=35132}
   [junit4]   2> 3166279 INFO  (jetty-launcher-3392-thread-1) [    ] o.a.s.s.SolrDispatchFilter  ___      _       Welcome to Apache Solr? version 8.0.0
   [junit4]   2> 3166279 INFO  (jetty-launcher-3392-thread-1) [    ] o.a.s.s.SolrDispatchFilter / __| ___| |_ _   Starting in cloud mode on port null
   [junit4]   2> 3166280 ERROR (jetty-launcher-3392-thread-2) [    ] o.a.s.u.StartupLoggingUtils Missing Java Option solr.log.dir. Logging may be missing or incomplete.
   [junit4]   2> 3166280 INFO  (jetty-launcher-3392-thread-1) [    ] o.a.s.s.SolrDispatchFilter \__ \/ _ \ | '_|  Install dir: null, Default config dir: null
   [junit4]   2> 3166280 INFO  (jetty-launcher-3392-thread-1) [    ] o.a.s.s.SolrDispatchFilter |___/\___/_|_|    Start time: 2017-10-12T00:21:45.985Z
   [junit4]   2> 3166280 INFO  (jetty-launcher-3392-thread-2) [    ] o.a.s.s.SolrDispatchFilter  ___      _       Welcome to Apache Solr? version 8.0.0
   [junit4]   2> 3166280 INFO  (jetty-launcher-3392-thread-2) [    ] o.a.s.s.SolrDispatchFilter / __| ___| |_ _   Starting in cloud mode on port null
   [junit4]   2> 3166280 INFO  (jetty-launcher-3392-thread-2) [    ] o.a.s.s.SolrDispatchFilter \__ \/ _ \ | '_|  Install dir: null, Default config dir: null
   [junit4]   2> 3166280 INFO  (jetty-launcher-3392-thread-2) [    ] o.a.s.s.SolrDispatchFilter |___/\___/_|_|    Start time: 2017-10-12T00:21:45.985Z
   [junit4]   2> 3166290 INFO  (jetty-launcher-3392-thread-2) [    ] o.a.s.s.SolrDispatchFilter solr.xml found in ZooKeeper. Loading...
   [junit4]   2> 3166290 INFO  (jetty-launcher-3392-thread-1) [    ] o.a.s.s.SolrDispatchFilter solr.xml found in ZooKeeper. Loading...
   [junit4]   2> 3166298 INFO  (jetty-launcher-3392-thread-1) [    ] o.a.s.c.ZkContainer Zookeeper client=127.0.0.1:57299/solr
   [junit4]   2> 3166298 INFO  (jetty-launcher-3392-thread-2) [    ] o.a.s.c.ZkContainer Zookeeper client=127.0.0.1:57299/solr
   [junit4]   2> 3166434 INFO  (jetty-launcher-3392-thread-2) [n:127.0.0.1:35132_solr    ] o.a.s.c.Overseer Overseer (id=null) closing
   [junit4]   2> 3166434 INFO  (jetty-launcher-3392-thread-1) [n:127.0.0.1:58171_solr    ] o.a.s.c.Overseer Overseer (id=null) closing
   [junit4]   2> 3166437 INFO  (jetty-launcher-3392-thread-2) [n:127.0.0.1:35132_solr    ] o.a.s.c.OverseerElectionContext I am going to be the leader 127.0.0.1:35132_solr
   [junit4]   2> 3166437 INFO  (jetty-launcher-3392-thread-1) [n:127.0.0.1:58171_solr    ] o.a.s.c.ZkController Register node as live in ZooKeeper:/live_nodes/127.0.0.1:58171_solr
   [junit4]   2> 3166442 INFO  (zkCallback-3403-thread-1-processing-n:127.0.0.1:58171_solr) [n:127.0.0.1:58171_solr    ] o.a.s.c.c.ZkStateReader Updated live nodes from ZooKeeper... (0) -> (1)
   [junit4]   2> 3166444 INFO  (zkCallback-3404-thread-1-processing-n:127.0.0.1:35132_solr) [n:127.0.0.1:35132_solr    ] o.a.s.c.c.ZkStateReader Updated live nodes from ZooKeeper... (0) -> (1)
   [junit4]   2> 3166445 INFO  (jetty-launcher-3392-thread-2) [n:127.0.0.1:35132_solr    ] o.a.s.c.Overseer Overseer (id=98813064370454534-127.0.0.1:35132_solr-n_0000000000) starting
   [junit4]   2> 3166457 INFO  (jetty-launcher-3392-thread-2) [n:127.0.0.1:35132_solr    ] o.a.s.c.ZkController Register node as live in ZooKeeper:/live_nodes/127.0.0.1:35132_solr
   [junit4]   2> 3166459 INFO  (zkCallback-3403-thread-1-processing-n:127.0.0.1:58171_solr) [n:127.0.0.1:58171_solr    ] o.a.s.c.c.ZkStateReader Updated live nodes from ZooKeeper... (1) -> (2)
   [junit4]   2> 3166460 INFO  (zkCallback-3404-thread-1-processing-n:127.0.0.1:35132_solr) [n:127.0.0.1:35132_solr    ] o.a.s.c.c.ZkStateReader Updated live nodes from ZooKeeper... (1) -> (2)
   [junit4]   2> 3166470 INFO  (jetty-launcher-3392-thread-1) [n:127.0.0.1:58171_solr    ] o.a.s.c.CoreContainer Initializing authentication plugin: org.apache.solr.security.HttpParamDelegationTokenPlugin
   [junit4]   2> 3166470 WARN  (jetty-launcher-3392-thread-1) [n:127.0.0.1:58171_solr    ] o.a.s.c.s.i.Krb5HttpClientBuilder org.apache.solr.client.solrj.impl.Krb5HttpClientBuilder is configured without specifying system property 'java.security.auth.login.config'
   [junit4]   2> 3166470 INFO  (jetty-launcher-3392-thread-1) [n:127.0.0.1:58171_solr    ] o.a.s.s.KerberosPlugin Params: {solr.kerberos.impersonator.user.noGroups.hosts=*, solr.kerberos.impersonator.user.bogusGroup.groups=__some_bogus_group, token.valid=30, cookie.domain=127.0.0.1, solr.kerberos.impersonator.user.anyHostAnyUser.groups=*, solr.kerberos.impersonator.user.bogusGroup.hosts=*, solr.kerberos.impersonator.user.anyHostAnyUser.hosts=*, token.validity=36000, solr.kerberos.impersonator.user.noHosts.groups=*, type=kerberos, solr.kerberos.impersonator.user.localHostAnyGroup.groups=*, delegation-token.token-kind=solr-dt, solr.kerberos.impersonator.user.wrongHost.hosts=1.1.1.1.1.1, cookie.path=/, zk-dt-secret-manager.znodeWorkingPath=solr/security/zkdtsm, solr.kerberos.impersonator.user.localHostAnyGroup.hosts=serv1-vm3,localhost,127.0.0.1, signer.secret.provider.zookeeper.path=/token, solr.kerberos.impersonator.user.anyHostUsersGroup.groups=staff, zk-dt-secret-manager.enable=true, solr.kerberos.impersonator.user.wrongHost.groups=*, kerberos.name.rules=DEFAULT, signer.secret.provider=zookeeper, solr.kerberos.impersonator.user.anyHostUsersGroup.hosts=*}
   [junit4]   2> 3166471 INFO  (jetty-launcher-3392-thread-1) [n:127.0.0.1:58171_solr    ] o.a.c.f.i.CuratorFrameworkImpl Starting
   [junit4]   2> 3166473 INFO  (jetty-launcher-3392-thread-1-EventThread) [n:127.0.0.1:58171_solr    ] o.a.c.f.s.ConnectionStateManager State change: CONNECTED
   [junit4]   2> 3166494 WARN  (jetty-launcher-3392-thread-1) [n:127.0.0.1:58171_solr    ] o.a.s.c.s.i.Krb5HttpClientBuilder org.apache.solr.client.solrj.impl.Krb5HttpClientBuilder is configured without specifying system property 'java.security.auth.login.config'
   [junit4]   2> 3166505 INFO  (jetty-launcher-3392-thread-2) [n:127.0.0.1:35132_solr    ] o.a.s.c.CoreContainer Initializing authentication plugin: org.apache.solr.security.HttpParamDelegationTokenPlugin
   [junit4]   2> 3166505 WARN  (jetty-launcher-3392-thread-2) [n:127.0.0.1:35132_solr    ] o.a.s.c.s.i.Krb5HttpClientBuilder org.apache.solr.client.solrj.impl.Krb5HttpClientBuilder is configured without specifying system property 'java.security.auth.login.config'
   [junit4]   2> 3166505 INFO  (jetty-launcher-3392-thread-2) [n:127.0.0.1:35132_solr    ] o.a.s.s.KerberosPlugin Params: {solr.kerberos.impersonator.user.noGroups.hosts=*, solr.kerberos.impersonator.user.bogusGroup.groups=__some_bogus_group, token.valid=30, cookie.domain=127.0.0.1, solr.kerberos.impersonator.user.anyHostAnyUser.groups=*, solr.kerberos.impersonator.user.bogusGroup.hosts=*, solr.kerberos.impersonator.user.anyHostAnyUser.hosts=*, token.validity=36000, solr.kerberos.impersonator.user.noHosts.groups=*, type=kerberos, solr.kerberos.impersonator.user.localHostAnyGroup.groups=*, delegation-token.token-kind=solr-dt, solr.kerberos.impersonator.user.wrongHost.hosts=1.1.1.1.1.1, cookie.path=/, zk-dt-secret-manager.znodeWorkingPath=solr/security/zkdtsm, solr.kerberos.impersonator.user.localHostAnyGroup.hosts=serv1-vm3,localhost,127.0.0.1, signer.secret.provider.zookeeper.path=/token, solr.kerberos.impersonator.user.anyHostUsersGroup.groups=staff, zk-dt-secret-manager.enable=true, solr.kerberos.impersonator.user.wrongHost.groups=*, kerberos.name.rules=DEFAULT, signer.secret.provider=zookeeper, solr.kerberos.impersonator.user.anyHostUsersGroup.hosts=*}
   [junit4]   2> 3166506 INFO  (jetty-launcher-3392-thread-2) [n:127.0.0.1:35132_solr    ] o.a.c.f.i.CuratorFrameworkImpl Starting
   [junit4]   2> 3166508 INFO  (jetty-launcher-3392-thread-2-EventThread) [n:127.0.0.1:35132_solr    ] o.a.c.f.s.ConnectionStateManager State change: CONNECTED
   [junit4]   2> 3166530 WARN  (jetty-launcher-3392-thread-2) [n:127.0.0.1:35132_solr    ] o.a.s.c.s.i.Krb5HttpClientBuilder org.apache.solr.client.solrj.impl.Krb5HttpClientBuilder is configured without specifying system property 'java.security.auth.login.config'
   [junit4]   2> 3166549 INFO  (jetty-launcher-3392-thread-1) [n:127.0.0.1:58171_solr    ] o.a.s.m.r.SolrJmxReporter JMX monitoring for 'solr_58171.solr.node' (registry 'solr.node') enabled at server: com.sun.jmx.mbeanserver.JmxMBeanServer@22fe79fe
   [junit4]   2> 3166555 INFO  (jetty-launcher-3392-thread-1) [n:127.0.0.1:58171_solr    ] o.a.s.m.r.SolrJmxReporter JMX monitoring for 'solr_58171.solr.jvm' (registry 'solr.jvm') enabled at server: com.sun.jmx.mbeanserver.JmxMBeanServer@22fe79fe
   [junit4]   2> 3166555 INFO  (jetty-launcher-3392-thread-1) [n:127.0.0.1:58171_solr    ] o.a.s.m.r.SolrJmxReporter JMX monitoring for 'solr_58171.solr.jetty' (registry 'solr.jetty') enabled at server: com.sun.jmx.mbeanserver.JmxMBeanServer@22fe79fe
   [junit4]   2> 3166556 INFO  (jetty-launcher-3392-thread-1) [n:127.0.0.1:58171_solr    ] o.a.s.c.CorePropertiesLocator Found 0 core definitions underneath /export/home/jenkins/workspace/Lucene-Solr-master-Solaris/solr/build/solr-core/test/J0/temp/solr.cloud.TestSolrCloudWithSecureImpersonation_6595348457A40AF6-001/tempDir-001/node1/.
   [junit4]   2> 3166564 INFO  (jetty-launcher-3392-thread-2) [n:127.0.0.1:35132_solr    ] o.a.s.m.r.SolrJmxReporter JMX monitoring for 'solr_35132.solr.node' (registry 'solr.node') enabled at server: com.sun.jmx.mbeanserver.JmxMBeanServer@22fe79fe
   [junit4]   2> 3166570 INFO  (jetty-launcher-3392-thread-2) [n:127.0.0.1:35132_solr    ] o.a.s.m.r.SolrJmxReporter JMX monitoring for 'solr_35132.solr.jvm' (registry 'solr.jvm') enabled at server: com.sun.jmx.mbeanserver.JmxMBeanServer@22fe79fe
   [junit4]   2> 3166570 INFO  (jetty-launcher-3392-thread-2) [n:127.0.0.1:35132_solr    ] o.a.s.m.r.SolrJmxReporter JMX monitoring for 'solr_35132.solr.jetty' (registry 'solr.jetty') enabled at server: com.sun.jmx.mbeanserver.JmxMBeanServer@22fe79fe
   [junit4]   2> 3166570 INFO  (jetty-launcher-3392-thread-2) [n:127.0.0.1:35132_solr    ] o.a.s.c.CorePropertiesLocator Found 0 core definitions underneath /export/home/jenkins/workspace/Lucene-Solr-master-Solaris/solr/build/solr-core/test/J0/temp/solr.cloud.TestSolrCloudWithSecureImpersonation_6595348457A40AF6-001/tempDir-001/node2/.
   [junit4]   2> 3166604 WARN  (NIOServerCxn.Factory:0.0.0.0/0.0.0.0:0) [    ] o.a.z.s.NIOServerCnxn caught end of stream exception
   [junit4]   2> EndOfStreamException: Unable to read additional data from client sessionid 0x15f0df560f80009, likely client has closed socket
   [junit4]   2> 	at org.apache.zookeeper.server.NIOServerCnxn.doIO(NIOServerCnxn.java:239)
   [junit4]   2> 	at org.apache.zookeeper.server.NIOServerCnxnFactory.run(NIOServerCnxnFactory.java:203)
   [junit4]   2> 	at java.lang.Thread.run(Thread.java:748)
   [junit4]   2> 3166785 INFO  (TEST-TestSolrCloudWithSecureImpersonation.testProxyInvalidGroup-seed#[6595348457A40AF6]) [    ] o.a.s.SolrTestCaseJ4 ###Starting testProxyInvalidGroup
   [junit4]   2> 3166845 WARN  (qtp1375888285-25897) [    ] o.a.h.s.ShellBasedUnixGroupsMapping got exception trying to get groups for user bar: id: invalid user name: "bar"
   [junit4]   2> id: invalid user name: "bar"
   [junit4]   2> 
   [junit4]   2> 3166847 WARN  (TEST-TestSolrCloudWithSecureImpersonation.testProxyInvalidGroup-seed#[6595348457A40AF6]) [    ] o.a.h.c.p.ResponseProcessCookies Invalid cookie header: "Set-Cookie: hadoop.auth="u=bogusGroup&p=bogusGroup&t=test&e=1507803706493&s=s6HDLkTt6oB/HzexWypn+c9Y9Uk="; Path=/; Domain=127.0.0.1; Expires= , 12-   -2017 10:21:46 GMT; HttpOnly". Invalid 'expires' attribute: , 12- -2017 10:21:46 GMT
   [junit4]   2> 3166847 INFO  (TEST-TestSolrCloudWithSecureImpersonation.testProxyInvalidGroup-seed#[6595348457A40AF6]) [    ] o.a.s.SolrTestCaseJ4 ###Ending testProxyInvalidGroup
   [junit4]   2> 3167029 INFO  (TEST-TestSolrCloudWithSecureImpersonation.testProxyNoConfigGroups-seed#[6595348457A40AF6]) [    ] o.a.s.SolrTestCaseJ4 ###Starting testProxyNoConfigGroups
   [junit4]   2> 3167040 WARN  (TEST-TestSolrCloudWithSecureImpersonation.testProxyNoConfigGroups-seed#[6595348457A40AF6]) [    ] o.a.h.c.p.ResponseProcessCookies Invalid cookie header: "Set-Cookie: hadoop.auth="u=noGroups&p=noGroups&t=test&e=1507803706735&s=PxI+2JowuRkRxnkONp9GDRDuckw="; Path=/; Domain=127.0.0.1; Expires= , 12-   -2017 10:21:46 GMT; HttpOnly". Invalid 'expires' attribute: , 12- -2017 10:21:46 GMT
   [junit4]   2> 3167040 INFO  (TEST-TestSolrCloudWithSecureImpersonation.testProxyNoConfigGroups-seed#[6595348457A40AF6]) [    ] o.a.s.SolrTestCaseJ4 ###Ending testProxyNoConfigGroups
   [junit4]   2> 3167239 INFO  (TEST-TestSolrCloudWithSecureImpersonation.testProxyInvalidRemote-seed#[6595348457A40AF6]) [    ] o.a.s.SolrTestCaseJ4 ###Starting testProxyInvalidRemote
   [junit4]   2> 3167249 WARN  (TEST-TestSolrCloudWithSecureImpersonation.testProxyInvalidRemote-seed#[6595348457A40AF6]) [    ] o.a.h.c.p.ResponseProcessCookies Invalid cookie header: "Set-Cookie: hadoop.auth="u=localHostAnyGroup&p=localHostAnyGroup&t=test&e=1507803706945&s=n2pASzo0lAHd4LA0Yrs5UYFiuHA="; Path=/; Domain=127.0.0.1; Expires= , 12-   -2017 10:21:46 GMT; HttpOnly". Invalid 'expires' attribute: , 12- -2017 10:21:46 GMT
   [junit4]   2> 3167249 INFO  (TEST-TestSolrCloudWithSecureImpersonation.testProxyInvalidRemote-seed#[6595348457A40AF6]) [    ] o.a.s.SolrTestCaseJ4 ###Ending testProxyInvalidRemote
   [junit4]   2> 3167425 INFO  (TEST-TestSolrCloudWithSecureImpersonation.testProxyValidateGroup-seed#[6595348457A40AF6]) [    ] o.a.s.SolrTestCaseJ4 ###Starting testProxyValidateGroup
   [junit4]   2> 3167447 INFO  (qtp1375888285-25900) [n:127.0.0.1:58171_solr    ] o.a.s.h.a.CollectionsHandler Invoked Collection Action :list with params doAs=jenkins&action=LIST&wt=javabin&version=2 and sendToOCPQueue=true
   [junit4]   2> 3167447 INFO  (qtp1375888285-25900) [n:127.0.0.1:58171_solr    ] o.a.s.s.HttpSolrCall [admin] webapp=null path=/admin/collections params={doAs=jenkins&action=LIST&wt=javabin&version=2} status=0 QTime=0
   [junit4]   2> 3167447 WARN  (TEST-TestSolrCloudWithSecureImpersonation.testProxyValidateGroup-seed#[6595348457A40AF6]) [    ] o.a.h.c.p.ResponseProcessCookies Invalid cookie header: "Set-Cookie: hadoop.auth="u=anyHostUsersGroup&p=anyHostUsersGroup&t=test&e=1507803707130&s=KTwTraTO6uCORLYAdtxnprLfFhY="; Path=/; Domain=127.0.0.1; Expires= , 12-   -2017 10:21:47 GMT; HttpOnly". Invalid 'expires' attribute: , 12- -2017 10:21:47 GMT
   [junit4]   2> 3167447 INFO  (TEST-TestSolrCloudWithSecureImpersonation.testProxyValidateGroup-seed#[6595348457A40AF6]) [    ] o.a.s.SolrTestCaseJ4 ###Ending testProxyValidateGroup
   [junit4]   2> 3167622 INFO  (TEST-TestSolrCloudWithSecureImpersonation.testProxyValidateAnyHostAnyUser-seed#[6595348457A40AF6]) [    ] o.a.s.SolrTestCaseJ4 ###Starting testProxyValidateAnyHostAnyUser
   [junit4]   2> 3167623 INFO  (qtp1375888285-25902) [n:127.0.0.1:58171_solr    ] o.a.s.h.a.CollectionsHandler Invoked Collection Action :list with params doAs=bar&action=LIST&wt=javabin&version=2 and sendToOCPQueue=true
   [junit4]   2> 3167623 INFO  (qtp1375888285-25902) [n:127.0.0.1:58171_solr    ] o.a.s.s.HttpSolrCall [admin] webapp=null path=/admin/collections params={doAs=bar&action=LIST&wt=javabin&version=2} status=0 QTime=0
   [junit4]   2> 3167623 WARN  (TEST-TestSolrCloudWithSecureImpersonation.testProxyValidateAnyHostAnyUser-seed#[6595348457A40AF6]) [    ] o.a.h.c.p.ResponseProcessCookies Invalid cookie header: "Set-Cookie: hadoop.auth="u=anyHostAnyUser&p=anyHostAnyUser&t=test&e=1507803707327&s=WghnWA65aATMuaWJyrO62Rvlbf0="; Path=/; Domain=127.0.0.1; Expires= , 12-   -2017 10:21:47 GMT; HttpOnly". Invalid 'expires' attribute: , 12- -2017 10:21:47 GMT
   [junit4]   2> 3167623 INFO  (TEST-TestSolrCloudWithSecureImpersonation.testProxyValidateAnyHostAnyUser-seed#[6595348457A40AF6]) [    ] o.a.s.SolrTestCaseJ4 ###Ending testProxyValidateAnyHostAnyUser
   [junit4]   2> 3167801 INFO  (TEST-TestSolrCloudWithSecureImpersonation.testProxyNullProxyUser-seed#[6595348457A40AF6]) [    ] o.a.s.SolrTestCaseJ4 ###Starting testProxyNullProxyUser
   [junit4]   2> 3167802 INFO  (qtp1375888285-25903) [    ] o.a.s.s.SolrDispatchFilter Error authenticating
   [junit4]   2> java.lang.IllegalArgumentException: userName is NULL, empty or contains a '&'
   [junit4]   2> 	at org.apache.hadoop.security.authentication.util.AuthToken.checkForIllegalArgument(AuthToken.java:87)
   [junit4]   2> 	at org.apache.hadoop.security.authentication.util.AuthToken.<init>(AuthToken.java:70)
   [junit4]   2> 	at org.apache.hadoop.security.authentication.server.AuthenticationToken.<init>(AuthenticationToken.java:58)
   [junit4]   2> 	at org.apache.solr.security.HttpParamDelegationTokenPlugin$HttpParamDelegationTokenAuthenticationHandler$HttpParamAuthenticationHandler.authenticate(HttpParamDelegationTokenPlugin.java:213)
   [junit4]   2> 	at org.apache.hadoop.security.token.delegation.web.DelegationTokenAuthenticationHandler.authenticate(DelegationTokenAuthenticationHandler.java:348)
   [junit4]   2> 	at org.apache.solr.security.RequestContinuesRecorderAuthenticationHandler.authenticate(RequestContinuesRecorderAuthenticationHandler.java:69)
   [junit4]   2> 	at org.apache.hadoop.security.authentication.server.AuthenticationFilter.doFilter(AuthenticationFilter.java:518)
   [junit4]   2> 	at org.apache.solr.security.DelegationTokenKerberosFilter.doFilter(DelegationTokenKerberosFilter.java:134)
   [junit4]   2> 	at org.apache.solr.security.HttpParamDelegationTokenPlugin$HttpParamToRequestFilter.doFilter(HttpParamDelegationTokenPlugin.java:245)
   [junit4]   2> 	at org.apache.solr.security.KerberosPlugin.doAuthenticate(KerberosPlugin.java:243)
   [junit4]   2> 	at org.apache.solr.servlet.SolrDispatchFilter.authenticateRequest(SolrDispatchFilter.java:451)
   [junit4]   2> 	at org.apache.solr.servlet.SolrDispatchFilter.doFilter(SolrDispatchFilter.java:347)
   [junit4]   2> 	at org.apache.solr.servlet.SolrDispatchFilter.doFilter(SolrDispatchFilter.java:326)
   [junit4]   2> 	at org.eclipse.jetty.servlet.ServletHandler$CachedChain.doFilter(ServletHandler.java:1759)
   [junit4]   2> 	at org.apache.solr.client.solrj.embedded.JettySolrRunner$DebugFilter.doFilter(JettySolrRunner.java:139)
   [junit4]   2> 	at org.eclipse.jetty.servlet.ServletHandler$CachedChain.doFilter(ServletHandler.java:1759)
   [junit4]   2> 	at org.eclipse.jetty.servlet.ServletHandler.doHandle(ServletHandler.java:582)
   [junit4]   2> 	at org.eclipse.jetty.server.session.SessionHandler.doHandle(SessionHandler.java:224)
   [junit4]   2> 	at org.eclipse.jetty.server.handler.ContextHandler.doHandle(ContextHandler.java:1180)
   [junit4]   2> 	at org.eclipse.jetty.servlet.ServletHandler.doScope(ServletHandler.java:512)
   [junit4]   2> 	at org.eclipse.jetty.server.session.SessionHandler.doScope(SessionHandler.java:185)
   [junit4]   2> 	at org.eclipse.jetty.server.handler.ContextHandler.doScope(ContextHandler.java:1112)
   [junit4]   2> 	at org.eclipse.jetty.server.handler.ScopedHandler.handle(ScopedHandler.java:141)
   [junit4]   2> 	at org.eclipse.jetty.server.handler.gzip.GzipHandler.handle(GzipHandler.java:493)
   [junit4]   2> 	at org.eclipse.jetty.server.handler.HandlerWrapper.handle(HandlerWrapper.java:134)
   [junit4]   2> 	at org.eclipse.jetty.server.Server.handle(Server.java:534)
   [junit4]   2> 	at org.eclipse.jetty.server.HttpChannel.handle(HttpChannel.java:320)
   [junit4]   2> 	at org.eclipse.jetty.server.HttpConnection.onFillable(HttpConnection.java:251)
   [junit4]   2> 	at org.eclipse.jetty.io.AbstractConnection$ReadCallback.succeeded(AbstractConnection.java:283)
   [junit4]   2> 	at org.eclipse.jetty.io.FillInterest.fillable(FillInterest.java:108)
   [junit4]   2> 	at org.eclipse.jetty.io.SelectChannelEndPoint$2.run(SelectChannelEndPoint.java:93)
   [junit4]   2> 	at org.eclipse.jetty.util.thread.strategy.ExecuteProduceConsume.executeProduceConsume(ExecuteProduceConsume.java:303)
   [junit4]   2> 	at org.eclipse.jetty.util.thread.strategy.ExecuteProduceConsume.produceConsume(ExecuteProduceConsume.java:148)
   [junit4]   2> 	at org.eclipse.jetty.util.thread.strategy.ExecuteProduceConsume.run(ExecuteProduceConsume.java:136)
   [junit4]   2> 	at org.eclipse.jetty.util.thread.QueuedThreadPool.runJob(QueuedThreadPool.java:671)
   [junit4]   2> 	at org.eclipse.jetty.util.thread.QueuedThreadPool$2.run(QueuedThreadPool.java:589)
   [junit4]   2> 	at java.lang.Thread.run(Thread.java:748)
   [junit4]   2> 3167805 WARN  (qtp1375888285-25903) [    ] o.e.j.s.ServletHandler /solr/admin/collections
   [junit4]   2> org.apache.solr.common.SolrException: Error during request authentication, 
   [junit4]   2> 	at org.apache.solr.servlet.SolrDispatchFilter.authenticateRequest(SolrDispatchFilter.java:457)
   [junit4]   2> 	at org.apache.solr.servlet.SolrDispatchFilter.doFilter(SolrDispatchFilter.java:347)
   [junit4]   2> 	at org.apache.solr.servlet.SolrDispatchFilter.doFilter(SolrDispatchFilter.java:326)
   [junit4]   2> 	at org.eclipse.jetty.servlet.ServletHandler$CachedChain.doFilter(ServletHandler.java:1759)
   [junit4]   2> 	at org.apache.solr.client.solrj.embedded.JettySolrRunner$DebugFilter.doFilter(JettySolrRunner.java:139)
   [junit4]   2> 	at org.eclipse.jetty.servlet.ServletHandler$CachedChain.doFilter(ServletHandler.java:1759)
   [junit4]   2> 	at org.eclipse.jetty.servlet.ServletHandler.doHandle(ServletHandler.java:582)
   [junit4]   2> 	at org.eclipse.jetty.server.session.SessionHandler.doHandle(SessionHandler.java:224)
   [junit4]   2> 	at org.eclipse.jetty.server.handler.ContextHandler.doHandle(ContextHandler.java:1180)
   [junit4]   2> 	at org.eclipse.jetty.servlet.ServletHandler.doScope(ServletHandler.java:512)
   [junit4]   2> 	at org.eclipse.jetty.server.session.SessionHandler.doScope(SessionHandler.java:185)
   [junit4]   2> 	at org.eclipse.jetty.server.handler.ContextHandler.doScope(ContextHandler.java:1112)
   [junit4]   2> 	at org.eclipse.jetty.server.handler.ScopedHandler.handle(ScopedHandler.java:141)
   [junit4]   2> 	at org.eclipse.jetty.server.handler.gzip.GzipHandler.handle(GzipHandler.java:493)
   [junit4]   2> 	at org.eclipse.jetty.server.handler.HandlerWrapper.handle(HandlerWrapper.java:134)
   [junit4]   2> 	at org.eclipse.jetty.server.Server.handle(Server.java:534)
   [junit4]   2> 	at org.eclipse.jetty.server.HttpChannel.handle(HttpChannel.java:320)
   [junit4]   2> 	at org.eclipse.jetty.server.HttpConnection.onFillable(HttpConnection.java:251)
   [junit4]   2> 	at org.eclipse.jetty.io.AbstractConnection$ReadCallback.succeeded(AbstractConnection.java:283)
   [junit4]   2> 	at org.eclipse.jetty.io.FillInterest.fillable(FillInterest.java:108)
   [junit4]   2> 	at org.eclipse.jetty.io.SelectChannelEndPoint$2.run(SelectChannelEndPoint.java:93)
   [junit4]   2> 	at org.eclipse.jetty.util.thread.strategy.ExecuteProduceConsume.executeProduceConsume(ExecuteProduceConsume.java:303)
   [junit4]   2> 	at org.eclipse.jetty.util.thread.strategy.ExecuteProduceConsume.produceConsume(ExecuteProduceConsume.java:148)
   [junit4]   2> 	at org.eclipse.jetty.util.thread.strategy.ExecuteProduceConsume.run(ExecuteProduceConsume.java:136)
   [junit4]   2> 	at org.eclipse.jetty.util.thread.QueuedThreadPool.runJob(QueuedThreadPool.java:671)
   [junit4]   2> 	at org.eclipse.jetty.util.thread.QueuedThreadPool$2.run(QueuedThreadPool.java:589)
   [junit4]   2> 	at java.lang.Thread.run(Thread.java:748)
   [junit4]   2> Caused by: java.lang.IllegalArgumentException: userName is NULL, empty or contains a '&'
   [junit4]   2> 	at org.apache.hadoop.security.authentication.util.AuthToken.checkForIllegalArgument(AuthToken.java:87)
   [junit4]   2> 	at org.apache.hadoop.security.authentication.util.AuthToken.<init>(AuthToken.java:70)
   [junit4]   2> 	at org.apache.hadoop.security.authentication.server.AuthenticationToken.<init>(AuthenticationToken.java:58)
   [junit4]   2> 	at org.apache.solr.security.HttpParamDelegationTokenPlugin$HttpParamDelegationTokenAuthenticationHandler$HttpParamAuthenticationHandler.authenticate(HttpParamDelegationTokenPlugin.java:213)
   [junit4]   2> 	at org.apache.hadoop.security.token.delegation.web.DelegationTokenAuthenticationHandler.authenticate(DelegationTokenAuthenticationHandler.java:348)
   [junit4]   2> 	at org.apache.solr.security.RequestContinuesRecorderAuthenticationHandler.authenticate(RequestContinuesRecorderAuthenticationHandler.java:69)
   [junit4]   2> 	at org.apache.hadoop.security.authentication.server.AuthenticationFilter.doFilter(AuthenticationFilter.java:518)
   [junit4]   2> 	at org.apache.solr.security.DelegationTokenKerberosFilter.doFilter(DelegationTokenKerberosFilter.java:134)
   [junit4]   2> 	at org.apache.solr.security.HttpParamDelegationTokenPlugin$HttpParamToRequestFilter.doFilter(HttpParamDelegationTokenPlugin.java:245)
   [junit4]   2> 	at org.apache.solr.security.KerberosPlugin.doAuthenticate(KerberosPlugin.java:243)
   [junit4]   2> 	at org.apache.solr.servlet.SolrDispatchFilter.authenticateRequest(SolrDispatchFilter.java:451)
   [junit4]   2> 	... 26 more
   [junit4]   2> 3167810 INFO  (TEST-TestSolrCloudWithSecureImpersonation.testProxyNullProxyUser-seed#[6595348457A40AF6]) [    ] o.a.s.SolrTestCaseJ4 ###Ending testProxyNullProxyUser
   [junit4]   2> 3167988 INFO  (TEST-TestSolrCloudWithSecureImpersonation.testForwarding-seed#[6595348457A40AF6]) [    ] o.a.s.SolrTestCaseJ4 ###Starting testForwarding
   [junit4]   2> 3168559 INFO  (TEST-TestSolrCloudWithSecureImpersonation.testForwarding-seed#[6595348457A40AF6]) [    ] o.a.s.c.c.ZkStateReader Updated live nodes from ZooKeeper... (0) -> (2)
   [junit4]   2> 3168560 INFO  (TEST-TestSolrCloudWithSecureImpersonation.testForwarding-seed#[6595348457A40AF6]) [    ] o.a.s.c.s.i.ZkClientClusterStateProvider Cluster at 127.0.0.1:57299/solr ready
   [junit4]   2> 3168561 INFO  (qtp1375888285-25898) [n:127.0.0.1:58171_solr    ] o.a.s.h.a.CollectionsHandler Invoked Collection Action :create with params pullReplicas=0&replicationFactor=1&collection.configName=conf1&maxShardsPerNode=1&name=forwardingCollection&nrtReplicas=1&action=CREATE&numShards=1&tlogReplicas=0&wt=javabin&version=2 and sendToOCPQueue=true
   [junit4]   2> 3168564 INFO  (OverseerThreadFactory-10930-thread-1-processing-n:127.0.0.1:35132_solr) [n:127.0.0.1:35132_solr    ] o.a.s.c.CreateCollectionCmd Create collection forwardingCollection
   [junit4]   2> 3168683 INFO  (OverseerStateUpdate-98813064370454534-127.0.0.1:35132_solr-n_0000000000) [n:127.0.0.1:35132_solr    ] o.a.s.c.o.SliceMutator createReplica() {
   [junit4]   2>   "operation":"ADDREPLICA",
   [junit4]   2>   "collection":"forwardingCollection",
   [junit4]   2>   "shard":"shard1",
   [junit4]   2>   "core":"forwardingCollection_shard1_replica_n1",
   [junit4]   2>   "state":"down",
   [junit4]   2>   "base_url":"http://127.0.0.1:35132/solr",
   [junit4]   2>   "type":"NRT"} 
   [junit4]   2> 3168889 INFO  (qtp1599324119-25904) [n:127.0.0.1:35132_solr    ] o.a.s.h.a.CoreAdminOperation core create command qt=/admin/cores&coreNodeName=core_node2&collection.configName=conf1&newCollection=true&name=forwardingCollection_shard1_replica_n1&action=CREATE&numShards=1&collection=forwardingCollection&shard=shard1&wt=javabin&version=2&replicaType=NRT
   [junit4]   2> 3168890 INFO  (qtp1599324119-25904) [n:127.0.0.1:35132_solr    ] o.a.s.c.TransientSolrCoreCacheDefault Allocating transient cache for 2147483647 transient cores
   [junit4]   2> 3169002 INFO  (zkCallback-3404-thread-2-processing-n:127.0.0.1:35132_solr) [n:127.0.0.1:35132_solr    ] o.a.s.c.c.ZkStateReader A cluster state change: [WatchedEvent state:SyncConnected type:NodeDataChanged path:/collections/forwardingCollection/state.json] for collection [forwardingCollection] has occurred - updating... (live nodes size: [2])
   [junit4]   2> 3169002 INFO  (zkCallback-3404-thread-1-processing-n:127.0.0.1:35132_solr) [n:127.0.0.1:35132_solr    ] o.a.s.c.c.ZkStateReader A cluster state change: [WatchedEvent state:SyncConnected type:NodeDataChanged path:/collections/forwardingCollection/state.json] for collection [forwardingCollection] has occurred - updating... (live nodes size: [2])
   [junit4]   2> 3169933 INFO  (qtp1599324119-25904) [n:127.0.0.1:35132_solr c:forwardingCollection s:shard1 r:core_node2 x:forwardingCollection_shard1_replica_n1] o.a.s.c.SolrConfig Using Lucene MatchVersion: 8.0.0
   [junit4]   2> 3169959 INFO  (qtp1599324119-25904) [n:127.0.0.1:35132_solr c:forwardingCollection s:shard1 r:core_node2 x:forwardingCollection_shard1_replica_n1] o.a.s.s.IndexSchema [forwardingCollection_shard1_replica_n1] Schema name=test
   [junit4]   2> 3170045 INFO  (qtp1599324119-25904) [n:127.0.0.1:35132_solr c:forwardingCollection s:shard1 r:core_node2 x:forwardingCollection_shard1_replica_n1] o.a.s.s.IndexSchema Loaded schema test/1.0 with uniqueid field id
   [junit4]   2> 3170063 INFO  (qtp1599324119-25904) [n:127.0.0.1:35132_solr c:forwardingCollection s:shard1 r:core_node2 x:forwardingCollection_shard1_replica_n1] o.a.s.c.CoreContainer Creating SolrCore 'forwardingCollection_shard1_replica_n1' using configuration from collection forwardingCollection, trusted=true
   [junit4]   2> 3170063 INFO  (qtp1599324119-25904) [n:127.0.0.1:35132_solr c:forwardingCollection s:shard1 r:core_node2 x:forwardingCollection_shard1_replica_n1] o.a.s.m.r.SolrJmxReporter JMX monitoring for 'solr_35132.solr.core.forwardingCollection.shard1.replica_n1' (registry 'solr.core.forwardingCollection.shard1.replica_n1') enabled at server: com.sun.jmx.mbeanserver.JmxMBeanServer@22fe79fe
   [junit4]   2> 3170064 INFO  (qtp1599324119-25904) [n:127.0.0.1:35132_solr c:forwardingCollection s:shard1 r:core_node2 x:forwardingCollection_shard1_replica_n1] o.a.s.c.SolrCore solr.RecoveryStrategy.Builder
   [junit4]   2> 3170064 INFO  (qtp1599324119-25904) [n:127.0.0.1:35132_solr c:forwardingCollection s:shard1 r:core_node2 x:forwardingCollection_shard1_replica_n1] o.a.s.c.SolrCore [[forwardingCollection_shard1_replica_n1] ] Opening new SolrCore at [/export/home/jenkins/workspace/Lucene-Solr-master-Solaris/solr/build/solr-core/test/J0/temp/solr.cloud.TestSolrCloudWithSecureImpersonation_6595348457A40AF6-001/tempDir-001/node2/forwardingCollection_shard1_replica_n1], dataDir=[/export/home/jenkins/workspace/Lucene-Solr-master-Solaris/solr/build/solr-core/test/J0/temp/solr.cloud.TestSolrCloudWithSecureImpersonation_6595348457A40AF6-001/tempDir-001/node2/./forwardingCollection_shard1_replica_n1/data/]
   [junit4]   2> 3170065 INFO  (qtp1599324119-25904) [n:127.0.0.1:35132_solr c:forwardingCollection s:shard1 r:core_node2 x:forwardingCollection_shard1_replica_n1] o.a.s.u.RandomMergePolicy RandomMergePolicy wrapping class org.apache.lucene.index.LogByteSizeMergePolicy: [LogByteSizeMergePolicy: minMergeSize=1677721, mergeFactor=29, maxMergeSize=2147483648, maxMergeSizeForForcedMerge=9223372036854775807, calibrateSizeByDeletes=true, maxMergeDocs=2147483647, maxCFSSegmentSizeMB=8.796093022207999E12, noCFSRatio=1.0]
   [junit4]   2> 3170112 INFO  (qtp1599324119-25904) [n:127.0.0.1:35132_solr c:forwardingCollection s:shard1 r:core_node2 x:forwardingCollection_shard1_replica_n1] o.a.s.u.UpdateHandler Using UpdateLog implementation: org.apache.solr.update.UpdateLog
   [junit4]   2> 3170112 INFO  (qtp1599324119-25904) [n:127.0.0.1:35132_solr c:forwardingCollection s:shard1 r:core_node2 x:forwardingCollection_shard1_replica_n1] o.a.s.u.UpdateLog Initializing UpdateLog: dataDir= defaultSyncLevel=FLUSH numRecordsToKeep=100 maxNumLogsToKeep=10 numVersionBuckets=65536
   [junit4]   2> 3170114 INFO  (qtp1599324119-25904) [n:127.0.0.1:35132_solr c:forwardingCollection s:shard1 r:core_node2 x:forwardingCollection_shard1_replica_n1] o.a.s.u.CommitTracker Hard AutoCommit: disabled
   [junit4]   2> 3170114 INFO  (qtp1599324119-25904) [n:127.0.0.1:35132_solr c:forwardingCollection s:shard1 r:core_node2 x:forwardingCollection_shard1_replica_n1] o.a.s.u.CommitTracker Soft AutoCommit: disabled
   [junit4]   2> 3170115 INFO  (qtp1599324119-25904) [n:127.0.0.1:35132_solr c:forwardingCollection s:shard1 r:core_node2 x:forwardingCollection_shard1_replica_n1] o.a.s.u.RandomMergePolicy RandomMergePolicy wrapping class org.apache.lucene.index.LogByteSizeMergePolicy: [LogByteSizeMergePolicy: minMergeSize=1677721, mergeFactor=38, maxMergeSize=2147483648, maxMergeSizeForForcedMerge=9223372036854775807, calibrateSizeByDeletes=false, maxMergeDocs=2147483647, maxCFSSegmentSizeMB=8.796093022207999E12, noCFSRatio=0.0]
   [junit4]   2> 3170115 INFO  (qtp1599324119-25904) [n:127.0.0.1:35132_solr c:forwardingCollection s:shard1 r:core_node2 x:forwardingCollection_shard1_replica_n1] o.a.s.s.SolrIndexSearcher Opening [Searcher@342670ec[forwardingCollection_shard1_replica_n1] main]
   [junit4]   2> 3170116 INFO  (qtp1599324119-25904) [n:127.0.0.1:35132_solr c:forwardingCollection s:shard1 r:core_node2 x:forwardingCollection_shard1_replica_n1] o.a.s.h.c.SpellCheckComponent Initializing spell checkers
   [junit4]   2> 3170122 INFO  (qtp1599324119-25904) [n:127.0.0.1:35132_solr c:forwardingCollection s:shard1 r:core_node2 x:forwardingCollection_shard1_replica_n1] o.a.s.s.DirectSolrSpellChecker init: {name=direct,classname=DirectSolrSpellChecker,field=lowerfilt,minQueryLength=3}
   [junit4]   2> 3170136 INFO  (qtp1599324119-25904) [n:127.0.0.1:35132_solr c:forwardingCollection s:shard1 r:core_node2 x:forwardingCollection_shard1_replica_n1] o.a.s.h.ReplicationHandler Commits will be reserved for 10000ms.
   [junit4]   2> 3170136 INFO  (qtp1599324119-25904) [n:127.0.0.1:35132_solr c:forwardingCollection s:shard1 r:core_node2 x:forwardingCollection_shard1_replica_n1] o.a.s.u.UpdateLog Could not find max version in index or recent updates, using new clock 1581009034114236416
   [junit4]   2> 3170136 INFO  (searcherExecutor-10935-thread-1-processing-n:127.0.0.1:35132_solr x:forwardingCollection_shard1_replica_n1 s:shard1 c:forwardingCollection r:core_node2) [n:127.0.0.1:35132_solr c:forwardingCollection s:shard1 r:core_node2 x:forwardingCollection_shard1_replica_n1] o.a.s.h.c.SpellCheckComponent Loading spell index for spellchecker: default
   [junit4]   2> 3170142 INFO  (searcherExecutor-10935-thread-1-processing-n:127.0.0.1:35132_solr x:forwardingCollection_shard1_replica_n1 s:shard1 c:forwardingCollection r:core_node2) [n:127.0.0.1:35132_solr c:forwardingCollection s:shard1 r:core_node2 x:forwardingCollection_shard1_replica_n1] o.a.s.h.c.SpellCheckComponent Loading spell index for spellchecker: direct
   [junit4]   2> 3170142 INFO  (searcherExecutor-10935-thread-1-processing-n:127.0.0.1:35132_solr x:forwardingCollection_shard1_replica_n1 s:shard1 c:forwardingCollection r:core_node2) [n:127.0.0.1:35132_solr c:forwardingCollection s:shard1 r:core_node2 x:forwardingCollection_shard1_replica_n1] o.a.s.h.c.SpellCheckComponent Loading spell index for spellchecker: wordbreak
   [junit4]   2> 3170142 INFO  (searcherExecutor-10935-thread-1-processing-n:127.0.0.1:35132_solr x:forwardingCollection_shard1_replica_n1 s:shard1 c:forwardingCollection r:core_node2) [n:127.0.0.1:35132_solr c:forwardingCollection s:shard1 r:core_node2 x:forwardingCollection_shard1_replica_n1] o.a.s.h.c.SpellCheckComponent Loading spell index for spellchecker: multipleFields
   [junit4]   2> 3170142 INFO  (searcherExecutor-10935-thread-1-processing-n:127.0.0.1:35132_solr x:forwardingCollection_shard1_replica_n1 s:shard1 c:forwardingCollection r:core_node2) [n:127.0.0.1:35132_solr c:forwardingCollection s:shard1 r:core_node2 x:forwardingCollection_shard1_replica_n1] o.a.s.h.c.SpellCheckComponent Loading spell index for spellchecker: jarowinkler
   [junit4]   2> 3170143 INFO  (searcherExecutor-10935-thread-1-processing-n:127.0.0.1:35132_solr x:forwardingCollection_shard1_replica_n1 s:shard1 c:forwardingCollection r:core_node2) [n:127.0.0.1:35132_solr c:forwardingCollection s:shard1 r:core_node2 x:forwardingCollection_shard1_replica_n1] o.a.s.h.c.SpellCheckComponent Loading spell index for spellchecker: external
   [junit4]   2> 3170143 INFO  (searcherExecutor-10935-thread-1-processing-n:127.0.0.1:35132_solr x:forwardingCollection_shard1_replica_n1 s:shard1 c:forwardingCollection r:core_node2) [n:127.0.0.1:35132_solr c:forwardingCollection s:shard1 r:core_node2 x:forwardingCollection_shard1_replica_n1] o.a.s.h.c.SpellCheckComponent Loading spell index for spellchecker: freq
   [junit4]   2> 3170144 INFO  (searcherExecutor-10935-thread-1-processing-n:127.0.0.1:35132_solr x:forwardingCollection_shard1_replica_n1 s:shard1 c:forwardingCollection r:core_node2) [n:127.0.0.1:35132_solr c:forwardingCollection s:shard1 r:core_node2 x:forwardingCollection_shard1_replica_n1] o.a.s.h.c.SpellCheckComponent Loading spell index for spellchecker: fqcn
   [junit4]   2> 3170144 INFO  (searcherExecutor-10935-thread-1-processing-n:127.0.0.1:35132_solr x:forwardingCollection_shard1_replica_n1 s:shard1 c:forwardingCollection r:core_node2) [n:127.0.0.1:35132_solr c:forwardingCollection s:shard1 r:core_node2 x:forwardingCollection_shard1_replica_n1] o.a.s.h.c.SpellCheckComponent Loading spell index for spellchecker: perDict
   [junit4]   2> 3170145 INFO  (searcherExecutor-10935-thread-1-processing-n:127.0.0.1:35132_solr x:forwardingCollection_shard1_replica_n1 s:shard1 c:forwardingCollection r:core_node2) [n:127.0.0.1:35132_solr c:forwardingCollection s:shard1 r:core_node2 x:forwardingCollection_shard1_replica_n1] o.a.s.c.SolrCore [forwardingCollection_shard1_replica_n1] Registered new searcher Searcher@342670ec[forwardingCollection_shard1_replica_n1] main{ExitableDirectoryReader(UninvertingDirectoryReader())}
   [junit4]   2> 3170147 INFO  (qtp1599324119-25904) [n:127.0.0.1:35132_solr c:forwardingCollection s:shard1 r:core_node2 x:forwardingCollection_shard1_replica_n1] o.a.s.c.ShardLeaderElectionContext Enough replicas found to continue.
   [junit4]   2> 3170147 INFO  (qtp1599324119-25904) [n:127.0.0.1:35132_solr c:forwardingCollection s:shard1 r:core_node2 x:forwardingCollection_shard1_replica_n1] o.a.s.c.ShardLeaderElectionContext I may be the new leader - try and sync
   [junit4]   2> 3170147 INFO  (qtp1599324119-25904) [n:127.0.0.1:35132_solr c:forwardingCollection s:shard1 r:core_node2 x:forwardingCollection_shard1_replica_n1] o.a.s.c.SyncStrategy Sync replicas to http://127.0.0.1:35132/solr/forwardingCollection_shard1_replica_n1/
   [junit4]   2> 3170147 INFO  (qtp1599324119-25904) [n:127.0.0.1:35132_solr c:forwardingCollection s:shard1 r:core_node2 x:forwardingCollection_shard1_replica_n1] o.a.s.c.SyncStrategy Sync Success - now sync replicas to me
   [junit4]   2> 3170147 INFO  (qtp1599324119-25904) [n:127.0.0.1:35132_solr c:forwardingCollection s:shard1 r:core_node2 x:forwardingCollection_shard1_replica_n1] o.a.s.c.SyncStrategy http://127.0.0.1:35132/solr/forwardingCollection_shard1_replica_n1/ has no replicas
   [junit4]   2> 3170147 INFO  (qtp1599324119-25904) [n:127.0.0.1:35132_solr c:forwardingCollection s:shard1 r:core_node2 x:forwardingCollection_shard1_replica_n1] o.a.s.c.ShardLeaderElectionContext Found all replicas participating in election, clear LIR
   [junit4]   2> 3170152 INFO  (qtp1599324119-25904) [n:127.0.0.1:35132_solr c:forwardingCollection s:shard1 r:core_node2 x:forwardingCollection_shard1_replica_n1] o.a.s.c.ShardLeaderElectionContext I am the new leader: http://127.0.0.1:35132/solr/forwardingCollection_shard1_replica_n1/ shard1
   [junit4]   2> 3170256 INFO  (zkCallback-3404-thread-2-processing-n:127.0.0.1:35132_solr) [n:127.0.0.1:35132_solr    ] o.a.s.c.c.ZkStateReader A cluster state change: [WatchedEvent state:SyncConnected type:NodeDataChanged path:/collections/forwardingCollection/state.json] for collection [forwardingCollection] has occurred - updating... (live nodes size: [2])
   [junit4]   2> 3170256 INFO  (zkCallback-3404-thread-1-processing-n:127.0.0.1:35132_solr) [n:127.0.0.1:35132_solr    ] o.a.s.c.c.ZkStateReader A cluster state change: [WatchedEvent state:SyncConnected type:NodeDataChanged path:/collections/forwardingCollection/state.json] for collection [forwardingCollection] has occurred - updating... (live nodes size: [2])
   [junit4]   2> 3170305 INFO  (qtp1599324119-25904) [n:127.0.0.1:35132_solr c:forwardingCollection s:shard1 r:core_node2 x:forwardingCollection_shard1_replica_n1] o.a.s.c.ZkController I am the leader, no recovery necessary
   [junit4]   2> 3170309 INFO  (qtp1599324119-25904) [n:127.0.0.1:35132_solr c:forwardingCollection s:shard1 r:core_node2 x:forwardingCollection_shard1_replica_n1] o.a.s.s.HttpSolrCall [admin] webapp=null path=/admin/cores params={qt=/admin/cores&coreNodeName=core_node2&collection.configName=conf1&newCollection=true&name=forwardingCollection_shard1_replica_n1&action=CREATE&numShards=1&collection=forwardingCollection&shard=shard1&wt=javabin&version=2&replicaType=NRT} status=0 QTime=1420
   [junit4]   2> 3170310 WARN  (httpShardExecutor-10926-thread-1-processing-n:127.0.0.1:35132_solr [http:////127.0.0.1:35132//solr] http:////127.0.0.1:35132//solr) [n:127.0.0.1:35132_solr    ] o.a.h.c.p.ResponseProcessCookies Invalid cookie header: "Set-Cookie: hadoop.auth="u=$&p=$&t=test&e=1507803708593&s=2rBy99Pf4kGvmyMm9TC9YrPHmms="; Path=/; Domain=127.0.0.1; Expires= , 12-   -2017 10:21:48 GMT; HttpOnly". Invalid 'expires' attribute: , 12- -2017 10:21:48 GMT
   [junit4]   2> 3170319 INFO  (qtp1375888285-25898) [n:127.0.0.1:58171_solr    ] o.a.s.h.a.CollectionsHandler Wait for new collection to be active for at most 30 seconds. Check all shard replicas
   [junit4]   2> 3170426 INFO  (zkCallback-3404-thread-1-processing-n:127.0.0.1:35132_solr) [n:127.0.0.1:35132_solr    ] o.a.s.c.c.ZkStateReader A cluster state change: [WatchedEvent state:SyncConnected type:NodeDataChanged path:/collections/forwardingCollection/state.json] for collection [forwardingCollection] has occurred - updating... (live nodes size: [2])
   [junit4]   2> 3170426 INFO  (zkCallback-3404-thread-2-processing-n:127.0.0.1:35132_solr) [n:127.0.0.1:35132_solr    ] o.a.s.c.c.ZkStateReader A cluster state change: [WatchedEvent state:SyncConnected type:NodeDataChanged path:/collections/forwardingCollection/state.json] for collection [forwardingCollection] has occurred - updating... (live nodes size: [2])
   [junit4]   2> 3170572 INFO  (OverseerCollectionConfigSetProcessor-98813064370454534-127.0.0.1:35132_solr-n_0000000000) [n:127.0.0.1:35132_solr    ] o.a.s.c.OverseerTaskQueue Response ZK path: /overseer/collection-queue-work/qnr-0000000000 doesn't exist.  Requestor may have disconnected from ZooKeeper
   [junit4]   2> 3171322 INFO  (qtp1375888285-25898) [n:127.0.0.1:58171_solr    ] o.a.s.s.HttpSolrCall [admin] webapp=null path=/admin/collections params={pullReplicas=0&replicationFactor=1&collection.configName=conf1&maxShardsPerNode=1&name=forwardingCollection&nrtReplicas=1&action=CREATE&numShards=1&tlogReplicas=0&wt=javabin&version=2} status=0 QTime=2761
   [junit4]   2> 3171323 WARN  (TEST-TestSolrCloudWithSecureImpersonation.testForwarding-seed#[6595348457A40AF6]) [    ] o.a.h.c.p.ResponseProcessCookies Invalid cookie header: "Set-Cookie: hadoop.auth="u=user&p=user&t=test&e=1507803708266&s=lr3lQyRxcpZpUQGWXDMAA8N51nU="; Path=/; Domain=127.0.0.1; Expires= , 12-   -2017 10:21:48 GMT; HttpOnly". Invalid 'expires' attribute: , 12- -2017 10:21:48 GMT
   [junit4]   2> 3171323 INFO  (TEST-TestSolrCloudWithSecureImpersonation.testForwarding-seed#[6595348457A40AF6]) [    ] o.a.s.c.AbstractDistribZkTestBase Wait for recoveries to finish - collection: forwardingCollection failOnTimeout:true timeout (sec):100
   [junit4]   2> 3171325 INFO  (TEST-TestSolrCloudWithSecureImpersonation.testForwarding-seed#[6595348457A40AF6]) [    ] o.a.s.c.AbstractDistribZkTestBase Recoveries finished - collection: forwardingCollection
   [junit4]   2> 3171329 INFO  (qtp1375888285-25900) [n:127.0.0.1:58171_solr    ] o.a.s.c.TransientSolrCoreCacheDefault Allocating transient cache for 2147483647 transient cores
   [junit4]   2> 3171339 INFO  (qtp1599324119-25907) [n:127.0.0.1:35132_solr c:forwardingCollection s:shard1 r:core_node2 x:forwardingCollection_shard1_replica_n1] o.a.s.c.S.Request [forwardingCollection_shard1_replica_n1]  webapp=/solr path=/select params={q=*:*&wt=javabin&version=2} hits=0 status=0 QTime=0
   [junit4]   2> 3171340 WARN  (qtp1375888285-25900) [n:127.0.0.1:58171_solr    ] o.a.h.c.p.ResponseProcessCookies Invalid cookie header: "Set-Cookie: hadoop.auth="u=$&p=$&t=test&e=1507803711038&s=/nKdkQIn0CLzBX49Poni4ZLdyZQ="; Path=/; Domain=127.0.0.1; Expires= , 12-   -2017 10:21:51 GMT; HttpOnly". Invalid 'expires' attribute: , 12- -2017 10:21:51 GMT
   [junit4]   2> 3171341 WARN  (TEST-TestSolrCloudWithSecureImpersonation.testForwarding-seed#[6595348457A40AF6]) [    ] o.a.h.c.p.ResponseProcessCookies Invalid cookie header: "Set-Cookie: hadoop.auth="u=user&p=user&t=test&e=1507803711033&s=uTXL+2HhFmlyGcOQHRysLhidnJA="; Path=/; Domain=127.0.0.1; Expires= , 12-   -2017 10:21:51 GMT; HttpOnly". Invalid 'expires' attribute: , 12- -2017 10:21:51 GMT
   [junit4]   2> 3171341 WARN  (TEST-TestSolrCloudWithSecureImpersonation.testForwarding-seed#[6595348457A40AF6]) [    ] o.a.h.c.p.ResponseProcessCookies Invalid cookie header: "Set-Cookie: hadoop.auth="u=$&p=$&t=test&e=1507803711038&s=/nKdkQIn0CLzBX49Poni4ZLdyZQ="; Path=/; Domain=127.0.0.1; Expires= , 12-   -2017 10:21:51 GMT; HttpOnly". Invalid 'expires' attribute: , 12- -2017 10:21:51 GMT
   [junit4]   2> 3171346 INFO  (qtp1599324119-25908) [n:127.0.0.1:35132_solr c:forwardingCollection s:shard1 r:core_node2 x:forwardingCollection_shard1_replica_n1] o.a.s.c.S.Request [forwardingCollection_shard1_replica_n1]  webapp=/solr path=/select params={q=*:*&wt=javabin&version=2} hits=0 status=0 QTime=0
   [junit4]   2> 3171346 WARN  (TEST-TestSolrCloudWithSecureImpersonation.testForwarding-seed#[6595348457A40AF6]) [    ] o.a.h.c.p.ResponseProcessCookies Invalid cookie header: "Set-Cookie: hadoop.auth="u=user&p=user&t=test&e=1507803711050&s=dbdSMnyT+46Nbi2JOqPBEmlFxqE="; Path=/; Domain=127.0.0.1; Expires= , 12-   -2017 10:21:51 GMT; HttpOnly". Invalid 'expires' attribute: , 12- -2017 10:21:51 GMT
   [junit4]   2> 3171347 INFO  (TEST-TestSolrCloudWithSecureImpersonation.testForwarding-seed#[6595348457A40AF6]) [    ] o.a.s.SolrTestCaseJ4 ###Ending testForwarding
   [junit4]   2> 3171577 INFO  (TEST-TestSolrCloudWithSecureImpersonation.testProxyUnknownRemote-seed#[6595348457A40AF6]) [    ] o.a.s.SolrTestCaseJ4 ###Starting testProxyUnknownRemote
   [junit4]   2> 3181802 WARN  (TEST-TestSolrCloudWithSecureImpersonation.testForwarding-seed#[6595348457A40AF6]-SendThread(127.0.0.1:57299)) [    ] o.a.z.ClientCnxn Client session timed out, have not heard from server in 10478ms for sessionid 0x15f0df560f8000b
   [junit4]   2> 3181802 WARN  (jetty-launcher-3392-thread-1-SendThread(127.0.0.1:57299)) [n:127.0.0.1:58171_solr    ] o.a.z.ClientCnxn Client session timed out, have not heard from server in 15260ms for sessionid 0x15f0df560f80007
   [junit4]   2> 3181802 WARN  (jetty-launcher-3392-thread-2-SendThread(127.0.0.1:57299)) [n:127.0.0.1:35132_solr    ] o.a.z.ClientCnxn Client session timed out, have not heard from server in 15261ms for sessionid 0x15f0df560f80008
   [junit4]   2> 3181803 WARN  (NIOServerCxn.Factory:0.0.0.0/0.0.0.0:0) [    ] o.a.z.s.NIOServerCnxn caught end of stream exception
   [junit4]   2> EndOfStreamException: Unable to read additional data from client sessionid 0x15f0df560f8000b, likely client has closed socket
   [junit4]   2> 	at org.apache.zookeeper.server.NIOServerCnxn.doIO(NIOServerCnxn.java:239)
   [junit4]   2> 	at org.apache.zookeeper.server.NIOServerCnxnFactory.run(NIOServerCnxnFactory.java:203)
   [junit4]   2> 	at java.lang.Thread.run(Thread.java:748)
   [junit4]   2> 3181803 WARN  (TEST-TestSolrCloudWithSecureImpersonation.testProxyUnknownRemote-seed#[6595348457A40AF6]) [    ] o.a.h.c.p.ResponseProcessCookies Invalid cookie header: "Set-Cookie: hadoop.auth="u=localHostAnyGroup&p=localHostAnyGroup&t=test&e=1507803711283&s=oJK0xymbl/w8GvdnEYHybXxJgGY="; Path=/; Domain=127.0.0.1; Expires= , 12-   -2017 10:21:51 GMT; HttpOnly". Invalid 'expires' attribute: , 12- -2017 10:21:51 GMT
   [junit4]   2> 3181804 WARN  (NIOServerCxn.Factory:0.0.0.0/0.0.0.0:0) [    ] o.a.z.s.NIOServerCnxn caught end of stream exception
   [junit4]   2> EndOfStreamException: Unable to read additional data from client sessionid 0x15f0df560f80007, likely client has closed socket
   [junit4]   2> 	at org.apache.zookeeper.server.NIOServerCnxn.doIO(NIOServerCnxn.java:239)
   [junit4]   2> 	at org.apache.zookeeper.server.NIOServerCnxnFactory.run(NIOServerCnxnFactory.java:203)
   [junit4]   2> 	at java.lang.Thread.run(Thread.java:748)
   [junit4]   2> 3181804 INFO  (TEST-TestSolrCloudWithSecureImpersonation.testProxyUnknownRemote-seed#[6595348457A40AF6]) [    ] o.a.s.SolrTestCaseJ4 ###Ending testProxyUnknownRemote
   [junit4]   2> 3181804 WARN  (NIOServerCxn.Factory:0.0.0.0/0.0.0.0:0) [    ] o.a.z.s.NIOServerCnxn caught end of stream exception
   [junit4]   2> EndOfStreamException: Unable to read additional data from client sessionid 0x15f0df560f80008, likely client has closed socket
   [junit4]   2> 	at org.apache.zookeeper.server.NIOServerCnxn.doIO(NIOServerCnxn.java:239)
   [junit4]   2> 	at org.apache.zookeeper.server.NIOServerCnxnFactory.run(NIOServerCnxnFactory.java:203)
   [junit4]   2> 	at java.lang.Thread.run(Thread.java:748)
   [junit4]   2> 3181904 INFO  (jetty-launcher-3392-thread-2-EventThread) [n:127.0.0.1:35132_solr    ] o.a.c.f.s.ConnectionStateManager State change: SUSPENDED
   [junit4]   2> 3181911 WARN  (zkCallback-3411-thread-1) [    ] o.a.s.c.c.ConnectionManager Watcher org.apache.solr.common.cloud.ConnectionManager@7e513c51 name: ZooKeeperConnection Watcher:127.0.0.1:57299/solr got event WatchedEvent state:Disconnected type:None path:null path: null type: None
   [junit4]   2> 3181911 WARN  (zkCallback-3411-thread-1) [    ] o.a.s.c.c.ConnectionManager zkClient has disconnected
   [junit4]   2> 3182041 INFO  (TEST-TestSolrCloudWithSecureImpersonation.testProxyValidateHost-seed#[6595348457A40AF6]) [    ] o.a.s.SolrTestCaseJ4 ###Starting testProxyValidateHost
   [junit4]   2> 3182041 INFO  (qtp1375888285-25894) [n:127.0.0.1:58171_solr    ] o.a.s.h.a.CollectionsHandler Invoked Collection Action :list with params doAs=bar&action=LIST&wt=javabin&version=2 and sendToOCPQueue=true
   [junit4]   2> 3182042 INFO  (qtp1375888285-25894) [n:127.0.0.1:58171_solr    ] o.a.s.s.HttpSolrCall [admin] webapp=null path=/admin/collections params={doAs=bar&action=LIST&wt=javabin&version=2} status=0 QTime=0
   [junit4]   2> 3182042 WARN  (TEST-TestSolrCloudWithSecureImpersonation.testProxyValidateHost-seed#[6595348457A40AF6]) [    ] o.a.h.c.p.ResponseProcessCookies Invalid cookie header: "Set-Cookie: hadoop.auth="u=localHostAnyGroup&p=localHostAnyGroup&t=test&e=1507803721746&s=QICa11bvUJkBieaI78WuI2CGK5c="; Path=/; Domain=127.0.0.1; Expires= , 12-   -2017 10:22:01 GMT; HttpOnly". Invalid 'expires' attribute: , 12- -2017 10:22:01 GMT
   [junit4]   2> 3182043 INFO  (TEST-TestSolrCloudWithSecureImpersonation.testProxyValidateHost-seed#[6595348457A40AF6]) [    ] o.a.s.SolrTestCaseJ4 ###Ending testProxyValidateHost
   [junit4]   2> 3182304 INFO  (TEST-TestSolrCloudWithSecureImpersonation.testProxyNoConfigHosts-seed#[6595348457A40AF6]) [    ] o.a.s.SolrTestCaseJ4 ###Starting testProxyNoConfigHosts
   [junit4]   2> 3182313 WARN  (TEST-TestSolrCloudWithSecureImpersonation.testProxyNoConfigHosts-seed#[6595348457A40AF6]) [    ] o.a.h.c.p.ResponseProcessCookies Invalid cookie header: "Set-Cookie: hadoop.auth="u=noHosts&p=noHosts&t=test&e=1507803722009&s=c8OEcQnrCy2iriZNXUa1mJ5cTB0="; Path=/; Domain=127.0.0.1; Expires= , 12-   -2017 10:22:02 GMT; HttpOnly". Invalid 'expires' attribute: , 12- -2017 10:22:02 GMT
   [junit4]   2> 3182314 INFO  (TEST-TestSolrCloudWithSecureImpersonation.testProxyNoConfigHosts-seed#[6595348457A40AF6]) [    ] o.a.s.SolrTestCaseJ4 ###Ending testProxyNoConfigHosts
   [junit4]   2> 3182580 INFO  (TEST-TestSolrCloudWithSecureImpersonation.testProxyWrongHost-seed#[6595348457A40AF6]) [    ] o.a.s.SolrTestCaseJ4 ###Starting testProxyWrongHost
   [junit4]   2> 3188754 WARN  (TEST-TestSolrCloudWithSecureImpersonation.testForwarding-seed#[6595348457A40AF6]-SendThread(127.0.0.1:57299)) [    ] o.a.z.ClientCnxn Unable to reconnect to ZooKeeper service, session 0x15f0df560f8000b has expired
   [junit4]   2> 3188754 WARN  (jetty-launcher-3392-thread-1-SendThread(127.0.0.1:57299)) [n:127.0.0.1:58171_solr    ] o.a.z.ClientCnxn Unable to reconnect to ZooKeeper service, session 0x15f0df560f80007 has expired
   [junit4]   2> 3188755 WARN  (jetty-launcher-3392-thread-2-SendThread(127.0.0.1:57299)) [n:127.0.0.1:35132_solr    ] o.a.z.ClientCnxn Unable to reconnect to ZooKeeper service, session 0x15f0df560f80008 has expired
   [junit4]   2> 3188755 WARN  (TEST-TestSolrCloudWithSecureImpersonation.testProxyWrongHost-seed#[6595348457A40AF6]) [    ] o.a.h.c.p.ResponseProcessCookies Invalid cookie header: "Set-Cookie: hadoop.auth="u=wrongHost&p=wrongHost&t=test&e=1507803722286&s=LnUOaSwkfTHj6ft6D+wJoEXwRIY="; Path=/; Domain=127.0.0.1; Expires= , 12-   -2017 10:22:02 GMT; HttpOnly". Invalid 'expires' attribute: , 12- -2017 10:22:02 GMT
   [junit4]   2> 3188755 INFO  (TEST-TestSolrCloudWithSecureImpersonation.testProxyWrongHost-seed#[6595348457A40AF6]) [    ] o.a.s.SolrTestCaseJ4 ###Ending testProxyWrongHost
   [junit4]   2> 3188755 WARN  (zkCallback-3411-thread-1) [    ] o.a.s.c.c.ConnectionManager Watcher org.apache.solr.common.cloud.ConnectionManager@7e513c51 name: ZooKeeperConnection Watcher:127.0.0.1:57299/solr got event WatchedEvent state:Expired type:None path:null path: null type: None
   [junit4]   2> 3188755 WARN  (zkCallback-3411-thread-1) [    ] o.a.s.c.c.ConnectionManager Our previous ZooKeeper session was expired. Attempting to reconnect to recover relationship with ZooKeeper...
   [junit4]   2> 3188756 WARN  (zkCallback-3411-thread-1) [    ] o.a.s.c.c.DefaultConnectionStrategy Connection expired - starting a new one...
   [junit4]   2> 3188875 INFO  (zkCallback-3411-thread-1) [    ] o.a.s.c.c.ConnectionManager Connection with ZooKeeper reestablished.
   [junit4]   2> 3188882 INFO  (zkCallback-3411-thread-1) [    ] o.a.s.c.c.DefaultConnectionStrategy Reconnected to ZooKeeper
   [junit4]   2> 3188882 INFO  (zkCallback-3411-thread-1) [    ] o.a.s.c.c.ConnectionManager Connected:true
   [junit4]   2> 3188996 INFO  (TEST-TestSolrCloudWithSecureImpersonation.testProxyInvalidProxyUser-seed#[6595348457A40AF6]) [    ] o.a.s.SolrTestCaseJ4 ###Starting testProxyInvalidProxyUser
   [junit4]   2> 3188999 WARN  (TEST-TestSolrCloudWithSecureImpersonation.testProxyInvalidProxyUser-seed#[6595348457A40AF6]) [    ] o.a.h.c.p.ResponseProcessCookies Invalid cookie header: "Set-Cookie: hadoop.auth="u=bar&p=bar&t=test&e=1507803728702&s=QDHXstmHp6BE3tQrTwdi5clS3Ck="; Path=/; Domain=127.0.0.1; Expires= , 12-   -2017 10:22:08 GMT; HttpOnly". Invalid 'expires' attribute: , 12- -2017 10:22:08 GMT
   [junit4]   2> 3188999 INFO  (TEST-TestSolrCloudWithSecureImpersonation.testProxyInvalidProxyUser-seed#[6595348457A40AF6]) [    ] o.a.s.SolrTestCaseJ4 ###Ending testProxyInvalidProxyUser
   [junit4]   2> 3189004 INFO  (jetty-closer-3393-thread-1) [    ] o.e.j.s.AbstractConnector Stopped ServerConnector@6b6dff6d{HTTP/1.1,[http/1.1]}{127.0.0.1:0}
   [junit4]   2> 3189004 INFO  (jetty-closer-3393-thread-1) [    ] o.a.s.c.CoreContainer Shutting down CoreContainer instance=289814715
   [junit4]   2> 3189005 INFO  (jetty-closer-3393-thread-2) [    ] o.e.j.s.AbstractConnector Stopped ServerConnector@60ba47e5{HTTP/1.1,[http/1.1]}{127.0.0.1:0}
   [junit4]   2> 3189005 INFO  (jetty-closer-3393-thread-2) [    ] o.a.s.c.CoreContainer Shutting down CoreContainer instance=681531175
   [junit4]   2> 3189005 INFO  (jetty-closer-3393-thread-1) [    ] o.a.s.m.SolrMetricManager Closing metric reporters for registry=solr.node, tag=null
   [junit4]   2> 3189005 INFO  (jetty-closer-3393-thread-1) [    ] o.a.s.m.r.SolrJmxReporter Closing reporter [org.apache.solr.metrics.reporters.SolrJmxReporter@4f690297: rootName = solr_58171, domain = solr.node, service url = null, agent id = null] for registry solr.node / com.codahale.metrics.MetricRegistry@12089103
   [junit4]   2> 3189005 INFO  (jetty-closer-3393-thread-2) [    ] o.a.s.m.SolrMetricManager Closing metric reporters for registry=solr.node, tag=null
   [junit4]   2> 3189005 INFO  (jetty-closer-3393-thread-2) [    ] o.a.s.m.r.SolrJmxReporter Closing reporter [org.apache.solr.metrics.reporters.SolrJmxReporter@3287a49b: rootName = solr_35132, domain = solr.node, service url = null, agent id = null] for registry solr.node / com.codahale.metrics.MetricRegistry@70971c17
   [junit4]   2> 3189011 INFO  (jetty-closer-3393-thread-1) [    ] o.a.s.m.SolrMetricManager Closing metric reporters for registry=solr.jvm, tag=null
   [junit4]   2> 3189011 INFO  (jetty-closer-3393-thread-1) [    ] o.a.s.m.r.SolrJmxReporter Closing reporter [org.apache.solr.metrics.reporters.SolrJmxReporter@67020445: rootName = solr_58171, domain = solr.jvm, service url = null, agent id = null] for registry solr.jvm / com.codahale.metrics.MetricRegistry@5e331ea
   [junit4]   2> 3189011 INFO  (jetty-closer-3393-thread-2) [    ] o.a.s.m.SolrMetricManager Closing metric reporters for registry=solr.jvm, tag=null
   [junit4]   2> 3189011 INFO  (jetty-closer-3393-thread-2) [    ] o.a.s.m.r.SolrJmxReporter Closing reporter [org.apache.solr.metrics.reporters.SolrJmxReporter@1482adff: rootName = solr_35132, domain = solr.jvm, service url = null, agent id = null] for registry solr.jvm / com.codahale.metrics.MetricRegistry@5e331ea
   [junit4]   2> 3189014 INFO  (jetty-closer-3393-thread-1) [    ] o.a.s.m.SolrMetricManager Closing metric reporters for registry=solr.jetty, tag=null
   [junit4]   2> 3189014 INFO  (jetty-closer-3393-thread-1) [    ] o.a.s.m.r.SolrJmxReporter Closing reporter [org.apache.solr.metrics.reporters.SolrJmxReporter@50e6d66e: rootName = solr_58171, domain = solr.jetty, service url = null, agent id = null] for registry solr.jetty / com.codahale.metrics.MetricRegistry@7ec7a195
   [junit4]   2> 3189015 INFO  (jetty-closer-3393-thread-2) [    ] o.a.s.m.SolrMetricManager Closing metric reporters for registry=solr.jetty, tag=null
   [junit4]   2> 3189015 INFO  (jetty-closer-3393-thread-2) [    ] o.a.s.m.r.SolrJmxReporter Closing reporter [org.apache.solr.metrics.reporters.SolrJmxReporter@86d76d6: rootName = solr_35132, domain = solr.jetty, service url = null, agent id = null] for registry solr.jetty / com.codahale.metrics.MetricRegistry@7ec7a195
   [junit4]   2> 3189018 INFO  (jetty-closer-3393-thread-1) [    ] o.a.s.m.SolrMetricManager Closing metric reporters for registry=solr.cluster, tag=null
   [junit4]   2> 3189018 INFO  (jetty-closer-3393-thread-2) [    ] o.a.s.m.SolrMetricManager Closing metric reporters for registry=solr.cluster, tag=null
   [junit4]   2> 3189021 INFO  (coreCloseExecutor-10940-thread-1) [n:127.0.0.1:35132_solr c:forwardingCollection s:shard1 r:core_node2 x:forwardingCollection_shard1_replica_n1] o.a.s.c.SolrCore [forwardingCollection_shard1_replica_n1]  CLOSING SolrCore org.apache.solr.core.SolrCore@55ce728
   [junit4]   2> 3189021 INFO  (coreCloseExecutor-10940-thread-1) [n:127.0.0.1:35132_solr c:forwardingCollection s:shard1 r:core_node2 x:forwardingCollection_shard1_replica_n1] o.a.s.m.SolrMetricManager Closing metric reporters for registry=solr.core.forwardingCollection.shard1.replica_n1, tag=89974568
   [junit4]   2> 3189021 INFO  (coreCloseExecutor-10940-thread-1) [n:127.0.0.1:35132_solr c:forwardingCollection s:shard1 r:core_node2 x:forwardingCollection_shard1_replica_n1] o.a.s.m.r.SolrJmxReporter Closing reporter [org.apache.solr.metrics.reporters.SolrJmxReporter@23936159: rootName = solr_35132, domain = solr.core.forwardingCollection.shard1.replica_n1, service url = null, agent id = null] for registry solr.core.forwardingCollection.shard1.replica_n1 / com.codahale.metrics.MetricRegistry@bec5fd
   [junit4]   2> 3189022 ERROR (Thread[Thread-7280,5,TGRP-TestSolrCloudWithSecureImpersonation]) [n:127.0.0.1:58171_solr    ] o.a.h.s.t.d.AbstractDelegationTokenSecretManager ExpiredTokenRemover received java.lang.InterruptedException: sleep interrupted
   [junit4]   2> 3189023 INFO  (zkCallback-3404-thread-1-processing-n:127.0.0.1:35132_solr) [n:127.0.0.1:35132_solr    ] o.a.s.c.c.ZkStateReader A cluster state change: [WatchedEvent state:SyncConnected type:NodeDataChanged path:/collections/forwardingCollection/state.json] for collection [forwardingCollection] has occurred - updating... (live nodes size: [2])
   [junit4]   2> 3189024 INFO  (zkCallback-3404-thread-2-processing-n:127.0.0.1:35132_solr) [n:127.0.0.1:35132_solr    ] o.a.s.c.c.ZkStateReader Updated live nodes from ZooKeeper... (2) -> (1)
   [junit4]   2> 3189025 INFO  (zkCallback-3404-thread-3-processing-n:127.0.0.1:35132_solr) [n:127.0.0.1:35132_solr    ] o.a.s.c.c.ZkStateReader A cluster state change: [WatchedEvent state:SyncConnected type:NodeDataChanged path:/collections/forwardingCollection/state.json] for collection [forwardingCollection] has occurred - updating... (live nodes size: [1])
   [junit4]   2> 3189027 INFO  (jetty-closer-3393-thread-1) [    ] o.e.j.s.h.ContextHandler Stopped o.e.j.s.ServletContextHandler@105007f1{/solr,null,UNAVAILABLE}
   [junit4]   2> 3189036 INFO  (coreCloseExecutor-10940-thread-1) [n:127.0.0.1:35132_solr c:forwardingCollection s:shard1 r:core_node2 x:forwardingCollection_shard1_replica_n1] o.a.s.m.SolrMetricManager Closing metric reporters for registry=solr.collection.forwardingCollection.shard1.leader, tag=89974568
   [junit4]   2> 3189037 INFO  (jetty-closer-3393-thread-2) [    ] o.a.s.c.Overseer Overseer (id=98813064370454534-127.0.0.1:35132_solr-n_0000000000) closing
   [junit4]   2> 3189038 WARN  (OverseerAutoScalingTriggerThread-98813064370454534-127.0.0.1:35132_solr-n_0000000000) [n:127.0.0.1:35132_solr    ] o.a.s.c.a.OverseerTriggerThread OverseerTriggerThread woken up but we are closed, exiting.
   [junit4]   2> 3189038 INFO  (OverseerStateUpdate-98813064370454534-127.0.0.1:35132_solr-n_0000000000) [n:127.0.0.1:35132_solr    ] o.a.s.c.Overseer Overseer Loop exiting : 127.0.0.1:35132_solr
   [junit4]   2> 3190550 WARN  (zkCallback-3404-thread-3-processing-n:127.0.0.1:35132_solr) [n:127.0.0.1:35132_solr    ] o.a.s.c.c.ZkStateReader ZooKeeper watch triggered, but Solr cannot talk to ZK: [KeeperErrorCode = Session expired for /live_nodes]
   [junit4]   2> 3190551 ERROR (Thread[Thread-7282,5,TGRP-TestSolrCloudWithSecureImpersonation]) [n:127.0.0.1:35132_solr    ] o.a.h.s.t.d.AbstractDelegationTokenSecretManager ExpiredTokenRemover received java.lang.InterruptedException: sleep interrupted
   [junit4]   2> 3190553 INFO  (jetty-closer-3393-thread-2) [    ] o.e.j.s.h.ContextHandler Stopped o.e.j.s.ServletContextHandler@12a92327{/solr,null,UNAVAILABLE}
   [junit4]   2> 3190556 ERROR (SUITE-TestSolrCloudWithSecureImpersonation-seed#[6595348457A40AF6]-worker) [    ] o.a.z.s.ZooKeeperServer ZKShutdownHandler is not registered, so ZooKeeper server won't take any action on ERROR or SHUTDOWN server state changes
   [junit4]   2> 3190557 INFO  (SUITE-TestSolrCloudWithSecureImpersonation-seed#[6595348457A40AF6]-worker) [    ] o.a.s.c.ZkTestServer connecting to 127.0.0.1:57299 57299
   [junit4]   2> 3196365 INFO  (Thread-7263) [    ] o.a.s.c.ZkTestServer connecting to 127.0.0.1:57299 57299
   [junit4]   2> 3196371 WARN  (Thread-7263) [    ] o.a.s.c.ZkTestServer Watch limit violations: 
   [junit4]   2> Maximum concurrent create/delete watches above limit:
   [junit4]   2> 
   [junit4]   2> 	4	/solr/aliases.json
   [junit4]   2> 	4	/solr/clusterprops.json
   [junit4]   2> 	2	/solr/security.json
   [junit4]   2> 
   [junit4]   2> Maximum concurrent data watches above limit:
   [junit4]   2> 
   [junit4]   2> 	6	/solr/collections/forwardingCollection/state.json
   [junit4]   2> 	4	/solr/clusterstate.json
   [junit4]   2> 	2	/solr/security/zkdtsm/ZKDTSMRoot/ZKDTSMKeyIdRoot
   [junit4]   2> 	2	/solr/security/zkdtsm/ZKDTSMRoot/ZKDTSMMasterKeyRoot/DK_1
   [junit4]   2> 	2	/solr/security/zkdtsm/ZKDTSMRoot/ZKDTSMMasterKeyRoot/DK_3
   [junit4]   2> 	2	/solr/security/zkdtsm/ZKDTSMRoot/ZKDTSMMasterKeyRoot/DK_2
   [junit4]   2> 	2	/solr/security/zkdtsm/ZKDTSMRoot/ZKDTSMMasterKeyRoot/DK_4
   [junit4]   2> 	2	/solr/security/zkdtsm/ZKDTSMRoot/ZKDTSMSeqNumRoot
   [junit4]   2> 
   [junit4]   2> Maximum concurrent children watches above limit:
   [junit4]   2> 
   [junit4]   2> 	4	/solr/live_nodes
   [junit4]   2> 	4	/solr/collections
   [junit4]   2> 	2	/solr/security/zkdtsm/ZKDTSMRoot/ZKDTSMMasterKeyRoot
   [junit4]   2> 	2	/solr/security/zkdtsm/ZKDTSMRoot/ZKDTSMTokensRoot
   [junit4]   2> 
   [junit4]   2> 3196397 INFO  (SUITE-TestSolrCloudWithSecureImpersonation-seed#[6595348457A40AF6]-worker) [    ] o.a.s.SolrTestCaseJ4 ------------------------------------------------------- Done waiting for tracked resources to be released
   [junit4]   2> Oct 12, 2017 12:22:16 AM com.carrotsearch.randomizedtesting.ThreadLeakControl checkThreadLeaks
   [junit4]   2> WARNING: Will linger awaiting termination of 2 leaked thread(s).
   [junit4]   2> 3212089 ERROR (jetty-launcher-3392-thread-2-EventThread) [n:127.0.0.1:35132_solr    ] o.a.c.f.i.CuratorFrameworkImpl Watcher exception
   [junit4]   2> java.lang.IllegalStateException: Client is not started
   [junit4]   2> 	at com.google.common.base.Preconditions.checkState(Preconditions.java:149)
   [junit4]   2> 	at org.apache.curator.CuratorZookeeperClient.getZooKeeper(CuratorZookeeperClient.java:113)
   [junit4]   2> 	at org.apache.curator.framework.imps.CuratorFrameworkImpl.getZooKeeper(CuratorFrameworkImpl.java:477)
   [junit4]   2> 	at org.apache.curator.framework.imps.NamespaceFacade.getZooKeeper(NamespaceFacade.java:112)
   [junit4]   2> 	at org.apache.curator.framework.imps.GetDataBuilderImpl$4.call(GetDataBuilderImpl.java:302)
   [junit4]   2> 	at org.apache.curator.framework.imps.GetDataBuilderImpl$4.call(GetDataBuilderImpl.java:291)
   [junit4]   2> 	at org.apache.curator.RetryLoop.callWithRetry(RetryLoop.java:107)
   [junit4]   2> 	at org.apache.curator.framework.imps.GetDataBuilderImpl.pathInForeground(GetDataBuilderImpl.java:288)
   [junit4]   2> 	at org.apache.curator.framework.imps.GetDataBuilderImpl.forPath(GetDataBuilderImpl.java:279)
   [junit4]   2> 	at org.apache.curator.framework.imps.GetDataBuilderImpl.forPath(GetDataBuilderImpl.java:41)
   [junit4]   2> 	at org.apache.curator.framework.recipes.shared.SharedValue.readValue(SharedValue.java:244)
   [junit4]   2> 	at org.apache.curator.framework.recipes.shared.SharedValue.access$100(SharedValue.java:44)
   [junit4]   2> 	at org.apache.curator.framework.recipes.shared.SharedValue$1.process(SharedValue.java:61)
   [junit4]   2> 	at org.apache.curator.framework.imps.NamespaceWatcher.process(NamespaceWatcher.java:67)
   [junit4]   2> 	at org.apache.zookeeper.ClientCnxn$EventThread.processEvent(ClientCnxn.java:530)
   [junit4]   2> 	at org.apache.zookeeper.ClientCnxn$EventThread.run(ClientCnxn.java:505)
   [junit4]   2> 3212090 WARN  (jetty-launcher-3392-thread-2-EventThread) [n:127.0.0.1:35132_solr    ] o.a.c.ConnectionState Session expired event received
   [junit4]   2> 3212092 WARN  (jetty-launcher-3392-thread-2-SendThread(127.0.0.1:57299)) [n:127.0.0.1:35132_solr    ] o.a.z.ClientCnxn Session 0x0 for server null, unexpected error, closing socket connection and attempting reconnect
   [junit4]   2> java.net.ConnectException: Connection refused
   [junit4]   2> 	at sun.nio.ch.SocketChannelImpl.checkConnect(Native Method)
   [junit4]   2> 	at sun.nio.ch.SocketChannelImpl.finishConnect(SocketChannelImpl.java:717)
   [junit4]   2> 	at org.apache.zookeeper.ClientCnxnSocketNIO.doTransport(ClientCnxnSocketNIO.java:361)
   [junit4]   2> 	at org.apache.zookeeper.ClientCnxn$SendThread.run(ClientCnxn.java:1141)
   [junit4]   2> 3213193 WARN  (jetty-launcher-3392-thread-2-SendThread(127.0.0.1:57299)) [n:127.0.0.1:35132_solr    ] o.a.z.ClientCnxn Session 0x0 for server null, unexpected error, closing socket connection and attempting reconnect
   [junit4]   2> java.net.ConnectException: Connection refused
   [junit4]   2> 	at sun.nio.ch.SocketChannelImpl.checkConnect(Native Method)
   [junit4]   2> 	at sun.nio.ch.SocketChannelImpl.finishConnect(SocketChannelImpl.java:717)
   [junit4]   2> 	at org.apache.zookeeper.ClientCnxnSocketNIO.doTransport(ClientCnxnSocketNIO.java:361)
   [junit4]   2> 	at org.apache.zookeeper.ClientCnxn$SendThread.run(ClientCnxn.java:1141)
   [junit4]   2> 3214295 WARN  (jetty-launcher-3392-thread-2-SendThread(127.0.0.1:57299)) [n:127.0.0.1:35132_solr    ] o.a.z.ClientCnxn Session 0x0 for server null, unexpected error, closing socket connection and attempting reconnect
   [junit4]   2> java.net.ConnectException: Connection refused
   [junit4]   2> 	at sun.nio.ch.SocketChannelImpl.checkConnect(Native Method)
   [junit4]   2> 	at sun.nio.ch.SocketChannelImpl.finishConnect(SocketChannelImpl.java:717)
   [junit4]   2> 	at org.apache.zookeeper.ClientCnxnSocketNIO.doTransport(ClientCnxnSocketNIO.java:361)
   [junit4]   2> 	at org.apache.zookeeper.ClientCnxn$SendThread.run(ClientCnxn.java:1141)
   [junit4]   2> 3215397 WARN  (jetty-launcher-3392-thread-2-SendThread(127.0.0.1:57299)) [n:127.0.0.1:35132_solr    ] o.a.z.ClientCnxn Session 0x0 for server null, unexpected error, closing socket connection and attempting reconnect
   [junit4]   2> java.net.ConnectException: Connection refused
   [junit4]   2> 	at sun.nio.ch.SocketChannelImpl.checkConnect(Native Method)
   [junit4]   2> 	at sun.nio.ch.SocketChannelImpl.finishConnect(SocketChannelImpl.java:717)
   [junit4]   2> 	at org.apache.zookeeper.ClientCnxnSocketNIO.doTransport(ClientCnxnSocketNIO.java:361)
   [junit4]   2> 	at org.apache.zookeeper.ClientCnxn$SendThread.run(ClientCnxn.java:1141)
   [junit4]   2> 3216498 WARN  (jetty-launcher-3392-thread-2-SendThread(127.0.0.1:57299)) [n:127.0.0.1:35132_solr    ] o.a.z.ClientCnxn Session 0x0 for server null, unexpected error, closing socket connection and attempting reconnect
   [junit4]   2> java.net.ConnectException: Connection refused
   [junit4]   2> 	at sun.nio.ch.SocketChannelImpl.checkConnect(Native Method)
   [junit4]   2> 	at sun.nio.ch.SocketChannelImpl.finishConnect(SocketChannelImpl.java:717)
   [junit4]   2> 	at org.apache.zookeeper.ClientCnxnSocketNIO.doTransport(ClientCnxnSocketNIO.java:361)
   [junit4]   2> 	at org.apache.zookeeper.ClientCnxn$SendThread.run(ClientCnxn.java:1141)
   [junit4]   2> Oct 12, 2017 12:22:36 AM com.carrotsearch.randomizedtesting.ThreadLeakControl checkThreadLeaks
   [junit4]   2> SEVERE: 3 threads leaked from SUITE scope at org.apache.solr.cloud.TestSolrCloudWithSecureImpersonation: 
   [junit4]   2>    1) Thread[id=25941, name=jetty-launcher-3392-thread-1-EventThread, state=TIMED_WAITING, group=TGRP-TestSolrCloudWithSecureImpersonation]
   [junit4]   2>         at sun.misc.Unsafe.park(Native Method)
   [junit4]   2>         at java.util.concurrent.locks.LockSupport.parkNanos(LockSupport.java:215)
   [junit4]   2>         at java.util.concurrent.locks.AbstractQueuedSynchronizer.doAcquireSharedNanos(AbstractQueuedSynchronizer.java:1037)
   [junit4]   2>         at java.util.concurrent.locks.AbstractQueuedSynchronizer.tryAcquireSharedNanos(AbstractQueuedSynchronizer.java:1328)
   [junit4]   2>         at java.util.concurrent.CountDownLatch.await(CountDownLatch.java:277)
   [junit4]   2>         at org.apache.curator.CuratorZookeeperClient.internalBlockUntilConnectedOrTimedOut(CuratorZookeeperClient.java:323)
   [junit4]   2>         at org.apache.curator.RetryLoop.callWithRetry(RetryLoop.java:105)
   [junit4]   2>         at org.apache.curator.framework.imps.GetDataBuilderImpl.pathInForeground(GetDataBuilderImpl.java:288)
   [junit4]   2>         at org.apache.curator.framework.imps.GetDataBuilderImpl.forPath(GetDataBuilderImpl.java:279)
   [junit4]   2>         at org.apache.curator.framework.imps.GetDataBuilderImpl.forPath(GetDataBuilderImpl.java:41)
   [junit4]   2>         at org.apache.curator.framework.recipes.shared.SharedValue.readValue(SharedValue.java:244)
   [junit4]   2>         at org.apache.curator.framework.recipes.shared.SharedValue.access$100(SharedValue.java:44)
   [junit4]   2>         at org.apache.curator.framework.recipes.shared.SharedValue$1.process(SharedValue.java:61)
   [junit4]   2>         at org.apache.curator.framework.imps.NamespaceWatcher.process(NamespaceWatcher.java:67)
   [junit4]   2>         at org.apache.zookeeper.ClientCnxn$EventThread.processEvent(ClientCnxn.java:530)
   [junit4]   2>         at org.apache.zookeeper.ClientCnxn$EventThread.run(ClientCnxn.java:505)
   [junit4]   2>    2) Thread[id=26004, name=jetty-launcher-3392-thread-2-SendThread(127.0.0.1:57299), state=TIMED_WAITING, group=TGRP-TestSolrCloudWithSecureImpersonation]
   [junit4]   2>         at java.lang.Thread.sleep(Native Method)
   [junit4]   2>         at org.apache.zookeeper.client.StaticHostProvider.next(StaticHostProvider.java:101)
   [junit4]   2>         at org.apache.zookeeper.ClientCnxn$SendThread.startConnect(ClientCnxn.java:997)
   [junit4]   2>         at org.apache.zookeeper.ClientCnxn$SendThread.run(ClientCnxn.java:1060)
   [junit4]   2>    3) Thread[id=26005, name=jetty-launcher-3392-thread-2-EventThread, state=WAITING, group=TGRP-TestSolrCloudWithSecureImpersonation]
   [junit4]   2>         at sun.misc.Unsafe.park(Native Method)
   [junit4]   2>         at java.util.concurrent.locks.LockSupport.park(LockSupport.java:175)
   [junit4]   2>         at java.util.concurrent.locks.AbstractQueuedSynchronizer$ConditionObject.await(AbstractQueuedSynchronizer.java:2039)
   [junit4]   2>         at java.util.concurrent.LinkedBlockingQueue.take(LinkedBlockingQueue.java:442)
   [junit4]   2>         at org.apache.zookeeper.ClientCnxn$EventThread.run(ClientCnxn.java:501)
   [junit4]   2> Oct 12, 2017 12:22:36 AM com.carrotsearch.randomizedtesting.ThreadLeakControl tryToInterruptAll
   [junit4]   2> INFO: Starting to interrupt leaked threads:
   [junit4]   2>    1) Thread[id=25941, name=jetty-launcher-3392-thread-1-EventThread, state=TIMED_WAITING, group=TGRP-TestSolrCloudWithSecureImpersonation]
   [junit4]   2>    2) Thread[id=26004, name=jetty-launcher-3392-thread-2-SendThread(127.0.0.1:57299), state=TIMED_WAITING, group=TGRP-TestSolrCloudWithSecureImpersonation]
   [junit4]   2>    3) Thread[id=26005, name=jetty-launcher-3392-thread-2-EventThread, state=WAITING, group=TGRP-TestSolrCloudWithSecureImpersonation]
   [junit4]   2> 3216722 WARN  (jetty-launcher-3392-thread-2-SendThread(127.0.0.1:57299)) [n:127.0.0.1:35132_solr    ] o.a.z.c.StaticHostProvider Unexpected exception
   [junit4]   2> java.lang.InterruptedException: sleep interrupted
   [junit4]   2> 	at java.lang.Thread.sleep(Native Method)
   [junit4]   2> 	at org.apache.zookeeper.client.StaticHostProvider.next(StaticHostProvider.java:101)
   [junit4]   2> 	at org.apache.zookeeper.ClientCnxn$SendThread.startConnect(ClientCnxn.java:997)
   [junit4]   2> 	at org.apache.zookeeper.ClientCnxn$SendThread.run(ClientCnxn.java:1060)
   [junit4]   2> 3216722 ERROR (jetty-launcher-3392-thread-2-EventThread) [n:127.0.0.1:35132_solr    ] o.a.z.ClientCnxn Event thread exiting due to interruption
   [junit4]   2> java.lang.InterruptedException
   [junit4]   2> 	at java.util.concurrent.locks.AbstractQueuedSynchronizer$ConditionObject.reportInterruptAfterWait(AbstractQueuedSynchronizer.java:2014)
   [junit4]   2> 	at java.util.concurrent.locks.AbstractQueuedSynchronizer$ConditionObject.await(AbstractQueuedSynchronizer.java:2048)
   [junit4]   2> 	at java.util.concurrent.LinkedBlockingQueue.take(LinkedBlockingQueue.java:442)
   [junit4]   2> 	at org.apache.zookeeper.ClientCnxn$EventThread.run(ClientCnxn.java:501)
   [junit4]   2> 3216726 WARN  (jetty-launcher-3392-thread-2-SendThread(127.0.0.1:57299)) [n:127.0.0.1:35132_solr    ] o.a.z.ClientCnxn Session 0x0 for server null, unexpected error, closing socket connection and attempting reconnect
   [junit4]   2> java.net.ConnectException: Connection refused
   [junit4]   2> 	at sun.nio.ch.SocketChannelImpl.checkConnect(Native Method)
   [junit4]   2> 	at sun.nio.ch.SocketChannelImpl.finishConnect(SocketChannelImpl.java:717)
   [junit4]   2> 	at org.apache.zookeeper.ClientCnxnSocketNIO.doTransport(ClientCnxnSocketNIO.java:361)
   [junit4]   2> 	at org.apache.zookeeper.ClientCnxn$SendThread.run(ClientCnxn.java:1141)
   [junit4]   2> 3216722 ERROR (jetty-launcher-3392-thread-1-EventThread) [n:127.0.0.1:58171_solr    ] o.a.c.f.i.CuratorFrameworkImpl Watcher exception
   [junit4]   2> java.lang.InterruptedException
   [junit4]   2> 	at java.util.concurrent.locks.AbstractQueuedSynchronizer.doAcquireSharedNanos(AbstractQueuedSynchronizer.java:1039)
   [junit4]   2> 	at java.util.concurrent.locks.AbstractQueuedSynchronizer.tryAcquireSharedNanos(AbstractQueuedSynchronizer.java:1328)
   [junit4]   2> 	at java.util.concurrent.CountDownLatch.await(CountDownLatch.java:277)
   [junit4]   2> 	at org.apache.curator.CuratorZookeeperClient.internalBlockUntilConnectedOrTimedOut(CuratorZookeeperClient.java:323)
   [junit4]   2> 	at org.apache.curator.RetryLoop.callWithRetry(RetryLoop.java:105)
   [junit4]   2> 	at org.apache.curator.framework.imps.GetDataBuilderImpl.pathInForeground(GetDataBuilderImpl.java:288)
   [junit4]   2> 	at org.apache.curator.framework.imps.GetDataBuilderImpl.forPath(GetDataBuilderImpl.java:279)
   [junit4]   2> 	at org.apache.curator.framework.imps.GetDataBuilderImpl.forPath(GetDataBuilderImpl.java:41)
   [junit4]   2> 	at org.apache.curator.framework.recipes.shared.SharedValue.readValue(SharedValue.java:244)
   [junit4]   2> 	at org.apache.curator.framework.recipes.shared.SharedValue.access$100(SharedValue.java:44)
   [junit4]   2> 	at org.apache.curator.framework.recipes.shared.SharedValue$1.process(SharedValue.java:61)
   [junit4]   2> 	at org.apache.curator.framework.imps.NamespaceWatcher.process(NamespaceWatcher.java:67)
   [junit4]   2> 	at org.apache.zookeeper.ClientCnxn$EventThread.processEvent(ClientCnxn.java:530)
   [junit4]   2> 	at org.apache.zookeeper.ClientCnxn$EventThread.run(ClientCnxn.java:505)
   [junit4]   2> 3216726 WARN  (jetty-launcher-3392-thread-1-EventThread) [n:127.0.0.1:58171_solr    ] o.a.c.ConnectionState Session expired event received
   [junit4]   2> 3216727 WARN  (jetty-launcher-3392-thread-1-SendThread(127.0.0.1:57299)) [n:127.0.0.1:58171_solr    ] o.a.z.ClientCnxn Session 0x0 for server null, unexpected error, closing socket connection and attempting reconnect
   [junit4]   2> java.net.ConnectException: Connection refused
   [junit4]   2> 	at sun.nio.ch.SocketChannelImpl.checkConnect(Native Method)
   [junit4]   2> 	at sun.nio.ch.SocketChannelImpl.finishConnect(SocketChannelImpl.java:717)
   [junit4]   2> 	at org.apache.zookeeper.ClientCnxnSocketNIO.doTransport(ClientCnxnSocketNIO.java:361)
   [junit4]

[...truncated too long message...]

 TestConfigSets, TestSchemaSimilarityResource, DeleteStatusTest, TestLeaderInitiatedRecoveryThread, TestExportWriter, TestSolrXml, SolrTestCaseJ4Test, TestSSLRandomization, TestConfigsApi, TestEmbeddedSolrServerSchemaAPI, TestSmileRequest, TestAddFieldRealTimeGet, RegexBoostProcessorTest, CollectionsAPIAsyncDistributedZkTest, TestSolrCoreProperties, SuggestComponentContextFilterQueryTest, TestNumericRangeQuery64, ClusterStateUpdateTest, ResourceLoaderTest, OverseerCollectionConfigSetProcessorTest, TestSkipOverseerOperations, TestBinaryField, TestOnReconnectListenerSupport, TestSearcherReuse, SolrCoreTest, TestApiFramework, WordBreakSolrSpellCheckerTest, TestSubQueryTransformer, ShufflingReplicaListTransformerTest, TestPayloadCheckQParserPlugin, TestClassicSimilarityFactory, ExecutePlanActionTest, QueryElevationComponentTest, DirectoryFactoryTest, ReplaceNodeTest, TestCodecSupport, CollectionStateFormat2Test, AlternateDirectoryTest, TestQuerySenderNoQuery, OverseerRolesTest, UniqFieldsUpdateProcessorFactoryTest, TestDistributedSearch, AutoAddReplicasIntegrationTest, SuggesterWFSTTest, SimplePostToolTest, NumericFieldsTest, XsltUpdateRequestHandlerTest, TestAtomicUpdateErrorCases, TestOrdValues, PrimitiveFieldTypeTest, DateMathParserTest, SolrInfoBeanTest, TestMultiValuedNumericRangeQuery, DeleteReplicaTest, BlockJoinFacetRandomTest, TestRTimerTree, TestPullReplica, V2ApiIntegrationTest, TestRecoveryHdfs, BinaryUpdateRequestHandlerTest, NoCacheHeaderTest, TestHttpShardHandlerFactory, TestTrieFacet, SimpleCollectionCreateDeleteTest, GraphQueryTest, DocExpirationUpdateProcessorFactoryTest, IndexSchemaTest, CSVRequestHandlerTest, SpatialFilterTest, LeaderElectionTest, SoftAutoCommitTest, MoveReplicaHDFSTest, ParsingFieldUpdateProcessorsTest, SubstringBytesRefFilterTest, RecoveryAfterSoftCommitTest, ExplicitHLLTest, TestGraphMLResponseWriter, TestFieldCacheSort, TestExactStatsCache, RulesTest, TestDFRSimilarityFactory, ClassificationUpdateProcessorTest, TestQuerySenderListener, TestStressVersions, ChaosMonkeyNothingIsSafeTest, SolrJmxReporterTest, ImplicitSnitchTest, TestInPlaceUpdatesStandalone, DeleteLastCustomShardedReplicaTest, HdfsBasicDistributedZk2Test, TestImplicitCoreProperties, TestAuthenticationFramework, TestMissingGroups, AliasIntegrationTest, RestartWhileUpdatingTest, TestLegacyNumericUtils, CdcrReplicationDistributedZkTest, TestFreeTextSuggestions, TestSQLHandlerNonCloud, TestPseudoReturnFields, TestRawTransformer, ZkControllerTest, TestReloadAndDeleteDocs, ScriptEngineTest, TestManagedResourceStorage, InfixSuggestersTest, TestExclusionRuleCollectionAccess, TestLazyCores, OverseerTaskQueueTest, FieldAnalysisRequestHandlerTest, PeerSyncTest, TestPKIAuthenticationPlugin, TestSolrCoreParser, HttpTriggerListenerTest, OverseerTest, HdfsUnloadDistributedZkTest, TestPhraseSuggestions, TestReversedWildcardFilterFactory, ChaosMonkeySafeLeaderTest, CollectionsAPIDistributedZkTest, OpenCloseCoreStressTest, ShardRoutingTest, BasicZkTest, FullSolrCloudDistribCmdsTest, TestReplicationHandler, TestRandomFaceting, ZkSolrClientTest, TestZkChroot, TestRandomDVFaceting, ZkCLITest, TestDistributedGrouping, TestFaceting, TestHashPartitioner, DistributedSpellCheckComponentTest, TestRealTimeGet, TestJoin, HardAutoCommitTest, DistributedTermsComponentTest, TestRangeQuery, TestCoreContainer, SimpleFacetsTest, TestSolr4Spatial, TestGroupingSearch, SolrCmdDistributorTest, BadIndexSchemaTest, TestSort, TestFiltering, BasicFunctionalityTest, DirectUpdateHandlerTest, TestBadConfig, HighlighterTest, DistributedQueryElevationComponentTest, AnalysisAfterCoreReloadTest, TestExtendedDismaxParser, SuggesterFSTTest, CoreAdminHandlerTest, SchemaVersionSpecificBehaviorTest, DirectUpdateHandlerOptimizeTest, TestSurroundQueryParser, TestOmitPositions, TermsComponentTest, TermVectorComponentTest, LoggingHandlerTest, TestCSVResponseWriter, QueryParsingTest, TestPHPSerializedResponseWriter, TestComponentsName, SearchHandlerTest, TestLFUCache, TestMergePolicyConfig, TestSolrDeletionPolicy2, MinimalSchemaTest, TestConfig, OutputWriterTest, TestFuzzyAnalyzedSuggestions, TestPostingsSolrHighlighter, DirectSolrConnectionTest, NotRequiredUniqueKeyTest, SpellPossibilityIteratorTest, TestCharFilters, SynonymTokenizerTest, TestXIncludeConfig, TestSweetSpotSimilarityFactory, TestPerFieldSimilarity, TestLMDirichletSimilarityFactory, TestBM25SimilarityFactory, TestFastWriter, TestFastOutputStream, OpenExchangeRatesOrgProviderTest, URLClassifyProcessorTest, PluginInfoTest, PreAnalyzedFieldTest, TestSystemIdResolver, PrimUtilsTest, TestSuggestSpellingConverter, DateFieldTest, RAMDirectoryFactoryTest, TestSolrJ, SliceStateTest, UUIDFieldTest, TestRTGBase, TestCursorMarkWithoutUniqueKey, TestDistributedMissingSort, TestHighlightDedupGrouping, ConnectionReuseTest, AssignTest, CloudExitableDirectoryReaderTest, CollectionReloadTest, ConcurrentDeleteAndCreateCollectionTest, ConnectionManagerTest, CreateCollectionCleanupTest, CustomCollectionTest, DeleteShardTest, DistribJoinFromCollectionTest, DocValuesNotIndexedTest, HealthCheckHandlerTest, LeaderInitiatedRecoveryOnCommitTest, MissingSegmentRecoveryTest, MoveReplicaHDFSFailoverTest, OverseerStatusTest, ReplicationFactorTest, RollingRestartTest, SSLMigrationTest, ShardSplitTest, TestRebalanceLeaders, TestShortCircuitedRequests, TestSolrCloudWithDelegationTokens, TestSolrCloudWithSecureImpersonation]
   [junit4]   2> NOTE: reproduce with: ant test  -Dtestcase=TestSolrCloudWithSecureImpersonation -Dtests.seed=6595348457A40AF6 -Dtests.slow=true -Dtests.locale=ar -Dtests.timezone=GMT0 -Dtests.asserts=true -Dtests.file.encoding=ISO-8859-1
   [junit4] ERROR   0.00s J0 | TestSolrCloudWithSecureImpersonation (suite) <<<
   [junit4]    > Throwable #1: com.carrotsearch.randomizedtesting.ThreadLeakError: 3 threads leaked from SUITE scope at org.apache.solr.cloud.TestSolrCloudWithSecureImpersonation: 
   [junit4]    >    1) Thread[id=25941, name=jetty-launcher-3392-thread-1-EventThread, state=TIMED_WAITING, group=TGRP-TestSolrCloudWithSecureImpersonation]
   [junit4]    >         at sun.misc.Unsafe.park(Native Method)
   [junit4]    >         at java.util.concurrent.locks.LockSupport.parkNanos(LockSupport.java:215)
   [junit4]    >         at java.util.concurrent.locks.AbstractQueuedSynchronizer.doAcquireSharedNanos(AbstractQueuedSynchronizer.java:1037)
   [junit4]    >         at java.util.concurrent.locks.AbstractQueuedSynchronizer.tryAcquireSharedNanos(AbstractQueuedSynchronizer.java:1328)
   [junit4]    >         at java.util.concurrent.CountDownLatch.await(CountDownLatch.java:277)
   [junit4]    >         at org.apache.curator.CuratorZookeeperClient.internalBlockUntilConnectedOrTimedOut(CuratorZookeeperClient.java:323)
   [junit4]    >         at org.apache.curator.RetryLoop.callWithRetry(RetryLoop.java:105)
   [junit4]    >         at org.apache.curator.framework.imps.GetDataBuilderImpl.pathInForeground(GetDataBuilderImpl.java:288)
   [junit4]    >         at org.apache.curator.framework.imps.GetDataBuilderImpl.forPath(GetDataBuilderImpl.java:279)
   [junit4]    >         at org.apache.curator.framework.imps.GetDataBuilderImpl.forPath(GetDataBuilderImpl.java:41)
   [junit4]    >         at org.apache.curator.framework.recipes.shared.SharedValue.readValue(SharedValue.java:244)
   [junit4]    >         at org.apache.curator.framework.recipes.shared.SharedValue.access$100(SharedValue.java:44)
   [junit4]    >         at org.apache.curator.framework.recipes.shared.SharedValue$1.process(SharedValue.java:61)
   [junit4]    >         at org.apache.curator.framework.imps.NamespaceWatcher.process(NamespaceWatcher.java:67)
   [junit4]    >         at org.apache.zookeeper.ClientCnxn$EventThread.processEvent(ClientCnxn.java:530)
   [junit4]    >         at org.apache.zookeeper.ClientCnxn$EventThread.run(ClientCnxn.java:505)
   [junit4]    >    2) Thread[id=26004, name=jetty-launcher-3392-thread-2-SendThread(127.0.0.1:57299), state=TIMED_WAITING, group=TGRP-TestSolrCloudWithSecureImpersonation]
   [junit4]    >         at java.lang.Thread.sleep(Native Method)
   [junit4]    >         at org.apache.zookeeper.client.StaticHostProvider.next(StaticHostProvider.java:101)
   [junit4]    >         at org.apache.zookeeper.ClientCnxn$SendThread.startConnect(ClientCnxn.java:997)
   [junit4]    >         at org.apache.zookeeper.ClientCnxn$SendThread.run(ClientCnxn.java:1060)
   [junit4]    >    3) Thread[id=26005, name=jetty-launcher-3392-thread-2-EventThread, state=WAITING, group=TGRP-TestSolrCloudWithSecureImpersonation]
   [junit4]    >         at sun.misc.Unsafe.park(Native Method)
   [junit4]    >         at java.util.concurrent.locks.LockSupport.park(LockSupport.java:175)
   [junit4]    >         at java.util.concurrent.locks.AbstractQueuedSynchronizer$ConditionObject.await(AbstractQueuedSynchronizer.java:2039)
   [junit4]    >         at java.util.concurrent.LinkedBlockingQueue.take(LinkedBlockingQueue.java:442)
   [junit4]    >         at org.apache.zookeeper.ClientCnxn$EventThread.run(ClientCnxn.java:501)
   [junit4]    > 	at __randomizedtesting.SeedInfo.seed([6595348457A40AF6]:0)Throwable #2: com.carrotsearch.randomizedtesting.ThreadLeakError: There are still zombie threads that couldn't be terminated:
   [junit4]    >    1) Thread[id=26004, name=jetty-launcher-3392-thread-2-SendThread(127.0.0.1:57299), state=TIMED_WAITING, group=TGRP-TestSolrCloudWithSecureImpersonation]
   [junit4]    >         at java.lang.Thread.sleep(Native Method)
   [junit4]    >         at org.apache.zookeeper.client.StaticHostProvider.next(StaticHostProvider.java:101)
   [junit4]    >         at org.apache.zookeeper.ClientCnxn$SendThread.startConnect(ClientCnxn.java:997)
   [junit4]    >         at org.apache.zookeeper.ClientCnxn$SendThread.run(ClientCnxn.java:1060)
   [junit4]    > 	at __randomizedtesting.SeedInfo.seed([6595348457A40AF6]:0)
   [junit4] Completed [552/745 (1!)] on J0 in 53.66s, 12 tests, 2 errors <<< FAILURES!

[...truncated 47516 lines...]

Mime
View raw message