lucene-dev mailing list archives

Site index · List index
Message view « Date » · « Thread »
Top « Date » · « Thread »
From Policeman Jenkins Server <jenk...@thetaphi.de>
Subject [JENKINS] Lucene-Solr-7.x-Linux (64bit/jdk1.8.0_144) - Build # 712 - Still Unstable!
Date Tue, 31 Oct 2017 19:10:57 GMT
Build: https://jenkins.thetaphi.de/job/Lucene-Solr-7.x-Linux/712/
Java: 64bit/jdk1.8.0_144 -XX:-UseCompressedOops -XX:+UseG1GC

3 tests failed.
FAILED:  org.apache.solr.cloud.TestPrepRecovery.testLeaderUnloaded

Error Message:
Expected collection: testLeaderUnloaded to be live with 1 shard and 2 replicas null Live Nodes: [127.0.0.1:38473_solr, 127.0.0.1:40607_solr] Last available state: null

Stack Trace:
java.lang.AssertionError: Expected collection: testLeaderUnloaded to be live with 1 shard and 2 replicas
null
Live Nodes: [127.0.0.1:38473_solr, 127.0.0.1:40607_solr]
Last available state: null
	at __randomizedtesting.SeedInfo.seed([56E578426BA3C4D4:5426BB4968F2AD6]:0)
	at org.junit.Assert.fail(Assert.java:93)
	at org.apache.solr.cloud.SolrCloudTestCase.waitForState(SolrCloudTestCase.java:269)
	at org.apache.solr.cloud.TestPrepRecovery.testLeaderUnloaded(TestPrepRecovery.java:59)
	at sun.reflect.NativeMethodAccessorImpl.invoke0(Native Method)
	at sun.reflect.NativeMethodAccessorImpl.invoke(NativeMethodAccessorImpl.java:62)
	at sun.reflect.DelegatingMethodAccessorImpl.invoke(DelegatingMethodAccessorImpl.java:43)
	at java.lang.reflect.Method.invoke(Method.java:498)
	at com.carrotsearch.randomizedtesting.RandomizedRunner.invoke(RandomizedRunner.java:1737)
	at com.carrotsearch.randomizedtesting.RandomizedRunner$8.evaluate(RandomizedRunner.java:934)
	at com.carrotsearch.randomizedtesting.RandomizedRunner$9.evaluate(RandomizedRunner.java:970)
	at com.carrotsearch.randomizedtesting.RandomizedRunner$10.evaluate(RandomizedRunner.java:984)
	at com.carrotsearch.randomizedtesting.rules.SystemPropertiesRestoreRule$1.evaluate(SystemPropertiesRestoreRule.java:57)
	at org.apache.lucene.util.TestRuleSetupTeardownChained$1.evaluate(TestRuleSetupTeardownChained.java:49)
	at org.apache.lucene.util.AbstractBeforeAfterRule$1.evaluate(AbstractBeforeAfterRule.java:45)
	at org.apache.lucene.util.TestRuleThreadAndTestName$1.evaluate(TestRuleThreadAndTestName.java:48)
	at org.apache.lucene.util.TestRuleIgnoreAfterMaxFailures$1.evaluate(TestRuleIgnoreAfterMaxFailures.java:64)
	at org.apache.lucene.util.TestRuleMarkFailure$1.evaluate(TestRuleMarkFailure.java:47)
	at com.carrotsearch.randomizedtesting.rules.StatementAdapter.evaluate(StatementAdapter.java:36)
	at com.carrotsearch.randomizedtesting.ThreadLeakControl$StatementRunner.run(ThreadLeakControl.java:368)
	at com.carrotsearch.randomizedtesting.ThreadLeakControl.forkTimeoutingTask(ThreadLeakControl.java:817)
	at com.carrotsearch.randomizedtesting.ThreadLeakControl$3.evaluate(ThreadLeakControl.java:468)
	at com.carrotsearch.randomizedtesting.RandomizedRunner.runSingleTest(RandomizedRunner.java:943)
	at com.carrotsearch.randomizedtesting.RandomizedRunner$5.evaluate(RandomizedRunner.java:829)
	at com.carrotsearch.randomizedtesting.RandomizedRunner$6.evaluate(RandomizedRunner.java:879)
	at com.carrotsearch.randomizedtesting.RandomizedRunner$7.evaluate(RandomizedRunner.java:890)
	at com.carrotsearch.randomizedtesting.rules.StatementAdapter.evaluate(StatementAdapter.java:36)
	at com.carrotsearch.randomizedtesting.rules.SystemPropertiesRestoreRule$1.evaluate(SystemPropertiesRestoreRule.java:57)
	at org.apache.lucene.util.AbstractBeforeAfterRule$1.evaluate(AbstractBeforeAfterRule.java:45)
	at com.carrotsearch.randomizedtesting.rules.StatementAdapter.evaluate(StatementAdapter.java:36)
	at org.apache.lucene.util.TestRuleStoreClassName$1.evaluate(TestRuleStoreClassName.java:41)
	at com.carrotsearch.randomizedtesting.rules.NoShadowingOrOverridesOnMethodsRule$1.evaluate(NoShadowingOrOverridesOnMethodsRule.java:40)
	at com.carrotsearch.randomizedtesting.rules.NoShadowingOrOverridesOnMethodsRule$1.evaluate(NoShadowingOrOverridesOnMethodsRule.java:40)
	at com.carrotsearch.randomizedtesting.rules.StatementAdapter.evaluate(StatementAdapter.java:36)
	at com.carrotsearch.randomizedtesting.rules.StatementAdapter.evaluate(StatementAdapter.java:36)
	at com.carrotsearch.randomizedtesting.rules.StatementAdapter.evaluate(StatementAdapter.java:36)
	at org.apache.lucene.util.TestRuleAssertionsRequired$1.evaluate(TestRuleAssertionsRequired.java:53)
	at org.apache.lucene.util.TestRuleMarkFailure$1.evaluate(TestRuleMarkFailure.java:47)
	at org.apache.lucene.util.TestRuleIgnoreAfterMaxFailures$1.evaluate(TestRuleIgnoreAfterMaxFailures.java:64)
	at org.apache.lucene.util.TestRuleIgnoreTestSuites$1.evaluate(TestRuleIgnoreTestSuites.java:54)
	at com.carrotsearch.randomizedtesting.rules.StatementAdapter.evaluate(StatementAdapter.java:36)
	at com.carrotsearch.randomizedtesting.ThreadLeakControl$StatementRunner.run(ThreadLeakControl.java:368)
	at java.lang.Thread.run(Thread.java:748)


FAILED:  org.apache.solr.cloud.TestPrepRecovery.testLeaderNotResponding

Error Message:
Expected collection: testLeaderNotResponding to be live with 1 shard and 1 replicas null Live Nodes: [127.0.0.1:38473_solr, 127.0.0.1:40607_solr] Last available state: null

Stack Trace:
java.lang.AssertionError: Expected collection: testLeaderNotResponding to be live with 1 shard and 1 replicas
null
Live Nodes: [127.0.0.1:38473_solr, 127.0.0.1:40607_solr]
Last available state: null
	at __randomizedtesting.SeedInfo.seed([56E578426BA3C4D4:FB950252CD4046B]:0)
	at org.junit.Assert.fail(Assert.java:93)
	at org.apache.solr.cloud.SolrCloudTestCase.waitForState(SolrCloudTestCase.java:269)
	at org.apache.solr.cloud.TestPrepRecovery.testLeaderNotResponding(TestPrepRecovery.java:93)
	at sun.reflect.NativeMethodAccessorImpl.invoke0(Native Method)
	at sun.reflect.NativeMethodAccessorImpl.invoke(NativeMethodAccessorImpl.java:62)
	at sun.reflect.DelegatingMethodAccessorImpl.invoke(DelegatingMethodAccessorImpl.java:43)
	at java.lang.reflect.Method.invoke(Method.java:498)
	at com.carrotsearch.randomizedtesting.RandomizedRunner.invoke(RandomizedRunner.java:1737)
	at com.carrotsearch.randomizedtesting.RandomizedRunner$8.evaluate(RandomizedRunner.java:934)
	at com.carrotsearch.randomizedtesting.RandomizedRunner$9.evaluate(RandomizedRunner.java:970)
	at com.carrotsearch.randomizedtesting.RandomizedRunner$10.evaluate(RandomizedRunner.java:984)
	at com.carrotsearch.randomizedtesting.rules.SystemPropertiesRestoreRule$1.evaluate(SystemPropertiesRestoreRule.java:57)
	at org.apache.lucene.util.TestRuleSetupTeardownChained$1.evaluate(TestRuleSetupTeardownChained.java:49)
	at org.apache.lucene.util.AbstractBeforeAfterRule$1.evaluate(AbstractBeforeAfterRule.java:45)
	at org.apache.lucene.util.TestRuleThreadAndTestName$1.evaluate(TestRuleThreadAndTestName.java:48)
	at org.apache.lucene.util.TestRuleIgnoreAfterMaxFailures$1.evaluate(TestRuleIgnoreAfterMaxFailures.java:64)
	at org.apache.lucene.util.TestRuleMarkFailure$1.evaluate(TestRuleMarkFailure.java:47)
	at com.carrotsearch.randomizedtesting.rules.StatementAdapter.evaluate(StatementAdapter.java:36)
	at com.carrotsearch.randomizedtesting.ThreadLeakControl$StatementRunner.run(ThreadLeakControl.java:368)
	at com.carrotsearch.randomizedtesting.ThreadLeakControl.forkTimeoutingTask(ThreadLeakControl.java:817)
	at com.carrotsearch.randomizedtesting.ThreadLeakControl$3.evaluate(ThreadLeakControl.java:468)
	at com.carrotsearch.randomizedtesting.RandomizedRunner.runSingleTest(RandomizedRunner.java:943)
	at com.carrotsearch.randomizedtesting.RandomizedRunner$5.evaluate(RandomizedRunner.java:829)
	at com.carrotsearch.randomizedtesting.RandomizedRunner$6.evaluate(RandomizedRunner.java:879)
	at com.carrotsearch.randomizedtesting.RandomizedRunner$7.evaluate(RandomizedRunner.java:890)
	at com.carrotsearch.randomizedtesting.rules.StatementAdapter.evaluate(StatementAdapter.java:36)
	at com.carrotsearch.randomizedtesting.rules.SystemPropertiesRestoreRule$1.evaluate(SystemPropertiesRestoreRule.java:57)
	at org.apache.lucene.util.AbstractBeforeAfterRule$1.evaluate(AbstractBeforeAfterRule.java:45)
	at com.carrotsearch.randomizedtesting.rules.StatementAdapter.evaluate(StatementAdapter.java:36)
	at org.apache.lucene.util.TestRuleStoreClassName$1.evaluate(TestRuleStoreClassName.java:41)
	at com.carrotsearch.randomizedtesting.rules.NoShadowingOrOverridesOnMethodsRule$1.evaluate(NoShadowingOrOverridesOnMethodsRule.java:40)
	at com.carrotsearch.randomizedtesting.rules.NoShadowingOrOverridesOnMethodsRule$1.evaluate(NoShadowingOrOverridesOnMethodsRule.java:40)
	at com.carrotsearch.randomizedtesting.rules.StatementAdapter.evaluate(StatementAdapter.java:36)
	at com.carrotsearch.randomizedtesting.rules.StatementAdapter.evaluate(StatementAdapter.java:36)
	at com.carrotsearch.randomizedtesting.rules.StatementAdapter.evaluate(StatementAdapter.java:36)
	at org.apache.lucene.util.TestRuleAssertionsRequired$1.evaluate(TestRuleAssertionsRequired.java:53)
	at org.apache.lucene.util.TestRuleMarkFailure$1.evaluate(TestRuleMarkFailure.java:47)
	at org.apache.lucene.util.TestRuleIgnoreAfterMaxFailures$1.evaluate(TestRuleIgnoreAfterMaxFailures.java:64)
	at org.apache.lucene.util.TestRuleIgnoreTestSuites$1.evaluate(TestRuleIgnoreTestSuites.java:54)
	at com.carrotsearch.randomizedtesting.rules.StatementAdapter.evaluate(StatementAdapter.java:36)
	at com.carrotsearch.randomizedtesting.ThreadLeakControl$StatementRunner.run(ThreadLeakControl.java:368)
	at java.lang.Thread.run(Thread.java:748)


FAILED:  org.apache.solr.cloud.TestTlogReplica.testRemoveLeader

Error Message:
Error from server at http://127.0.0.1:45913/solr: Error waiting for corenode gone

Stack Trace:
org.apache.solr.client.solrj.impl.HttpSolrClient$RemoteSolrException: Error from server at http://127.0.0.1:45913/solr: Error waiting for corenode gone
	at org.apache.solr.client.solrj.impl.HttpSolrClient.executeMethod(HttpSolrClient.java:658)
	at org.apache.solr.client.solrj.impl.HttpSolrClient.request(HttpSolrClient.java:255)
	at org.apache.solr.client.solrj.impl.HttpSolrClient.request(HttpSolrClient.java:244)
	at org.apache.solr.client.solrj.impl.LBHttpSolrClient.doRequest(LBHttpSolrClient.java:483)
	at org.apache.solr.client.solrj.impl.LBHttpSolrClient.request(LBHttpSolrClient.java:413)
	at org.apache.solr.client.solrj.impl.CloudSolrClient.sendRequest(CloudSolrClient.java:1096)
	at org.apache.solr.client.solrj.impl.CloudSolrClient.requestWithRetryOnStaleState(CloudSolrClient.java:875)
	at org.apache.solr.client.solrj.impl.CloudSolrClient.request(CloudSolrClient.java:808)
	at org.apache.solr.client.solrj.SolrRequest.process(SolrRequest.java:178)
	at org.apache.solr.client.solrj.SolrRequest.process(SolrRequest.java:195)
	at org.apache.solr.cloud.TestTlogReplica.doReplaceLeader(TestTlogReplica.java:391)
	at org.apache.solr.cloud.TestTlogReplica.testRemoveLeader(TestTlogReplica.java:317)
	at sun.reflect.NativeMethodAccessorImpl.invoke0(Native Method)
	at sun.reflect.NativeMethodAccessorImpl.invoke(NativeMethodAccessorImpl.java:62)
	at sun.reflect.DelegatingMethodAccessorImpl.invoke(DelegatingMethodAccessorImpl.java:43)
	at java.lang.reflect.Method.invoke(Method.java:498)
	at com.carrotsearch.randomizedtesting.RandomizedRunner.invoke(RandomizedRunner.java:1737)
	at com.carrotsearch.randomizedtesting.RandomizedRunner$8.evaluate(RandomizedRunner.java:934)
	at com.carrotsearch.randomizedtesting.RandomizedRunner$9.evaluate(RandomizedRunner.java:970)
	at com.carrotsearch.randomizedtesting.RandomizedRunner$10.evaluate(RandomizedRunner.java:984)
	at com.carrotsearch.randomizedtesting.rules.SystemPropertiesRestoreRule$1.evaluate(SystemPropertiesRestoreRule.java:57)
	at org.apache.lucene.util.TestRuleSetupTeardownChained$1.evaluate(TestRuleSetupTeardownChained.java:49)
	at org.apache.lucene.util.AbstractBeforeAfterRule$1.evaluate(AbstractBeforeAfterRule.java:45)
	at org.apache.lucene.util.TestRuleThreadAndTestName$1.evaluate(TestRuleThreadAndTestName.java:48)
	at org.apache.lucene.util.TestRuleIgnoreAfterMaxFailures$1.evaluate(TestRuleIgnoreAfterMaxFailures.java:64)
	at org.apache.lucene.util.TestRuleMarkFailure$1.evaluate(TestRuleMarkFailure.java:47)
	at com.carrotsearch.randomizedtesting.rules.StatementAdapter.evaluate(StatementAdapter.java:36)
	at com.carrotsearch.randomizedtesting.ThreadLeakControl$StatementRunner.run(ThreadLeakControl.java:368)
	at com.carrotsearch.randomizedtesting.ThreadLeakControl.forkTimeoutingTask(ThreadLeakControl.java:817)
	at com.carrotsearch.randomizedtesting.ThreadLeakControl$3.evaluate(ThreadLeakControl.java:468)
	at com.carrotsearch.randomizedtesting.RandomizedRunner.runSingleTest(RandomizedRunner.java:943)
	at com.carrotsearch.randomizedtesting.RandomizedRunner$5.evaluate(RandomizedRunner.java:829)
	at com.carrotsearch.randomizedtesting.RandomizedRunner$6.evaluate(RandomizedRunner.java:879)
	at com.carrotsearch.randomizedtesting.RandomizedRunner$7.evaluate(RandomizedRunner.java:890)
	at com.carrotsearch.randomizedtesting.rules.StatementAdapter.evaluate(StatementAdapter.java:36)
	at com.carrotsearch.randomizedtesting.rules.SystemPropertiesRestoreRule$1.evaluate(SystemPropertiesRestoreRule.java:57)
	at org.apache.lucene.util.AbstractBeforeAfterRule$1.evaluate(AbstractBeforeAfterRule.java:45)
	at com.carrotsearch.randomizedtesting.rules.StatementAdapter.evaluate(StatementAdapter.java:36)
	at org.apache.lucene.util.TestRuleStoreClassName$1.evaluate(TestRuleStoreClassName.java:41)
	at com.carrotsearch.randomizedtesting.rules.NoShadowingOrOverridesOnMethodsRule$1.evaluate(NoShadowingOrOverridesOnMethodsRule.java:40)
	at com.carrotsearch.randomizedtesting.rules.NoShadowingOrOverridesOnMethodsRule$1.evaluate(NoShadowingOrOverridesOnMethodsRule.java:40)
	at com.carrotsearch.randomizedtesting.rules.StatementAdapter.evaluate(StatementAdapter.java:36)
	at com.carrotsearch.randomizedtesting.rules.StatementAdapter.evaluate(StatementAdapter.java:36)
	at com.carrotsearch.randomizedtesting.rules.StatementAdapter.evaluate(StatementAdapter.java:36)
	at org.apache.lucene.util.TestRuleAssertionsRequired$1.evaluate(TestRuleAssertionsRequired.java:53)
	at org.apache.lucene.util.TestRuleMarkFailure$1.evaluate(TestRuleMarkFailure.java:47)
	at org.apache.lucene.util.TestRuleIgnoreAfterMaxFailures$1.evaluate(TestRuleIgnoreAfterMaxFailures.java:64)
	at org.apache.lucene.util.TestRuleIgnoreTestSuites$1.evaluate(TestRuleIgnoreTestSuites.java:54)
	at com.carrotsearch.randomizedtesting.rules.StatementAdapter.evaluate(StatementAdapter.java:36)
	at com.carrotsearch.randomizedtesting.ThreadLeakControl$StatementRunner.run(ThreadLeakControl.java:368)
	at java.lang.Thread.run(Thread.java:748)




Build Log:
[...truncated 12383 lines...]
   [junit4] Suite: org.apache.solr.cloud.TestTlogReplica
   [junit4]   2> 635114 INFO  (SUITE-TestTlogReplica-seed#[56E578426BA3C4D4]-worker) [    ] o.a.s.SolrTestCaseJ4 SecureRandom sanity checks: test.solr.allowed.securerandom=null & java.security.egd=file:/dev/./urandom
   [junit4]   2> Creating dataDir: /home/jenkins/workspace/Lucene-Solr-7.x-Linux/solr/build/solr-core/test/J2/temp/solr.cloud.TestTlogReplica_56E578426BA3C4D4-001/init-core-data-001
   [junit4]   2> 635114 WARN  (SUITE-TestTlogReplica-seed#[56E578426BA3C4D4]-worker) [    ] o.a.s.SolrTestCaseJ4 startTrackingSearchers: numOpens=7 numCloses=7
   [junit4]   2> 635114 INFO  (SUITE-TestTlogReplica-seed#[56E578426BA3C4D4]-worker) [    ] o.a.s.SolrTestCaseJ4 Using PointFields (NUMERIC_POINTS_SYSPROP=true) w/NUMERIC_DOCVALUES_SYSPROP=true
   [junit4]   2> 635115 INFO  (SUITE-TestTlogReplica-seed#[56E578426BA3C4D4]-worker) [    ] o.a.s.SolrTestCaseJ4 Randomized ssl (false) and clientAuth (true) via: @org.apache.solr.util.RandomizeSSL(reason=, value=NaN, ssl=NaN, clientAuth=NaN)
   [junit4]   2> 635115 INFO  (SUITE-TestTlogReplica-seed#[56E578426BA3C4D4]-worker) [    ] o.a.s.c.MiniSolrCloudCluster Starting cluster of 2 servers in /home/jenkins/workspace/Lucene-Solr-7.x-Linux/solr/build/solr-core/test/J2/temp/solr.cloud.TestTlogReplica_56E578426BA3C4D4-001/tempDir-001
   [junit4]   2> 635115 INFO  (SUITE-TestTlogReplica-seed#[56E578426BA3C4D4]-worker) [    ] o.a.s.c.ZkTestServer STARTING ZK TEST SERVER
   [junit4]   2> 635120 INFO  (Thread-2298) [    ] o.a.s.c.ZkTestServer client port:0.0.0.0/0.0.0.0:0
   [junit4]   2> 635120 INFO  (Thread-2298) [    ] o.a.s.c.ZkTestServer Starting server
   [junit4]   2> 635126 ERROR (Thread-2298) [    ] o.a.z.s.ZooKeeperServer ZKShutdownHandler is not registered, so ZooKeeper server won't take any action on ERROR or SHUTDOWN server state changes
   [junit4]   2> 635220 INFO  (SUITE-TestTlogReplica-seed#[56E578426BA3C4D4]-worker) [    ] o.a.s.c.ZkTestServer start zk server on port:40057
   [junit4]   2> 635271 INFO  (jetty-launcher-1108-thread-1) [    ] o.e.j.s.Server jetty-9.3.20.v20170531
   [junit4]   2> 635271 INFO  (jetty-launcher-1108-thread-2) [    ] o.e.j.s.Server jetty-9.3.20.v20170531
   [junit4]   2> 635274 INFO  (jetty-launcher-1108-thread-1) [    ] o.e.j.s.h.ContextHandler Started o.e.j.s.ServletContextHandler@67771bea{/solr,null,AVAILABLE}
   [junit4]   2> 635274 INFO  (jetty-launcher-1108-thread-2) [    ] o.e.j.s.h.ContextHandler Started o.e.j.s.ServletContextHandler@7083b05f{/solr,null,AVAILABLE}
   [junit4]   2> 635274 INFO  (jetty-launcher-1108-thread-1) [    ] o.e.j.s.AbstractConnector Started ServerConnector@fed2a71{HTTP/1.1,[http/1.1]}{127.0.0.1:45721}
   [junit4]   2> 635274 INFO  (jetty-launcher-1108-thread-2) [    ] o.e.j.s.AbstractConnector Started ServerConnector@38af0fba{HTTP/1.1,[http/1.1]}{127.0.0.1:45913}
   [junit4]   2> 635274 INFO  (jetty-launcher-1108-thread-1) [    ] o.e.j.s.Server Started @637187ms
   [junit4]   2> 635274 INFO  (jetty-launcher-1108-thread-2) [    ] o.e.j.s.Server Started @637187ms
   [junit4]   2> 635274 INFO  (jetty-launcher-1108-thread-1) [    ] o.a.s.c.s.e.JettySolrRunner Jetty properties: {hostContext=/solr, hostPort=45721}
   [junit4]   2> 635274 INFO  (jetty-launcher-1108-thread-2) [    ] o.a.s.c.s.e.JettySolrRunner Jetty properties: {hostContext=/solr, hostPort=45913}
   [junit4]   2> 635274 ERROR (jetty-launcher-1108-thread-1) [    ] o.a.s.u.StartupLoggingUtils Missing Java Option solr.log.dir. Logging may be missing or incomplete.
   [junit4]   2> 635274 ERROR (jetty-launcher-1108-thread-2) [    ] o.a.s.u.StartupLoggingUtils Missing Java Option solr.log.dir. Logging may be missing or incomplete.
   [junit4]   2> 635274 INFO  (jetty-launcher-1108-thread-1) [    ] o.a.s.s.SolrDispatchFilter  ___      _       Welcome to Apache Solr? version 7.2.0
   [junit4]   2> 635275 INFO  (jetty-launcher-1108-thread-2) [    ] o.a.s.s.SolrDispatchFilter  ___      _       Welcome to Apache Solr? version 7.2.0
   [junit4]   2> 635275 INFO  (jetty-launcher-1108-thread-1) [    ] o.a.s.s.SolrDispatchFilter / __| ___| |_ _   Starting in cloud mode on port null
   [junit4]   2> 635275 INFO  (jetty-launcher-1108-thread-2) [    ] o.a.s.s.SolrDispatchFilter / __| ___| |_ _   Starting in cloud mode on port null
   [junit4]   2> 635275 INFO  (jetty-launcher-1108-thread-1) [    ] o.a.s.s.SolrDispatchFilter \__ \/ _ \ | '_|  Install dir: null
   [junit4]   2> 635275 INFO  (jetty-launcher-1108-thread-2) [    ] o.a.s.s.SolrDispatchFilter \__ \/ _ \ | '_|  Install dir: null
   [junit4]   2> 635275 INFO  (jetty-launcher-1108-thread-1) [    ] o.a.s.s.SolrDispatchFilter |___/\___/_|_|    Start time: 2017-10-31T18:21:18.239Z
   [junit4]   2> 635275 INFO  (jetty-launcher-1108-thread-2) [    ] o.a.s.s.SolrDispatchFilter |___/\___/_|_|    Start time: 2017-10-31T18:21:18.239Z
   [junit4]   2> 635277 INFO  (jetty-launcher-1108-thread-2) [    ] o.a.s.s.SolrDispatchFilter solr.xml found in ZooKeeper. Loading...
   [junit4]   2> 635298 INFO  (jetty-launcher-1108-thread-1) [    ] o.a.s.s.SolrDispatchFilter solr.xml found in ZooKeeper. Loading...
   [junit4]   2> 635300 INFO  (jetty-launcher-1108-thread-2) [    ] o.a.s.c.ZkContainer Zookeeper client=127.0.0.1:40057/solr
   [junit4]   2> 635316 INFO  (jetty-launcher-1108-thread-1) [    ] o.a.s.c.ZkContainer Zookeeper client=127.0.0.1:40057/solr
   [junit4]   2> 635376 INFO  (jetty-launcher-1108-thread-2) [n:127.0.0.1:45913_solr    ] o.a.s.c.Overseer Overseer (id=null) closing
   [junit4]   2> 635376 INFO  (jetty-launcher-1108-thread-1) [n:127.0.0.1:45721_solr    ] o.a.s.c.Overseer Overseer (id=null) closing
   [junit4]   2> 635376 INFO  (jetty-launcher-1108-thread-2) [n:127.0.0.1:45913_solr    ] o.a.s.c.OverseerElectionContext I am going to be the leader 127.0.0.1:45913_solr
   [junit4]   2> 635376 INFO  (jetty-launcher-1108-thread-1) [n:127.0.0.1:45721_solr    ] o.a.s.c.ZkController Register node as live in ZooKeeper:/live_nodes/127.0.0.1:45721_solr
   [junit4]   2> 635376 INFO  (jetty-launcher-1108-thread-2) [n:127.0.0.1:45913_solr    ] o.a.s.c.Overseer Overseer (id=98924893181378564-127.0.0.1:45913_solr-n_0000000000) starting
   [junit4]   2> 635378 INFO  (zkCallback-1116-thread-1-processing-n:127.0.0.1:45913_solr) [n:127.0.0.1:45913_solr    ] o.a.s.c.c.ZkStateReader Updated live nodes from ZooKeeper... (0) -> (1)
   [junit4]   2> 635378 INFO  (zkCallback-1120-thread-1-processing-n:127.0.0.1:45721_solr) [n:127.0.0.1:45721_solr    ] o.a.s.c.c.ZkStateReader Updated live nodes from ZooKeeper... (0) -> (1)
   [junit4]   2> 635404 INFO  (jetty-launcher-1108-thread-2) [n:127.0.0.1:45913_solr    ] o.a.s.c.ZkController Register node as live in ZooKeeper:/live_nodes/127.0.0.1:45913_solr
   [junit4]   2> 635405 INFO  (zkCallback-1116-thread-1-processing-n:127.0.0.1:45913_solr) [n:127.0.0.1:45913_solr    ] o.a.s.c.c.ZkStateReader Updated live nodes from ZooKeeper... (1) -> (2)
   [junit4]   2> 635406 INFO  (zkCallback-1120-thread-1-processing-n:127.0.0.1:45721_solr) [n:127.0.0.1:45721_solr    ] o.a.s.c.c.ZkStateReader Updated live nodes from ZooKeeper... (1) -> (2)
   [junit4]   2> 635414 INFO  (jetty-launcher-1108-thread-1) [n:127.0.0.1:45721_solr    ] o.a.s.m.r.SolrJmxReporter JMX monitoring for 'solr_45721.solr.node' (registry 'solr.node') enabled at server: com.sun.jmx.mbeanserver.JmxMBeanServer@34e7322d
   [junit4]   2> 635421 INFO  (jetty-launcher-1108-thread-1) [n:127.0.0.1:45721_solr    ] o.a.s.m.r.SolrJmxReporter JMX monitoring for 'solr_45721.solr.jvm' (registry 'solr.jvm') enabled at server: com.sun.jmx.mbeanserver.JmxMBeanServer@34e7322d
   [junit4]   2> 635421 INFO  (jetty-launcher-1108-thread-1) [n:127.0.0.1:45721_solr    ] o.a.s.m.r.SolrJmxReporter JMX monitoring for 'solr_45721.solr.jetty' (registry 'solr.jetty') enabled at server: com.sun.jmx.mbeanserver.JmxMBeanServer@34e7322d
   [junit4]   2> 635422 INFO  (jetty-launcher-1108-thread-1) [n:127.0.0.1:45721_solr    ] o.a.s.c.CorePropertiesLocator Found 0 core definitions underneath /home/jenkins/workspace/Lucene-Solr-7.x-Linux/solr/build/solr-core/test/J2/temp/solr.cloud.TestTlogReplica_56E578426BA3C4D4-001/tempDir-001/node2/.
   [junit4]   2> 635544 INFO  (jetty-launcher-1108-thread-2) [n:127.0.0.1:45913_solr    ] o.a.s.m.r.SolrJmxReporter JMX monitoring for 'solr_45913.solr.node' (registry 'solr.node') enabled at server: com.sun.jmx.mbeanserver.JmxMBeanServer@34e7322d
   [junit4]   2> 635548 INFO  (jetty-launcher-1108-thread-2) [n:127.0.0.1:45913_solr    ] o.a.s.m.r.SolrJmxReporter JMX monitoring for 'solr_45913.solr.jvm' (registry 'solr.jvm') enabled at server: com.sun.jmx.mbeanserver.JmxMBeanServer@34e7322d
   [junit4]   2> 635549 INFO  (jetty-launcher-1108-thread-2) [n:127.0.0.1:45913_solr    ] o.a.s.m.r.SolrJmxReporter JMX monitoring for 'solr_45913.solr.jetty' (registry 'solr.jetty') enabled at server: com.sun.jmx.mbeanserver.JmxMBeanServer@34e7322d
   [junit4]   2> 635549 INFO  (jetty-launcher-1108-thread-2) [n:127.0.0.1:45913_solr    ] o.a.s.c.CorePropertiesLocator Found 0 core definitions underneath /home/jenkins/workspace/Lucene-Solr-7.x-Linux/solr/build/solr-core/test/J2/temp/solr.cloud.TestTlogReplica_56E578426BA3C4D4-001/tempDir-001/node1/.
   [junit4]   2> 635565 INFO  (SUITE-TestTlogReplica-seed#[56E578426BA3C4D4]-worker) [    ] o.a.s.c.c.ZkStateReader Updated live nodes from ZooKeeper... (0) -> (2)
   [junit4]   2> 635569 INFO  (SUITE-TestTlogReplica-seed#[56E578426BA3C4D4]-worker) [    ] o.a.s.c.s.i.ZkClientClusterStateProvider Cluster at 127.0.0.1:40057/solr ready
   [junit4]   2> 635571 INFO  (SUITE-TestTlogReplica-seed#[56E578426BA3C4D4]-worker) [    ] o.a.s.c.TestTlogReplica Using legacyCloud?: false
   [junit4]   2> 635572 INFO  (qtp1341810275-7026) [n:127.0.0.1:45913_solr    ] o.a.s.h.a.CollectionsHandler Invoked Collection Action :clusterprop with params val=false&name=legacyCloud&action=CLUSTERPROP&wt=javabin&version=2 and sendToOCPQueue=true
   [junit4]   2> 635572 INFO  (qtp1341810275-7026) [n:127.0.0.1:45913_solr    ] o.a.s.s.HttpSolrCall [admin] webapp=null path=/admin/collections params={val=false&name=legacyCloud&action=CLUSTERPROP&wt=javabin&version=2} status=0 QTime=0
   [junit4]   2> 635578 INFO  (TEST-TestTlogReplica.testBasicLeaderElection-seed#[56E578426BA3C4D4]) [    ] o.a.s.SolrTestCaseJ4 ###Starting testBasicLeaderElection
   [junit4]   2> 635579 INFO  (qtp1341810275-7028) [n:127.0.0.1:45913_solr    ] o.a.s.h.a.CollectionsHandler Invoked Collection Action :create with params pullReplicas=0&replicationFactor=0&collection.configName=conf&maxShardsPerNode=100&name=tlog_replica_test_basic_leader_election&nrtReplicas=0&action=CREATE&numShards=1&tlogReplicas=2&wt=javabin&version=2 and sendToOCPQueue=true
   [junit4]   2> 635580 INFO  (OverseerThreadFactory-2854-thread-1-processing-n:127.0.0.1:45913_solr) [n:127.0.0.1:45913_solr    ] o.a.s.c.CreateCollectionCmd Create collection tlog_replica_test_basic_leader_election
   [junit4]   2> 635683 INFO  (OverseerStateUpdate-98924893181378564-127.0.0.1:45913_solr-n_0000000000) [n:127.0.0.1:45913_solr    ] o.a.s.c.o.SliceMutator createReplica() {
   [junit4]   2>   "operation":"ADDREPLICA",
   [junit4]   2>   "collection":"tlog_replica_test_basic_leader_election",
   [junit4]   2>   "shard":"shard1",
   [junit4]   2>   "core":"tlog_replica_test_basic_leader_election_shard1_replica_t1",
   [junit4]   2>   "state":"down",
   [junit4]   2>   "base_url":"http://127.0.0.1:45721/solr",
   [junit4]   2>   "type":"TLOG",
   [junit4]   2>   "waitForFinalState":"false"} 
   [junit4]   2> 635684 INFO  (OverseerStateUpdate-98924893181378564-127.0.0.1:45913_solr-n_0000000000) [n:127.0.0.1:45913_solr    ] o.a.s.c.o.SliceMutator createReplica() {
   [junit4]   2>   "operation":"ADDREPLICA",
   [junit4]   2>   "collection":"tlog_replica_test_basic_leader_election",
   [junit4]   2>   "shard":"shard1",
   [junit4]   2>   "core":"tlog_replica_test_basic_leader_election_shard1_replica_t2",
   [junit4]   2>   "state":"down",
   [junit4]   2>   "base_url":"http://127.0.0.1:45913/solr",
   [junit4]   2>   "type":"TLOG",
   [junit4]   2>   "waitForFinalState":"false"} 
   [junit4]   2> 635886 INFO  (qtp1341810275-7015) [n:127.0.0.1:45913_solr    ] o.a.s.h.a.CoreAdminOperation core create command qt=/admin/cores&coreNodeName=core_node4&collection.configName=conf&newCollection=true&name=tlog_replica_test_basic_leader_election_shard1_replica_t2&action=CREATE&numShards=1&collection=tlog_replica_test_basic_leader_election&shard=shard1&wt=javabin&version=2&replicaType=TLOG
   [junit4]   2> 635887 INFO  (qtp519579176-7023) [n:127.0.0.1:45721_solr    ] o.a.s.h.a.CoreAdminOperation core create command qt=/admin/cores&coreNodeName=core_node3&collection.configName=conf&newCollection=true&name=tlog_replica_test_basic_leader_election_shard1_replica_t1&action=CREATE&numShards=1&collection=tlog_replica_test_basic_leader_election&shard=shard1&wt=javabin&version=2&replicaType=TLOG
   [junit4]   2> 635887 INFO  (qtp1341810275-7015) [n:127.0.0.1:45913_solr    ] o.a.s.c.TransientSolrCoreCacheDefault Allocating transient cache for 2147483647 transient cores
   [junit4]   2> 635887 INFO  (qtp519579176-7023) [n:127.0.0.1:45721_solr    ] o.a.s.c.TransientSolrCoreCacheDefault Allocating transient cache for 2147483647 transient cores
   [junit4]   2> 635991 INFO  (zkCallback-1116-thread-1-processing-n:127.0.0.1:45913_solr) [n:127.0.0.1:45913_solr    ] o.a.s.c.c.ZkStateReader A cluster state change: [WatchedEvent state:SyncConnected type:NodeDataChanged path:/collections/tlog_replica_test_basic_leader_election/state.json] for collection [tlog_replica_test_basic_leader_election] has occurred - updating... (live nodes size: [2])
   [junit4]   2> 635991 INFO  (zkCallback-1120-thread-1-processing-n:127.0.0.1:45721_solr) [n:127.0.0.1:45721_solr    ] o.a.s.c.c.ZkStateReader A cluster state change: [WatchedEvent state:SyncConnected type:NodeDataChanged path:/collections/tlog_replica_test_basic_leader_election/state.json] for collection [tlog_replica_test_basic_leader_election] has occurred - updating... (live nodes size: [2])
   [junit4]   2> 635992 INFO  (zkCallback-1116-thread-2-processing-n:127.0.0.1:45913_solr) [n:127.0.0.1:45913_solr    ] o.a.s.c.c.ZkStateReader A cluster state change: [WatchedEvent state:SyncConnected type:NodeDataChanged path:/collections/tlog_replica_test_basic_leader_election/state.json] for collection [tlog_replica_test_basic_leader_election] has occurred - updating... (live nodes size: [2])
   [junit4]   2> 635992 INFO  (zkCallback-1120-thread-2-processing-n:127.0.0.1:45721_solr) [n:127.0.0.1:45721_solr    ] o.a.s.c.c.ZkStateReader A cluster state change: [WatchedEvent state:SyncConnected type:NodeDataChanged path:/collections/tlog_replica_test_basic_leader_election/state.json] for collection [tlog_replica_test_basic_leader_election] has occurred - updating... (live nodes size: [2])
   [junit4]   2> 636896 INFO  (qtp1341810275-7015) [n:127.0.0.1:45913_solr c:tlog_replica_test_basic_leader_election s:shard1 r:core_node4 x:tlog_replica_test_basic_leader_election_shard1_replica_t2] o.a.s.c.SolrConfig Using Lucene MatchVersion: 7.2.0
   [junit4]   2> 636916 INFO  (qtp1341810275-7015) [n:127.0.0.1:45913_solr c:tlog_replica_test_basic_leader_election s:shard1 r:core_node4 x:tlog_replica_test_basic_leader_election_shard1_replica_t2] o.a.s.s.IndexSchema [tlog_replica_test_basic_leader_election_shard1_replica_t2] Schema name=minimal
   [junit4]   2> 636919 INFO  (qtp1341810275-7015) [n:127.0.0.1:45913_solr c:tlog_replica_test_basic_leader_election s:shard1 r:core_node4 x:tlog_replica_test_basic_leader_election_shard1_replica_t2] o.a.s.s.IndexSchema Loaded schema minimal/1.1 with uniqueid field id
   [junit4]   2> 636919 INFO  (qtp1341810275-7015) [n:127.0.0.1:45913_solr c:tlog_replica_test_basic_leader_election s:shard1 r:core_node4 x:tlog_replica_test_basic_leader_election_shard1_replica_t2] o.a.s.c.CoreContainer Creating SolrCore 'tlog_replica_test_basic_leader_election_shard1_replica_t2' using configuration from collection tlog_replica_test_basic_leader_election, trusted=true
   [junit4]   2> 636919 INFO  (qtp1341810275-7015) [n:127.0.0.1:45913_solr c:tlog_replica_test_basic_leader_election s:shard1 r:core_node4 x:tlog_replica_test_basic_leader_election_shard1_replica_t2] o.a.s.m.r.SolrJmxReporter JMX monitoring for 'solr_45913.solr.core.tlog_replica_test_basic_leader_election.shard1.replica_t2' (registry 'solr.core.tlog_replica_test_basic_leader_election.shard1.replica_t2') enabled at server: com.sun.jmx.mbeanserver.JmxMBeanServer@34e7322d
   [junit4]   2> 636919 INFO  (qtp1341810275-7015) [n:127.0.0.1:45913_solr c:tlog_replica_test_basic_leader_election s:shard1 r:core_node4 x:tlog_replica_test_basic_leader_election_shard1_replica_t2] o.a.s.c.SolrCore solr.RecoveryStrategy.Builder
   [junit4]   2> 636919 INFO  (qtp1341810275-7015) [n:127.0.0.1:45913_solr c:tlog_replica_test_basic_leader_election s:shard1 r:core_node4 x:tlog_replica_test_basic_leader_election_shard1_replica_t2] o.a.s.c.SolrCore [[tlog_replica_test_basic_leader_election_shard1_replica_t2] ] Opening new SolrCore at [/home/jenkins/workspace/Lucene-Solr-7.x-Linux/solr/build/solr-core/test/J2/temp/solr.cloud.TestTlogReplica_56E578426BA3C4D4-001/tempDir-001/node1/tlog_replica_test_basic_leader_election_shard1_replica_t2], dataDir=[/home/jenkins/workspace/Lucene-Solr-7.x-Linux/solr/build/solr-core/test/J2/temp/solr.cloud.TestTlogReplica_56E578426BA3C4D4-001/tempDir-001/node1/./tlog_replica_test_basic_leader_election_shard1_replica_t2/data/]
   [junit4]   2> 636928 INFO  (qtp519579176-7023) [n:127.0.0.1:45721_solr c:tlog_replica_test_basic_leader_election s:shard1 r:core_node3 x:tlog_replica_test_basic_leader_election_shard1_replica_t1] o.a.s.c.SolrConfig Using Lucene MatchVersion: 7.2.0
   [junit4]   2> 636934 INFO  (qtp519579176-7023) [n:127.0.0.1:45721_solr c:tlog_replica_test_basic_leader_election s:shard1 r:core_node3 x:tlog_replica_test_basic_leader_election_shard1_replica_t1] o.a.s.s.IndexSchema [tlog_replica_test_basic_leader_election_shard1_replica_t1] Schema name=minimal
   [junit4]   2> 636936 INFO  (qtp519579176-7023) [n:127.0.0.1:45721_solr c:tlog_replica_test_basic_leader_election s:shard1 r:core_node3 x:tlog_replica_test_basic_leader_election_shard1_replica_t1] o.a.s.s.IndexSchema Loaded schema minimal/1.1 with uniqueid field id
   [junit4]   2> 636936 INFO  (qtp519579176-7023) [n:127.0.0.1:45721_solr c:tlog_replica_test_basic_leader_election s:shard1 r:core_node3 x:tlog_replica_test_basic_leader_election_shard1_replica_t1] o.a.s.c.CoreContainer Creating SolrCore 'tlog_replica_test_basic_leader_election_shard1_replica_t1' using configuration from collection tlog_replica_test_basic_leader_election, trusted=true
   [junit4]   2> 636936 INFO  (qtp519579176-7023) [n:127.0.0.1:45721_solr c:tlog_replica_test_basic_leader_election s:shard1 r:core_node3 x:tlog_replica_test_basic_leader_election_shard1_replica_t1] o.a.s.m.r.SolrJmxReporter JMX monitoring for 'solr_45721.solr.core.tlog_replica_test_basic_leader_election.shard1.replica_t1' (registry 'solr.core.tlog_replica_test_basic_leader_election.shard1.replica_t1') enabled at server: com.sun.jmx.mbeanserver.JmxMBeanServer@34e7322d
   [junit4]   2> 636936 INFO  (qtp519579176-7023) [n:127.0.0.1:45721_solr c:tlog_replica_test_basic_leader_election s:shard1 r:core_node3 x:tlog_replica_test_basic_leader_election_shard1_replica_t1] o.a.s.c.SolrCore solr.RecoveryStrategy.Builder
   [junit4]   2> 636936 INFO  (qtp519579176-7023) [n:127.0.0.1:45721_solr c:tlog_replica_test_basic_leader_election s:shard1 r:core_node3 x:tlog_replica_test_basic_leader_election_shard1_replica_t1] o.a.s.c.SolrCore [[tlog_replica_test_basic_leader_election_shard1_replica_t1] ] Opening new SolrCore at [/home/jenkins/workspace/Lucene-Solr-7.x-Linux/solr/build/solr-core/test/J2/temp/solr.cloud.TestTlogReplica_56E578426BA3C4D4-001/tempDir-001/node2/tlog_replica_test_basic_leader_election_shard1_replica_t1], dataDir=[/home/jenkins/workspace/Lucene-Solr-7.x-Linux/solr/build/solr-core/test/J2/temp/solr.cloud.TestTlogReplica_56E578426BA3C4D4-001/tempDir-001/node2/./tlog_replica_test_basic_leader_election_shard1_replica_t1/data/]
   [junit4]   2> 636998 INFO  (qtp1341810275-7015) [n:127.0.0.1:45913_solr c:tlog_replica_test_basic_leader_election s:shard1 r:core_node4 x:tlog_replica_test_basic_leader_election_shard1_replica_t2] o.a.s.u.UpdateHandler Using UpdateLog implementation: org.apache.solr.update.UpdateLog
   [junit4]   2> 636998 INFO  (qtp1341810275-7015) [n:127.0.0.1:45913_solr c:tlog_replica_test_basic_leader_election s:shard1 r:core_node4 x:tlog_replica_test_basic_leader_election_shard1_replica_t2] o.a.s.u.UpdateLog Initializing UpdateLog: dataDir=null defaultSyncLevel=FLUSH numRecordsToKeep=100 maxNumLogsToKeep=10 numVersionBuckets=65536
   [junit4]   2> 636999 INFO  (qtp1341810275-7015) [n:127.0.0.1:45913_solr c:tlog_replica_test_basic_leader_election s:shard1 r:core_node4 x:tlog_replica_test_basic_leader_election_shard1_replica_t2] o.a.s.u.CommitTracker Hard AutoCommit: disabled
   [junit4]   2> 637000 INFO  (qtp1341810275-7015) [n:127.0.0.1:45913_solr c:tlog_replica_test_basic_leader_election s:shard1 r:core_node4 x:tlog_replica_test_basic_leader_election_shard1_replica_t2] o.a.s.u.CommitTracker Soft AutoCommit: disabled
   [junit4]   2> 637001 INFO  (qtp1341810275-7015) [n:127.0.0.1:45913_solr c:tlog_replica_test_basic_leader_election s:shard1 r:core_node4 x:tlog_replica_test_basic_leader_election_shard1_replica_t2] o.a.s.s.SolrIndexSearcher Opening [Searcher@6731e158[tlog_replica_test_basic_leader_election_shard1_replica_t2] main]
   [junit4]   2> 637002 INFO  (qtp1341810275-7015) [n:127.0.0.1:45913_solr c:tlog_replica_test_basic_leader_election s:shard1 r:core_node4 x:tlog_replica_test_basic_leader_election_shard1_replica_t2] o.a.s.r.ManagedResourceStorage Configured ZooKeeperStorageIO with znodeBase: /configs/conf
   [junit4]   2> 637003 INFO  (qtp1341810275-7015) [n:127.0.0.1:45913_solr c:tlog_replica_test_basic_leader_election s:shard1 r:core_node4 x:tlog_replica_test_basic_leader_election_shard1_replica_t2] o.a.s.r.ManagedResourceStorage Loaded null at path _rest_managed.json using ZooKeeperStorageIO:path=/configs/conf
   [junit4]   2> 637004 INFO  (qtp1341810275-7015) [n:127.0.0.1:45913_solr c:tlog_replica_test_basic_leader_election s:shard1 r:core_node4 x:tlog_replica_test_basic_leader_election_shard1_replica_t2] o.a.s.h.ReplicationHandler Commits will be reserved for 10000ms.
   [junit4]   2> 637004 INFO  (qtp1341810275-7015) [n:127.0.0.1:45913_solr c:tlog_replica_test_basic_leader_election s:shard1 r:core_node4 x:tlog_replica_test_basic_leader_election_shard1_replica_t2] o.a.s.u.UpdateLog Could not find max version in index or recent updates, using new clock 1582798292876525568
   [junit4]   2> 637008 INFO  (qtp1341810275-7015) [n:127.0.0.1:45913_solr c:tlog_replica_test_basic_leader_election s:shard1 r:core_node4 x:tlog_replica_test_basic_leader_election_shard1_replica_t2] o.a.s.c.ShardLeaderElectionContext Waiting until we see more replicas up for shard shard1: total=2 found=1 timeoutin=9999ms
   [junit4]   2> 637009 INFO  (searcherExecutor-2859-thread-1-processing-n:127.0.0.1:45913_solr x:tlog_replica_test_basic_leader_election_shard1_replica_t2 s:shard1 c:tlog_replica_test_basic_leader_election r:core_node4) [n:127.0.0.1:45913_solr c:tlog_replica_test_basic_leader_election s:shard1 r:core_node4 x:tlog_replica_test_basic_leader_election_shard1_replica_t2] o.a.s.c.SolrCore [tlog_replica_test_basic_leader_election_shard1_replica_t2] Registered new searcher Searcher@6731e158[tlog_replica_test_basic_leader_election_shard1_replica_t2] main{ExitableDirectoryReader(UninvertingDirectoryReader())}
   [junit4]   2> 637017 INFO  (qtp519579176-7023) [n:127.0.0.1:45721_solr c:tlog_replica_test_basic_leader_election s:shard1 r:core_node3 x:tlog_replica_test_basic_leader_election_shard1_replica_t1] o.a.s.u.UpdateHandler Using UpdateLog implementation: org.apache.solr.update.UpdateLog
   [junit4]   2> 637017 INFO  (qtp519579176-7023) [n:127.0.0.1:45721_solr c:tlog_replica_test_basic_leader_election s:shard1 r:core_node3 x:tlog_replica_test_basic_leader_election_shard1_replica_t1] o.a.s.u.UpdateLog Initializing UpdateLog: dataDir=null defaultSyncLevel=FLUSH numRecordsToKeep=100 maxNumLogsToKeep=10 numVersionBuckets=65536
   [junit4]   2> 637019 INFO  (qtp519579176-7023) [n:127.0.0.1:45721_solr c:tlog_replica_test_basic_leader_election s:shard1 r:core_node3 x:tlog_replica_test_basic_leader_election_shard1_replica_t1] o.a.s.u.CommitTracker Hard AutoCommit: disabled
   [junit4]   2> 637019 INFO  (qtp519579176-7023) [n:127.0.0.1:45721_solr c:tlog_replica_test_basic_leader_election s:shard1 r:core_node3 x:tlog_replica_test_basic_leader_election_shard1_replica_t1] o.a.s.u.CommitTracker Soft AutoCommit: disabled
   [junit4]   2> 637021 INFO  (qtp519579176-7023) [n:127.0.0.1:45721_solr c:tlog_replica_test_basic_leader_election s:shard1 r:core_node3 x:tlog_replica_test_basic_leader_election_shard1_replica_t1] o.a.s.s.SolrIndexSearcher Opening [Searcher@1d9ee55f[tlog_replica_test_basic_leader_election_shard1_replica_t1] main]
   [junit4]   2> 637022 INFO  (qtp519579176-7023) [n:127.0.0.1:45721_solr c:tlog_replica_test_basic_leader_election s:shard1 r:core_node3 x:tlog_replica_test_basic_leader_election_shard1_replica_t1] o.a.s.r.ManagedResourceStorage Configured ZooKeeperStorageIO with znodeBase: /configs/conf
   [junit4]   2> 637022 INFO  (qtp519579176-7023) [n:127.0.0.1:45721_solr c:tlog_replica_test_basic_leader_election s:shard1 r:core_node3 x:tlog_replica_test_basic_leader_election_shard1_replica_t1] o.a.s.r.ManagedResourceStorage Loaded null at path _rest_managed.json using ZooKeeperStorageIO:path=/configs/conf
   [junit4]   2> 637023 INFO  (qtp519579176-7023) [n:127.0.0.1:45721_solr c:tlog_replica_test_basic_leader_election s:shard1 r:core_node3 x:tlog_replica_test_basic_leader_election_shard1_replica_t1] o.a.s.h.ReplicationHandler Commits will be reserved for 10000ms.
   [junit4]   2> 637023 INFO  (qtp519579176-7023) [n:127.0.0.1:45721_solr c:tlog_replica_test_basic_leader_election s:shard1 r:core_node3 x:tlog_replica_test_basic_leader_election_shard1_replica_t1] o.a.s.u.UpdateLog Could not find max version in index or recent updates, using new clock 1582798292896448512
   [junit4]   2> 637024 INFO  (searcherExecutor-2860-thread-1-processing-n:127.0.0.1:45721_solr x:tlog_replica_test_basic_leader_election_shard1_replica_t1 s:shard1 c:tlog_replica_test_basic_leader_election r:core_node3) [n:127.0.0.1:45721_solr c:tlog_replica_test_basic_leader_election s:shard1 r:core_node3 x:tlog_replica_test_basic_leader_election_shard1_replica_t1] o.a.s.c.SolrCore [tlog_replica_test_basic_leader_election_shard1_replica_t1] Registered new searcher Searcher@1d9ee55f[tlog_replica_test_basic_leader_election_shard1_replica_t1] main{ExitableDirectoryReader(UninvertingDirectoryReader())}
   [junit4]   2> 637117 INFO  (zkCallback-1116-thread-2-processing-n:127.0.0.1:45913_solr) [n:127.0.0.1:45913_solr    ] o.a.s.c.c.ZkStateReader A cluster state change: [WatchedEvent state:SyncConnected type:NodeDataChanged path:/collections/tlog_replica_test_basic_leader_election/state.json] for collection [tlog_replica_test_basic_leader_election] has occurred - updating... (live nodes size: [2])
   [junit4]   2> 637117 INFO  (zkCallback-1116-thread-1-processing-n:127.0.0.1:45913_solr) [n:127.0.0.1:45913_solr    ] o.a.s.c.c.ZkStateReader A cluster state change: [WatchedEvent state:SyncConnected type:NodeDataChanged path:/collections/tlog_replica_test_basic_leader_election/state.json] for collection [tlog_replica_test_basic_leader_election] has occurred - updating... (live nodes size: [2])
   [junit4]   2> 637118 INFO  (zkCallback-1120-thread-2-processing-n:127.0.0.1:45721_solr) [n:127.0.0.1:45721_solr    ] o.a.s.c.c.ZkStateReader A cluster state change: [WatchedEvent state:SyncConnected type:NodeDataChanged path:/collections/tlog_replica_test_basic_leader_election/state.json] for collection [tlog_replica_test_basic_leader_election] has occurred - updating... (live nodes size: [2])
   [junit4]   2> 637118 INFO  (zkCallback-1120-thread-1-processing-n:127.0.0.1:45721_solr) [n:127.0.0.1:45721_solr    ] o.a.s.c.c.ZkStateReader A cluster state change: [WatchedEvent state:SyncConnected type:NodeDataChanged path:/collections/tlog_replica_test_basic_leader_election/state.json] for collection [tlog_replica_test_basic_leader_election] has occurred - updating... (live nodes size: [2])
   [junit4]   2> 637508 INFO  (qtp1341810275-7015) [n:127.0.0.1:45913_solr c:tlog_replica_test_basic_leader_election s:shard1 r:core_node4 x:tlog_replica_test_basic_leader_election_shard1_replica_t2] o.a.s.c.ShardLeaderElectionContext Enough replicas found to continue.
   [junit4]   2> 637508 INFO  (qtp1341810275-7015) [n:127.0.0.1:45913_solr c:tlog_replica_test_basic_leader_election s:shard1 r:core_node4 x:tlog_replica_test_basic_leader_election_shard1_replica_t2] o.a.s.c.ShardLeaderElectionContext I may be the new leader - try and sync
   [junit4]   2> 637508 INFO  (qtp1341810275-7015) [n:127.0.0.1:45913_solr c:tlog_replica_test_basic_leader_election s:shard1 r:core_node4 x:tlog_replica_test_basic_leader_election_shard1_replica_t2] o.a.s.c.SyncStrategy Sync replicas to http://127.0.0.1:45913/solr/tlog_replica_test_basic_leader_election_shard1_replica_t2/
   [junit4]   2> 637509 INFO  (qtp1341810275-7015) [n:127.0.0.1:45913_solr c:tlog_replica_test_basic_leader_election s:shard1 r:core_node4 x:tlog_replica_test_basic_leader_election_shard1_replica_t2] o.a.s.u.PeerSync PeerSync: core=tlog_replica_test_basic_leader_election_shard1_replica_t2 url=http://127.0.0.1:45913/solr START replicas=[http://127.0.0.1:45721/solr/tlog_replica_test_basic_leader_election_shard1_replica_t1/] nUpdates=100
   [junit4]   2> 637510 INFO  (qtp519579176-7027) [n:127.0.0.1:45721_solr c:tlog_replica_test_basic_leader_election s:shard1 r:core_node3 x:tlog_replica_test_basic_leader_election_shard1_replica_t1] o.a.s.c.S.Request [tlog_replica_test_basic_leader_election_shard1_replica_t1]  webapp=/solr path=/get params={distrib=false&qt=/get&fingerprint=false&getVersions=100&wt=javabin&version=2} status=0 QTime=0
   [junit4]   2> 637809 INFO  (qtp1341810275-7015) [n:127.0.0.1:45913_solr c:tlog_replica_test_basic_leader_election s:shard1 r:core_node4 x:tlog_replica_test_basic_leader_election_shard1_replica_t2] o.a.s.u.PeerSync PeerSync: core=tlog_replica_test_basic_leader_election_shard1_replica_t2 url=http://127.0.0.1:45913/solr DONE.  We have no versions.  sync failed.
   [junit4]   2> 637809 INFO  (qtp1341810275-7015) [n:127.0.0.1:45913_solr c:tlog_replica_test_basic_leader_election s:shard1 r:core_node4 x:tlog_replica_test_basic_leader_election_shard1_replica_t2] o.a.s.c.SyncStrategy Leader's attempt to sync with shard failed, moving to the next candidate
   [junit4]   2> 637809 INFO  (qtp1341810275-7015) [n:127.0.0.1:45913_solr c:tlog_replica_test_basic_leader_election s:shard1 r:core_node4 x:tlog_replica_test_basic_leader_election_shard1_replica_t2] o.a.s.c.ShardLeaderElectionContext We failed sync, but we have no versions - we can't sync in that case - we were active before, so become leader anyway
   [junit4]   2> 637809 INFO  (qtp1341810275-7015) [n:127.0.0.1:45913_solr c:tlog_replica_test_basic_leader_election s:shard1 r:core_node4 x:tlog_replica_test_basic_leader_election_shard1_replica_t2] o.a.s.c.ShardLeaderElectionContext Found all replicas participating in election, clear LIR
   [junit4]   2> 637809 INFO  (qtp1341810275-7015) [n:127.0.0.1:45913_solr c:tlog_replica_test_basic_leader_election s:shard1 r:core_node4 x:tlog_replica_test_basic_leader_election_shard1_replica_t2] o.a.s.c.ZkController tlog_replica_test_basic_leader_election_shard1_replica_t2 stopping background replication from leader
   [junit4]   2> 637811 INFO  (qtp1341810275-7015) [n:127.0.0.1:45913_solr c:tlog_replica_test_basic_leader_election s:shard1 r:core_node4 x:tlog_replica_test_basic_leader_election_shard1_replica_t2] o.a.s.c.ShardLeaderElectionContext I am the new leader: http://127.0.0.1:45913/solr/tlog_replica_test_basic_leader_election_shard1_replica_t2/ shard1
   [junit4]   2> 637912 INFO  (zkCallback-1120-thread-1-processing-n:127.0.0.1:45721_solr) [n:127.0.0.1:45721_solr    ] o.a.s.c.c.ZkStateReader A cluster state change: [WatchedEvent state:SyncConnected type:NodeDataChanged path:/collections/tlog_replica_test_basic_leader_election/state.json] for collection [tlog_replica_test_basic_leader_election] has occurred - updating... (live nodes size: [2])
   [junit4]   2> 637912 INFO  (zkCallback-1116-thread-1-processing-n:127.0.0.1:45913_solr) [n:127.0.0.1:45913_solr    ] o.a.s.c.c.ZkStateReader A cluster state change: [WatchedEvent state:SyncConnected type:NodeDataChanged path:/collections/tlog_replica_test_basic_leader_election/state.json] for collection [tlog_replica_test_basic_leader_election] has occurred - updating... (live nodes size: [2])
   [junit4]   2> 637912 INFO  (zkCallback-1120-thread-2-processing-n:127.0.0.1:45721_solr) [n:127.0.0.1:45721_solr    ] o.a.s.c.c.ZkStateReader A cluster state change: [WatchedEvent state:SyncConnected type:NodeDataChanged path:/collections/tlog_replica_test_basic_leader_election/state.json] for collection [tlog_replica_test_basic_leader_election] has occurred - updating... (live nodes size: [2])
   [junit4]   2> 637912 INFO  (zkCallback-1116-thread-2-processing-n:127.0.0.1:45913_solr) [n:127.0.0.1:45913_solr    ] o.a.s.c.c.ZkStateReader A cluster state change: [WatchedEvent state:SyncConnected type:NodeDataChanged path:/collections/tlog_replica_test_basic_leader_election/state.json] for collection [tlog_replica_test_basic_leader_election] has occurred - updating... (live nodes size: [2])
   [junit4]   2> 637961 INFO  (qtp1341810275-7015) [n:127.0.0.1:45913_solr c:tlog_replica_test_basic_leader_election s:shard1 r:core_node4 x:tlog_replica_test_basic_leader_election_shard1_replica_t2] o.a.s.c.ZkController I am the leader, no recovery necessary
   [junit4]   2> 637962 INFO  (qtp1341810275-7015) [n:127.0.0.1:45913_solr c:tlog_replica_test_basic_leader_election s:shard1 r:core_node4 x:tlog_replica_test_basic_leader_election_shard1_replica_t2] o.a.s.s.HttpSolrCall [admin] webapp=null path=/admin/cores params={qt=/admin/cores&coreNodeName=core_node4&collection.configName=conf&newCollection=true&name=tlog_replica_test_basic_leader_election_shard1_replica_t2&action=CREATE&numShards=1&collection=tlog_replica_test_basic_leader_election&shard=shard1&wt=javabin&version=2&replicaType=TLOG} status=0 QTime=2075
   [junit4]   2> 638030 INFO  (qtp519579176-7023) [n:127.0.0.1:45721_solr c:tlog_replica_test_basic_leader_election s:shard1 r:core_node3 x:tlog_replica_test_basic_leader_election_shard1_replica_t1] o.a.s.c.ZkController tlog_replica_test_basic_leader_election_shard1_replica_t1 starting background replication from leader
   [junit4]   2> 638030 INFO  (qtp519579176-7023) [n:127.0.0.1:45721_solr c:tlog_replica_test_basic_leader_election s:shard1 r:core_node3 x:tlog_replica_test_basic_leader_election_shard1_replica_t1] o.a.s.c.ReplicateFromLeader Will start replication from leader with poll interval: 00:00:03
   [junit4]   2> 638033 INFO  (qtp519579176-7023) [n:127.0.0.1:45721_solr c:tlog_replica_test_basic_leader_election s:shard1 r:core_node3 x:tlog_replica_test_basic_leader_election_shard1_replica_t1] o.a.s.h.ReplicationHandler Poll scheduled at an interval of 3000ms
   [junit4]   2> 638033 INFO  (qtp519579176-7023) [n:127.0.0.1:45721_solr c:tlog_replica_test_basic_leader_election s:shard1 r:core_node3 x:tlog_replica_test_basic_leader_election_shard1_replica_t1] o.a.s.h.ReplicationHandler Commits will be reserved for 10000ms.
   [junit4]   2> 638033 INFO  (indexFetcher-2870-thread-1) [n:127.0.0.1:45721_solr c:tlog_replica_test_basic_leader_election s:shard1 r:core_node3 x:tlog_replica_test_basic_leader_election_shard1_replica_t1] o.a.s.h.IndexFetcher Replica core_node4 is leader but it's state is down, skipping replication
   [junit4]   2> 638034 INFO  (qtp519579176-7023) [n:127.0.0.1:45721_solr c:tlog_replica_test_basic_leader_election s:shard1 r:core_node3 x:tlog_replica_test_basic_leader_election_shard1_replica_t1] o.a.s.s.HttpSolrCall [admin] webapp=null path=/admin/cores params={qt=/admin/cores&coreNodeName=core_node3&collection.configName=conf&newCollection=true&name=tlog_replica_test_basic_leader_election_shard1_replica_t1&action=CREATE&numShards=1&collection=tlog_replica_test_basic_leader_election&shard=shard1&wt=javabin&version=2&replicaType=TLOG} status=0 QTime=2147
   [junit4]   2> 638035 INFO  (qtp1341810275-7028) [n:127.0.0.1:45913_solr    ] o.a.s.h.a.CollectionsHandler Wait for new collection to be active for at most 30 seconds. Check all shard replicas
   [junit4]   2> 638036 INFO  (OverseerCollectionConfigSetProcessor-98924893181378564-127.0.0.1:45913_solr-n_0000000000) [n:127.0.0.1:45913_solr    ] o.a.s.c.OverseerTaskQueue Response ZK path: /overseer/collection-queue-work/qnr-0000000000 doesn't exist.  Requestor may have disconnected from ZooKeeper
   [junit4]   2> 638135 INFO  (zkCallback-1116-thread-2-processing-n:127.0.0.1:45913_solr) [n:127.0.0.1:45913_solr    ] o.a.s.c.c.ZkStateReader A cluster state change: [WatchedEvent state:SyncConnected type:NodeDataChanged path:/collections/tlog_replica_test_basic_leader_election/state.json] for collection [tlog_replica_test_basic_leader_election] has occurred - updating... (live nodes size: [2])
   [junit4]   2> 638135 INFO  (zkCallback-1116-thread-1-processing-n:127.0.0.1:45913_solr) [n:127.0.0.1:45913_solr    ] o.a.s.c.c.ZkStateReader A cluster state change: [WatchedEvent state:SyncConnected type:NodeDataChanged path:/collections/tlog_replica_test_basic_leader_election/state.json] for collection [tlog_replica_test_basic_leader_election] has occurred - updating... (live nodes size: [2])
   [junit4]   2> 638135 INFO  (zkCallback-1120-thread-2-processing-n:127.0.0.1:45721_solr) [n:127.0.0.1:45721_solr    ] o.a.s.c.c.ZkStateReader A cluster state change: [WatchedEvent state:SyncConnected type:NodeDataChanged path:/collections/tlog_replica_test_basic_leader_election/state.json] for collection [tlog_replica_test_basic_leader_election] has occurred - updating... (live nodes size: [2])
   [junit4]   2> 638135 INFO  (zkCallback-1120-thread-1-processing-n:127.0.0.1:45721_solr) [n:127.0.0.1:45721_solr    ] o.a.s.c.c.ZkStateReader A cluster state change: [WatchedEvent state:SyncConnected type:NodeDataChanged path:/collections/tlog_replica_test_basic_leader_election/state.json] for collection [tlog_replica_test_basic_leader_election] has occurred - updating... (live nodes size: [2])
   [junit4]   2> 639035 INFO  (qtp1341810275-7028) [n:127.0.0.1:45913_solr    ] o.a.s.s.HttpSolrCall [admin] webapp=null path=/admin/collections params={pullReplicas=0&replicationFactor=0&collection.configName=conf&maxShardsPerNode=100&name=tlog_replica_test_basic_leader_election&nrtReplicas=0&action=CREATE&numShards=1&tlogReplicas=2&wt=javabin&version=2} status=0 QTime=3456
   [junit4]   2> 639045 INFO  (qtp519579176-7014) [n:127.0.0.1:45721_solr c:tlog_replica_test_basic_leader_election s:shard1 r:core_node3 x:tlog_replica_test_basic_leader_election_shard1_replica_t1] o.a.s.u.p.LogUpdateProcessorFactory [tlog_replica_test_basic_leader_election_shard1_replica_t1]  webapp=/solr path=/update params={update.distrib=FROMLEADER&_version_=-1582798295010377728&distrib.from=http://127.0.0.1:45913/solr/tlog_replica_test_basic_leader_election_shard1_replica_t2/&wt=javabin&version=2}{deleteByQuery=*:* (-1582798295010377728)} 0 0
   [junit4]   2> 639047 INFO  (qtp519579176-7016) [n:127.0.0.1:45721_solr c:tlog_replica_test_basic_leader_election s:shard1 r:core_node3 x:tlog_replica_test_basic_leader_election_shard1_replica_t1] o.a.s.u.p.LogUpdateProcessorFactory [tlog_replica_test_basic_leader_election_shard1_replica_t1]  webapp=/solr path=/update params={update.distrib=FROMLEADER&waitSearcher=true&openSearcher=true&commit=true&softCommit=false&distrib.from=http://127.0.0.1:45913/solr/tlog_replica_test_basic_leader_election_shard1_replica_t2/&commit_end_point=true&wt=javabin&version=2&expungeDeletes=false}{commit=} 0 0
   [junit4]   2> 639047 INFO  (qtp1341810275-7015) [n:127.0.0.1:45913_solr c:tlog_replica_test_basic_leader_election s:shard1 r:core_node4 x:tlog_replica_test_basic_leader_election_shard1_replica_t2] o.a.s.u.DirectUpdateHandler2 start commit{_version_=1582798295018766336,optimize=false,openSearcher=true,waitSearcher=true,expungeDeletes=false,softCommit=false,prepareCommit=false}
   [junit4]   2> 639047 INFO  (qtp1341810275-7015) [n:127.0.0.1:45913_solr c:tlog_replica_test_basic_leader_election s:shard1 r:core_node4 x:tlog_replica_test_basic_leader_election_shard1_replica_t2] o.a.s.u.DirectUpdateHandler2 No uncommitted changes. Skipping IW.commit.
   [junit4]   2> 639047 INFO  (qtp1341810275-7015) [n:127.0.0.1:45913_solr c:tlog_replica_test_basic_leader_election s:shard1 r:core_node4 x:tlog_replica_test_basic_leader_election_shard1_replica_t2] o.a.s.u.DirectUpdateHandler2 end_commit_flush
   [junit4]   2> 639048 INFO  (qtp1341810275-7015) [n:127.0.0.1:45913_solr c:tlog_replica_test_basic_leader_election s:shard1 r:core_node4 x:tlog_replica_test_basic_leader_election_shard1_replica_t2] o.a.s.u.p.LogUpdateProcessorFactory [tlog_replica_test_basic_leader_election_shard1_replica_t2]  webapp=/solr path=/update params={update.distrib=FROMLEADER&waitSearcher=true&openSearcher=true&commit=true&softCommit=false&distrib.from=http://127.0.0.1:45913/solr/tlog_replica_test_basic_leader_election_shard1_replica_t2/&commit_end_point=true&wt=javabin&version=2&expungeDeletes=false}{commit=} 0 0
   [junit4]   2> 639048 INFO  (qtp1341810275-7029) [n:127.0.0.1:45913_solr c:tlog_replica_test_basic_leader_election s:shard1 r:core_node4 x:tlog_replica_test_basic_leader_election_shard1_replica_t2] o.a.s.u.p.LogUpdateProcessorFactory [tlog_replica_test_basic_leader_election_shard1_replica_t2]  webapp=/solr path=/update params={_stateVer_=tlog_replica_test_basic_leader_election:5&commit=true&wt=javabin&version=2}{deleteByQuery=*:* (-1582798295010377728),commit=} 0 8
   [junit4]   2> 639051 INFO  (qtp519579176-7027) [n:127.0.0.1:45721_solr c:tlog_replica_test_basic_leader_election s:shard1 r:core_node3 x:tlog_replica_test_basic_leader_election_shard1_replica_t1] o.a.s.u.p.LogUpdateProcessorFactory [tlog_replica_test_basic_leader_election_shard1_replica_t1]  webapp=/solr path=/update params={update.distrib=FROMLEADER&distrib.from=http://127.0.0.1:45913/solr/tlog_replica_test_basic_leader_election_shard1_replica_t2/&wt=javabin&version=2}{add=[1 (1582798295021912064), 2 (1582798295022960640)]} 0 0
   [junit4]   2> 639052 INFO  (qtp1341810275-7017) [n:127.0.0.1:45913_solr c:tlog_replica_test_basic_leader_election s:shard1 r:core_node4 x:tlog_replica_test_basic_leader_election_shard1_replica_t2] o.a.s.u.p.LogUpdateProcessorFactory [tlog_replica_test_basic_leader_election_shard1_replica_t2]  webapp=/solr path=/update params={wt=javabin&version=2}{add=[1 (1582798295021912064), 2 (1582798295022960640)]} 0 2
   [junit4]   2> 639052 INFO  (TEST-TestTlogReplica.testBasicLeaderElection-seed#[56E578426BA3C4D4]) [    ] o.a.s.c.ChaosMonkey monkey: kill jetty! 45913
   [junit4]   2> 639053 INFO  (TEST-TestTlogReplica.testBasicLeaderElection-seed#[56E578426BA3C4D4]) [    ] o.e.j.s.AbstractConnector Stopped ServerConnector@38af0fba{HTTP/1.1,[http/1.1]}{127.0.0.1:0}
   [junit4]   2> 639054 INFO  (TEST-TestTlogReplica.testBasicLeaderElection-seed#[56E578426BA3C4D4]) [    ] o.a.s.c.CoreContainer Shutting down CoreContainer instance=87618235
   [junit4]   2> 639054 INFO  (TEST-TestTlogReplica.testBasicLeaderElection-seed#[56E578426BA3C4D4]) [    ] o.a.s.m.SolrMetricManager Closing metric reporters for registry=solr.node, tag=null
   [junit4]   2> 639054 INFO  (TEST-TestTlogReplica.testBasicLeaderElection-seed#[56E578426BA3C4D4]) [    ] o.a.s.m.r.SolrJmxReporter Closing reporter [org.apache.solr.metrics.reporters.SolrJmxReporter@21275a60: rootName = solr_45913, domain = solr.node, service url = null, agent id = null] for registry solr.node / com.codahale.metrics.MetricRegistry@4b6d3754
   [junit4]   2> 639066 INFO  (TEST-TestTlogReplica.testBasicLeaderElection-seed#[56E578426BA3C4D4]) [    ] o.a.s.m.SolrMetricManager Closing metric reporters for registry=solr.jvm, tag=null
   [junit4]   2> 639067 INFO  (TEST-TestTlogReplica.testBasicLeaderElection-seed#[56E578426BA3C4D4]) [    ] o.a.s.m.r.SolrJmxReporter Closing reporter [org.apache.solr.metrics.reporters.SolrJmxReporter@574ad2eb: rootName = solr_45913, domain = solr.jvm, service url = null, agent id = null] for registry solr.jvm / com.codahale.metrics.MetricRegistry@713a20c4
   [junit4]   2> 639076 INFO  (TEST-TestTlogReplica.testBasicLeaderElection-seed#[56E578426BA3C4D4]) [    ] o.a.s.m.SolrMetricManager Closing metric reporters for registry=solr.jetty, tag=null
   [junit4]   2> 639076 INFO  (TEST-TestTlogReplica.testBasicLeaderElection-seed#[56E578426BA3C4D4]) [    ] o.a.s.m.r.SolrJmxReporter Closing reporter [org.apache.solr.metrics.reporters.SolrJmxReporter@4c03e375: rootName = solr_45913, domain = solr.jetty, service url = null, agent id = null] for registry solr.jetty / com.codahale.metrics.MetricRegistry@2a949e95
   [junit4]   2> 639077 INFO  (TEST-TestTlogReplica.testBasicLeaderElection-seed#[56E578426BA3C4D4]) [    ] o.a.s.c.ZkController Remove node as live in ZooKeeper:/live_nodes/127.0.0.1:45913_solr
   [junit4]   2> 639078 INFO  (TEST-TestTlogReplica.testBasicLeaderElection-seed#[56E578426BA3C4D4]) [    ] o.a.s.m.SolrMetricManager Closing metric reporters for registry=solr.cluster, tag=null
   [junit4]   2> 639078 INFO  (zkCallback-1116-thread-1-processing-n:127.0.0.1:45913_solr) [n:127.0.0.1:45913_solr    ] o.a.s.c.c.ZkStateReader Updated live nodes from ZooKeeper... (2) -> (1)
   [junit4]   2> 639078 INFO  (zkCallback-1127-thread-1) [    ] o.a.s.c.c.ZkStateReader Updated live nodes from ZooKeeper... (2) -> (1)
   [junit4]   2> 639078 INFO  (coreCloseExecutor-2871-thread-1) [n:127.0.0.1:45913_solr c:tlog_replica_test_basic_leader_election s:shard1 r:core_node4 x:tlog_replica_test_basic_leader_election_shard1_replica_t2] o.a.s.c.SolrCore [tlog_replica_test_basic_leader_election_shard1_replica_t2]  CLOSING SolrCore org.apache.solr.core.SolrCore@491e7680
   [junit4]   2> 639078 INFO  (coreCloseExecutor-2871-thread-1) [n:127.0.0.1:45913_solr c:tlog_replica_test_basic_leader_election s:shard1 r:core_node4 x:tlog_replica_test_basic_leader_election_shard1_replica_t2] o.a.s.m.SolrMetricManager Closing metric reporters for registry=solr.core.tlog_replica_test_basic_leader_election.shard1.replica_t2, tag=1226733184
   [junit4]   2> 639078 INFO  (coreCloseExecutor-2871-thread-1) [n:127.0.0.1:45913_solr c:tlog_replica_test_basic_leader_election s:shard1 r:core_node4 x:tlog_replica_test_basic_leader_election_shard1_replica_t2] o.a.s.m.r.SolrJmxReporter Closing reporter [org.apache.solr.metrics.reporters.SolrJmxReporter@71fdc2b7: rootName = solr_45913, domain = solr.core.tlog_replica_test_basic_leader_election.shard1.replica_t2, service url = null, agent id = null] for registry solr.core.tlog_replica_test_basic_leader_election.shard1.replica_t2 / com.codahale.metrics.MetricRegistry@32527a2d
   [junit4]   2> 639079 INFO  (zkCallback-1120-thread-1-processing-n:127.0.0.1:45721_solr) [n:127.0.0.1:45721_solr    ] o.a.s.c.c.ZkStateReader Updated live nodes from ZooKeeper... (2) -> (1)
   [junit4]   2> 639085 INFO  (coreCloseExecutor-2871-thread-1) [n:127.0.0.1:45913_solr c:tlog_replica_test_basic_leader_election s:shard1 r:core_node4 x:tlog_replica_test_basic_leader_election_shard1_replica_t2] o.a.s.m.SolrMetricManager Closing metric reporters for registry=solr.collection.tlog_replica_test_basic_leader_election.shard1.leader, tag=1226733184
   [junit4]   2> 639085 INFO  (coreCloseExecutor-2871-thread-1) [n:127.0.0.1:45913_solr c:tlog_replica_test_basic_leader_election s:shard1 r:core_node4 x:tlog_replica_test_basic_leader_election_shard1_replica_t2] o.a.s.u.DirectUpdateHandler2 Committing on IndexWriter close.
   [junit4]   2> 639085 INFO  (coreCloseExecutor-2871-thread-1) [n:127.0.0.1:45913_solr c:tlog_replica_test_basic_leader_election s:shard1 r:core_node4 x:tlog_replica_test_basic_leader_election_shard1_replica_t2] o.a.s.u.SolrIndexWriter Calling setCommitData with IW:org.apache.solr.update.SolrIndexWriter@38aa115d commitCommandVersion:0
   [junit4]   2> 639087 INFO  (TEST-TestTlogReplica.testBasicLeaderElection-seed#[56E578426BA3C4D4]) [    ] o.a.s.c.Overseer Overseer (id=98924893181378564-127.0.0.1:45913_solr-n_0000000000) closing
   [junit4]   2> 639087 INFO  (OverseerStateUpdate-98924893181378564-127.0.0.1:45913_solr-n_0000000000) [n:127.0.0.1:45913_solr    ] o.a.s.c.Overseer Overseer Loop exiting : 127.0.0.1:45913_solr
   [junit4]   2> 639088 WARN  (OverseerAutoScalingTriggerThread-98924893181378564-127.0.0.1:45913_solr-n_0000000000) [n:127.0.0.1:45913_solr    ] o.a.s.c.a.OverseerTriggerThread OverseerTriggerThread woken up but we are closed, exiting.
   [junit4]   2> 639089 INFO  (TEST-TestTlogReplica.testBasicLeaderElection-seed#[56E578426BA3C4D4]) [    ] o.e.j.s.h.ContextHandler Stopped o.e.j.s.ServletContextHandler@7083b05f{/solr,null,UNAVAILABLE}
   [junit4]   2> 639089 INFO  (zkCallback-1120-thread-1-processing-n:127.0.0.1:45721_solr) [n:127.0.0.1:45721_solr    ] o.a.s.c.OverseerElectionContext I am going to be the leader 127.0.0.1:45721_solr
   [junit4]   2> 639089 INFO  (TEST-TestTlogReplica.testBasicLeaderElection-seed#[56E578426BA3C4D4]) [    ] o.a.s.c.ChaosMonkey monkey: stop jetty! 45913
   [junit4]   2> 639089 INFO  (zkCallback-1120-thread-1-processing-n:127.0.0.1:45721_solr) [n:127.0.0.1:45721_solr    ] o.a.s.c.Overseer Overseer (id=98924893181378566-127.0.0.1:45721_solr-n_0000000001) starting
   [junit4]   2> 639089 INFO  (zkCallback-1120-thread-2-processing-n:127.0.0.1:45721_solr) [n:127.0.0.1:45721_solr c:tlog_replica_test_basic_leader_election s:shard1 r:core_node3 x:tlog_replica_test_basic_leader_election_shard1_replica_t1] o.a.s.c.ShardLeaderElectionContext I may be the new leader - try and sync
   [junit4]   2> 639092 ERROR (TEST-TestTlogReplica.testBasicLeaderElection-seed#[56E578426BA3C4D4]) [    ] o.a.s.c.s.i.CloudSolrClient Request to collection [tlog_replica_test_basic_leader_election] failed due to (0) org.apache.http.NoHttpResponseException: 127.0.0.1:45913 failed to respond, retry? 0
   [junit4]   2> 639097 INFO  (zkCallback-1120-thread-1-processing-n:127.0.0.1:45721_solr) [n:127.0.0.1:45721_solr    ] o.a.s.c.c.ZkStateReader A cluster state change: [WatchedEvent state:SyncConnected type:NodeDataChanged path:/collections/tlog_replica_test_basic_leader_election/state.json] for collection [tlog_replica_test_basic_leader_election] has occurred - updating... (live nodes size: [1])
   [junit4]   2> 639097 INFO  (zkCallback-1120-thread-3-processing-n:127.0.0.1:45721_solr) [n:127.0.0.1:45721_solr    ] o.a.s.c.c.ZkStateReader A cluster state change: [WatchedEvent state:SyncConnected type:NodeDataChanged path:/collections/tlog_replica_test_basic_leader_election/state.json] for collection [tlog_replica_test_basic_leader_election] has occurred - updating... (live nodes size: [1])
   [junit4]   2> 639097 INFO  (zkCallback-1127-thread-1) [    ] o.a.s.c.c.ZkStateReader A cluster state change: [WatchedEvent state:SyncConnected type:NodeDataChanged path:/collections/tlog_replica_test_basic_leader_election/state.json] for collection [tlog_replica_test_basic_leader_election] has occurred - updating... (live nodes size: [1])
   [junit4]   2> 639198 INFO  (zkCallback-1127-thread-1) [    ] o.a.s.c.c.ZkStateReader A cluster state change: [WatchedEvent state:SyncConnected type:NodeDataChanged path:/collections/tlog_replica_test_basic_leader_election/state.json] for collection [tlog_replica_test_basic_leader_election] has occurred - updating... (live nodes size: [1])
   [junit4]   2> 639198 INFO  (zkCallback-1120-thread-3-processing-n:127.0.0.1:45721_solr) [n:127.0.0.1:45721_solr    ] o.a.s.c.c.ZkStateReader A cluster state change: [WatchedEvent state:SyncConnected type:NodeDataChanged path:/collections/tlog_replica_test_basic_leader_election/state.json] for collection [tlog_replica_test_basic_leader_election] has occurred - updating... (live nodes size: [1])
   [junit4]   2> 639198 INFO  (zkCallback-1120-thread-1-processing-n:127.0.0.1:45721_solr) [n:127.0.0.1:45721_solr    ] o.a.s.c.c.ZkStateReader A cluster state change: [WatchedEvent state:SyncConnected type:NodeDataChanged path:/collections/tlog_replica_test_basic_leader_election/state.json] for collection [tlog_replica_test_basic_leader_election] has occurred - updating... (live nodes size: [1])
   [junit4]   2> 641032 INFO  (indexFetcher-2870-thread-1) [n:127.0.0.1:45721_solr c:tlog_replica_test_basic_leader_election s:shard1 r:core_node3 x:tlog_replica_test_basic_leader_election_shard1_replica_t1] o.a.s.h.IndexFetcher Last replication failed, so I'll force replication
   [junit4]   2> 641590 INFO  (zkCallback-1120-thread-2-processing-n:127.0.0.1:45721_solr) [n:127.0.0.1:45721_solr c:tlog_replica_test_basic_leader_election s:shard1 r:core_node3 x:tlog_replica_test_basic_leader_election_shard1_replica_t1] o.a.s.c.SyncStrategy Sync replicas to http://127.0.0.1:45721/solr/tlog_replica_test_basic_leader_election_shard1_replica_t1/
   [junit4]   2> 641590 INFO  (zkCallback-1120-thread-2-processing-n:127.0.0.1:45721_solr) [n:127.0.0.1:45721_solr c:tlog_replica_test_basic_leader_election s:shard1 r:core_node3 x:tlog_replica_test_basic_leader_election_shard1_replica_t1] o.a.s.c.SyncStrategy Sync Success - now sync replicas to me
   [junit4]   2> 641590 INFO  (zkCallback-1120-thread-2-processing-n:127.0.0.1:45721_solr) [n:127.0.0.1:45721_solr c:tlog_replica_test_basic_leader_election s:shard1 r:core_node3 x:tlog_replica_test_basic_leader_election_shard1_replica_t1] o.a.s.c.SyncStrategy http://127.0.0.1:45721/solr/tlog_replica_test_basic_leader_election_shard1_replica_t1/ has no replicas
   [junit4]   2> 641590 INFO  (zkCallback-1120-thread-2-processing-n:127.0.0.1:45721_solr) [n:127.0.0.1:45721_solr c:tlog_replica_test_basic_leader_election s:shard1 r:core_node3 x:tlog_replica_test_basic_leader_election_shard1_replica_t1] o.a.s.c.ZkController tlog_replica_test_basic_leader_election_shard1_replica_t1 stopping background replication from leader
   [junit4]   2> 641592 INFO  (zkCallback-1120-thread-2-processing-n:127.0.0.1:45721_solr) [n:127.0.0.1:45721_solr c:tlog_replica_test_basic_leader_election s:shard1 r:core_node3 x:tlog_replica_test_basic_leader_election_shard1_replica_t1] o.a.s.c.ShardLeaderElectionContext Replaying tlog before become new leader
   [junit4]   2> 641592 WARN  (recoveryExecutor-2866-thread-1-processing-n:127.0.0.1:45721_solr x:tlog_replica_test_basic_leader_election_shard1_replica_t1 s:shard1 c:tlog_replica_test_basic_leader_election r:core_node3) [n:127.0.0.1:45721_solr c:tlog_replica_test_basic_leader_election s:shard1 r:core_node3 x:tlog_replica_test_basic_leader_election_shard1_replica_t1] o.a.s.u.UpdateLog Starting log replay tlog{file=/home/jenkins/workspace/Lucene-Solr-7.x-Linux/solr/build/solr-core/test/J2/temp/solr.cloud.TestTlogReplica_56E578426BA3C4D4-001/tempDir-001/node2/tlog_replica_test_basic_leader_election_shard1_replica_t1/data/tlog/tlog.0000000000000000000 refcount=2} active=false starting pos=0 inSortedOrder=true
   [junit4]   2> 641594 INFO  (recoveryExecutor-2866-thread-1-processing-n:127.0.0.1:45721_solr x:tlog_replica_test_basic_leader_election_shard1_replica_t1 s:shard1 c:tlog_replica_test_basic_leader_election r:core_node3) [n:127.0.0.1:45721_solr c:tlog_replica_test_basic_leader_election s:shard1 r:core_node3 x:tlog_replica_test_basic_leader_election_shard1_replica_t1] o.a.s.u.DirectUpdateHandler2 start commit{flags=2,optimize=false,openSearcher=true,waitSearcher=true,expungeDeletes=false,softCommit=false,prepareCommit=false}
   [junit4]   2> 641595 INFO  (recoveryExecutor-2866-thread-1-processing-n:127.0.0.1:45721_solr x:tlog_replica_test_basic_leader_election_shard1_replica_t1 s:shard1 c:tlog_replica_test_basic_leader_election r:core_node3) [n:127.0.0.1:45721_solr c:tlog_replica_test_basic_leader_election s:shard1 r:core_node3 x:tlog_replica_test_basic_leader_election_shard1_replica_t1] o.a.s.u.SolrIndexWriter Calling setCommitData with IW:org.apache.solr.update.SolrIndexWriter@71a21c71 commitCommandVersion:0
   [junit4]   2> 641597 INFO  (recoveryExecutor-2866-thread-1-processing-n:127.0.0.1:45721_solr x:tlog_replica_test_basic_leader_election_shard1_replica_t1 s:shard1 c:tlog_replica_test_basic_leader_election r:core_node3) [n:127.0.0.1:45721_solr c:tlog_replica_test_basic_leader_election s:shard1 r:core_node3 x:tlog_replica_test_basic_leader_election_shard1_replica_t1] o.a.s.s.SolrIndexSearcher Opening [Searcher@60ccbd6a[tlog_replica_test_basic_leader_election_shard1_replica_t1] main]
   [junit4]   2> 641597 INFO  (recoveryExecutor-2866-thread-1-processing-n:127.0.0.1:45721_solr x:tlog_replica_test_basic_leader_election_shard1_replica_t1 s:shard1 c:tlog_replica_test_basic_leader_election r:core_node3) [n:127.0.0.1:45721_solr c:tlog_replica_test_basic_leader_election s:shard1 r:core_node3 x:tlog_replica_test_basic_leader_election_shard1_replica_t1] o.a.s.u.DirectUpdateHandler2 end_commit_flush
   [junit4]   2> 641598 INFO  (searcherExecutor-2860-thread-1-processing-n:127.0.0.1:45721_solr x:tlog_replica_test_basic_leader_election_shard1_replica_t1 s:shard1 c:tlog_replica_test_basic_leader_election r:core_node3) [n:127.0.0.1:45721_solr c:tlog_replica_test_basic_leader_election s:shard1 r:core_node3 x:tlog_replica_test_basic_leader_election_shard1_replica_t1] o.a.s.c.SolrCore [tlog_replica_test_basic_leader_election_shard1_replica_t1] Registered new searcher Searcher@60ccbd6a[tlog_replica_test_basic_leader_election_shard1_replica_t1] main{ExitableDirectoryReader(UninvertingDirectoryReader(Uninverting(_0(7.2.0):C2)))}
   [junit4]   2> 641598 INFO  (recoveryExecutor-2866-thread-1-processing-n:127.0.0.1:45721_solr x:tlog_replica_test_basic_leader_election_shard1_replica_t1 s:shard1 c:tlog_replica_test_basic_leader_election r:core_node3) [n:127.0.0.1:45721_solr c:tlog_replica_test_basic_leader_election s:shard1 r:core_node3 x:tlog_replica_test_basic_leader_election_shard1_replica_t1] o.a.s.u.p.LogUpdateProcessorFactory [tlog_replica_test_basic_leader_election_shard1_replica_t1] {deleteByQuery=*:* (-1582798295010377728),add=[1 (1582798295021912064), 2 (1582798295022960640)]} 0 5
   [junit4]   2> 641598 WARN  (recoveryExecutor-2866-thread-1-processing-n:127.0.0.1:45721_solr x:tlog_replica_test_basic_leader_election_shard1_replica_t1 s:shard1 c:tlog_replica_test_basic_leader_election r:core_node3) [n:127.0.0.1:45721_solr c:tlog_replica_test_basic_leader_election s:shard1 r:core_node3 x:tlog_replica_test_basic_leader_election_shard1_replica_t1] o.a.s.u.UpdateLog Log replay finished. recoveryInfo=RecoveryInfo{adds=2 deletes=0 deleteByQuery=1 errors=0 positionOfStart=0}
   [junit4]   2> 641600 INFO  (zkCallback-1120-thread-2-processing-n:127.0.0.1:45721_solr) [n:127.0.0.1:45721_solr c:tlog_replica_test_basic_leader_election s:shard1 r:core_node3 x:tlog_replica_test_basic_leader_election_shard1_replica_t1] o.a.s.c.ShardLeaderElectionContext I am the new leader: http://127.0.0.1:45721/solr/tlog_replica_test_basic_leader_election_shard1_replica_t1/ shard1
   [junit4]   2> 641600 INFO  (zkCallback-1120-thread-2-processing-n:127.0.0.1:45721_solr) [n:127.0.0.1:45721_solr    ] o.a.s.c.c.ZkStateReader A cluster state change: [WatchedEvent state:SyncConnected type:NodeDataChanged path:/collections/tlog_replica_test_basic_leader_election/state.json] for collection [tlog_replica_test_basic_leader_election] has occurred - updating... (live nodes size: [1])
   [junit4]   2> 641600 INFO  (zkCallback-1120-thread-1-processing-n:127.0.0.1:45721_solr) [n:127.0.0.1:45721_solr    ] o.a.s.c.c.ZkStateReader A cluster state change: [WatchedEvent state:SyncConnected type:NodeDataChanged path:/collections/tlog_replica_test_basic_leader_election/state.json] for collection [tlog_replica_test_basic_leader_election] has occurred - updating... (live nodes size: [1])
   [junit4]   2> 641600 INFO  (zkCallback-1127-thread-1) [    ] o.a.s.c.c.ZkStateReader A cluster state change: [WatchedEvent state:SyncConnected type:NodeDataChanged path:/collections/tlog_replica_test_basic_leader_election/state.json] for collection [tlog_replica_test_basic_leader_election] has occurred - updating... (live nodes size: [1])
   [junit4]   2> 641649 INFO  (qtp519579176-7018) [n:127.0.0.1:45721_solr c:tlog_replica_test_basic_leader_election s:shard1 r:core_node3 x:tlog_replica_test_basic_leader_election_shard1_replica_t1] o.a.s.u.p.LogUpdateProcessorFactory [tlog_replica_test_basic_leader_election_shard1_replica_t1]  webapp=/solr path=/update params={wt=javabin&version=2}{add=[3 (1582798297746112512), 4 (1582798297747161088)]} 0 2555
   [junit4]   2> 641650 INFO  (TEST-TestTlogReplica.testBasicLeaderElection-seed#[56E578426BA3C4D4]) [    ] o.a.s.c.ChaosMonkey monkey: starting jetty! 45913
   [junit4]   2> 641650 INFO  (TEST-TestTlogReplica.testBasicLeaderElection-seed#[56E578426BA3C4D4]) [    ] o.e.j.s.Server jetty-9.3.20.v20170531
   [junit4]   2> 641651 INFO  (TEST-TestTlogReplica.testBasicLeaderElection-seed#[56E578426BA3C4D4]) [    ] o.e.j.s.h.ContextHandler Started o.e.j.s.ServletContextHandler@384e39e{/solr,null,AVAILABLE}
   [junit4]   2> 641651 INFO  (TEST-TestTlogReplica.testBasicLeaderElection-seed#[56E578426BA3C4D4]) [    ] o.e.j.s.AbstractConnector Started ServerConnector@477b40af{HTTP/1.1,[http/1.1]}{127.0.0.1:45913}
   [junit4]   2> 641651 INFO  (TEST-TestTlogReplica.testBasicLeaderElection-seed#[56E578426BA3C4D4]) [    ] o.e.j.s.Server Started @643564ms
   [junit4]   2> 641651 INFO  (TEST-TestTlogReplica.testBasicLeaderElection-seed#[56E578426BA3C4D4]) [    ] o.a.s.c.s.e.JettySolrRunner Jetty properties: {hostContext=/solr, hostPort=45913}
   [junit4]   2> 641652 ERROR (TEST-TestTlogReplica.testBasicLeaderElection-seed#[56E578426BA3C4D4]) [    ] o.a.s.u.StartupLoggingUtils Missing Java Option solr.log.dir. Logging may be missing or incomplete.
   [junit4]   2> 641652 INFO  (TEST-TestTlogReplica.testBasicLeaderElection-seed#[56E578426BA3C4D4]) [    ] o.a.s.s.SolrDispatchFilter  ___      _       Welcome to Apache Solr? version 7.2.0
   [junit4]   2> 641652 INFO  (TEST-TestTlogReplica.testBasicLeaderElection-seed#[56E578426BA3C4D4]) [    ] o.a.s.s.SolrDispatchFilter / __| ___| |_ _   Starting in cloud mode on port null
   [junit4]   2> 641652 INFO  (TEST-TestTlogReplica.testBasicLeaderElection-seed#[56E578426BA3C4D4]) [    ] o.a.s.s.SolrDispatchFilter \__ \/ _ \ | '_|  Install dir: null
   [junit4]   2> 641652 INFO  (TEST-TestTlogReplica.testBasicLeaderElection-seed#[56E578426BA3C4D4]) [    ] o.a.s.s.SolrDispatchFilter |___/\___/_|_|    Start time: 2017-10-31T18:21:24.616Z
   [junit4]   2> 641653 INFO  (TEST-TestTlogReplica.testBasicLeaderElection-seed#[56E578426BA3C4D4]) [    ] o.a.s.s.SolrDispatchFilter solr.xml found in ZooKeeper. Loading...
   [junit4]   2> 641686 INFO  (TEST-TestTlogReplica.testBasicLeaderElection-seed#[56E578426BA3C4D4]) [    ] o.a.s.c.ZkContainer Zookeeper client=127.0.0.1:40057/solr
   [junit4]   2> 641690 INFO  (TEST-TestTlogReplica.testBasicLeaderElection-seed#[56E578426BA3C4D4]) [n:127.0.0.1:45913_solr    ] o.a.s.c.c.ZkStateReader Updated live nodes from ZooKeeper... (0) -> (1)
   [junit4]   2> 641691 INFO  (TEST-TestTlogReplica.testBasicLeaderElection-seed#[56E578426BA3C4D4]) [n:127.0.0.1:45913_solr    ] o.a.s.c.Overseer Overseer (id=null) closing
   [junit4]   2> 641692 INFO  (TEST-TestTlogReplica.testBasicLeaderElection-seed#[56E578426BA3C4D4]) [n:127.0.0.1:45913_solr    ] o.a.s.c.ZkController Register node as live in ZooKeeper:/live_nodes/127.0.0.1:45913_solr
   [junit4]   2> 641692 INFO  (zkCallback-1127-thread-1) [    ] o.a.s.c.c.ZkStateReader Updated live nodes from ZooKeeper... (1) -> (2)
   [junit4]   2> 641692 INFO  (zkCallback-1120-thread-3-processing-n:127.0.0.1:45721_solr) [n:127.0.0.1:45721_solr    ] o.a.s.c.c.ZkStateReader Updated live nodes from ZooKeeper... (1) -> (2)
   [junit4]   2> 641693 INFO  (zkCallback-1134-thread-1-processing-n:127.0.0.1:45913_solr) [n:127.0.0.1:45913_solr    ] o.a.s.c.c.ZkStateReader Updated live nodes from ZooKeeper... (1) -> (2)
   [junit4]   2> 641743 INFO  (TEST-TestTlogReplica.testBasicLeaderElection-seed#[56E578426BA3C4D4]) [n:127.0.0.1:45913_solr    ] o.a.s.m.r.SolrJmxReporter JMX monitoring for 'solr_45913.solr.node' (registry 'solr.node') enabled at server: com.sun.jmx.mbeanserver.JmxMBeanServer@34e7322d
   [junit4]   2> 641750 INFO  (TEST-TestTlogReplica.testBasicLeaderElection-seed#[56E578426BA3C4D4]) [n:127.0.0.1:45913_solr    ] o.a.s.m.r.SolrJmxReporter JMX monitoring for 'solr_45913.solr.jvm' (registry 'solr.jvm') enabled at server: com.sun.jmx.mbeanserver.JmxMBeanServer@34e7322d
   [junit4]   2> 641750 INFO  (TEST-TestTlogReplica.testBasicLeaderElection-seed#[56E578426BA3C4D4]) [n:127.0.0.1:45913_solr    ] o.a.s.m.r.SolrJmxReporter JMX monitoring for 'solr_45913.solr.jetty' (registry 'solr.jetty') enabled at server: com.sun.jmx.mbeanserver.JmxMBeanServer@34e7322d
   [junit4]   2> 641752 INFO  (TEST-TestTlogReplica.testBasicLeaderElection-seed#[56E578426BA3C4D4]) [n:127.0.0.1:45913_solr    ] o.a.s.c.CorePropertiesLocator Found 1 core definitions underneath /home/jenkins/workspace/Lucene-Solr-7.x-Linux/solr/build/solr-core/test/J2/temp/solr.cloud.TestTlogReplica_56E578426BA3C4D4-001/tempDir-001/node1/.
   [junit4]   2> 641752 INFO  (TEST-TestTlogReplica.testBasicLeaderElection-seed#[56E578426BA3C4D4]) [n:127.0.0.1:45913_solr    ] o.a.s.c.CorePropertiesLocator Cores are: [tlog_replica_test_basic_leader_election_shard1_replica_t2]
   [junit4]   2> 641752 INFO  (coreLoadExecutor-2882-thread-1-processing-n:127.0.0.1:45913_solr) [n:127.0.0.1:45913_solr    ] o.a.s.c.TransientSolrCoreCacheDefault Allocating transient cache for 2147483647 transient cores
   [junit4]   2> 641761 INFO  (coreLoadExecutor-2882-thread-1-processing-n:127.0.0.1:45913_solr) [n:127.0.0.1:45913_solr    ] o.a.s.c.SolrConfig Using Lucene MatchVersion: 7.2.0
   [junit4]   2> 641766 INFO  (coreLoadExecutor-2882-thread-1-processing-n:127.0.0.1:45913_solr) [n:127.0.0.1:45913_solr    ] o.a.s.s.IndexSchema [tlog_replica_test_basic_leader_election_shard1_replica_t2] Schema name=minimal
   [junit4]   2> 641768 INFO  (coreLoadExecutor-2882-thread-1-processing-n:127.0.0.1:45913_solr) [n:127.0.0.1:45913_solr    ] o.a.s.s.IndexSchema Loaded schema minimal/1.1 with uniqueid field id
   [junit4]   2> 641773 INFO  (coreLoadExecutor-2882-thread-1-processing-n:127.0.0.1:45913_solr) [n:127.0.0.1:45913_solr c:tlog_replica_test_basic_leader_election s:shard1 r:core_node4 x:tlog_replica_test_basic_leader_election_shard1_replica_t2] o.a.s.c.SolrConfig Using Lucene MatchVersion: 7.2.0
   [junit4]   2> 641778 INFO  (coreLoadExecutor-2882-thread-1-processing-n:127.0.0.1:45913_solr) [n:127.0.0.1:45913_solr c:tlog_replica_test_basic_leader_election s:shard1 r:core_node4 x:tlog_replica_test_basic_leader_election_shard1_replica_t2] o.a.s.s.IndexSchema [tlog_replica_test_basic_leader_election_shard1_replica_t2] Schema name=minimal
   [junit4]   2> 641779 INFO  (coreLoadExecutor-2882-thread-1-processing-n:127.0.0.1:45913_solr) [n:127.0.0.1:45913_solr c:tlog_replica_test_basic_leader_election s:shard1 r:core_node4 x:tlog_replica_test_basic_leader_election_shard1_replica_t2] o.a.s.s.IndexSchema Loaded schema minimal/1.1 with uniqueid field id
   [junit4]   2> 641779 INFO  (coreLoadExecutor-2882-thread-1-processing-n:127.0.0.1:45913_solr) [n:127.0.0.1:45913_solr c:tlog_replica_test_basic_leader_election s:shard1 r:core_node4 x:tlog_replica_test_basic_leader_election_shard1_replica_t2] o.a.s.c.CoreContainer Creating SolrCore 'tlog_replica_test_basic_leader_election_shard1_replica_t2' using configuration from collection tlog_replica_test_basic_leader_election, trusted=true
   [junit4]   2> 641780 INFO  (coreLoadExecutor-2882-thread-1-processing-n:127.0.0.1:45913_solr) [n:127.0.0.1:45913_solr c:tlog_replica_test_basic_leader_election s:shard1 r:core_node4 x:tlog_replica_test_basic_leader_election_shard1_replica_t2] o.a.s.m.r.SolrJmxReporter JMX monitoring for 'solr_45913.solr.core.tlog_replica_test_basic_leader_election.shard1.replica_t2' (registry 'solr.core.tlog_replica_test_basic_leader_election.shard1.replica_t2') enabled at server: com.sun.jmx.mbeanserver.JmxMBeanServer@34e7322d
   [junit4]   2> 641780 INFO  (coreLoadExecutor-2882-thread-1-processing-n:127.0.0.1:45913_solr) [n:127.0.0.1:45913_solr c:tlog_replica_test_basic_leader_election s:shard1 r:core_node4 x:tlog_replica_test_basic_leader_election_shard1_replica_t2] o.a.s.c.SolrCore solr.RecoveryStrategy.Builder
   [junit4]   2> 641780 INFO  (coreLoadExecutor-2882-thread-1-processing-n:127.0.0.1:45913_solr) [n:127.0.0.1:45913_solr c:tlog_replica_test_basic_leader_election s:shard1 r:core_node4 x:tlog_replica_test_basic_leader_election_shard1_replica_t2] o.a.s.c.SolrCore [[tlog_replica_test_basic_leader_election_shard1_replica_t2] ] Opening new SolrCore at [/home/jenkins/workspace/Lucene-Solr-7.x-Linux/solr/build/solr-core/test/J2/temp/solr.cloud.TestTlogReplica_56E578426BA3C4D4-001/tempDir-001/node1/tlog_replica_test_basic_leader_election_shard1_replica_t2], dataDir=[/home/jenkins/workspace/Lucene-Solr-7.x-Linux/solr/build/solr-core/test/J2/temp/solr.cloud.TestTlogReplica_56E578426BA3C4D4-001/tempDir-001/node1/./tlog_replica_test_basic_leader_election_shard1_replica_t2/data/]
   [junit4]   2> 641793 INFO  (zkCallback-1120-thread-3-processing-n:127.0.0.1:45721_solr) [n:127.0.0.1:45721_solr    ] o.a.s.c.c.ZkStateReader A cluster state change: [WatchedEvent state:SyncConnected type:NodeDataChanged path:/collections/tlog_replica_test_basic_leader_election/state.json] for collection [tlog_replica_test_basic_leader_election] has occurred - updating... (live nodes size: [2])
   [junit4]   2> 641793 INFO  (zkCallback-1127-thread-1) [    ] o.a.s.c.c.ZkStateReader A cluster state change: [WatchedEvent state:SyncConnected type:NodeDataChanged path:/collections/tlog_replica_test_basic_leader_election/state.json] for collection [tlog_replica_test_basic_leader_election] has occurred - updating... (live nodes size: [2])
   [junit4]   2> 641793 INFO  (zkCallback-1120-thread-1-processing-n:127.0.0.1:45721_solr) [n:127.0.0.1:45721_solr    ] o.a.s.c.c.ZkStateReader A cluster state change: [WatchedEvent state:SyncConnected type:NodeDataChanged path:/collections/tlog_replica_test_basic_leader_election/state.json] for collection [tlog_replica_test_basic_leader_election] has occurred - updating... (live nodes size: [2])
   [junit4]   2> 641793 INFO  (zkCallback-1134-thread-1-processing-n:127.0.0.1:45913_solr) [n:127.0.0.1:45913_solr    ] o.a.s.c.c.ZkStateReader A cluster state change: [WatchedEvent state:SyncConnected type:NodeDataChanged path:/collections/tlog_replica_test_basic_leader_election/state.json] for collection [tlog_replica_test_basic_leader_election] has occurred - updating... (live nodes size: [2])
   [junit4]   2> 641793 INFO  (zkCallback-1134-thread-2-processing-n:127.0.0.1:45913_solr) [n:127.0.0.1:45913_solr    ] o.a.s.c.c.ZkStateReader A cluster state change: [WatchedEvent state:SyncConnected type:NodeDataChanged path:/collections/tlog_replica_test_basic_leader_election/state.json] for collection [tlog_replica_test_basic_leader_election] has occurred - updating... (live nodes size: [2])
   [junit4]   2> 641805 INFO  (coreLoadExecutor-2882-thread-1-processing-n:127.0.0.1:45913_solr) [n:127.0.0.1:45913_solr c:tlog_replica_test_basic_leader_election s:shard1 r:core_node4 x:tlog_replica_test_basic_leader_election_shard1_replica_t2] o.a.s.u.UpdateHandler Using UpdateLog implementation: org.apache.solr.update.UpdateLog
   [junit4]   2> 641805 INFO  (coreLoadExecutor-2882-thread-1-processing-n:127.0.0.1:45913_solr) [n:127.0.0.1:45913_solr c:tlog_replica_test_basic_leader_election s:shard1 r:core_node4 x:tlog_replica_test_basic_leader_election_shard1_replica_t2] o.a.s.u.UpdateLog Initializing UpdateLog: dataDir=null defaultSyncLevel=FLUSH numRecordsToKeep=100 maxNumLogsToKeep=10 numVersionBuckets=65536
   [junit4]   2> 641807 INFO  (coreLoadExecutor-2882-thread-1-processing-n:127.0.0.1:45913_solr) [n:127.0.0.1:45913_solr c:tlog_replica_test_basic_leader_election s:shard1 r:core_node4 x:tlog_replica_test_basic_leader_election_shard1_replica_t2] o.a.s.u.CommitTracker Hard AutoCommit: disabled
   [junit4]   2> 641807 INFO  (coreLoadExecutor-2882-thread-1-processing-n:127.0.0.1:45913_solr) [n:127.0.0.1:45913_solr c:tlog_replica_test_basic_leader_election s:shard1 r:core_node4 x:tlog_replica_test_basic_leader_election_shard1_replica_t2] o.a.s.u.CommitTracker Soft AutoCommit: disabled
   [junit4]   2> 641808 INFO  (coreLoadExecutor-2882-thread-1-processing-n:127.0.0.1:45913_solr) [n:127.0.0.1:45913_solr c:tlog_replica_test_basic_leader_election s:shard1 r:core_node4 x:tlog_replica_test_basic_leader_election_shard1_replica_t2] o.a.s.s.SolrIndexSearcher Opening [Searcher@29601d4a[tlog_replica_test_basic_leader_election_shard1_replica_t2] main]
   [junit4]   2> 641808 INFO  (coreLoadExecutor-2882-thread-1-processing-n:127.0.0.1:45913_solr) [n:127.0.0.1:45913_solr c:tlog_replica_test_basic_leader_election s:shard1 r:core_node4 x:tlog_replica_test_basic_leader_election_shard1_replica_t2] o.a.s.r.ManagedResourceStorage Configured ZooKeeperStorageIO with znodeBase: /configs/conf
   [junit4]   2> 641809 INFO  (coreLoadExecutor-2882-thread-1-processing-n:127.0.0.1:45913_solr) [n:127.0.0.1:45913_solr c:tlog_replica_test_basic_leader_election s:shard1 r:core_node4 x:tlog_replica_test_basic_leader_election_shard1_replica_t2] o.a.s.r.ManagedResourceStorage Loaded null at path _rest_managed.json using ZooKeeperStorageIO:path=/configs/conf
   [junit4]   2> 641809 INFO  (coreLoadExecutor-2882-thread-1-processing-n:127.0.0.1:45913_solr) [n:127.0.0.1:45913_solr c:tlog_replica_test_basic_leader_election s:shard1 r:core_node4 x:tlog_replica_test_basic_leader_election_shard1_replica_t2] o.a.s.h.ReplicationHandler Commits will be reserved for 10000ms.
   [junit4]   2> 641810 INFO  (searcherExecutor-2883-thread-1-processing-n:127.0.0.1:45913_solr x:tlog_replica_test_basic_leader_election_shard1_replica_t2 s:shard1 c:tlog_replica_test_basic_leader_election r:core_node4) [n:127.0.0.1:45913_solr c:tlog_replica_test_basic_leader_election s:shard1 r:core_node4 x:tlog_replica_test_basic_leader_election_shard1_replica_t2] o.a.s.c.SolrCore [tlog_replica_test_basic_leader_election_shard1_replica_t2] Registered new searcher Searcher@29601d4a[tlog_replica_test_basic_leader_election_shard1_replica_t2] main{ExitableDirectoryReader(UninvertingDirectoryReader())}
   [junit4]   2> 641810 INFO  (coreLoadExecutor-2882-thread-1-processing-n:127.0.0.1:45913_solr) [n:127.0.0.1:45913_solr c:tlog_replica_test_basic_leader_election s:shard1 r:core_node4 x:tlog_replica_test_basic_leader_election_shard1_replica_t2] o.a.s.u.UpdateLog Could not find max version in index or recent updates, using new clock 1582798297915981824
   [junit4]   2> 641812 INFO  (coreZkRegister-2877-threa

[...truncated too long message...]

-closer-5934-thread-1) [    ] o.a.s.m.SolrMetricManager Closing metric reporters for registry=solr.jetty, tag=null
   [junit4]   2> 2196747 INFO  (jetty-closer-5934-thread-1) [    ] o.a.s.m.r.SolrJmxReporter Closing reporter [org.apache.solr.metrics.reporters.SolrJmxReporter@60af6e47: rootName = null, domain = solr.jetty, service url = null, agent id = null] for registry solr.jetty / com.codahale.metrics.MetricRegistry@5e572565
   [junit4]   2> 2196748 INFO  (jetty-closer-5934-thread-1) [    ] o.a.s.c.ZkController Remove node as live in ZooKeeper:/live_nodes/127.0.0.1:38473_solr
   [junit4]   2> 2196749 INFO  (jetty-closer-5934-thread-1) [    ] o.a.s.m.SolrMetricManager Closing metric reporters for registry=solr.cluster, tag=null
   [junit4]   2> 2196749 INFO  (zkCallback-5944-thread-9-processing-n:127.0.0.1:40607_solr) [n:127.0.0.1:40607_solr    ] o.a.s.c.c.ZkStateReader Updated live nodes from ZooKeeper... (2) -> (1)
   [junit4]   2> 2196749 INFO  (zkCallback-5945-thread-5-processing-n:127.0.0.1:38473_solr) [n:127.0.0.1:38473_solr    ] o.a.s.c.c.ZkStateReader Updated live nodes from ZooKeeper... (2) -> (1)
   [junit4]   2> 2196750 INFO  (jetty-closer-5934-thread-1) [    ] o.e.j.s.h.ContextHandler Stopped o.e.j.s.ServletContextHandler@6e6569f5{/solr,null,UNAVAILABLE}
   [junit4]   2> 2196751 INFO  (jetty-closer-5934-thread-2) [    ] o.a.s.m.SolrMetricManager Closing metric reporters for registry=solr.jetty, tag=null
   [junit4]   2> 2196751 INFO  (jetty-closer-5934-thread-2) [    ] o.a.s.m.r.SolrJmxReporter Closing reporter [org.apache.solr.metrics.reporters.SolrJmxReporter@3942ea1d: rootName = null, domain = solr.jetty, service url = null, agent id = null] for registry solr.jetty / com.codahale.metrics.MetricRegistry@5e572565
   [junit4]   2> 2196752 INFO  (jetty-closer-5934-thread-2) [    ] o.a.s.c.ZkController Remove node as live in ZooKeeper:/live_nodes/127.0.0.1:40607_solr
   [junit4]   2> 2196752 INFO  (jetty-closer-5934-thread-2) [    ] o.a.s.m.SolrMetricManager Closing metric reporters for registry=solr.cluster, tag=null
   [junit4]   2> 2196753 INFO  (zkCallback-5944-thread-9-processing-n:127.0.0.1:40607_solr) [n:127.0.0.1:40607_solr    ] o.a.s.c.c.ZkStateReader Updated live nodes from ZooKeeper... (1) -> (0)
   [junit4]   2> 2196753 INFO  (jetty-closer-5934-thread-2) [    ] o.a.s.c.Overseer Overseer (id=98924979505790981-127.0.0.1:40607_solr-n_0000000000) closing
   [junit4]   2> 2196753 INFO  (OverseerStateUpdate-98924979505790981-127.0.0.1:40607_solr-n_0000000000) [n:127.0.0.1:40607_solr    ] o.a.s.c.Overseer Overseer Loop exiting : 127.0.0.1:40607_solr
   [junit4]   2> 2196753 WARN  (OverseerAutoScalingTriggerThread-98924979505790981-127.0.0.1:40607_solr-n_0000000000) [n:127.0.0.1:40607_solr    ] o.a.s.c.a.OverseerTriggerThread OverseerTriggerThread woken up but we are closed, exiting.
   [junit4]   2> 2196755 INFO  (jetty-closer-5934-thread-2) [    ] o.e.j.s.h.ContextHandler Stopped o.e.j.s.ServletContextHandler@6a89e6ee{/solr,null,UNAVAILABLE}
   [junit4]   2> 2196755 ERROR (SUITE-TestPrepRecovery-seed#[56E578426BA3C4D4]-worker) [    ] o.a.z.s.ZooKeeperServer ZKShutdownHandler is not registered, so ZooKeeper server won't take any action on ERROR or SHUTDOWN server state changes
   [junit4]   2> 2196755 INFO  (SUITE-TestPrepRecovery-seed#[56E578426BA3C4D4]-worker) [    ] o.a.s.c.ZkTestServer connecting to 127.0.0.1:45489 45489
   [junit4]   2> 2201783 INFO  (Thread-4501) [    ] o.a.s.c.ZkTestServer connecting to 127.0.0.1:45489 45489
   [junit4]   2> 2201784 WARN  (Thread-4501) [    ] o.a.s.c.ZkTestServer Watch limit violations: 
   [junit4]   2> Maximum concurrent create/delete watches above limit:
   [junit4]   2> 
   [junit4]   2> 	3	/solr/aliases.json
   [junit4]   2> 	3	/solr/clusterprops.json
   [junit4]   2> 	3	/solr/collections/testLeaderUnloaded/state.json
   [junit4]   2> 	2	/solr/security.json
   [junit4]   2> 	2	/solr/collections/testLeaderNotResponding/state.json
   [junit4]   2> 
   [junit4]   2> Maximum concurrent data watches above limit:
   [junit4]   2> 
   [junit4]   2> 	6	/solr/collections/testLeaderUnloaded/state.json
   [junit4]   2> 	3	/solr/clusterstate.json
   [junit4]   2> 	3	/solr/collections/testLeaderNotResponding/state.json
   [junit4]   2> 
   [junit4]   2> Maximum concurrent children watches above limit:
   [junit4]   2> 
   [junit4]   2> 	3	/solr/live_nodes
   [junit4]   2> 	3	/solr/collections
   [junit4]   2> 
   [junit4]   2> NOTE: leaving temporary files on disk at: /home/jenkins/workspace/Lucene-Solr-7.x-Linux/solr/build/solr-core/test/J1/temp/solr.cloud.TestPrepRecovery_56E578426BA3C4D4-001
   [junit4]   2> NOTE: test params are: codec=Asserting(Lucene70): {}, docValues:{}, maxPointsInLeafNode=1244, maxMBSortInHeap=7.811035624164836, sim=RandomSimilarity(queryNorm=true): {}, locale=mt-MT, timezone=EAT
   [junit4]   2> NOTE: Linux 4.10.0-37-generic amd64/Oracle Corporation 1.8.0_144 (64-bit)/cpus=8,threads=1,free=109652104,total=536870912
   [junit4]   2> NOTE: All tests run in this JVM: [TestReloadDeadlock, NumericFieldsTest, DistributedIntervalFacetingTest, TestLuceneMatchVersion, TestStressLucene, DirectUpdateHandlerTest, TermVectorComponentDistributedTest, TestNumericRangeQuery64, HttpPartitionTest, V2StandaloneTest, ResponseHeaderTest, BadCopyFieldTest, ConfigureRecoveryStrategyTest, SolrCmdDistributorTest, SolrIndexSplitterTest, TestSolrCloudWithHadoopAuthPlugin, TestJsonFacetRefinement, DistribDocExpirationUpdateProcessorTest, MigrateRouteKeyTest, BlockDirectoryTest, TestSmileRequest, TestCollationField, DeleteShardTest, LargeFieldTest, TestCloudSearcherWarming, SegmentsInfoRequestHandlerTest, TestCloudManagedSchema, VersionInfoTest, DistributedTermsComponentTest, ShardRoutingCustomTest, SampleTest, ClusterStateUpdateTest, SolrRequestParserTest, AnalyticsMergeStrategyTest, TestRTGBase, OutputWriterTest, TestDocBasedVersionConstraints, UninvertDocValuesMergePolicyTest, TestFaceting, DataDrivenBlockJoinTest, TestHashQParserPlugin, TestSolrCoreSnapshots, FullHLLTest, AssignTest, TestSQLHandler, SSLMigrationTest, TestSolrQueryParser, TestXIncludeConfig, LeaderFailureAfterFreshStartTest, DOMUtilTest, TestReplicationHandlerBackup, DistributedDebugComponentTest, ExitableDirectoryReaderTest, OpenCloseCoreStressTest, RegexBoostProcessorTest, TestNoOpRegenerator, TolerantUpdateProcessorTest, TestMacroExpander, TestSchemaNameResource, SignatureUpdateProcessorFactoryTest, ConcurrentDeleteAndCreateCollectionTest, TestSolrConfigHandlerConcurrent, TestStressLiveNodes, UtilsToolTest, TestFieldResource, NumberUtilsTest, TestEmbeddedSolrServerAdminHandler, AddReplicaTest, CurrencyFieldTypeTest, SuggesterTSTTest, DocumentAnalysisRequestHandlerTest, BasicAuthIntegrationTest, HdfsLockFactoryTest, TestConfigSetsAPIZkFailure, AddBlockUpdateTest, TestWriterPerf, SystemLogListenerTest, TestChildDocTransformer, TestBM25SimilarityFactory, TestDFISimilarityFactory, TestSha256AuthenticationProvider, ChaosMonkeySafeLeaderTest, TestQuerySenderNoQuery, PreAnalyzedFieldTest, TestSchemaVersionResource, CloudExitableDirectoryReaderTest, SolrShardReporterTest, MoveReplicaHDFSTest, SpatialHeatmapFacetsTest, TestLazyCores, ClassificationUpdateProcessorTest, SortSpecParsingTest, TestClusterStateMutator, HdfsRecoverLeaseTest, TestPayloadScoreQParserPlugin, BlobRepositoryCloudTest, HdfsBasicDistributedZk2Test, TestLeaderInitiatedRecoveryThread, BlockJoinFacetDistribTest, ChaosMonkeySafeLeaderWithPullReplicasTest, HighlighterMaxOffsetTest, TestCollectionAPIs, CreateCollectionCleanupTest, DistributedVersionInfoTest, SolrMetricManagerTest, SchemaVersionSpecificBehaviorTest, TestSolrCloudWithSecureImpersonation, TestCustomStream, SolrJmxReporterTest, TestPerFieldSimilarity, HdfsSyncSliceTest, VMParamsZkACLAndCredentialsProvidersTest, TestBackupRepositoryFactory, TestRangeQuery, TestAnalyzedSuggestions, PingRequestHandlerTest, TestRemoteStreaming, LukeRequestHandlerTest, RequestHandlersTest, TestDynamicFieldCollectionResource, UnloadDistributedZkTest, CollectionsAPIDistributedZkTest, LeaderElectionIntegrationTest, BasicZkTest, FullSolrCloudDistribCmdsTest, TestRandomFaceting, ZkSolrClientTest, TestDistributedSearch, TestReload, SpellCheckComponentTest, TestFunctionQuery, TestBadConfig, ShowFileRequestHandlerTest, DistributedQueryElevationComponentTest, SuggesterFSTTest, SpatialFilterTest, TestPseudoReturnFields, QueryEqualityTest, DefaultValueUpdateProcessorTest, SortByFunctionTest, DocValuesMultiTest, TestSolrDeletionPolicy1, XsltUpdateRequestHandlerTest, IndexBasedSpellCheckerTest, DirectSolrSpellCheckerTest, TestOmitPositions, DocumentBuilderTest, TestValueSourceCache, PathHierarchyTokenizerFactoryTest, TestIndexingPerformance, MoreLikeThisHandlerTest, IndexSchemaRuntimeFieldTest, IndexSchemaTest, TestCSVResponseWriter, BinaryUpdateRequestHandlerTest, TestPartialUpdateDeduplication, CSVRequestHandlerTest, TestComponentsName, SearchHandlerTest, TestLFUCache, TestLMJelinekMercerSimilarityFactory, TestFastWriter, TestFastOutputStream, TestFastLRUCache, DateFieldTest, RAMDirectoryFactoryTest, ZkNodePropsTest, CircularListTest, SolrTestCaseJ4Test, TestCrossCoreJoin, TestCursorMarkWithoutUniqueKey, TestHighlightDedupGrouping, TestTolerantSearch, TestLuceneIndexBackCompat, CdcrBootstrapTest, ConfigSetsAPITest, CustomCollectionTest, LeaderInitiatedRecoveryOnShardRestartTest, MoveReplicaHDFSFailoverTest, NodeMutatorTest, OverseerCollectionConfigSetProcessorTest, OverseerStatusTest, OverseerTaskQueueTest, ReplicationFactorTest, RestartWhileUpdatingTest, RollingRestartTest, SharedFSAutoReplicaFailoverTest, SimpleCollectionCreateDeleteTest, TestCloudDeleteByQuery, TestCloudInspectUtil, TestCloudJSONFacetJoinDomain, TestCloudRecovery, TestConfigSetsAPIExclusivity, TestCryptoKeys, TestDistribDocBasedVersion, TestLeaderElectionWithEmptyReplica, TestLeaderElectionZkExpiry, TestPrepRecovery]
   [junit4] Completed [558/746 (2!)] on J1 in 249.50s, 2 tests, 2 failures <<< FAILURES!

[...truncated 47921 lines...]

Mime
View raw message