lucene-dev mailing list archives

Site index · List index
Message view « Date » · « Thread »
Top « Date » · « Thread »
From Policeman Jenkins Server <jenk...@thetaphi.de>
Subject [JENKINS] Lucene-Solr-master-MacOSX (64bit/jdk1.8.0) - Build # 4244 - Still Unstable!
Date Mon, 23 Oct 2017 07:20:33 GMT
Build: https://jenkins.thetaphi.de/job/Lucene-Solr-master-MacOSX/4244/
Java: 64bit/jdk1.8.0 -XX:+UseCompressedOops -XX:+UseSerialGC

7 tests failed.
FAILED:  org.apache.solr.cloud.CustomCollectionTest.testRouteFieldForImplicitRouter

Error Message:
Error from server at https://127.0.0.1:60150/solr/withShardField: Async exception during distributed update: Too many open files

Stack Trace:
org.apache.solr.client.solrj.impl.HttpSolrClient$RemoteSolrException: Error from server at https://127.0.0.1:60150/solr/withShardField: Async exception during distributed update: Too many open files
	at __randomizedtesting.SeedInfo.seed([697C7D878F6E3A93:3C2C95152397F563]:0)
	at org.apache.solr.client.solrj.impl.HttpSolrClient.executeMethod(HttpSolrClient.java:626)
	at org.apache.solr.client.solrj.impl.HttpSolrClient.request(HttpSolrClient.java:253)
	at org.apache.solr.client.solrj.impl.HttpSolrClient.request(HttpSolrClient.java:242)
	at org.apache.solr.client.solrj.impl.LBHttpSolrClient.doRequest(LBHttpSolrClient.java:483)
	at org.apache.solr.client.solrj.impl.LBHttpSolrClient.request(LBHttpSolrClient.java:413)
	at org.apache.solr.client.solrj.impl.CloudSolrClient.sendRequest(CloudSolrClient.java:1086)
	at org.apache.solr.client.solrj.impl.CloudSolrClient.requestWithRetryOnStaleState(CloudSolrClient.java:867)
	at org.apache.solr.client.solrj.impl.CloudSolrClient.request(CloudSolrClient.java:800)
	at org.apache.solr.client.solrj.SolrRequest.process(SolrRequest.java:178)
	at org.apache.solr.client.solrj.request.UpdateRequest.commit(UpdateRequest.java:233)
	at org.apache.solr.cloud.CustomCollectionTest.testRouteFieldForImplicitRouter(CustomCollectionTest.java:141)
	at sun.reflect.NativeMethodAccessorImpl.invoke0(Native Method)
	at sun.reflect.NativeMethodAccessorImpl.invoke(NativeMethodAccessorImpl.java:62)
	at sun.reflect.DelegatingMethodAccessorImpl.invoke(DelegatingMethodAccessorImpl.java:43)
	at java.lang.reflect.Method.invoke(Method.java:498)
	at com.carrotsearch.randomizedtesting.RandomizedRunner.invoke(RandomizedRunner.java:1737)
	at com.carrotsearch.randomizedtesting.RandomizedRunner$8.evaluate(RandomizedRunner.java:934)
	at com.carrotsearch.randomizedtesting.RandomizedRunner$9.evaluate(RandomizedRunner.java:970)
	at com.carrotsearch.randomizedtesting.RandomizedRunner$10.evaluate(RandomizedRunner.java:984)
	at com.carrotsearch.randomizedtesting.rules.SystemPropertiesRestoreRule$1.evaluate(SystemPropertiesRestoreRule.java:57)
	at org.apache.lucene.util.TestRuleSetupTeardownChained$1.evaluate(TestRuleSetupTeardownChained.java:49)
	at org.apache.lucene.util.AbstractBeforeAfterRule$1.evaluate(AbstractBeforeAfterRule.java:45)
	at org.apache.lucene.util.TestRuleThreadAndTestName$1.evaluate(TestRuleThreadAndTestName.java:48)
	at org.apache.lucene.util.TestRuleIgnoreAfterMaxFailures$1.evaluate(TestRuleIgnoreAfterMaxFailures.java:64)
	at org.apache.lucene.util.TestRuleMarkFailure$1.evaluate(TestRuleMarkFailure.java:47)
	at com.carrotsearch.randomizedtesting.rules.StatementAdapter.evaluate(StatementAdapter.java:36)
	at com.carrotsearch.randomizedtesting.ThreadLeakControl$StatementRunner.run(ThreadLeakControl.java:368)
	at com.carrotsearch.randomizedtesting.ThreadLeakControl.forkTimeoutingTask(ThreadLeakControl.java:817)
	at com.carrotsearch.randomizedtesting.ThreadLeakControl$3.evaluate(ThreadLeakControl.java:468)
	at com.carrotsearch.randomizedtesting.RandomizedRunner.runSingleTest(RandomizedRunner.java:943)
	at com.carrotsearch.randomizedtesting.RandomizedRunner$5.evaluate(RandomizedRunner.java:829)
	at com.carrotsearch.randomizedtesting.RandomizedRunner$6.evaluate(RandomizedRunner.java:879)
	at com.carrotsearch.randomizedtesting.RandomizedRunner$7.evaluate(RandomizedRunner.java:890)
	at com.carrotsearch.randomizedtesting.rules.StatementAdapter.evaluate(StatementAdapter.java:36)
	at com.carrotsearch.randomizedtesting.rules.SystemPropertiesRestoreRule$1.evaluate(SystemPropertiesRestoreRule.java:57)
	at org.apache.lucene.util.AbstractBeforeAfterRule$1.evaluate(AbstractBeforeAfterRule.java:45)
	at com.carrotsearch.randomizedtesting.rules.StatementAdapter.evaluate(StatementAdapter.java:36)
	at org.apache.lucene.util.TestRuleStoreClassName$1.evaluate(TestRuleStoreClassName.java:41)
	at com.carrotsearch.randomizedtesting.rules.NoShadowingOrOverridesOnMethodsRule$1.evaluate(NoShadowingOrOverridesOnMethodsRule.java:40)
	at com.carrotsearch.randomizedtesting.rules.NoShadowingOrOverridesOnMethodsRule$1.evaluate(NoShadowingOrOverridesOnMethodsRule.java:40)
	at com.carrotsearch.randomizedtesting.rules.StatementAdapter.evaluate(StatementAdapter.java:36)
	at com.carrotsearch.randomizedtesting.rules.StatementAdapter.evaluate(StatementAdapter.java:36)
	at com.carrotsearch.randomizedtesting.rules.StatementAdapter.evaluate(StatementAdapter.java:36)
	at org.apache.lucene.util.TestRuleAssertionsRequired$1.evaluate(TestRuleAssertionsRequired.java:53)
	at org.apache.lucene.util.TestRuleMarkFailure$1.evaluate(TestRuleMarkFailure.java:47)
	at org.apache.lucene.util.TestRuleIgnoreAfterMaxFailures$1.evaluate(TestRuleIgnoreAfterMaxFailures.java:64)
	at org.apache.lucene.util.TestRuleIgnoreTestSuites$1.evaluate(TestRuleIgnoreTestSuites.java:54)
	at com.carrotsearch.randomizedtesting.rules.StatementAdapter.evaluate(StatementAdapter.java:36)
	at com.carrotsearch.randomizedtesting.ThreadLeakControl$StatementRunner.run(ThreadLeakControl.java:368)
	at java.lang.Thread.run(Thread.java:748)


FAILED:  org.apache.solr.cloud.TestTlogReplica.testCreateDelete {seed=[697C7D878F6E3A93:C63A30374D5C098F]}

Error Message:
Could not find collection : tlog_replica_test_create_delete

Stack Trace:
org.apache.solr.common.SolrException: Could not find collection : tlog_replica_test_create_delete
	at __randomizedtesting.SeedInfo.seed([697C7D878F6E3A93:C63A30374D5C098F]:0)
	at org.apache.solr.common.cloud.ClusterState.getCollection(ClusterState.java:111)
	at org.apache.solr.cloud.SolrCloudTestCase.getCollectionState(SolrCloudTestCase.java:247)
	at org.apache.solr.cloud.TestTlogReplica.testCreateDelete(TestTlogReplica.java:187)
	at sun.reflect.NativeMethodAccessorImpl.invoke0(Native Method)
	at sun.reflect.NativeMethodAccessorImpl.invoke(NativeMethodAccessorImpl.java:62)
	at sun.reflect.DelegatingMethodAccessorImpl.invoke(DelegatingMethodAccessorImpl.java:43)
	at java.lang.reflect.Method.invoke(Method.java:498)
	at com.carrotsearch.randomizedtesting.RandomizedRunner.invoke(RandomizedRunner.java:1737)
	at com.carrotsearch.randomizedtesting.RandomizedRunner$8.evaluate(RandomizedRunner.java:934)
	at com.carrotsearch.randomizedtesting.RandomizedRunner$9.evaluate(RandomizedRunner.java:970)
	at com.carrotsearch.randomizedtesting.RandomizedRunner$10.evaluate(RandomizedRunner.java:984)
	at com.carrotsearch.randomizedtesting.rules.SystemPropertiesRestoreRule$1.evaluate(SystemPropertiesRestoreRule.java:57)
	at org.apache.lucene.util.TestRuleSetupTeardownChained$1.evaluate(TestRuleSetupTeardownChained.java:49)
	at org.apache.lucene.util.AbstractBeforeAfterRule$1.evaluate(AbstractBeforeAfterRule.java:45)
	at org.apache.lucene.util.TestRuleThreadAndTestName$1.evaluate(TestRuleThreadAndTestName.java:48)
	at org.apache.lucene.util.TestRuleIgnoreAfterMaxFailures$1.evaluate(TestRuleIgnoreAfterMaxFailures.java:64)
	at org.apache.lucene.util.TestRuleMarkFailure$1.evaluate(TestRuleMarkFailure.java:47)
	at com.carrotsearch.randomizedtesting.rules.StatementAdapter.evaluate(StatementAdapter.java:36)
	at com.carrotsearch.randomizedtesting.ThreadLeakControl$StatementRunner.run(ThreadLeakControl.java:368)
	at com.carrotsearch.randomizedtesting.ThreadLeakControl.forkTimeoutingTask(ThreadLeakControl.java:817)
	at com.carrotsearch.randomizedtesting.ThreadLeakControl$3.evaluate(ThreadLeakControl.java:468)
	at com.carrotsearch.randomizedtesting.RandomizedRunner.runSingleTest(RandomizedRunner.java:943)
	at com.carrotsearch.randomizedtesting.RandomizedRunner$5.evaluate(RandomizedRunner.java:829)
	at com.carrotsearch.randomizedtesting.RandomizedRunner$6.evaluate(RandomizedRunner.java:879)
	at com.carrotsearch.randomizedtesting.RandomizedRunner$7.evaluate(RandomizedRunner.java:890)
	at com.carrotsearch.randomizedtesting.rules.StatementAdapter.evaluate(StatementAdapter.java:36)
	at com.carrotsearch.randomizedtesting.rules.SystemPropertiesRestoreRule$1.evaluate(SystemPropertiesRestoreRule.java:57)
	at org.apache.lucene.util.AbstractBeforeAfterRule$1.evaluate(AbstractBeforeAfterRule.java:45)
	at com.carrotsearch.randomizedtesting.rules.StatementAdapter.evaluate(StatementAdapter.java:36)
	at org.apache.lucene.util.TestRuleStoreClassName$1.evaluate(TestRuleStoreClassName.java:41)
	at com.carrotsearch.randomizedtesting.rules.NoShadowingOrOverridesOnMethodsRule$1.evaluate(NoShadowingOrOverridesOnMethodsRule.java:40)
	at com.carrotsearch.randomizedtesting.rules.NoShadowingOrOverridesOnMethodsRule$1.evaluate(NoShadowingOrOverridesOnMethodsRule.java:40)
	at com.carrotsearch.randomizedtesting.rules.StatementAdapter.evaluate(StatementAdapter.java:36)
	at com.carrotsearch.randomizedtesting.rules.StatementAdapter.evaluate(StatementAdapter.java:36)
	at com.carrotsearch.randomizedtesting.rules.StatementAdapter.evaluate(StatementAdapter.java:36)
	at org.apache.lucene.util.TestRuleAssertionsRequired$1.evaluate(TestRuleAssertionsRequired.java:53)
	at org.apache.lucene.util.TestRuleMarkFailure$1.evaluate(TestRuleMarkFailure.java:47)
	at org.apache.lucene.util.TestRuleIgnoreAfterMaxFailures$1.evaluate(TestRuleIgnoreAfterMaxFailures.java:64)
	at org.apache.lucene.util.TestRuleIgnoreTestSuites$1.evaluate(TestRuleIgnoreTestSuites.java:54)
	at com.carrotsearch.randomizedtesting.rules.StatementAdapter.evaluate(StatementAdapter.java:36)
	at com.carrotsearch.randomizedtesting.ThreadLeakControl$StatementRunner.run(ThreadLeakControl.java:368)
	at java.lang.Thread.run(Thread.java:748)


FAILED:  org.apache.solr.cloud.TestTlogReplica.testOutOfOrderDBQWithInPlaceUpdates

Error Message:
Expected collection to be created with 1 shards and  2 replicas null Live Nodes: [127.0.0.1:50110_solr, 127.0.0.1:50111_solr] Last available state: null

Stack Trace:
java.lang.AssertionError: Expected collection to be created with 1 shards and  2 replicas
null
Live Nodes: [127.0.0.1:50110_solr, 127.0.0.1:50111_solr]
Last available state: null
	at __randomizedtesting.SeedInfo.seed([697C7D878F6E3A93:EFBD856AD03FEC73]:0)
	at org.junit.Assert.fail(Assert.java:93)
	at org.apache.solr.cloud.SolrCloudTestCase.waitForState(SolrCloudTestCase.java:269)
	at org.apache.solr.cloud.TestTlogReplica.createAndWaitForCollection(TestTlogReplica.java:729)
	at org.apache.solr.cloud.TestTlogReplica.testOutOfOrderDBQWithInPlaceUpdates(TestTlogReplica.java:660)
	at sun.reflect.NativeMethodAccessorImpl.invoke0(Native Method)
	at sun.reflect.NativeMethodAccessorImpl.invoke(NativeMethodAccessorImpl.java:62)
	at sun.reflect.DelegatingMethodAccessorImpl.invoke(DelegatingMethodAccessorImpl.java:43)
	at java.lang.reflect.Method.invoke(Method.java:498)
	at com.carrotsearch.randomizedtesting.RandomizedRunner.invoke(RandomizedRunner.java:1737)
	at com.carrotsearch.randomizedtesting.RandomizedRunner$8.evaluate(RandomizedRunner.java:934)
	at com.carrotsearch.randomizedtesting.RandomizedRunner$9.evaluate(RandomizedRunner.java:970)
	at com.carrotsearch.randomizedtesting.RandomizedRunner$10.evaluate(RandomizedRunner.java:984)
	at com.carrotsearch.randomizedtesting.rules.SystemPropertiesRestoreRule$1.evaluate(SystemPropertiesRestoreRule.java:57)
	at org.apache.lucene.util.TestRuleSetupTeardownChained$1.evaluate(TestRuleSetupTeardownChained.java:49)
	at org.apache.lucene.util.AbstractBeforeAfterRule$1.evaluate(AbstractBeforeAfterRule.java:45)
	at org.apache.lucene.util.TestRuleThreadAndTestName$1.evaluate(TestRuleThreadAndTestName.java:48)
	at org.apache.lucene.util.TestRuleIgnoreAfterMaxFailures$1.evaluate(TestRuleIgnoreAfterMaxFailures.java:64)
	at org.apache.lucene.util.TestRuleMarkFailure$1.evaluate(TestRuleMarkFailure.java:47)
	at com.carrotsearch.randomizedtesting.rules.StatementAdapter.evaluate(StatementAdapter.java:36)
	at com.carrotsearch.randomizedtesting.ThreadLeakControl$StatementRunner.run(ThreadLeakControl.java:368)
	at com.carrotsearch.randomizedtesting.ThreadLeakControl.forkTimeoutingTask(ThreadLeakControl.java:817)
	at com.carrotsearch.randomizedtesting.ThreadLeakControl$3.evaluate(ThreadLeakControl.java:468)
	at com.carrotsearch.randomizedtesting.RandomizedRunner.runSingleTest(RandomizedRunner.java:943)
	at com.carrotsearch.randomizedtesting.RandomizedRunner$5.evaluate(RandomizedRunner.java:829)
	at com.carrotsearch.randomizedtesting.RandomizedRunner$6.evaluate(RandomizedRunner.java:879)
	at com.carrotsearch.randomizedtesting.RandomizedRunner$7.evaluate(RandomizedRunner.java:890)
	at com.carrotsearch.randomizedtesting.rules.StatementAdapter.evaluate(StatementAdapter.java:36)
	at com.carrotsearch.randomizedtesting.rules.SystemPropertiesRestoreRule$1.evaluate(SystemPropertiesRestoreRule.java:57)
	at org.apache.lucene.util.AbstractBeforeAfterRule$1.evaluate(AbstractBeforeAfterRule.java:45)
	at com.carrotsearch.randomizedtesting.rules.StatementAdapter.evaluate(StatementAdapter.java:36)
	at org.apache.lucene.util.TestRuleStoreClassName$1.evaluate(TestRuleStoreClassName.java:41)
	at com.carrotsearch.randomizedtesting.rules.NoShadowingOrOverridesOnMethodsRule$1.evaluate(NoShadowingOrOverridesOnMethodsRule.java:40)
	at com.carrotsearch.randomizedtesting.rules.NoShadowingOrOverridesOnMethodsRule$1.evaluate(NoShadowingOrOverridesOnMethodsRule.java:40)
	at com.carrotsearch.randomizedtesting.rules.StatementAdapter.evaluate(StatementAdapter.java:36)
	at com.carrotsearch.randomizedtesting.rules.StatementAdapter.evaluate(StatementAdapter.java:36)
	at com.carrotsearch.randomizedtesting.rules.StatementAdapter.evaluate(StatementAdapter.java:36)
	at org.apache.lucene.util.TestRuleAssertionsRequired$1.evaluate(TestRuleAssertionsRequired.java:53)
	at org.apache.lucene.util.TestRuleMarkFailure$1.evaluate(TestRuleMarkFailure.java:47)
	at org.apache.lucene.util.TestRuleIgnoreAfterMaxFailures$1.evaluate(TestRuleIgnoreAfterMaxFailures.java:64)
	at org.apache.lucene.util.TestRuleIgnoreTestSuites$1.evaluate(TestRuleIgnoreTestSuites.java:54)
	at com.carrotsearch.randomizedtesting.rules.StatementAdapter.evaluate(StatementAdapter.java:36)
	at com.carrotsearch.randomizedtesting.ThreadLeakControl$StatementRunner.run(ThreadLeakControl.java:368)
	at java.lang.Thread.run(Thread.java:748)


FAILED:  junit.framework.TestSuite.org.apache.solr.handler.TestReplicationHandler

Error Message:
ObjectTracker found 6 object(s) that were not released!!! [MockDirectoryWrapper, SolrCore, InternalHttpClient, MockDirectoryWrapper, MockDirectoryWrapper, MockDirectoryWrapper] org.apache.solr.common.util.ObjectReleaseTracker$ObjectTrackerException: org.apache.lucene.store.MockDirectoryWrapper  at org.apache.solr.common.util.ObjectReleaseTracker.track(ObjectReleaseTracker.java:42)  at org.apache.solr.core.CachingDirectoryFactory.get(CachingDirectoryFactory.java:348)  at org.apache.solr.update.SolrIndexWriter.create(SolrIndexWriter.java:92)  at org.apache.solr.core.SolrCore.initIndex(SolrCore.java:742)  at org.apache.solr.core.SolrCore.<init>(SolrCore.java:935)  at org.apache.solr.core.SolrCore.<init>(SolrCore.java:844)  at org.apache.solr.core.CoreContainer.createFromDescriptor(CoreContainer.java:1040)  at org.apache.solr.core.CoreContainer.lambda$load$13(CoreContainer.java:646)  at com.codahale.metrics.InstrumentedExecutorService$InstrumentedCallable.call(InstrumentedExecutorService.java:197)  at java.util.concurrent.FutureTask.run(FutureTask.java:266)  at org.apache.solr.common.util.ExecutorUtil$MDCAwareThreadPoolExecutor.lambda$execute$0(ExecutorUtil.java:188)  at java.util.concurrent.ThreadPoolExecutor.runWorker(ThreadPoolExecutor.java:1149)  at java.util.concurrent.ThreadPoolExecutor$Worker.run(ThreadPoolExecutor.java:624)  at java.lang.Thread.run(Thread.java:748)  org.apache.solr.common.util.ObjectReleaseTracker$ObjectTrackerException: org.apache.solr.core.SolrCore  at org.apache.solr.common.util.ObjectReleaseTracker.track(ObjectReleaseTracker.java:42)  at org.apache.solr.core.SolrCore.<init>(SolrCore.java:1020)  at org.apache.solr.core.SolrCore.reload(SolrCore.java:637)  at org.apache.solr.core.CoreContainer.reload(CoreContainer.java:1288)  at org.apache.solr.handler.IndexFetcher.lambda$reloadCore$0(IndexFetcher.java:910)  at java.lang.Thread.run(Thread.java:748)  org.apache.solr.common.util.ObjectReleaseTracker$ObjectTrackerException: org.apache.http.impl.client.InternalHttpClient  at org.apache.solr.common.util.ObjectReleaseTracker.track(ObjectReleaseTracker.java:42)  at org.apache.solr.client.solrj.impl.HttpClientUtil.createClient(HttpClientUtil.java:289)  at org.apache.solr.client.solrj.impl.HttpClientUtil.createClient(HttpClientUtil.java:298)  at org.apache.solr.handler.IndexFetcher.createHttpClient(IndexFetcher.java:222)  at org.apache.solr.handler.IndexFetcher.<init>(IndexFetcher.java:260)  at org.apache.solr.handler.ReplicationHandler.inform(ReplicationHandler.java:1216)  at org.apache.solr.core.SolrResourceLoader.inform(SolrResourceLoader.java:696)  at org.apache.solr.core.SolrCore.<init>(SolrCore.java:968)  at org.apache.solr.core.SolrCore.reload(SolrCore.java:637)  at org.apache.solr.core.CoreContainer.reload(CoreContainer.java:1288)  at org.apache.solr.handler.IndexFetcher.lambda$reloadCore$0(IndexFetcher.java:910)  at java.lang.Thread.run(Thread.java:748)  org.apache.solr.common.util.ObjectReleaseTracker$ObjectTrackerException: org.apache.lucene.store.MockDirectoryWrapper  at org.apache.solr.common.util.ObjectReleaseTracker.track(ObjectReleaseTracker.java:42)  at org.apache.solr.core.CachingDirectoryFactory.get(CachingDirectoryFactory.java:348)  at org.apache.solr.core.SolrCore.getNewIndexDir(SolrCore.java:350)  at org.apache.solr.core.SolrCore.initIndex(SolrCore.java:710)  at org.apache.solr.core.SolrCore.<init>(SolrCore.java:935)  at org.apache.solr.core.SolrCore.<init>(SolrCore.java:844)  at org.apache.solr.core.CoreContainer.createFromDescriptor(CoreContainer.java:1040)  at org.apache.solr.core.CoreContainer.lambda$load$13(CoreContainer.java:646)  at com.codahale.metrics.InstrumentedExecutorService$InstrumentedCallable.call(InstrumentedExecutorService.java:197)  at java.util.concurrent.FutureTask.run(FutureTask.java:266)  at org.apache.solr.common.util.ExecutorUtil$MDCAwareThreadPoolExecutor.lambda$execute$0(ExecutorUtil.java:188)  at java.util.concurrent.ThreadPoolExecutor.runWorker(ThreadPoolExecutor.java:1149)  at java.util.concurrent.ThreadPoolExecutor$Worker.run(ThreadPoolExecutor.java:624)  at java.lang.Thread.run(Thread.java:748)  org.apache.solr.common.util.ObjectReleaseTracker$ObjectTrackerException: org.apache.lucene.store.MockDirectoryWrapper  at org.apache.solr.common.util.ObjectReleaseTracker.track(ObjectReleaseTracker.java:42)  at org.apache.solr.core.CachingDirectoryFactory.get(CachingDirectoryFactory.java:348)  at org.apache.solr.core.SolrCore.initSnapshotMetaDataManager(SolrCore.java:479)  at org.apache.solr.core.SolrCore.<init>(SolrCore.java:929)  at org.apache.solr.core.SolrCore.<init>(SolrCore.java:844)  at org.apache.solr.core.CoreContainer.createFromDescriptor(CoreContainer.java:1040)  at org.apache.solr.core.CoreContainer.lambda$load$13(CoreContainer.java:646)  at com.codahale.metrics.InstrumentedExecutorService$InstrumentedCallable.call(InstrumentedExecutorService.java:197)  at java.util.concurrent.FutureTask.run(FutureTask.java:266)  at org.apache.solr.common.util.ExecutorUtil$MDCAwareThreadPoolExecutor.lambda$execute$0(ExecutorUtil.java:188)  at java.util.concurrent.ThreadPoolExecutor.runWorker(ThreadPoolExecutor.java:1149)  at java.util.concurrent.ThreadPoolExecutor$Worker.run(ThreadPoolExecutor.java:624)  at java.lang.Thread.run(Thread.java:748)  org.apache.solr.common.util.ObjectReleaseTracker$ObjectTrackerException: org.apache.lucene.store.MockDirectoryWrapper  at org.apache.solr.common.util.ObjectReleaseTracker.track(ObjectReleaseTracker.java:42)  at org.apache.solr.core.CachingDirectoryFactory.get(CachingDirectoryFactory.java:348)  at org.apache.solr.handler.IndexFetcher.fetchLatestIndex(IndexFetcher.java:494)  at org.apache.solr.handler.IndexFetcher.fetchLatestIndex(IndexFetcher.java:338)  at org.apache.solr.handler.ReplicationHandler.doFetch(ReplicationHandler.java:421)  at org.apache.solr.handler.ReplicationHandler.lambda$setupPolling$12(ReplicationHandler.java:1185)  at java.util.concurrent.Executors$RunnableAdapter.call(Executors.java:511)  at java.util.concurrent.FutureTask.runAndReset(FutureTask.java:308)  at java.util.concurrent.ScheduledThreadPoolExecutor$ScheduledFutureTask.access$301(ScheduledThreadPoolExecutor.java:180)  at java.util.concurrent.ScheduledThreadPoolExecutor$ScheduledFutureTask.run(ScheduledThreadPoolExecutor.java:294)  at java.util.concurrent.ThreadPoolExecutor.runWorker(ThreadPoolExecutor.java:1149)  at java.util.concurrent.ThreadPoolExecutor$Worker.run(ThreadPoolExecutor.java:624)  at java.lang.Thread.run(Thread.java:748)  

Stack Trace:
java.lang.AssertionError: ObjectTracker found 6 object(s) that were not released!!! [MockDirectoryWrapper, SolrCore, InternalHttpClient, MockDirectoryWrapper, MockDirectoryWrapper, MockDirectoryWrapper]
org.apache.solr.common.util.ObjectReleaseTracker$ObjectTrackerException: org.apache.lucene.store.MockDirectoryWrapper
	at org.apache.solr.common.util.ObjectReleaseTracker.track(ObjectReleaseTracker.java:42)
	at org.apache.solr.core.CachingDirectoryFactory.get(CachingDirectoryFactory.java:348)
	at org.apache.solr.update.SolrIndexWriter.create(SolrIndexWriter.java:92)
	at org.apache.solr.core.SolrCore.initIndex(SolrCore.java:742)
	at org.apache.solr.core.SolrCore.<init>(SolrCore.java:935)
	at org.apache.solr.core.SolrCore.<init>(SolrCore.java:844)
	at org.apache.solr.core.CoreContainer.createFromDescriptor(CoreContainer.java:1040)
	at org.apache.solr.core.CoreContainer.lambda$load$13(CoreContainer.java:646)
	at com.codahale.metrics.InstrumentedExecutorService$InstrumentedCallable.call(InstrumentedExecutorService.java:197)
	at java.util.concurrent.FutureTask.run(FutureTask.java:266)
	at org.apache.solr.common.util.ExecutorUtil$MDCAwareThreadPoolExecutor.lambda$execute$0(ExecutorUtil.java:188)
	at java.util.concurrent.ThreadPoolExecutor.runWorker(ThreadPoolExecutor.java:1149)
	at java.util.concurrent.ThreadPoolExecutor$Worker.run(ThreadPoolExecutor.java:624)
	at java.lang.Thread.run(Thread.java:748)

org.apache.solr.common.util.ObjectReleaseTracker$ObjectTrackerException: org.apache.solr.core.SolrCore
	at org.apache.solr.common.util.ObjectReleaseTracker.track(ObjectReleaseTracker.java:42)
	at org.apache.solr.core.SolrCore.<init>(SolrCore.java:1020)
	at org.apache.solr.core.SolrCore.reload(SolrCore.java:637)
	at org.apache.solr.core.CoreContainer.reload(CoreContainer.java:1288)
	at org.apache.solr.handler.IndexFetcher.lambda$reloadCore$0(IndexFetcher.java:910)
	at java.lang.Thread.run(Thread.java:748)

org.apache.solr.common.util.ObjectReleaseTracker$ObjectTrackerException: org.apache.http.impl.client.InternalHttpClient
	at org.apache.solr.common.util.ObjectReleaseTracker.track(ObjectReleaseTracker.java:42)
	at org.apache.solr.client.solrj.impl.HttpClientUtil.createClient(HttpClientUtil.java:289)
	at org.apache.solr.client.solrj.impl.HttpClientUtil.createClient(HttpClientUtil.java:298)
	at org.apache.solr.handler.IndexFetcher.createHttpClient(IndexFetcher.java:222)
	at org.apache.solr.handler.IndexFetcher.<init>(IndexFetcher.java:260)
	at org.apache.solr.handler.ReplicationHandler.inform(ReplicationHandler.java:1216)
	at org.apache.solr.core.SolrResourceLoader.inform(SolrResourceLoader.java:696)
	at org.apache.solr.core.SolrCore.<init>(SolrCore.java:968)
	at org.apache.solr.core.SolrCore.reload(SolrCore.java:637)
	at org.apache.solr.core.CoreContainer.reload(CoreContainer.java:1288)
	at org.apache.solr.handler.IndexFetcher.lambda$reloadCore$0(IndexFetcher.java:910)
	at java.lang.Thread.run(Thread.java:748)

org.apache.solr.common.util.ObjectReleaseTracker$ObjectTrackerException: org.apache.lucene.store.MockDirectoryWrapper
	at org.apache.solr.common.util.ObjectReleaseTracker.track(ObjectReleaseTracker.java:42)
	at org.apache.solr.core.CachingDirectoryFactory.get(CachingDirectoryFactory.java:348)
	at org.apache.solr.core.SolrCore.getNewIndexDir(SolrCore.java:350)
	at org.apache.solr.core.SolrCore.initIndex(SolrCore.java:710)
	at org.apache.solr.core.SolrCore.<init>(SolrCore.java:935)
	at org.apache.solr.core.SolrCore.<init>(SolrCore.java:844)
	at org.apache.solr.core.CoreContainer.createFromDescriptor(CoreContainer.java:1040)
	at org.apache.solr.core.CoreContainer.lambda$load$13(CoreContainer.java:646)
	at com.codahale.metrics.InstrumentedExecutorService$InstrumentedCallable.call(InstrumentedExecutorService.java:197)
	at java.util.concurrent.FutureTask.run(FutureTask.java:266)
	at org.apache.solr.common.util.ExecutorUtil$MDCAwareThreadPoolExecutor.lambda$execute$0(ExecutorUtil.java:188)
	at java.util.concurrent.ThreadPoolExecutor.runWorker(ThreadPoolExecutor.java:1149)
	at java.util.concurrent.ThreadPoolExecutor$Worker.run(ThreadPoolExecutor.java:624)
	at java.lang.Thread.run(Thread.java:748)

org.apache.solr.common.util.ObjectReleaseTracker$ObjectTrackerException: org.apache.lucene.store.MockDirectoryWrapper
	at org.apache.solr.common.util.ObjectReleaseTracker.track(ObjectReleaseTracker.java:42)
	at org.apache.solr.core.CachingDirectoryFactory.get(CachingDirectoryFactory.java:348)
	at org.apache.solr.core.SolrCore.initSnapshotMetaDataManager(SolrCore.java:479)
	at org.apache.solr.core.SolrCore.<init>(SolrCore.java:929)
	at org.apache.solr.core.SolrCore.<init>(SolrCore.java:844)
	at org.apache.solr.core.CoreContainer.createFromDescriptor(CoreContainer.java:1040)
	at org.apache.solr.core.CoreContainer.lambda$load$13(CoreContainer.java:646)
	at com.codahale.metrics.InstrumentedExecutorService$InstrumentedCallable.call(InstrumentedExecutorService.java:197)
	at java.util.concurrent.FutureTask.run(FutureTask.java:266)
	at org.apache.solr.common.util.ExecutorUtil$MDCAwareThreadPoolExecutor.lambda$execute$0(ExecutorUtil.java:188)
	at java.util.concurrent.ThreadPoolExecutor.runWorker(ThreadPoolExecutor.java:1149)
	at java.util.concurrent.ThreadPoolExecutor$Worker.run(ThreadPoolExecutor.java:624)
	at java.lang.Thread.run(Thread.java:748)

org.apache.solr.common.util.ObjectReleaseTracker$ObjectTrackerException: org.apache.lucene.store.MockDirectoryWrapper
	at org.apache.solr.common.util.ObjectReleaseTracker.track(ObjectReleaseTracker.java:42)
	at org.apache.solr.core.CachingDirectoryFactory.get(CachingDirectoryFactory.java:348)
	at org.apache.solr.handler.IndexFetcher.fetchLatestIndex(IndexFetcher.java:494)
	at org.apache.solr.handler.IndexFetcher.fetchLatestIndex(IndexFetcher.java:338)
	at org.apache.solr.handler.ReplicationHandler.doFetch(ReplicationHandler.java:421)
	at org.apache.solr.handler.ReplicationHandler.lambda$setupPolling$12(ReplicationHandler.java:1185)
	at java.util.concurrent.Executors$RunnableAdapter.call(Executors.java:511)
	at java.util.concurrent.FutureTask.runAndReset(FutureTask.java:308)
	at java.util.concurrent.ScheduledThreadPoolExecutor$ScheduledFutureTask.access$301(ScheduledThreadPoolExecutor.java:180)
	at java.util.concurrent.ScheduledThreadPoolExecutor$ScheduledFutureTask.run(ScheduledThreadPoolExecutor.java:294)
	at java.util.concurrent.ThreadPoolExecutor.runWorker(ThreadPoolExecutor.java:1149)
	at java.util.concurrent.ThreadPoolExecutor$Worker.run(ThreadPoolExecutor.java:624)
	at java.lang.Thread.run(Thread.java:748)


	at __randomizedtesting.SeedInfo.seed([697C7D878F6E3A93]:0)
	at org.junit.Assert.fail(Assert.java:93)
	at org.junit.Assert.assertTrue(Assert.java:43)
	at org.junit.Assert.assertNull(Assert.java:551)
	at org.apache.solr.SolrTestCaseJ4.teardownTestCases(SolrTestCaseJ4.java:295)
	at sun.reflect.GeneratedMethodAccessor24.invoke(Unknown Source)
	at sun.reflect.DelegatingMethodAccessorImpl.invoke(DelegatingMethodAccessorImpl.java:43)
	at java.lang.reflect.Method.invoke(Method.java:498)
	at com.carrotsearch.randomizedtesting.RandomizedRunner.invoke(RandomizedRunner.java:1737)
	at com.carrotsearch.randomizedtesting.RandomizedRunner$7.evaluate(RandomizedRunner.java:897)
	at com.carrotsearch.randomizedtesting.rules.StatementAdapter.evaluate(StatementAdapter.java:36)
	at com.carrotsearch.randomizedtesting.rules.SystemPropertiesRestoreRule$1.evaluate(SystemPropertiesRestoreRule.java:57)
	at org.apache.lucene.util.AbstractBeforeAfterRule$1.evaluate(AbstractBeforeAfterRule.java:45)
	at com.carrotsearch.randomizedtesting.rules.StatementAdapter.evaluate(StatementAdapter.java:36)
	at org.apache.lucene.util.TestRuleStoreClassName$1.evaluate(TestRuleStoreClassName.java:41)
	at com.carrotsearch.randomizedtesting.rules.NoShadowingOrOverridesOnMethodsRule$1.evaluate(NoShadowingOrOverridesOnMethodsRule.java:40)
	at com.carrotsearch.randomizedtesting.rules.NoShadowingOrOverridesOnMethodsRule$1.evaluate(NoShadowingOrOverridesOnMethodsRule.java:40)
	at com.carrotsearch.randomizedtesting.rules.StatementAdapter.evaluate(StatementAdapter.java:36)
	at com.carrotsearch.randomizedtesting.rules.StatementAdapter.evaluate(StatementAdapter.java:36)
	at com.carrotsearch.randomizedtesting.rules.StatementAdapter.evaluate(StatementAdapter.java:36)
	at org.apache.lucene.util.TestRuleAssertionsRequired$1.evaluate(TestRuleAssertionsRequired.java:53)
	at org.apache.lucene.util.TestRuleMarkFailure$1.evaluate(TestRuleMarkFailure.java:47)
	at org.apache.lucene.util.TestRuleIgnoreAfterMaxFailures$1.evaluate(TestRuleIgnoreAfterMaxFailures.java:64)
	at org.apache.lucene.util.TestRuleIgnoreTestSuites$1.evaluate(TestRuleIgnoreTestSuites.java:54)
	at com.carrotsearch.randomizedtesting.rules.StatementAdapter.evaluate(StatementAdapter.java:36)
	at com.carrotsearch.randomizedtesting.ThreadLeakControl$StatementRunner.run(ThreadLeakControl.java:368)
	at java.lang.Thread.run(Thread.java:748)


FAILED:  org.apache.solr.handler.admin.AutoscalingHistoryHandlerTest.testHistory

Error Message:
action did not execute

Stack Trace:
java.lang.AssertionError: action did not execute
	at __randomizedtesting.SeedInfo.seed([697C7D878F6E3A93:480D97A3526C594]:0)
	at org.junit.Assert.fail(Assert.java:93)
	at org.junit.Assert.assertTrue(Assert.java:43)
	at org.apache.solr.handler.admin.AutoscalingHistoryHandlerTest.testHistory(AutoscalingHistoryHandlerTest.java:260)
	at sun.reflect.NativeMethodAccessorImpl.invoke0(Native Method)
	at sun.reflect.NativeMethodAccessorImpl.invoke(NativeMethodAccessorImpl.java:62)
	at sun.reflect.DelegatingMethodAccessorImpl.invoke(DelegatingMethodAccessorImpl.java:43)
	at java.lang.reflect.Method.invoke(Method.java:498)
	at com.carrotsearch.randomizedtesting.RandomizedRunner.invoke(RandomizedRunner.java:1737)
	at com.carrotsearch.randomizedtesting.RandomizedRunner$8.evaluate(RandomizedRunner.java:934)
	at com.carrotsearch.randomizedtesting.RandomizedRunner$9.evaluate(RandomizedRunner.java:970)
	at com.carrotsearch.randomizedtesting.RandomizedRunner$10.evaluate(RandomizedRunner.java:984)
	at com.carrotsearch.randomizedtesting.rules.SystemPropertiesRestoreRule$1.evaluate(SystemPropertiesRestoreRule.java:57)
	at org.apache.lucene.util.TestRuleSetupTeardownChained$1.evaluate(TestRuleSetupTeardownChained.java:49)
	at org.apache.lucene.util.AbstractBeforeAfterRule$1.evaluate(AbstractBeforeAfterRule.java:45)
	at org.apache.lucene.util.TestRuleThreadAndTestName$1.evaluate(TestRuleThreadAndTestName.java:48)
	at org.apache.lucene.util.TestRuleIgnoreAfterMaxFailures$1.evaluate(TestRuleIgnoreAfterMaxFailures.java:64)
	at org.apache.lucene.util.TestRuleMarkFailure$1.evaluate(TestRuleMarkFailure.java:47)
	at com.carrotsearch.randomizedtesting.rules.StatementAdapter.evaluate(StatementAdapter.java:36)
	at com.carrotsearch.randomizedtesting.ThreadLeakControl$StatementRunner.run(ThreadLeakControl.java:368)
	at com.carrotsearch.randomizedtesting.ThreadLeakControl.forkTimeoutingTask(ThreadLeakControl.java:817)
	at com.carrotsearch.randomizedtesting.ThreadLeakControl$3.evaluate(ThreadLeakControl.java:468)
	at com.carrotsearch.randomizedtesting.RandomizedRunner.runSingleTest(RandomizedRunner.java:943)
	at com.carrotsearch.randomizedtesting.RandomizedRunner$5.evaluate(RandomizedRunner.java:829)
	at com.carrotsearch.randomizedtesting.RandomizedRunner$6.evaluate(RandomizedRunner.java:879)
	at com.carrotsearch.randomizedtesting.RandomizedRunner$7.evaluate(RandomizedRunner.java:890)
	at com.carrotsearch.randomizedtesting.rules.StatementAdapter.evaluate(StatementAdapter.java:36)
	at com.carrotsearch.randomizedtesting.rules.SystemPropertiesRestoreRule$1.evaluate(SystemPropertiesRestoreRule.java:57)
	at org.apache.lucene.util.AbstractBeforeAfterRule$1.evaluate(AbstractBeforeAfterRule.java:45)
	at com.carrotsearch.randomizedtesting.rules.StatementAdapter.evaluate(StatementAdapter.java:36)
	at org.apache.lucene.util.TestRuleStoreClassName$1.evaluate(TestRuleStoreClassName.java:41)
	at com.carrotsearch.randomizedtesting.rules.NoShadowingOrOverridesOnMethodsRule$1.evaluate(NoShadowingOrOverridesOnMethodsRule.java:40)
	at com.carrotsearch.randomizedtesting.rules.NoShadowingOrOverridesOnMethodsRule$1.evaluate(NoShadowingOrOverridesOnMethodsRule.java:40)
	at com.carrotsearch.randomizedtesting.rules.StatementAdapter.evaluate(StatementAdapter.java:36)
	at com.carrotsearch.randomizedtesting.rules.StatementAdapter.evaluate(StatementAdapter.java:36)
	at com.carrotsearch.randomizedtesting.rules.StatementAdapter.evaluate(StatementAdapter.java:36)
	at org.apache.lucene.util.TestRuleAssertionsRequired$1.evaluate(TestRuleAssertionsRequired.java:53)
	at org.apache.lucene.util.TestRuleMarkFailure$1.evaluate(TestRuleMarkFailure.java:47)
	at org.apache.lucene.util.TestRuleIgnoreAfterMaxFailures$1.evaluate(TestRuleIgnoreAfterMaxFailures.java:64)
	at org.apache.lucene.util.TestRuleIgnoreTestSuites$1.evaluate(TestRuleIgnoreTestSuites.java:54)
	at com.carrotsearch.randomizedtesting.rules.StatementAdapter.evaluate(StatementAdapter.java:36)
	at com.carrotsearch.randomizedtesting.ThreadLeakControl$StatementRunner.run(ThreadLeakControl.java:368)
	at java.lang.Thread.run(Thread.java:748)


FAILED:  junit.framework.TestSuite.org.apache.solr.handler.admin.AutoscalingHistoryHandlerTest

Error Message:
1 thread leaked from SUITE scope at org.apache.solr.handler.admin.AutoscalingHistoryHandlerTest:     1) Thread[id=830, name=AutoscalingActionExecutor-253-thread-1-processing-n:127.0.0.1:56372_solr, state=TIMED_WAITING, group=TGRP-AutoscalingHistoryHandlerTest]         at java.lang.Thread.sleep(Native Method)         at java.lang.Thread.sleep(Thread.java:340)         at java.util.concurrent.TimeUnit.sleep(TimeUnit.java:386)         at org.apache.solr.cloud.autoscaling.ExecutePlanAction.waitForTaskToFinish(ExecutePlanAction.java:155)         at org.apache.solr.cloud.autoscaling.ScheduledTriggers.waitForPendingTasks(ScheduledTriggers.java:289)         at org.apache.solr.cloud.autoscaling.ScheduledTriggers.lambda$null$2(ScheduledTriggers.java:221)         at org.apache.solr.cloud.autoscaling.ScheduledTriggers$$Lambda$422/223359456.run(Unknown Source)         at java.util.concurrent.Executors$RunnableAdapter.call(Executors.java:511)         at java.util.concurrent.FutureTask.run(FutureTask.java:266)         at org.apache.solr.common.util.ExecutorUtil$MDCAwareThreadPoolExecutor.lambda$execute$0(ExecutorUtil.java:188)         at org.apache.solr.common.util.ExecutorUtil$MDCAwareThreadPoolExecutor$$Lambda$18/2114964337.run(Unknown Source)         at java.util.concurrent.ThreadPoolExecutor.runWorker(ThreadPoolExecutor.java:1149)         at java.util.concurrent.ThreadPoolExecutor$Worker.run(ThreadPoolExecutor.java:624)         at java.lang.Thread.run(Thread.java:748)

Stack Trace:
com.carrotsearch.randomizedtesting.ThreadLeakError: 1 thread leaked from SUITE scope at org.apache.solr.handler.admin.AutoscalingHistoryHandlerTest: 
   1) Thread[id=830, name=AutoscalingActionExecutor-253-thread-1-processing-n:127.0.0.1:56372_solr, state=TIMED_WAITING, group=TGRP-AutoscalingHistoryHandlerTest]
        at java.lang.Thread.sleep(Native Method)
        at java.lang.Thread.sleep(Thread.java:340)
        at java.util.concurrent.TimeUnit.sleep(TimeUnit.java:386)
        at org.apache.solr.cloud.autoscaling.ExecutePlanAction.waitForTaskToFinish(ExecutePlanAction.java:155)
        at org.apache.solr.cloud.autoscaling.ScheduledTriggers.waitForPendingTasks(ScheduledTriggers.java:289)
        at org.apache.solr.cloud.autoscaling.ScheduledTriggers.lambda$null$2(ScheduledTriggers.java:221)
        at org.apache.solr.cloud.autoscaling.ScheduledTriggers$$Lambda$422/223359456.run(Unknown Source)
        at java.util.concurrent.Executors$RunnableAdapter.call(Executors.java:511)
        at java.util.concurrent.FutureTask.run(FutureTask.java:266)
        at org.apache.solr.common.util.ExecutorUtil$MDCAwareThreadPoolExecutor.lambda$execute$0(ExecutorUtil.java:188)
        at org.apache.solr.common.util.ExecutorUtil$MDCAwareThreadPoolExecutor$$Lambda$18/2114964337.run(Unknown Source)
        at java.util.concurrent.ThreadPoolExecutor.runWorker(ThreadPoolExecutor.java:1149)
        at java.util.concurrent.ThreadPoolExecutor$Worker.run(ThreadPoolExecutor.java:624)
        at java.lang.Thread.run(Thread.java:748)
	at __randomizedtesting.SeedInfo.seed([697C7D878F6E3A93]:0)


FAILED:  org.apache.solr.client.solrj.io.stream.StreamExpressionTest.testDistributions

Error Message:


Stack Trace:
java.lang.AssertionError
	at __randomizedtesting.SeedInfo.seed([B2FBE78760C5F78B:D04A62DBE3F1717]:0)
	at org.junit.Assert.fail(Assert.java:92)
	at org.junit.Assert.assertTrue(Assert.java:43)
	at org.junit.Assert.assertTrue(Assert.java:54)
	at org.apache.solr.client.solrj.io.stream.StreamExpressionTest.testDistributions(StreamExpressionTest.java:6137)
	at sun.reflect.NativeMethodAccessorImpl.invoke0(Native Method)
	at sun.reflect.NativeMethodAccessorImpl.invoke(NativeMethodAccessorImpl.java:62)
	at sun.reflect.DelegatingMethodAccessorImpl.invoke(DelegatingMethodAccessorImpl.java:43)
	at java.lang.reflect.Method.invoke(Method.java:498)
	at com.carrotsearch.randomizedtesting.RandomizedRunner.invoke(RandomizedRunner.java:1737)
	at com.carrotsearch.randomizedtesting.RandomizedRunner$8.evaluate(RandomizedRunner.java:934)
	at com.carrotsearch.randomizedtesting.RandomizedRunner$9.evaluate(RandomizedRunner.java:970)
	at com.carrotsearch.randomizedtesting.RandomizedRunner$10.evaluate(RandomizedRunner.java:984)
	at com.carrotsearch.randomizedtesting.rules.SystemPropertiesRestoreRule$1.evaluate(SystemPropertiesRestoreRule.java:57)
	at org.apache.lucene.util.TestRuleSetupTeardownChained$1.evaluate(TestRuleSetupTeardownChained.java:49)
	at org.apache.lucene.util.AbstractBeforeAfterRule$1.evaluate(AbstractBeforeAfterRule.java:45)
	at org.apache.lucene.util.TestRuleThreadAndTestName$1.evaluate(TestRuleThreadAndTestName.java:48)
	at org.apache.lucene.util.TestRuleIgnoreAfterMaxFailures$1.evaluate(TestRuleIgnoreAfterMaxFailures.java:64)
	at org.apache.lucene.util.TestRuleMarkFailure$1.evaluate(TestRuleMarkFailure.java:47)
	at com.carrotsearch.randomizedtesting.rules.StatementAdapter.evaluate(StatementAdapter.java:36)
	at com.carrotsearch.randomizedtesting.ThreadLeakControl$StatementRunner.run(ThreadLeakControl.java:368)
	at com.carrotsearch.randomizedtesting.ThreadLeakControl.forkTimeoutingTask(ThreadLeakControl.java:817)
	at com.carrotsearch.randomizedtesting.ThreadLeakControl$3.evaluate(ThreadLeakControl.java:468)
	at com.carrotsearch.randomizedtesting.RandomizedRunner.runSingleTest(RandomizedRunner.java:943)
	at com.carrotsearch.randomizedtesting.RandomizedRunner$5.evaluate(RandomizedRunner.java:829)
	at com.carrotsearch.randomizedtesting.RandomizedRunner$6.evaluate(RandomizedRunner.java:879)
	at com.carrotsearch.randomizedtesting.RandomizedRunner$7.evaluate(RandomizedRunner.java:890)
	at com.carrotsearch.randomizedtesting.rules.StatementAdapter.evaluate(StatementAdapter.java:36)
	at com.carrotsearch.randomizedtesting.rules.SystemPropertiesRestoreRule$1.evaluate(SystemPropertiesRestoreRule.java:57)
	at org.apache.lucene.util.AbstractBeforeAfterRule$1.evaluate(AbstractBeforeAfterRule.java:45)
	at com.carrotsearch.randomizedtesting.rules.StatementAdapter.evaluate(StatementAdapter.java:36)
	at org.apache.lucene.util.TestRuleStoreClassName$1.evaluate(TestRuleStoreClassName.java:41)
	at com.carrotsearch.randomizedtesting.rules.NoShadowingOrOverridesOnMethodsRule$1.evaluate(NoShadowingOrOverridesOnMethodsRule.java:40)
	at com.carrotsearch.randomizedtesting.rules.NoShadowingOrOverridesOnMethodsRule$1.evaluate(NoShadowingOrOverridesOnMethodsRule.java:40)
	at com.carrotsearch.randomizedtesting.rules.StatementAdapter.evaluate(StatementAdapter.java:36)
	at com.carrotsearch.randomizedtesting.rules.StatementAdapter.evaluate(StatementAdapter.java:36)
	at com.carrotsearch.randomizedtesting.rules.StatementAdapter.evaluate(StatementAdapter.java:36)
	at org.apache.lucene.util.TestRuleAssertionsRequired$1.evaluate(TestRuleAssertionsRequired.java:53)
	at org.apache.lucene.util.TestRuleMarkFailure$1.evaluate(TestRuleMarkFailure.java:47)
	at org.apache.lucene.util.TestRuleIgnoreAfterMaxFailures$1.evaluate(TestRuleIgnoreAfterMaxFailures.java:64)
	at org.apache.lucene.util.TestRuleIgnoreTestSuites$1.evaluate(TestRuleIgnoreTestSuites.java:54)
	at com.carrotsearch.randomizedtesting.rules.StatementAdapter.evaluate(StatementAdapter.java:36)
	at com.carrotsearch.randomizedtesting.ThreadLeakControl$StatementRunner.run(ThreadLeakControl.java:368)
	at java.lang.Thread.run(Thread.java:748)




Build Log:
[...truncated 11797 lines...]
   [junit4] Suite: org.apache.solr.handler.admin.AutoscalingHistoryHandlerTest
   [junit4]   2> 65185 INFO  (SUITE-AutoscalingHistoryHandlerTest-seed#[697C7D878F6E3A93]-worker) [    ] o.a.s.SolrTestCaseJ4 SecureRandom sanity checks: test.solr.allowed.securerandom=null & java.security.egd=file:/dev/./urandom
   [junit4]   2> Creating dataDir: /Users/jenkins/workspace/Lucene-Solr-master-MacOSX/solr/build/solr-core/test/J0/temp/solr.handler.admin.AutoscalingHistoryHandlerTest_697C7D878F6E3A93-001/init-core-data-001
   [junit4]   2> 65186 INFO  (SUITE-AutoscalingHistoryHandlerTest-seed#[697C7D878F6E3A93]-worker) [    ] o.a.s.SolrTestCaseJ4 Using PointFields (NUMERIC_POINTS_SYSPROP=true) w/NUMERIC_DOCVALUES_SYSPROP=false
   [junit4]   2> 65189 INFO  (SUITE-AutoscalingHistoryHandlerTest-seed#[697C7D878F6E3A93]-worker) [    ] o.a.s.SolrTestCaseJ4 Randomized ssl (false) and clientAuth (false) via: @org.apache.solr.util.RandomizeSSL(reason=, value=NaN, ssl=NaN, clientAuth=NaN) w/ MAC_OS_X supressed clientAuth
   [junit4]   2> 65189 INFO  (SUITE-AutoscalingHistoryHandlerTest-seed#[697C7D878F6E3A93]-worker) [    ] o.a.s.c.MiniSolrCloudCluster Starting cluster of 3 servers in /Users/jenkins/workspace/Lucene-Solr-master-MacOSX/solr/build/solr-core/test/J0/temp/solr.handler.admin.AutoscalingHistoryHandlerTest_697C7D878F6E3A93-001/tempDir-001
   [junit4]   2> 65189 INFO  (SUITE-AutoscalingHistoryHandlerTest-seed#[697C7D878F6E3A93]-worker) [    ] o.a.s.c.ZkTestServer STARTING ZK TEST SERVER
   [junit4]   2> 65190 INFO  (Thread-102) [    ] o.a.s.c.ZkTestServer client port:0.0.0.0/0.0.0.0:0
   [junit4]   2> 65190 INFO  (Thread-102) [    ] o.a.s.c.ZkTestServer Starting server
   [junit4]   2> 65192 ERROR (Thread-102) [    ] o.a.z.s.ZooKeeperServer ZKShutdownHandler is not registered, so ZooKeeper server won't take any action on ERROR or SHUTDOWN server state changes
   [junit4]   2> 65293 INFO  (SUITE-AutoscalingHistoryHandlerTest-seed#[697C7D878F6E3A93]-worker) [    ] o.a.s.c.ZkTestServer start zk server on port:56370
   [junit4]   2> 65321 INFO  (jetty-launcher-134-thread-2) [    ] o.e.j.s.Server jetty-9.3.20.v20170531
   [junit4]   2> 65321 INFO  (jetty-launcher-134-thread-3) [    ] o.e.j.s.Server jetty-9.3.20.v20170531
   [junit4]   2> 65322 INFO  (jetty-launcher-134-thread-1) [    ] o.e.j.s.Server jetty-9.3.20.v20170531
   [junit4]   2> 65325 INFO  (jetty-launcher-134-thread-2) [    ] o.e.j.s.h.ContextHandler Started o.e.j.s.ServletContextHandler@2006e996{/solr,null,AVAILABLE}
   [junit4]   2> 65328 INFO  (jetty-launcher-134-thread-1) [    ] o.e.j.s.h.ContextHandler Started o.e.j.s.ServletContextHandler@4d387a2{/solr,null,AVAILABLE}
   [junit4]   2> 65329 INFO  (jetty-launcher-134-thread-2) [    ] o.e.j.s.AbstractConnector Started ServerConnector@13eee43b{HTTP/1.1,[http/1.1]}{127.0.0.1:56372}
   [junit4]   2> 65329 INFO  (jetty-launcher-134-thread-1) [    ] o.e.j.s.AbstractConnector Started ServerConnector@f98fd03{HTTP/1.1,[http/1.1]}{127.0.0.1:56373}
   [junit4]   2> 65329 INFO  (jetty-launcher-134-thread-2) [    ] o.e.j.s.Server Started @75815ms
   [junit4]   2> 65329 INFO  (jetty-launcher-134-thread-1) [    ] o.e.j.s.Server Started @75815ms
   [junit4]   2> 65329 INFO  (jetty-launcher-134-thread-2) [    ] o.a.s.c.s.e.JettySolrRunner Jetty properties: {hostContext=/solr, hostPort=56372}
   [junit4]   2> 65329 INFO  (jetty-launcher-134-thread-1) [    ] o.a.s.c.s.e.JettySolrRunner Jetty properties: {hostContext=/solr, hostPort=56373}
   [junit4]   2> 65330 ERROR (jetty-launcher-134-thread-1) [    ] o.a.s.u.StartupLoggingUtils Missing Java Option solr.log.dir. Logging may be missing or incomplete.
   [junit4]   2> 65330 ERROR (jetty-launcher-134-thread-2) [    ] o.a.s.u.StartupLoggingUtils Missing Java Option solr.log.dir. Logging may be missing or incomplete.
   [junit4]   2> 65330 INFO  (jetty-launcher-134-thread-1) [    ] o.a.s.s.SolrDispatchFilter  ___      _       Welcome to Apache Solr? version 8.0.0
   [junit4]   2> 65330 INFO  (jetty-launcher-134-thread-1) [    ] o.a.s.s.SolrDispatchFilter / __| ___| |_ _   Starting in cloud mode on port null
   [junit4]   2> 65330 INFO  (jetty-launcher-134-thread-1) [    ] o.a.s.s.SolrDispatchFilter \__ \/ _ \ | '_|  Install dir: null, Default config dir: null
   [junit4]   2> 65330 INFO  (jetty-launcher-134-thread-2) [    ] o.a.s.s.SolrDispatchFilter  ___      _       Welcome to Apache Solr? version 8.0.0
   [junit4]   2> 65330 INFO  (jetty-launcher-134-thread-1) [    ] o.a.s.s.SolrDispatchFilter |___/\___/_|_|    Start time: 2017-10-23T06:01:44.538Z
   [junit4]   2> 65330 INFO  (jetty-launcher-134-thread-2) [    ] o.a.s.s.SolrDispatchFilter / __| ___| |_ _   Starting in cloud mode on port null
   [junit4]   2> 65330 INFO  (jetty-launcher-134-thread-2) [    ] o.a.s.s.SolrDispatchFilter \__ \/ _ \ | '_|  Install dir: null, Default config dir: null
   [junit4]   2> 65330 INFO  (jetty-launcher-134-thread-2) [    ] o.a.s.s.SolrDispatchFilter |___/\___/_|_|    Start time: 2017-10-23T06:01:44.538Z
   [junit4]   2> 65334 INFO  (jetty-launcher-134-thread-3) [    ] o.e.j.s.h.ContextHandler Started o.e.j.s.ServletContextHandler@e6cb2e4{/solr,null,AVAILABLE}
   [junit4]   2> 65335 INFO  (jetty-launcher-134-thread-3) [    ] o.e.j.s.AbstractConnector Started ServerConnector@30dfcc8c{HTTP/1.1,[http/1.1]}{127.0.0.1:56376}
   [junit4]   2> 65335 INFO  (jetty-launcher-134-thread-3) [    ] o.e.j.s.Server Started @75820ms
   [junit4]   2> 65335 INFO  (jetty-launcher-134-thread-3) [    ] o.a.s.c.s.e.JettySolrRunner Jetty properties: {hostContext=/solr, hostPort=56376}
   [junit4]   2> 65335 ERROR (jetty-launcher-134-thread-3) [    ] o.a.s.u.StartupLoggingUtils Missing Java Option solr.log.dir. Logging may be missing or incomplete.
   [junit4]   2> 65335 INFO  (jetty-launcher-134-thread-3) [    ] o.a.s.s.SolrDispatchFilter  ___      _       Welcome to Apache Solr? version 8.0.0
   [junit4]   2> 65336 INFO  (jetty-launcher-134-thread-3) [    ] o.a.s.s.SolrDispatchFilter / __| ___| |_ _   Starting in cloud mode on port null
   [junit4]   2> 65336 INFO  (jetty-launcher-134-thread-3) [    ] o.a.s.s.SolrDispatchFilter \__ \/ _ \ | '_|  Install dir: null, Default config dir: null
   [junit4]   2> 65336 INFO  (jetty-launcher-134-thread-3) [    ] o.a.s.s.SolrDispatchFilter |___/\___/_|_|    Start time: 2017-10-23T06:01:44.544Z
   [junit4]   2> 65337 INFO  (jetty-launcher-134-thread-1) [    ] o.a.s.s.SolrDispatchFilter solr.xml found in ZooKeeper. Loading...
   [junit4]   2> 65337 INFO  (jetty-launcher-134-thread-2) [    ] o.a.s.s.SolrDispatchFilter solr.xml found in ZooKeeper. Loading...
   [junit4]   2> 65348 INFO  (jetty-launcher-134-thread-3) [    ] o.a.s.s.SolrDispatchFilter solr.xml found in ZooKeeper. Loading...
   [junit4]   2> 65358 INFO  (jetty-launcher-134-thread-1) [    ] o.a.s.c.ZkContainer Zookeeper client=127.0.0.1:56370/solr
   [junit4]   2> 65362 INFO  (jetty-launcher-134-thread-2) [    ] o.a.s.c.ZkContainer Zookeeper client=127.0.0.1:56370/solr
   [junit4]   2> 65366 INFO  (jetty-launcher-134-thread-3) [    ] o.a.s.c.ZkContainer Zookeeper client=127.0.0.1:56370/solr
   [junit4]   2> 65553 INFO  (jetty-launcher-134-thread-2) [n:127.0.0.1:56372_solr    ] o.a.s.c.Overseer Overseer (id=null) closing
   [junit4]   2> 65554 INFO  (jetty-launcher-134-thread-1) [n:127.0.0.1:56373_solr    ] o.a.s.c.Overseer Overseer (id=null) closing
   [junit4]   2> 65560 INFO  (jetty-launcher-134-thread-3) [n:127.0.0.1:56376_solr    ] o.a.s.c.Overseer Overseer (id=null) closing
   [junit4]   2> 65561 INFO  (jetty-launcher-134-thread-2) [n:127.0.0.1:56372_solr    ] o.a.s.c.OverseerElectionContext I am going to be the leader 127.0.0.1:56372_solr
   [junit4]   2> 65562 INFO  (jetty-launcher-134-thread-1) [n:127.0.0.1:56373_solr    ] o.a.s.c.ZkController Register node as live in ZooKeeper:/live_nodes/127.0.0.1:56373_solr
   [junit4]   2> 65562 INFO  (jetty-launcher-134-thread-3) [n:127.0.0.1:56376_solr    ] o.a.s.c.ZkController Register node as live in ZooKeeper:/live_nodes/127.0.0.1:56376_solr
   [junit4]   2> 65563 INFO  (jetty-launcher-134-thread-2) [n:127.0.0.1:56372_solr    ] o.a.s.c.Overseer Overseer (id=98876686624292872-127.0.0.1:56372_solr-n_0000000000) starting
   [junit4]   2> 65566 INFO  (zkCallback-150-thread-1-processing-n:127.0.0.1:56372_solr) [n:127.0.0.1:56372_solr    ] o.a.s.c.c.ZkStateReader Updated live nodes from ZooKeeper... (0) -> (2)
   [junit4]   2> 65586 INFO  (zkCallback-151-thread-1-processing-n:127.0.0.1:56376_solr) [n:127.0.0.1:56376_solr    ] o.a.s.c.c.ZkStateReader Updated live nodes from ZooKeeper... (0) -> (2)
   [junit4]   2> 65595 INFO  (zkCallback-149-thread-1-processing-n:127.0.0.1:56373_solr) [n:127.0.0.1:56373_solr    ] o.a.s.c.c.ZkStateReader Updated live nodes from ZooKeeper... (0) -> (2)
   [junit4]   2> 65626 DEBUG (OverseerStateUpdate-98876686624292872-127.0.0.1:56372_solr-n_0000000000) [n:127.0.0.1:56372_solr    ] o.a.s.c.Overseer Starting to work on the main queue
   [junit4]   2> 65627 DEBUG (OverseerAutoScalingTriggerThread-98876686624292872-127.0.0.1:56372_solr-n_0000000000) [n:127.0.0.1:56372_solr    ] o.a.s.c.a.OverseerTriggerThread Adding .autoAddReplicas trigger
   [junit4]   2> 65628 DEBUG (OverseerAutoScalingTriggerThread-98876686624292872-127.0.0.1:56372_solr-n_0000000000) [n:127.0.0.1:56372_solr    ] o.a.s.c.a.OverseerTriggerThread Refreshing /autoscaling.json with znode version 1
   [junit4]   2> 65628 DEBUG (OverseerAutoScalingTriggerThread-98876686624292872-127.0.0.1:56372_solr-n_0000000000) [n:127.0.0.1:56372_solr    ] o.a.s.c.a.NodeLostTrigger Initial livenodes: [127.0.0.1:56373_solr, 127.0.0.1:56376_solr]
   [junit4]   2> 65628 DEBUG (OverseerAutoScalingTriggerThread-98876686624292872-127.0.0.1:56372_solr-n_0000000000) [n:127.0.0.1:56372_solr    ] o.a.s.c.a.OverseerTriggerThread Current znodeVersion 1, lastZnodeVersion -1
   [junit4]   2> 65629 DEBUG (OverseerAutoScalingTriggerThread-98876686624292872-127.0.0.1:56372_solr-n_0000000000) [n:127.0.0.1:56372_solr    ] o.a.s.c.a.OverseerTriggerThread Processed trigger updates upto znodeVersion 1
   [junit4]   2> 65629 INFO  (jetty-launcher-134-thread-2) [n:127.0.0.1:56372_solr    ] o.a.s.c.ZkController Register node as live in ZooKeeper:/live_nodes/127.0.0.1:56372_solr
   [junit4]   2> 65631 DEBUG (OverseerStateUpdate-98876686624292872-127.0.0.1:56372_solr-n_0000000000) [n:127.0.0.1:56372_solr    ] o.a.s.c.Overseer processMessage: queueSize: 1, message = {
   [junit4]   2>   "operation":"downnode",
   [junit4]   2>   "node_name":"127.0.0.1:56372_solr"} current state version: 0
   [junit4]   2> 65631 DEBUG (OverseerStateUpdate-98876686624292872-127.0.0.1:56372_solr-n_0000000000) [n:127.0.0.1:56372_solr    ] o.a.s.c.o.NodeMutator DownNode state invoked for node: 127.0.0.1:56372_solr
   [junit4]   2> 65632 INFO  (zkCallback-151-thread-1-processing-n:127.0.0.1:56376_solr) [n:127.0.0.1:56376_solr    ] o.a.s.c.c.ZkStateReader Updated live nodes from ZooKeeper... (2) -> (3)
   [junit4]   2> 65632 INFO  (zkCallback-149-thread-1-processing-n:127.0.0.1:56373_solr) [n:127.0.0.1:56373_solr    ] o.a.s.c.c.ZkStateReader Updated live nodes from ZooKeeper... (2) -> (3)
   [junit4]   2> 65632 INFO  (zkCallback-150-thread-1-processing-n:127.0.0.1:56372_solr) [n:127.0.0.1:56372_solr    ] o.a.s.c.c.ZkStateReader Updated live nodes from ZooKeeper... (2) -> (3)
   [junit4]   2> 65633 DEBUG (OverseerAutoScalingTriggerThread-98876686624292872-127.0.0.1:56372_solr-n_0000000000) [n:127.0.0.1:56372_solr    ] o.a.s.c.a.OverseerTriggerThread -- clean old nodeAdded markers
   [junit4]   2> 65634 DEBUG (OverseerAutoScalingTriggerThread-98876686624292872-127.0.0.1:56372_solr-n_0000000000) [n:127.0.0.1:56372_solr    ] o.a.s.c.a.OverseerTriggerThread Current znodeVersion 1, lastZnodeVersion 1
   [junit4]   2> 65640 DEBUG (ScheduledTrigger-252-thread-1) [n:127.0.0.1:56372_solr    ] o.a.s.c.a.NodeLostTrigger Running NodeLostTrigger: .auto_add_replicas with currently live nodes: [127.0.0.1:56372_solr, 127.0.0.1:56373_solr, 127.0.0.1:56376_solr]
   [junit4]   2> 65740 INFO  (jetty-launcher-134-thread-1) [n:127.0.0.1:56373_solr    ] o.a.s.m.r.SolrJmxReporter JMX monitoring for 'solr_56373.solr.node' (registry 'solr.node') enabled at server: com.sun.jmx.mbeanserver.JmxMBeanServer@4a84ea77
   [junit4]   2> 65741 INFO  (jetty-launcher-134-thread-3) [n:127.0.0.1:56376_solr    ] o.a.s.m.r.SolrJmxReporter JMX monitoring for 'solr_56376.solr.node' (registry 'solr.node') enabled at server: com.sun.jmx.mbeanserver.JmxMBeanServer@4a84ea77
   [junit4]   2> 65760 INFO  (jetty-launcher-134-thread-2) [n:127.0.0.1:56372_solr    ] o.a.s.m.r.SolrJmxReporter JMX monitoring for 'solr_56372.solr.node' (registry 'solr.node') enabled at server: com.sun.jmx.mbeanserver.JmxMBeanServer@4a84ea77
   [junit4]   2> 65787 INFO  (jetty-launcher-134-thread-1) [n:127.0.0.1:56373_solr    ] o.a.s.m.r.SolrJmxReporter JMX monitoring for 'solr_56373.solr.jvm' (registry 'solr.jvm') enabled at server: com.sun.jmx.mbeanserver.JmxMBeanServer@4a84ea77
   [junit4]   2> 65787 INFO  (jetty-launcher-134-thread-1) [n:127.0.0.1:56373_solr    ] o.a.s.m.r.SolrJmxReporter JMX monitoring for 'solr_56373.solr.jetty' (registry 'solr.jetty') enabled at server: com.sun.jmx.mbeanserver.JmxMBeanServer@4a84ea77
   [junit4]   2> 65788 INFO  (jetty-launcher-134-thread-3) [n:127.0.0.1:56376_solr    ] o.a.s.m.r.SolrJmxReporter JMX monitoring for 'solr_56376.solr.jvm' (registry 'solr.jvm') enabled at server: com.sun.jmx.mbeanserver.JmxMBeanServer@4a84ea77
   [junit4]   2> 65788 INFO  (jetty-launcher-134-thread-3) [n:127.0.0.1:56376_solr    ] o.a.s.m.r.SolrJmxReporter JMX monitoring for 'solr_56376.solr.jetty' (registry 'solr.jetty') enabled at server: com.sun.jmx.mbeanserver.JmxMBeanServer@4a84ea77
   [junit4]   2> 65790 INFO  (jetty-launcher-134-thread-1) [n:127.0.0.1:56373_solr    ] o.a.s.c.CorePropertiesLocator Found 0 core definitions underneath /Users/jenkins/workspace/Lucene-Solr-master-MacOSX/solr/build/solr-core/test/J0/temp/solr.handler.admin.AutoscalingHistoryHandlerTest_697C7D878F6E3A93-001/tempDir-001/node1/.
   [junit4]   2> 65791 INFO  (jetty-launcher-134-thread-3) [n:127.0.0.1:56376_solr    ] o.a.s.c.CorePropertiesLocator Found 0 core definitions underneath /Users/jenkins/workspace/Lucene-Solr-master-MacOSX/solr/build/solr-core/test/J0/temp/solr.handler.admin.AutoscalingHistoryHandlerTest_697C7D878F6E3A93-001/tempDir-001/node3/.
   [junit4]   2> 65793 INFO  (jetty-launcher-134-thread-2) [n:127.0.0.1:56372_solr    ] o.a.s.m.r.SolrJmxReporter JMX monitoring for 'solr_56372.solr.jvm' (registry 'solr.jvm') enabled at server: com.sun.jmx.mbeanserver.JmxMBeanServer@4a84ea77
   [junit4]   2> 65793 INFO  (jetty-launcher-134-thread-2) [n:127.0.0.1:56372_solr    ] o.a.s.m.r.SolrJmxReporter JMX monitoring for 'solr_56372.solr.jetty' (registry 'solr.jetty') enabled at server: com.sun.jmx.mbeanserver.JmxMBeanServer@4a84ea77
   [junit4]   2> 65794 INFO  (jetty-launcher-134-thread-2) [n:127.0.0.1:56372_solr    ] o.a.s.c.CorePropertiesLocator Found 0 core definitions underneath /Users/jenkins/workspace/Lucene-Solr-master-MacOSX/solr/build/solr-core/test/J0/temp/solr.handler.admin.AutoscalingHistoryHandlerTest_697C7D878F6E3A93-001/tempDir-001/node2/.
   [junit4]   2> 65872 INFO  (SUITE-AutoscalingHistoryHandlerTest-seed#[697C7D878F6E3A93]-worker) [    ] o.a.s.c.c.ZkStateReader Updated live nodes from ZooKeeper... (0) -> (3)
   [junit4]   2> 65874 INFO  (SUITE-AutoscalingHistoryHandlerTest-seed#[697C7D878F6E3A93]-worker) [    ] o.a.s.c.s.i.ZkClientClusterStateProvider Cluster at 127.0.0.1:56370/solr ready
   [junit4]   2> 65882 INFO  (qtp1630046680-673) [n:127.0.0.1:56372_solr    ] o.a.s.h.a.CollectionsHandler Invoked Collection Action :create with params replicationFactor=3&name=AutoscalingHistoryHandlerTest_collection&nrtReplicas=3&action=CREATE&numShards=1&wt=javabin&version=2 and sendToOCPQueue=true
   [junit4]   2> 65885 INFO  (OverseerThreadFactory-254-thread-1-processing-n:127.0.0.1:56372_solr) [n:127.0.0.1:56372_solr    ] o.a.s.c.CreateCollectionCmd Create collection AutoscalingHistoryHandlerTest_collection
   [junit4]   2> 65885 INFO  (OverseerThreadFactory-254-thread-1-processing-n:127.0.0.1:56372_solr) [n:127.0.0.1:56372_solr    ] o.a.s.c.CreateCollectionCmd Only _default config set found, using it.
   [junit4]   2> 65886 INFO  (OverseerThreadFactory-254-thread-1-processing-n:127.0.0.1:56372_solr) [n:127.0.0.1:56372_solr    ] o.a.s.c.c.ZkConfigManager Copying zk node /configs/_default/managed-schema to /configs/AutoscalingHistoryHandlerTest_collection/managed-schema
   [junit4]   2> 65889 INFO  (OverseerThreadFactory-254-thread-1-processing-n:127.0.0.1:56372_solr) [n:127.0.0.1:56372_solr    ] o.a.s.c.c.ZkConfigManager Copying zk node /configs/_default/protwords.txt to /configs/AutoscalingHistoryHandlerTest_collection/protwords.txt
   [junit4]   2> 65892 INFO  (OverseerThreadFactory-254-thread-1-processing-n:127.0.0.1:56372_solr) [n:127.0.0.1:56372_solr    ] o.a.s.c.c.ZkConfigManager Copying zk node /configs/_default/solrconfig.xml to /configs/AutoscalingHistoryHandlerTest_collection/solrconfig.xml
   [junit4]   2> 65895 INFO  (OverseerThreadFactory-254-thread-1-processing-n:127.0.0.1:56372_solr) [n:127.0.0.1:56372_solr    ] o.a.s.c.c.ZkConfigManager Copying zk node /configs/_default/synonyms.txt to /configs/AutoscalingHistoryHandlerTest_collection/synonyms.txt
   [junit4]   2> 65897 INFO  (OverseerThreadFactory-254-thread-1-processing-n:127.0.0.1:56372_solr) [n:127.0.0.1:56372_solr    ] o.a.s.c.c.ZkConfigManager Copying zk node /configs/_default/stopwords.txt to /configs/AutoscalingHistoryHandlerTest_collection/stopwords.txt
   [junit4]   2> 65901 INFO  (OverseerThreadFactory-254-thread-1-processing-n:127.0.0.1:56372_solr) [n:127.0.0.1:56372_solr    ] o.a.s.c.c.ZkConfigManager Copying zk node /configs/_default/lang/contractions_it.txt to /configs/AutoscalingHistoryHandlerTest_collection/lang/contractions_it.txt
   [junit4]   2> 65904 INFO  (OverseerThreadFactory-254-thread-1-processing-n:127.0.0.1:56372_solr) [n:127.0.0.1:56372_solr    ] o.a.s.c.c.ZkConfigManager Copying zk node /configs/_default/lang/contractions_ca.txt to /configs/AutoscalingHistoryHandlerTest_collection/lang/contractions_ca.txt
   [junit4]   2> 65907 INFO  (OverseerThreadFactory-254-thread-1-processing-n:127.0.0.1:56372_solr) [n:127.0.0.1:56372_solr    ] o.a.s.c.c.ZkConfigManager Copying zk node /configs/_default/lang/stemdict_nl.txt to /configs/AutoscalingHistoryHandlerTest_collection/lang/stemdict_nl.txt
   [junit4]   2> 65910 INFO  (OverseerThreadFactory-254-thread-1-processing-n:127.0.0.1:56372_solr) [n:127.0.0.1:56372_solr    ] o.a.s.c.c.ZkConfigManager Copying zk node /configs/_default/lang/stopwords_hy.txt to /configs/AutoscalingHistoryHandlerTest_collection/lang/stopwords_hy.txt
   [junit4]   2> 65913 INFO  (OverseerThreadFactory-254-thread-1-processing-n:127.0.0.1:56372_solr) [n:127.0.0.1:56372_solr    ] o.a.s.c.c.ZkConfigManager Copying zk node /configs/_default/lang/stopwords_no.txt to /configs/AutoscalingHistoryHandlerTest_collection/lang/stopwords_no.txt
   [junit4]   2> 65916 INFO  (OverseerThreadFactory-254-thread-1-processing-n:127.0.0.1:56372_solr) [n:127.0.0.1:56372_solr    ] o.a.s.c.c.ZkConfigManager Copying zk node /configs/_default/lang/stopwords_id.txt to /configs/AutoscalingHistoryHandlerTest_collection/lang/stopwords_id.txt
   [junit4]   2> 65919 INFO  (OverseerThreadFactory-254-thread-1-processing-n:127.0.0.1:56372_solr) [n:127.0.0.1:56372_solr    ] o.a.s.c.c.ZkConfigManager Copying zk node /configs/_default/lang/stopwords_da.txt to /configs/AutoscalingHistoryHandlerTest_collection/lang/stopwords_da.txt
   [junit4]   2> 65922 INFO  (OverseerThreadFactory-254-thread-1-processing-n:127.0.0.1:56372_solr) [n:127.0.0.1:56372_solr    ] o.a.s.c.c.ZkConfigManager Copying zk node /configs/_default/lang/stopwords_ga.txt to /configs/AutoscalingHistoryHandlerTest_collection/lang/stopwords_ga.txt
   [junit4]   2> 65925 INFO  (OverseerThreadFactory-254-thread-1-processing-n:127.0.0.1:56372_solr) [n:127.0.0.1:56372_solr    ] o.a.s.c.c.ZkConfigManager Copying zk node /configs/_default/lang/stopwords_hi.txt to /configs/AutoscalingHistoryHandlerTest_collection/lang/stopwords_hi.txt
   [junit4]   2> 65928 INFO  (OverseerThreadFactory-254-thread-1-processing-n:127.0.0.1:56372_solr) [n:127.0.0.1:56372_solr    ] o.a.s.c.c.ZkConfigManager Copying zk node /configs/_default/lang/stopwords_ja.txt to /configs/AutoscalingHistoryHandlerTest_collection/lang/stopwords_ja.txt
   [junit4]   2> 65931 INFO  (OverseerThreadFactory-254-thread-1-processing-n:127.0.0.1:56372_solr) [n:127.0.0.1:56372_solr    ] o.a.s.c.c.ZkConfigManager Copying zk node /configs/_default/lang/stopwords_pt.txt to /configs/AutoscalingHistoryHandlerTest_collection/lang/stopwords_pt.txt
   [junit4]   2> 65934 INFO  (OverseerThreadFactory-254-thread-1-processing-n:127.0.0.1:56372_solr) [n:127.0.0.1:56372_solr    ] o.a.s.c.c.ZkConfigManager Copying zk node /configs/_default/lang/stopwords_hu.txt to /configs/AutoscalingHistoryHandlerTest_collection/lang/stopwords_hu.txt
   [junit4]   2> 65937 INFO  (OverseerThreadFactory-254-thread-1-processing-n:127.0.0.1:56372_solr) [n:127.0.0.1:56372_solr    ] o.a.s.c.c.ZkConfigManager Copying zk node /configs/_default/lang/stopwords_el.txt to /configs/AutoscalingHistoryHandlerTest_collection/lang/stopwords_el.txt
   [junit4]   2> 65940 INFO  (OverseerThreadFactory-254-thread-1-processing-n:127.0.0.1:56372_solr) [n:127.0.0.1:56372_solr    ] o.a.s.c.c.ZkConfigManager Copying zk node /configs/_default/lang/stopwords_ru.txt to /configs/AutoscalingHistoryHandlerTest_collection/lang/stopwords_ru.txt
   [junit4]   2> 65943 INFO  (OverseerThreadFactory-254-thread-1-processing-n:127.0.0.1:56372_solr) [n:127.0.0.1:56372_solr    ] o.a.s.c.c.ZkConfigManager Copying zk node /configs/_default/lang/stopwords_tr.txt to /configs/AutoscalingHistoryHandlerTest_collection/lang/stopwords_tr.txt
   [junit4]   2> 65946 INFO  (OverseerThreadFactory-254-thread-1-processing-n:127.0.0.1:56372_solr) [n:127.0.0.1:56372_solr    ] o.a.s.c.c.ZkConfigManager Copying zk node /configs/_default/lang/stopwords_ar.txt to /configs/AutoscalingHistoryHandlerTest_collection/lang/stopwords_ar.txt
   [junit4]   2> 65949 INFO  (OverseerThreadFactory-254-thread-1-processing-n:127.0.0.1:56372_solr) [n:127.0.0.1:56372_solr    ] o.a.s.c.c.ZkConfigManager Copying zk node /configs/_default/lang/userdict_ja.txt to /configs/AutoscalingHistoryHandlerTest_collection/lang/userdict_ja.txt
   [junit4]   2> 65952 INFO  (OverseerThreadFactory-254-thread-1-processing-n:127.0.0.1:56372_solr) [n:127.0.0.1:56372_solr    ] o.a.s.c.c.ZkConfigManager Copying zk node /configs/_default/lang/stopwords_eu.txt to /configs/AutoscalingHistoryHandlerTest_collection/lang/stopwords_eu.txt
   [junit4]   2> 65955 INFO  (OverseerThreadFactory-254-thread-1-processing-n:127.0.0.1:56372_solr) [n:127.0.0.1:56372_solr    ] o.a.s.c.c.ZkConfigManager Copying zk node /configs/_default/lang/stopwords_it.txt to /configs/AutoscalingHistoryHandlerTest_collection/lang/stopwords_it.txt
   [junit4]   2> 65958 INFO  (OverseerThreadFactory-254-thread-1-processing-n:127.0.0.1:56372_solr) [n:127.0.0.1:56372_solr    ] o.a.s.c.c.ZkConfigManager Copying zk node /configs/_default/lang/stopwords_cz.txt to /configs/AutoscalingHistoryHandlerTest_collection/lang/stopwords_cz.txt
   [junit4]   2> 65961 INFO  (OverseerThreadFactory-254-thread-1-processing-n:127.0.0.1:56372_solr) [n:127.0.0.1:56372_solr    ] o.a.s.c.c.ZkConfigManager Copying zk node /configs/_default/lang/stoptags_ja.txt to /configs/AutoscalingHistoryHandlerTest_collection/lang/stoptags_ja.txt
   [junit4]   2> 65964 INFO  (OverseerThreadFactory-254-thread-1-processing-n:127.0.0.1:56372_solr) [n:127.0.0.1:56372_solr    ] o.a.s.c.c.ZkConfigManager Copying zk node /configs/_default/lang/contractions_fr.txt to /configs/AutoscalingHistoryHandlerTest_collection/lang/contractions_fr.txt
   [junit4]   2> 65967 INFO  (OverseerThreadFactory-254-thread-1-processing-n:127.0.0.1:56372_solr) [n:127.0.0.1:56372_solr    ] o.a.s.c.c.ZkConfigManager Copying zk node /configs/_default/lang/stopwords_de.txt to /configs/AutoscalingHistoryHandlerTest_collection/lang/stopwords_de.txt
   [junit4]   2> 65970 INFO  (OverseerThreadFactory-254-thread-1-processing-n:127.0.0.1:56372_solr) [n:127.0.0.1:56372_solr    ] o.a.s.c.c.ZkConfigManager Copying zk node /configs/_default/lang/stopwords_fa.txt to /configs/AutoscalingHistoryHandlerTest_collection/lang/stopwords_fa.txt
   [junit4]   2> 65973 INFO  (OverseerThreadFactory-254-thread-1-processing-n:127.0.0.1:56372_solr) [n:127.0.0.1:56372_solr    ] o.a.s.c.c.ZkConfigManager Copying zk node /configs/_default/lang/contractions_ga.txt to /configs/AutoscalingHistoryHandlerTest_collection/lang/contractions_ga.txt
   [junit4]   2> 65976 INFO  (OverseerThreadFactory-254-thread-1-processing-n:127.0.0.1:56372_solr) [n:127.0.0.1:56372_solr    ] o.a.s.c.c.ZkConfigManager Copying zk node /configs/_default/lang/stopwords_ca.txt to /configs/AutoscalingHistoryHandlerTest_collection/lang/stopwords_ca.txt
   [junit4]   2> 65979 INFO  (OverseerThreadFactory-254-thread-1-processing-n:127.0.0.1:56372_solr) [n:127.0.0.1:56372_solr    ] o.a.s.c.c.ZkConfigManager Copying zk node /configs/_default/lang/stopwords_nl.txt to /configs/AutoscalingHistoryHandlerTest_collection/lang/stopwords_nl.txt
   [junit4]   2> 65982 INFO  (OverseerThreadFactory-254-thread-1-processing-n:127.0.0.1:56372_solr) [n:127.0.0.1:56372_solr    ] o.a.s.c.c.ZkConfigManager Copying zk node /configs/_default/lang/stopwords_bg.txt to /configs/AutoscalingHistoryHandlerTest_collection/lang/stopwords_bg.txt
   [junit4]   2> 65985 INFO  (OverseerThreadFactory-254-thread-1-processing-n:127.0.0.1:56372_solr) [n:127.0.0.1:56372_solr    ] o.a.s.c.c.ZkConfigManager Copying zk node /configs/_default/lang/stopwords_en.txt to /configs/AutoscalingHistoryHandlerTest_collection/lang/stopwords_en.txt
   [junit4]   2> 65988 INFO  (OverseerThreadFactory-254-thread-1-processing-n:127.0.0.1:56372_solr) [n:127.0.0.1:56372_solr    ] o.a.s.c.c.ZkConfigManager Copying zk node /configs/_default/lang/stopwords_es.txt to /configs/AutoscalingHistoryHandlerTest_collection/lang/stopwords_es.txt
   [junit4]   2> 65991 INFO  (OverseerThreadFactory-254-thread-1-processing-n:127.0.0.1:56372_solr) [n:127.0.0.1:56372_solr    ] o.a.s.c.c.ZkConfigManager Copying zk node /configs/_default/lang/stopwords_lv.txt to /configs/AutoscalingHistoryHandlerTest_collection/lang/stopwords_lv.txt
   [junit4]   2> 65994 INFO  (OverseerThreadFactory-254-thread-1-processing-n:127.0.0.1:56372_solr) [n:127.0.0.1:56372_solr    ] o.a.s.c.c.ZkConfigManager Copying zk node /configs/_default/lang/stopwords_ro.txt to /configs/AutoscalingHistoryHandlerTest_collection/lang/stopwords_ro.txt
   [junit4]   2> 65997 INFO  (OverseerThreadFactory-254-thread-1-processing-n:127.0.0.1:56372_solr) [n:127.0.0.1:56372_solr    ] o.a.s.c.c.ZkConfigManager Copying zk node /configs/_default/lang/stopwords_th.txt to /configs/AutoscalingHistoryHandlerTest_collection/lang/stopwords_th.txt
   [junit4]   2> 66000 INFO  (OverseerThreadFactory-254-thread-1-processing-n:127.0.0.1:56372_solr) [n:127.0.0.1:56372_solr    ] o.a.s.c.c.ZkConfigManager Copying zk node /configs/_default/lang/stopwords_fr.txt to /configs/AutoscalingHistoryHandlerTest_collection/lang/stopwords_fr.txt
   [junit4]   2> 66003 INFO  (OverseerThreadFactory-254-thread-1-processing-n:127.0.0.1:56372_solr) [n:127.0.0.1:56372_solr    ] o.a.s.c.c.ZkConfigManager Copying zk node /configs/_default/lang/stopwords_sv.txt to /configs/AutoscalingHistoryHandlerTest_collection/lang/stopwords_sv.txt
   [junit4]   2> 66006 INFO  (OverseerThreadFactory-254-thread-1-processing-n:127.0.0.1:56372_solr) [n:127.0.0.1:56372_solr    ] o.a.s.c.c.ZkConfigManager Copying zk node /configs/_default/lang/stopwords_fi.txt to /configs/AutoscalingHistoryHandlerTest_collection/lang/stopwords_fi.txt
   [junit4]   2> 66009 INFO  (OverseerThreadFactory-254-thread-1-processing-n:127.0.0.1:56372_solr) [n:127.0.0.1:56372_solr    ] o.a.s.c.c.ZkConfigManager Copying zk node /configs/_default/lang/hyphenations_ga.txt to /configs/AutoscalingHistoryHandlerTest_collection/lang/hyphenations_ga.txt
   [junit4]   2> 66012 INFO  (OverseerThreadFactory-254-thread-1-processing-n:127.0.0.1:56372_solr) [n:127.0.0.1:56372_solr    ] o.a.s.c.c.ZkConfigManager Copying zk node /configs/_default/lang/stopwords_gl.txt to /configs/AutoscalingHistoryHandlerTest_collection/lang/stopwords_gl.txt
   [junit4]   2> 66015 INFO  (OverseerThreadFactory-254-thread-1-processing-n:127.0.0.1:56372_solr) [n:127.0.0.1:56372_solr    ] o.a.s.c.c.ZkConfigManager Copying zk node /configs/_default/params.json to /configs/AutoscalingHistoryHandlerTest_collection/params.json
   [junit4]   2> 66024 DEBUG (OverseerStateUpdate-98876686624292872-127.0.0.1:56372_solr-n_0000000000) [n:127.0.0.1:56372_solr    ] o.a.s.c.Overseer processMessage: queueSize: 1, message = {
   [junit4]   2>   "name":"AutoscalingHistoryHandlerTest_collection",
   [junit4]   2>   "fromApi":"true",
   [junit4]   2>   "replicationFactor":"3",
   [junit4]   2>   "numShards":"1",
   [junit4]   2>   "nrtReplicas":"3",
   [junit4]   2>   "stateFormat":"2",
   [junit4]   2>   "operation":"create"} current state version: 0
   [junit4]   2> 66024 DEBUG (OverseerStateUpdate-98876686624292872-127.0.0.1:56372_solr-n_0000000000) [n:127.0.0.1:56372_solr    ] o.a.s.c.o.ClusterStateMutator building a new cName: AutoscalingHistoryHandlerTest_collection
   [junit4]   2> 66024 DEBUG (OverseerStateUpdate-98876686624292872-127.0.0.1:56372_solr-n_0000000000) [n:127.0.0.1:56372_solr    ] o.a.s.c.o.ZkStateWriter going to create_collection /collections/AutoscalingHistoryHandlerTest_collection/state.json
   [junit4]   2> 66129 DEBUG (OverseerStateUpdate-98876686624292872-127.0.0.1:56372_solr-n_0000000000) [n:127.0.0.1:56372_solr    ] o.a.s.c.Overseer processMessage: queueSize: 1, message = {
   [junit4]   2>   "operation":"ADDREPLICA",
   [junit4]   2>   "collection":"AutoscalingHistoryHandlerTest_collection",
   [junit4]   2>   "shard":"shard1",
   [junit4]   2>   "core":"AutoscalingHistoryHandlerTest_collection_shard1_replica_n1",
   [junit4]   2>   "state":"down",
   [junit4]   2>   "base_url":"http://127.0.0.1:56373/solr",
   [junit4]   2>   "type":"NRT",
   [junit4]   2>   "waitForFinalState":"false"} current state version: 0
   [junit4]   2> 66129 INFO  (OverseerStateUpdate-98876686624292872-127.0.0.1:56372_solr-n_0000000000) [n:127.0.0.1:56372_solr    ] o.a.s.c.o.SliceMutator createReplica() {
   [junit4]   2>   "operation":"ADDREPLICA",
   [junit4]   2>   "collection":"AutoscalingHistoryHandlerTest_collection",
   [junit4]   2>   "shard":"shard1",
   [junit4]   2>   "core":"AutoscalingHistoryHandlerTest_collection_shard1_replica_n1",
   [junit4]   2>   "state":"down",
   [junit4]   2>   "base_url":"http://127.0.0.1:56373/solr",
   [junit4]   2>   "type":"NRT",
   [junit4]   2>   "waitForFinalState":"false"} 
   [junit4]   2> 66131 DEBUG (OverseerStateUpdate-98876686624292872-127.0.0.1:56372_solr-n_0000000000) [n:127.0.0.1:56372_solr    ] o.a.s.c.o.SliceMutator Old Slice: shard1:{
   [junit4]   2>   "range":"80000000-7fffffff",
   [junit4]   2>   "state":"active",
   [junit4]   2>   "replicas":{}}
   [junit4]   2> 66131 DEBUG (OverseerStateUpdate-98876686624292872-127.0.0.1:56372_solr-n_0000000000) [n:127.0.0.1:56372_solr    ] o.a.s.c.o.SliceMutator New Slice: shard1:{
   [junit4]   2>   "range":"80000000-7fffffff",
   [junit4]   2>   "state":"active",
   [junit4]   2>   "replicas":{"core_node3":{
   [junit4]   2>       "core":"AutoscalingHistoryHandlerTest_collection_shard1_replica_n1",
   [junit4]   2>       "base_url":"http://127.0.0.1:56373/solr",
   [junit4]   2>       "state":"down",
   [junit4]   2>       "node_name":null,
   [junit4]   2>       "type":"NRT"}}}
   [junit4]   2> 66132 DEBUG (OverseerStateUpdate-98876686624292872-127.0.0.1:56372_solr-n_0000000000) [n:127.0.0.1:56372_solr    ] o.a.s.c.Overseer processMessage: queueSize: 2, message = {
   [junit4]   2>   "operation":"ADDREPLICA",
   [junit4]   2>   "collection":"AutoscalingHistoryHandlerTest_collection",
   [junit4]   2>   "shard":"shard1",
   [junit4]   2>   "core":"AutoscalingHistoryHandlerTest_collection_shard1_replica_n2",
   [junit4]   2>   "state":"down",
   [junit4]   2>   "base_url":"http://127.0.0.1:56376/solr",
   [junit4]   2>   "type":"NRT",
   [junit4]   2>   "waitForFinalState":"false"} current state version: 0
   [junit4]   2> 66132 INFO  (OverseerStateUpdate-98876686624292872-127.0.0.1:56372_solr-n_0000000000) [n:127.0.0.1:56372_solr    ] o.a.s.c.o.SliceMutator createReplica() {
   [junit4]   2>   "operation":"ADDREPLICA",
   [junit4]   2>   "collection":"AutoscalingHistoryHandlerTest_collection",
   [junit4]   2>   "shard":"shard1",
   [junit4]   2>   "core":"AutoscalingHistoryHandlerTest_collection_shard1_replica_n2",
   [junit4]   2>   "state":"down",
   [junit4]   2>   "base_url":"http://127.0.0.1:56376/solr",
   [junit4]   2>   "type":"NRT",
   [junit4]   2>   "waitForFinalState":"false"} 
   [junit4]   2> 66134 DEBUG (OverseerStateUpdate-98876686624292872-127.0.0.1:56372_solr-n_0000000000) [n:127.0.0.1:56372_solr    ] o.a.s.c.o.SliceMutator Old Slice: shard1:{
   [junit4]   2>   "range":"80000000-7fffffff",
   [junit4]   2>   "state":"active",
   [junit4]   2>   "replicas":{"core_node3":{
   [junit4]   2>       "core":"AutoscalingHistoryHandlerTest_collection_shard1_replica_n1",
   [junit4]   2>       "base_url":"http://127.0.0.1:56373/solr",
   [junit4]   2>       "state":"down",
   [junit4]   2>       "node_name":null,
   [junit4]   2>       "type":"NRT"}}}
   [junit4]   2> 66134 DEBUG (OverseerStateUpdate-98876686624292872-127.0.0.1:56372_solr-n_0000000000) [n:127.0.0.1:56372_solr    ] o.a.s.c.o.SliceMutator New Slice: shard1:{
   [junit4]   2>   "range":"80000000-7fffffff",
   [junit4]   2>   "state":"active",
   [junit4]   2>   "replicas":{
   [junit4]   2>     "core_node3":{
   [junit4]   2>       "core":"AutoscalingHistoryHandlerTest_collection_shard1_replica_n1",
   [junit4]   2>       "base_url":"http://127.0.0.1:56373/solr",
   [junit4]   2>       "state":"down",
   [junit4]   2>       "node_name":null,
   [junit4]   2>       "type":"NRT"},
   [junit4]   2>     "core_node5":{
   [junit4]   2>       "core":"AutoscalingHistoryHandlerTest_collection_shard1_replica_n2",
   [junit4]   2>       "base_url":"http://127.0.0.1:56376/solr",
   [junit4]   2>       "state":"down",
   [junit4]   2>       "node_name":null,
   [junit4]   2>       "type":"NRT"}}}
   [junit4]   2> 66136 DEBUG (OverseerStateUpdate-98876686624292872-127.0.0.1:56372_solr-n_0000000000) [n:127.0.0.1:56372_solr    ] o.a.s.c.Overseer processMessage: queueSize: 3, message = {
   [junit4]   2>   "operation":"ADDREPLICA",
   [junit4]   2>   "collection":"AutoscalingHistoryHandlerTest_collection",
   [junit4]   2>   "shard":"shard1",
   [junit4]   2>   "core":"AutoscalingHistoryHandlerTest_collection_shard1_replica_n4",
   [junit4]   2>   "state":"down",
   [junit4]   2>   "base_url":"http://127.0.0.1:56372/solr",
   [junit4]   2>   "type":"NRT",
   [junit4]   2>   "waitForFinalState":"false"} current state version: 0
   [junit4]   2> 66136 INFO  (OverseerStateUpdate-98876686624292872-127.0.0.1:56372_solr-n_0000000000) [n:127.0.0.1:56372_solr    ] o.a.s.c.o.SliceMutator createReplica() {
   [junit4]   2>   "operation":"ADDREPLICA",
   [junit4]   2>   "collection":"AutoscalingHistoryHandlerTest_collection",
   [junit4]   2>   "shard":"shard1",
   [junit4]   2>   "core":"AutoscalingHistoryHandlerTest_collection_shard1_replica_n4",
   [junit4]   2>   "state":"down",
   [junit4]   2>   "base_url":"http://127.0.0.1:56372/solr",
   [junit4]   2>   "type":"NRT",
   [junit4]   2>   "waitForFinalState":"false"} 
   [junit4]   2> 66138 DEBUG (OverseerStateUpdate-98876686624292872-127.0.0.1:56372_solr-n_0000000000) [n:127.0.0.1:56372_solr    ] o.a.s.c.o.SliceMutator Old Slice: shard1:{
   [junit4]   2>   "range":"80000000-7fffffff",
   [junit4]   2>   "state":"active",
   [junit4]   2>   "replicas":{
   [junit4]   2>     "core_node3":{
   [junit4]   2>       "core":"AutoscalingHistoryHandlerTest_collection_shard1_replica_n1",
   [junit4]   2>       "base_url":"http://127.0.0.1:56373/solr",
   [junit4]   2>       "state":"down",
   [junit4]   2>       "node_name":null,
   [junit4]   2>       "type":"NRT"},
   [junit4]   2>     "core_node5":{
   [junit4]   2>       "core":"AutoscalingHistoryHandlerTest_collection_shard1_replica_n2",
   [junit4]   2>       "base_url":"http://127.0.0.1:56376/solr",
   [junit4]   2>       "state":"down",
   [junit4]   2>       "node_name":null,
   [junit4]   2>       "type":"NRT"}}}
   [junit4]   2> 66138 DEBUG (OverseerStateUpdate-98876686624292872-127.0.0.1:56372_solr-n_0000000000) [n:127.0.0.1:56372_solr    ] o.a.s.c.o.SliceMutator New Slice: shard1:{
   [junit4]   2>   "range":"80000000-7fffffff",
   [junit4]   2>   "state":"active",
   [junit4]   2>   "replicas":{
   [junit4]   2>     "core_node3":{
   [junit4]   2>       "core":"AutoscalingHistoryHandlerTest_collection_shard1_replica_n1",
   [junit4]   2>       "base_url":"http://127.0.0.1:56373/solr",
   [junit4]   2>       "state":"down",
   [junit4]   2>       "node_name":null,
   [junit4]   2>       "type":"NRT"},
   [junit4]   2>     "core_node5":{
   [junit4]   2>       "core":"AutoscalingHistoryHandlerTest_collection_shard1_replica_n2",
   [junit4]   2>       "base_url":"http://127.0.0.1:56376/solr",
   [junit4]   2>       "state":"down",
   [junit4]   2>       "node_name":null,
   [junit4]   2>       "type":"NRT"},
   [junit4]   2>     "core_node6":{
   [junit4]   2>       "core":"AutoscalingHistoryHandlerTest_collection_shard1_replica_n4",
   [junit4]   2>       "base_url":"http://127.0.0.1:56372/solr",
   [junit4]   2>       "state":"down",
   [junit4]   2>       "node_name":null,
   [junit4]   2>       "type":"NRT"}}}
   [junit4]   2> 66239 DEBUG (OverseerStateUpdate-98876686624292872-127.0.0.1:56372_solr-n_0000000000) [n:127.0.0.1:56372_solr    ] o.a.s.c.o.ZkStateWriter going to update_collection /collections/AutoscalingHistoryHandlerTest_collection/state.json version: 0
   [junit4]   2> 66351 INFO  (qtp1630046680-674) [n:127.0.0.1:56372_solr    ] o.a.s.h.a.CoreAdminOperation core create command qt=/admin/cores&coreNodeName=core_node6&collection.configName=AutoscalingHistoryHandlerTest_collection&newCollection=true&name=AutoscalingHistoryHandlerTest_collection_shard1_replica_n4&action=CREATE&numShards=1&collection=AutoscalingHistoryHandlerTest_collection&shard=shard1&wt=javabin&version=2&replicaType=NRT
   [junit4]   2> 66351 INFO  (qtp2033520237-691) [n:127.0.0.1:56376_solr    ] o.a.s.h.a.CoreAdminOperation core create command qt=/admin/cores&coreNodeName=core_node5&collection.configName=AutoscalingHistoryHandlerTest_collection&newCollection=true&name=AutoscalingHistoryHandlerTest_collection_shard1_replica_n2&action=CREATE&numShards=1&collection=AutoscalingHistoryHandlerTest_collection&shard=shard1&wt=javabin&version=2&replicaType=NRT
   [junit4]   2> 66351 INFO  (qtp1523132718-682) [n:127.0.0.1:56373_solr    ] o.a.s.h.a.CoreAdminOperation core create command qt=/admin/cores&coreNodeName=core_node3&collection.configName=AutoscalingHistoryHandlerTest_collection&newCollection=true&name=AutoscalingHistoryHandlerTest_collection_shard1_replica_n1&action=CREATE&numShards=1&collection=AutoscalingHistoryHandlerTest_collection&shard=shard1&wt=javabin&version=2&replicaType=NRT
   [junit4]   2> 66351 INFO  (qtp1630046680-674) [n:127.0.0.1:56372_solr    ] o.a.s.c.TransientSolrCoreCacheDefault Allocating transient cache for 2147483647 transient cores
   [junit4]   2> 66351 INFO  (qtp2033520237-691) [n:127.0.0.1:56376_solr    ] o.a.s.c.TransientSolrCoreCacheDefault Allocating transient cache for 2147483647 transient cores
   [junit4]   2> 66352 INFO  (qtp1523132718-682) [n:127.0.0.1:56373_solr    ] o.a.s.c.TransientSolrCoreCacheDefault Allocating transient cache for 2147483647 transient cores
   [junit4]   2> 66364 DEBUG (OverseerStateUpdate-98876686624292872-127.0.0.1:56372_solr-n_0000000000) [n:127.0.0.1:56372_solr    ] o.a.s.c.Overseer processMessage: queueSize: 2, message = {
   [junit4]   2>   "core":"AutoscalingHistoryHandlerTest_collection_shard1_replica_n4",
   [junit4]   2>   "core_node_name":"core_node6",
   [junit4]   2>   "roles":null,
   [junit4]   2>   "base_url":"http://127.0.0.1:56372/solr",
   [junit4]   2>   "node_name":"127.0.0.1:56372_solr",
   [junit4]   2>   "numShards":"1",
   [junit4]   2>   "state":"down",
   [junit4]   2>   "shard":"shard1",
   [junit4]   2>   "collection":"AutoscalingHistoryHandlerTest_collection",
   [junit4]   2>   "type":"NRT",
   [junit4]   2>   "operation":"state"} current state version: 0
   [junit4]   2> 66364 DEBUG (OverseerStateUpdate-98876686624292872-127.0.0.1:56372_solr-n_0000000000) [n:127.0.0.1:56372_solr    ] o.a.s.c.o.ReplicaMutator Update state numShards=1 message={
   [junit4]   2>   "core":"AutoscalingHistoryHandlerTest_collection_shard1_replica_n4",
   [junit4]   2>   "core_node_name":"core_node6",
   [junit4]   2>   "roles":null,
   [junit4]   2>   "base_url":"http://127.0.0.1:56372/solr",
   [junit4]   2>   "node_name":"127.0.0.1:56372_solr",
   [junit4]   2>   "numShards":"1",
   [junit4]   2>   "state":"down",
   [junit4]   2>   "shard":"shard1",
   [junit4]   2>   "collection":"AutoscalingHistoryHandlerTest_collection",
   [junit4]   2>   "type":"NRT",
   [junit4]   2>   "operation":"state"}
   [junit4]   2> 66364 DEBUG (OverseerStateUpdate-98876686624292872-127.0.0.1:56372_solr-n_0000000000) [n:127.0.0.1:56372_solr    ] o.a.s.c.o.ReplicaMutator Will update state for replica: core_node6:{"core":"AutoscalingHistoryHandlerTest_collection_shard1_replica_n4","base_url":"http://127.0.0.1:56372/solr","node_name":"127.0.0.1:56372_solr","state":"down","type":"NRT"}
   [junit4]   2> 66364 DEBUG (OverseerStateUpdate-98876686624292872-127.0.0.1:56372_solr-n_0000000000) [n:127.0.0.1:56372_solr    ] o.a.s.c.o.ReplicaMutator Collection is now: DocCollection(AutoscalingHistoryHandlerTest_collection//collections/AutoscalingHistoryHandlerTest_collection/state.json/1)={
   [junit4]   2>   "pullReplicas":"0",
   [junit4]   2>   "replicationFactor":"3",
   [junit4]   2>   "router":{"name":"compositeId"},
   [junit4]   2>   "maxShardsPerNode":"1",
   [junit4]   2>   "autoAddReplicas":"false",
   [junit4]   2>   "nrtReplicas":"3",
   [junit4]   2>   "tlogReplicas":"0",
   [junit4]   2>   "shards":{"shard1":{
   [junit4]   2>       "range":"80000000-7fffffff",
   [junit4]   2>       "state":"active",
   [junit4]   2>       "replicas":{
   [junit4]   2>         "core_node3":{
   [junit4]   2>           "core":"AutoscalingHistoryHandlerTest_collection_shard1_replica_n1",
   [junit4]   2>           "base_url":"http://127.0.0.1:56373/solr",
   [junit4]   2>           "state":"down",
   [junit4]   2>           "node_name":null,
   [junit4]   2>           "type":"NRT"},
   [junit4]   2>         "core_node5":{
   [junit4]   2>           "core":"AutoscalingHistoryHandlerTest_collection_shard1_replica_n2",
   [junit4]   2>           "base_url":"http://127.0.0.1:56376/solr",
   [junit4]   2>           "state":"down",
   [junit4]   2>           "node_name":null,
   [junit4]   2>           "type":"NRT"},
   [junit4]   2>         "core_node6":{
   [junit4]   2>           "core":"AutoscalingHistoryHandlerTest_collection_shard1_replica_n4",
   [junit4]   2>           "base_url":"http://127.0.0.1:56372/solr",
   [junit4]   2>           "node_name":"127.0.0.1:56372_solr",
   [junit4]   2>           "state":"down",
   [junit4]   2>           "type":"NRT"}}}}}
   [junit4]   2> 66364 DEBUG (OverseerStateUpdate-98876686624292872-127.0.0.1:56372_solr-n_0000000000) [n:127.0.0.1:56372_solr    ] o.a.s.c.Overseer processMessage: queueSize: 2, message = {
   [junit4]   2>   "core":"AutoscalingHistoryHandlerTest_collection_shard1_replica_n2",
   [junit4]   2>   "core_node_name":"core_node5",
   [junit4]   2>   "roles":null,
   [junit4]   2>   "base_url":"http://127.0.0.1:56376/solr",
   [junit4]   2>   "node_name":"127.0.0.1:56376_solr",
   [junit4]   2>   "numShards":"1",
   [junit4]   2>   "state":"down",
   [junit4]   2>   "shard":"shard1",
   [junit4]   2>   "collection":"AutoscalingHistoryHandlerTest_collection",
   [junit4]   2>   "type":"NRT",
   [junit4]   2>   "operation":"state"} current state version: 0
   [junit4]   2> 66364 DEBUG (OverseerStateUpdate-98876686624292872-127.0.0.1:56372_solr-n_0000000000) [n:127.0.0.1:56372_solr    ] o.a.s.c.o.ReplicaMutator Update state numShards=1 message={
   [junit4]   2>   "core":"AutoscalingHistoryHandlerTest_collection_shard1_replica_n2",
   [junit4]   2>   "core_node_name":"core_node5",
   [junit4]   2>   "roles":null,
   [junit4]   2>   "base_url":"http://127.0.0.1:56376/solr",
   [junit4]   2>   "node_name":"127.0.0.1:56376_solr",
   [junit4]   2>   "numShards":"1",
   [junit4]   2>   "state":"down",
   [junit4]   2>   "shard":"shard1",
   [junit4]   2>   "collection":"AutoscalingHistoryHandlerTest_collection",
   [junit4]   2>   "type":"NRT",
   [junit4]   2>   "operation":"state"}
   [junit4]   2> 66364 DEBUG (OverseerStateUpdate-98876686624292872-127.0.0.1:56372_solr-n_0000000000) [n:127.0.0.1:56372_solr    ] o.a.s.c.o.ReplicaMutator Will update state for replica: core_node5:{"core":"AutoscalingHistoryHandlerTest_collection_shard1_replica_n2","base_url":"http://127.0.0.1:56376/solr","node_name":"127.0.0.1:56376_solr","state":"down","type":"NRT"}
   [junit4]   2> 66364 DEBUG (OverseerStateUpdate-98876686624292872-127.0.0.1:56372_solr-n_0000000000) [n:127.0.0.1:56372_solr    ] o.a.s.c.o.ReplicaMutator Collection is now: DocCollection(AutoscalingHistoryHandlerTest_collection//collections/AutoscalingHistoryHandlerTest_collection/state.json/1)={
   [junit4]   2>   "pullReplicas":"0",
   [junit4]   2>   "replicationFactor":"3",
   [junit4]   2>   "router":{"name":"compositeId"},
   [junit4]   2>   "maxShardsPerNode":"1",
   [junit4]   2>   "autoAddReplicas":"false",
   [junit4]   2>   "nrtReplicas":"3",
   [junit4]   2>   "tlogReplicas":"0",
   [junit4]   2>   "shards":{"shard1":{
   [junit4]   2>       "range":"80000000-7fffffff",
   [junit4]   2>       "state":"active",
   [junit4]   2>       "replicas":{
   [junit4]   2>         "core_node3":{
   [junit4]   2>           "core":"AutoscalingHistoryHandlerTest_collection_shard1_replica_n1",
   [junit4]   2>           "base_url":"http://127.0.0.1:56373/solr",
   [junit4]   2>           "state":"down",
   [junit4]   2>           "node_name":null,
   [junit4]   2>           "type":"NRT"},
   [junit4]   2>         "core_node5":{
   [junit4]   2>           "core":"AutoscalingHistoryHandlerTest_collection_shard1_replica_n2",
   [junit4]   2>           "base_url":"http://127.0.0.1:56376/solr",
   [junit4]   2>           "node_name":"127.0.0.1:56376_solr",
   [junit4]   2>           "state":"down",
   [junit4]   2>           "type":"NRT"},
   [junit4]   2>         "core_node6":{
   [junit4]   2>           "core":"AutoscalingHistoryHandlerTest_collection_shard1_replica_n4",
   [junit4]   2>           "base_url":"http://127.0.0.1:56372/solr",
   [junit4]   2>           "node_name":"127.0.0.1:56372_solr",
   [junit4]   2>           "state":"down",
   [junit4]   2>           "type":"NRT"}}}}}
   [junit4]   2> 66365 DEBUG (OverseerStateUpdate-98876686624292872-127.0.0.1:56372_solr-n_0000000000) [n:127.0.0.1:56372_solr    ] o.a.s.c.Overseer processMessage: queueSize: 3, message = {
   [junit4]   2>   "core":"AutoscalingHistoryHandlerTest_collection_shard1_replica_n1",
   [junit4]   2>   "core_node_name":"core_node3",
   [junit4]   2>   "roles":null,
   [junit4]   2>   "base_url":"http://127.0.0.1:56373/solr",
   [junit4]   2>   "node_name":"127.0.0.1:56373_solr",
   [junit4]   2>   "numShards":"1",
   [junit4]   2>   "state":"down",
   [junit4]   2>   "shard":"shard1",
   [junit4]   2>   "collection":"AutoscalingHistoryHandlerTest_collection",
   [junit4]   2>   "type":"NRT",
   [junit4]   2>   "operation":"state"} current st

[...truncated too long message...]

7-thread-3) [    ] o.a.s.c.ZkController Remove node as live in ZooKeeper:/live_nodes/127.0.0.1:53897_solr
   [junit4]   2> 185912 INFO  (zkCallback-206-thread-2-processing-n:127.0.0.1:53894_solr) [n:127.0.0.1:53894_solr    ] o.a.s.c.c.ZkStateReader Updated live nodes from ZooKeeper... (3) -> (2)
   [junit4]   2> 185912 INFO  (zkCallback-207-thread-2-processing-n:127.0.0.1:53893_solr) [n:127.0.0.1:53893_solr    ] o.a.s.c.c.ZkStateReader Updated live nodes from ZooKeeper... (3) -> (2)
   [junit4]   2> 185912 INFO  (zkCallback-208-thread-2-processing-n:127.0.0.1:53898_solr) [n:127.0.0.1:53898_solr    ] o.a.s.c.c.ZkStateReader Updated live nodes from ZooKeeper... (3) -> (2)
   [junit4]   2> 185914 INFO  (coreCloseExecutor-391-thread-1) [n:127.0.0.1:53893_solr c:collection1 s:shard1 r:core_node3 x:collection1_shard1_replica_n1] o.a.s.m.SolrMetricManager Closing metric reporters for registry=solr.collection.collection1.shard1.leader, tag=1595270276
   [junit4]   2> 185916 INFO  (zkCallback-205-thread-3-processing-n:127.0.0.1:53897_solr) [n:127.0.0.1:53897_solr    ] o.a.s.c.c.ZkStateReader Updated live nodes from ZooKeeper... (3) -> (2)
   [junit4]   2> 185916 INFO  (jetty-closer-187-thread-2) [    ] o.a.s.c.ZkController Remove node as live in ZooKeeper:/live_nodes/127.0.0.1:53894_solr
   [junit4]   2> 185918 INFO  (zkCallback-208-thread-2-processing-n:127.0.0.1:53898_solr) [n:127.0.0.1:53898_solr    ] o.a.s.c.c.ZkStateReader Updated live nodes from ZooKeeper... (2) -> (1)
   [junit4]   2> 185918 INFO  (zkCallback-205-thread-2-processing-n:127.0.0.1:53897_solr) [n:127.0.0.1:53897_solr    ] o.a.s.c.c.ZkStateReader Updated live nodes from ZooKeeper... (2) -> (1)
   [junit4]   2> 185918 INFO  (zkCallback-206-thread-2-processing-n:127.0.0.1:53894_solr) [n:127.0.0.1:53894_solr    ] o.a.s.c.c.ZkStateReader Updated live nodes from ZooKeeper... (2) -> (1)
   [junit4]   2> 185918 INFO  (zkCallback-207-thread-2-processing-n:127.0.0.1:53893_solr) [n:127.0.0.1:53893_solr    ] o.a.s.c.c.ZkStateReader Updated live nodes from ZooKeeper... (2) -> (1)
   [junit4]   2> 185921 INFO  (jetty-closer-187-thread-1) [    ] o.a.s.m.SolrMetricManager Closing metric reporters for registry=solr.cluster, tag=null
   [junit4]   2> 185921 INFO  (jetty-closer-187-thread-3) [    ] o.a.s.m.SolrMetricManager Closing metric reporters for registry=solr.cluster, tag=null
   [junit4]   2> 185927 INFO  (zkCallback-208-thread-2-processing-n:127.0.0.1:53898_solr) [n:127.0.0.1:53898_solr    ] o.a.s.c.c.ZkStateReader Updated live nodes from ZooKeeper... (1) -> (0)
   [junit4]   2> 185927 INFO  (zkCallback-207-thread-2-processing-n:127.0.0.1:53893_solr) [n:127.0.0.1:53893_solr    ] o.a.s.c.c.ZkStateReader Updated live nodes from ZooKeeper... (1) -> (0)
   [junit4]   2> 185928 INFO  (zkCallback-205-thread-2-processing-n:127.0.0.1:53897_solr) [n:127.0.0.1:53897_solr    ] o.a.s.c.c.ZkStateReader Updated live nodes from ZooKeeper... (1) -> (0)
   [junit4]   2> 185928 INFO  (zkCallback-206-thread-2-processing-n:127.0.0.1:53894_solr) [n:127.0.0.1:53894_solr    ] o.a.s.c.c.ZkStateReader Updated live nodes from ZooKeeper... (1) -> (0)
   [junit4]   2> 185925 INFO  (zkCallback-1832-thread-1-processing-n:127.0.0.1:53893_solr x:collection1_shard1_replica_n1 s:shard1 c:collection1 r:core_node3) [n:127.0.0.1:53893_solr c:collection1 s:shard1 r:core_node3 x:collection1_shard1_replica_n1] o.a.s.c.c.ZkStateReader Updated live nodes from ZooKeeper... (4) -> (1)
   [junit4]   2> 185927 INFO  (zkCallback-1832-thread-3-processing-n:127.0.0.1:53893_solr x:collection1_shard1_replica_n1 s:shard1 c:collection1 r:core_node3) [n:127.0.0.1:53893_solr c:collection1 s:shard1 r:core_node3 x:collection1_shard1_replica_n1] o.a.s.c.c.ZkStateReader Updated live nodes from ZooKeeper... (1) -> (0)
   [junit4]   2> 185930 INFO  (jetty-closer-187-thread-2) [    ] o.a.s.m.SolrMetricManager Closing metric reporters for registry=solr.cluster, tag=null
   [junit4]   2> 185931 INFO  (coreCloseExecutor-392-thread-1) [n:127.0.0.1:53897_solr c:collection1 s:shard2 r:core_node4 x:collection1_shard2_replica_n2] o.a.s.c.SolrCore [collection1_shard2_replica_n2]  CLOSING SolrCore org.apache.solr.core.SolrCore@25f8f204
   [junit4]   2> 185931 INFO  (coreCloseExecutor-392-thread-1) [n:127.0.0.1:53897_solr c:collection1 s:shard2 r:core_node4 x:collection1_shard2_replica_n2] o.a.s.m.SolrMetricManager Closing metric reporters for registry=solr.core.collection1.shard2.replica_n2, tag=637071876
   [junit4]   2> 185931 INFO  (coreCloseExecutor-392-thread-1) [n:127.0.0.1:53897_solr c:collection1 s:shard2 r:core_node4 x:collection1_shard2_replica_n2] o.a.s.m.r.SolrJmxReporter Closing reporter [org.apache.solr.metrics.reporters.SolrJmxReporter@6cbff2d5: rootName = solr_53897, domain = solr.core.collection1.shard2.replica_n2, service url = null, agent id = null] for registry solr.core.collection1.shard2.replica_n2 / com.codahale.metrics.MetricRegistry@62328a38
   [junit4]   2> 185937 INFO  (jetty-closer-187-thread-2) [    ] o.e.j.s.h.ContextHandler Stopped o.e.j.s.ServletContextHandler@3d700101{/solr,null,UNAVAILABLE}
   [junit4]   2> 185941 INFO  (jetty-closer-187-thread-1) [    ] o.e.j.s.h.ContextHandler Stopped o.e.j.s.ServletContextHandler@79762f8d{/solr,null,UNAVAILABLE}
   [junit4]   2> 185943 INFO  (coreCloseExecutor-392-thread-1) [n:127.0.0.1:53897_solr c:collection1 s:shard2 r:core_node4 x:collection1_shard2_replica_n2] o.a.s.m.SolrMetricManager Closing metric reporters for registry=solr.collection.collection1.shard2.leader, tag=637071876
   [junit4]   2> 185945 INFO  (jetty-closer-187-thread-4) [    ] o.e.j.s.h.ContextHandler Stopped o.e.j.s.ServletContextHandler@420f0a0{/solr,null,UNAVAILABLE}
   [junit4]   2> 185948 INFO  (jetty-closer-187-thread-3) [    ] o.a.s.c.Overseer Overseer (id=98876922079019018-127.0.0.1:53897_solr-n_0000000000) closing
   [junit4]   2> 185948 INFO  (OverseerStateUpdate-98876922079019018-127.0.0.1:53897_solr-n_0000000000) [n:127.0.0.1:53897_solr    ] o.a.s.c.Overseer Overseer Loop exiting : 127.0.0.1:53897_solr
   [junit4]   2> 185949 WARN  (OverseerAutoScalingTriggerThread-98876922079019018-127.0.0.1:53897_solr-n_0000000000) [n:127.0.0.1:53897_solr    ] o.a.s.c.a.OverseerTriggerThread OverseerTriggerThread woken up but we are closed, exiting.
   [junit4]   2> 185951 INFO  (jetty-closer-187-thread-3) [    ] o.e.j.s.h.ContextHandler Stopped o.e.j.s.ServletContextHandler@65d41169{/solr,null,UNAVAILABLE}
   [junit4]   2> 185953 ERROR (SUITE-StreamExpressionTest-seed#[B2FBE78760C5F78B]-worker) [    ] o.a.z.s.ZooKeeperServer ZKShutdownHandler is not registered, so ZooKeeper server won't take any action on ERROR or SHUTDOWN server state changes
   [junit4]   2> 185954 INFO  (SUITE-StreamExpressionTest-seed#[B2FBE78760C5F78B]-worker) [    ] o.a.s.c.ZkTestServer connecting to 127.0.0.1:53887 53887
   [junit4]   2> 185977 INFO  (Thread-85) [    ] o.a.s.c.ZkTestServer connecting to 127.0.0.1:53887 53887
   [junit4]   2> 186127 WARN  (Thread-85) [    ] o.a.s.c.ZkTestServer Watch limit violations: 
   [junit4]   2> Maximum concurrent create/delete watches above limit:
   [junit4]   2> 
   [junit4]   2> 	100	/solr/aliases.json
   [junit4]   2> 	15	/solr/configs/conf
   [junit4]   2> 	8	/solr/configs/ml
   [junit4]   2> 	4	/solr/security.json
   [junit4]   2> 
   [junit4]   2> Maximum concurrent data watches above limit:
   [junit4]   2> 
   [junit4]   2> 	100	/solr/clusterprops.json
   [junit4]   2> 	100	/solr/clusterstate.json
   [junit4]   2> 	40	/solr/collections/destinationCollection/state.json
   [junit4]   2> 	28	/solr/collections/parallelDestinationCollection1/state.json
   [junit4]   2> 	20	/solr/collections/parallelDestinationCollection/state.json
   [junit4]   2> 	10	/solr/collections/mainCorpus1/state.json
   [junit4]   2> 	10	/solr/collections/destination/state.json
   [junit4]   2> 	10	/solr/collections/destination1/state.json
   [junit4]   2> 	10	/solr/collections/collection1/state.json
   [junit4]   2> 	10	/solr/collections/workQueue1/state.json
   [junit4]   2> 	10	/solr/collections/workQueue/state.json
   [junit4]   2> 	10	/solr/collections/uknownCollection/state.json
   [junit4]   2> 	10	/solr/collections/modelCollection/state.json
   [junit4]   2> 	10	/solr/collections/checkpointCollection/state.json
   [junit4]   2> 	10	/solr/collections/mainCorpus/state.json
   [junit4]   2> 	2	/solr/overseer_elect/election/98876922079019018-127.0.0.1:53897_solr-n_0000000000
   [junit4]   2> 	2	/solr/overseer_elect/election/98876922079019020-127.0.0.1:53898_solr-n_0000000001
   [junit4]   2> 
   [junit4]   2> Maximum concurrent children watches above limit:
   [junit4]   2> 
   [junit4]   2> 	100	/solr/live_nodes
   [junit4]   2> 	100	/solr/collections
   [junit4]   2> 
   [junit4]   2> NOTE: leaving temporary files on disk at: /Users/jenkins/workspace/Lucene-Solr-master-MacOSX/solr/build/solr-solrj/test/J0/temp/solr.client.solrj.io.stream.StreamExpressionTest_B2FBE78760C5F78B-001
   [junit4]   2> Oct 23, 2017 7:03:43 AM com.carrotsearch.randomizedtesting.ThreadLeakControl checkThreadLeaks
   [junit4]   2> WARNING: Will linger awaiting termination of 1 leaked thread(s).
   [junit4]   2> NOTE: test params are: codec=Lucene70, sim=RandomSimilarity(queryNorm=true): {}, locale=fi-FI, timezone=America/Phoenix
   [junit4]   2> NOTE: Mac OS X 10.11.6 x86_64/Oracle Corporation 1.8.0_144 (64-bit)/cpus=3,threads=1,free=110662624,total=230465536
   [junit4]   2> NOTE: All tests run in this JVM: [TestConfigSetAdminRequest, BasicHttpSolrClientTest, GreaterThanEqualToEvaluatorTest, TermsResponseTest, SolrExampleXMLTest, TestPathTrie, CubedRootEvaluatorTest, GraphExpressionTest, SolrDocumentTest, TestV2Request, TestUpdateRequestCodec, EqualToEvaluatorTest, ArcCosineEvaluatorTest, SolrExampleEmbeddedTest, RawValueEvaluatorTest, CoalesceEvaluatorTest, RoundEvaluatorTest, StreamExpressionTest]
   [junit4] Completed [121/145 (1!)] on J0 in 126.88s, 121 tests, 1 failure <<< FAILURES!

[...truncated 46329 lines...]

Mime
View raw message