lucene-dev mailing list archives

Site index · List index
Message view « Date » · « Thread »
Top « Date » · « Thread »
From Apache Jenkins Server <jenk...@builds.apache.org>
Subject [JENKINS] Lucene-Solr-Tests-master - Build # 2139 - Still unstable
Date Tue, 31 Oct 2017 20:08:36 GMT
Build: https://builds.apache.org/job/Lucene-Solr-Tests-master/2139/

8 tests failed.
FAILED:  org.apache.solr.cloud.TestCloudRecovery.corruptedLogTest

Error Message:
Could not load collection from ZK: collection1

Stack Trace:
org.apache.solr.common.SolrException: Could not load collection from ZK: collection1
	at __randomizedtesting.SeedInfo.seed([F153CCAE402B6938:7225935C96526799]:0)
	at org.apache.solr.common.cloud.ZkStateReader.getCollectionLive(ZkStateReader.java:1172)
	at org.apache.solr.common.cloud.ZkStateReader$LazyCollectionRef.get(ZkStateReader.java:692)
	at org.apache.solr.common.cloud.ClusterState.getCollectionOrNull(ClusterState.java:130)
	at org.apache.solr.common.cloud.ClusterState.getCollection(ClusterState.java:110)
	at org.apache.solr.common.cloud.ClusterStateUtil.waitForAllActiveAndLiveReplicas(ClusterStateUtil.java:70)
	at org.apache.solr.cloud.TestCloudRecovery.corruptedLogTest(TestCloudRecovery.java:184)
	at sun.reflect.NativeMethodAccessorImpl.invoke0(Native Method)
	at sun.reflect.NativeMethodAccessorImpl.invoke(NativeMethodAccessorImpl.java:62)
	at sun.reflect.DelegatingMethodAccessorImpl.invoke(DelegatingMethodAccessorImpl.java:43)
	at java.lang.reflect.Method.invoke(Method.java:498)
	at com.carrotsearch.randomizedtesting.RandomizedRunner.invoke(RandomizedRunner.java:1737)
	at com.carrotsearch.randomizedtesting.RandomizedRunner$8.evaluate(RandomizedRunner.java:934)
	at com.carrotsearch.randomizedtesting.RandomizedRunner$9.evaluate(RandomizedRunner.java:970)
	at com.carrotsearch.randomizedtesting.RandomizedRunner$10.evaluate(RandomizedRunner.java:984)
	at com.carrotsearch.randomizedtesting.rules.SystemPropertiesRestoreRule$1.evaluate(SystemPropertiesRestoreRule.java:57)
	at org.apache.lucene.util.TestRuleSetupTeardownChained$1.evaluate(TestRuleSetupTeardownChained.java:49)
	at org.apache.lucene.util.AbstractBeforeAfterRule$1.evaluate(AbstractBeforeAfterRule.java:45)
	at org.apache.lucene.util.TestRuleThreadAndTestName$1.evaluate(TestRuleThreadAndTestName.java:48)
	at org.apache.lucene.util.TestRuleIgnoreAfterMaxFailures$1.evaluate(TestRuleIgnoreAfterMaxFailures.java:64)
	at org.apache.lucene.util.TestRuleMarkFailure$1.evaluate(TestRuleMarkFailure.java:47)
	at com.carrotsearch.randomizedtesting.rules.StatementAdapter.evaluate(StatementAdapter.java:36)
	at com.carrotsearch.randomizedtesting.ThreadLeakControl$StatementRunner.run(ThreadLeakControl.java:368)
	at com.carrotsearch.randomizedtesting.ThreadLeakControl.forkTimeoutingTask(ThreadLeakControl.java:817)
	at com.carrotsearch.randomizedtesting.ThreadLeakControl$3.evaluate(ThreadLeakControl.java:468)
	at com.carrotsearch.randomizedtesting.RandomizedRunner.runSingleTest(RandomizedRunner.java:943)
	at com.carrotsearch.randomizedtesting.RandomizedRunner$5.evaluate(RandomizedRunner.java:829)
	at com.carrotsearch.randomizedtesting.RandomizedRunner$6.evaluate(RandomizedRunner.java:879)
	at com.carrotsearch.randomizedtesting.RandomizedRunner$7.evaluate(RandomizedRunner.java:890)
	at com.carrotsearch.randomizedtesting.rules.StatementAdapter.evaluate(StatementAdapter.java:36)
	at com.carrotsearch.randomizedtesting.rules.SystemPropertiesRestoreRule$1.evaluate(SystemPropertiesRestoreRule.java:57)
	at org.apache.lucene.util.AbstractBeforeAfterRule$1.evaluate(AbstractBeforeAfterRule.java:45)
	at com.carrotsearch.randomizedtesting.rules.StatementAdapter.evaluate(StatementAdapter.java:36)
	at org.apache.lucene.util.TestRuleStoreClassName$1.evaluate(TestRuleStoreClassName.java:41)
	at com.carrotsearch.randomizedtesting.rules.NoShadowingOrOverridesOnMethodsRule$1.evaluate(NoShadowingOrOverridesOnMethodsRule.java:40)
	at com.carrotsearch.randomizedtesting.rules.NoShadowingOrOverridesOnMethodsRule$1.evaluate(NoShadowingOrOverridesOnMethodsRule.java:40)
	at com.carrotsearch.randomizedtesting.rules.StatementAdapter.evaluate(StatementAdapter.java:36)
	at com.carrotsearch.randomizedtesting.rules.StatementAdapter.evaluate(StatementAdapter.java:36)
	at com.carrotsearch.randomizedtesting.rules.StatementAdapter.evaluate(StatementAdapter.java:36)
	at org.apache.lucene.util.TestRuleAssertionsRequired$1.evaluate(TestRuleAssertionsRequired.java:53)
	at org.apache.lucene.util.TestRuleMarkFailure$1.evaluate(TestRuleMarkFailure.java:47)
	at org.apache.lucene.util.TestRuleIgnoreAfterMaxFailures$1.evaluate(TestRuleIgnoreAfterMaxFailures.java:64)
	at org.apache.lucene.util.TestRuleIgnoreTestSuites$1.evaluate(TestRuleIgnoreTestSuites.java:54)
	at com.carrotsearch.randomizedtesting.rules.StatementAdapter.evaluate(StatementAdapter.java:36)
	at com.carrotsearch.randomizedtesting.ThreadLeakControl$StatementRunner.run(ThreadLeakControl.java:368)
	at java.lang.Thread.run(Thread.java:748)
Caused by: org.apache.zookeeper.KeeperException$SessionExpiredException: KeeperErrorCode = Session expired for /collections/collection1/state.json
	at org.apache.zookeeper.KeeperException.create(KeeperException.java:127)
	at org.apache.zookeeper.KeeperException.create(KeeperException.java:51)
	at org.apache.zookeeper.ZooKeeper.getData(ZooKeeper.java:1212)
	at org.apache.solr.common.cloud.SolrZkClient.lambda$getData$5(SolrZkClient.java:332)
	at org.apache.solr.common.cloud.ZkCmdExecutor.retryOperation(ZkCmdExecutor.java:60)
	at org.apache.solr.common.cloud.SolrZkClient.getData(SolrZkClient.java:332)
	at org.apache.solr.common.cloud.ZkStateReader.fetchCollectionState(ZkStateReader.java:1184)
	at org.apache.solr.common.cloud.ZkStateReader.getCollectionLive(ZkStateReader.java:1170)
	... 44 more


FAILED:  org.apache.solr.cloud.TestRandomRequestDistribution.test

Error Message:
KeeperErrorCode = Session expired for /clusterstate.json

Stack Trace:
org.apache.zookeeper.KeeperException$SessionExpiredException: KeeperErrorCode = Session expired for /clusterstate.json
	at __randomizedtesting.SeedInfo.seed([F153CCAE402B6938:7907F374EED704C0]:0)
	at org.apache.zookeeper.KeeperException.create(KeeperException.java:127)
	at org.apache.zookeeper.KeeperException.create(KeeperException.java:51)
	at org.apache.zookeeper.ZooKeeper.getData(ZooKeeper.java:1212)
	at org.apache.solr.common.cloud.SolrZkClient.lambda$getData$5(SolrZkClient.java:332)
	at org.apache.solr.common.cloud.ZkCmdExecutor.retryOperation(ZkCmdExecutor.java:60)
	at org.apache.solr.common.cloud.SolrZkClient.getData(SolrZkClient.java:332)
	at org.apache.solr.common.cloud.ZkStateReader.refreshLegacyClusterState(ZkStateReader.java:586)
	at org.apache.solr.common.cloud.ZkStateReader.forceUpdateCollection(ZkStateReader.java:352)
	at org.apache.solr.cloud.AbstractFullDistribZkTestBase.updateMappingsFromZk(AbstractFullDistribZkTestBase.java:674)
	at org.apache.solr.cloud.AbstractFullDistribZkTestBase.updateMappingsFromZk(AbstractFullDistribZkTestBase.java:669)
	at org.apache.solr.cloud.AbstractFullDistribZkTestBase.createJettys(AbstractFullDistribZkTestBase.java:464)
	at org.apache.solr.cloud.AbstractFullDistribZkTestBase.createServers(AbstractFullDistribZkTestBase.java:334)
	at org.apache.solr.BaseDistributedSearchTestCase$ShardsRepeatRule$ShardsFixedStatement.callStatement(BaseDistributedSearchTestCase.java:991)
	at org.apache.solr.BaseDistributedSearchTestCase$ShardsRepeatRule$ShardsStatement.evaluate(BaseDistributedSearchTestCase.java:968)
	at com.carrotsearch.randomizedtesting.rules.SystemPropertiesRestoreRule$1.evaluate(SystemPropertiesRestoreRule.java:57)
	at org.apache.lucene.util.TestRuleSetupTeardownChained$1.evaluate(TestRuleSetupTeardownChained.java:49)
	at org.apache.lucene.util.AbstractBeforeAfterRule$1.evaluate(AbstractBeforeAfterRule.java:45)
	at org.apache.lucene.util.TestRuleThreadAndTestName$1.evaluate(TestRuleThreadAndTestName.java:48)
	at org.apache.lucene.util.TestRuleIgnoreAfterMaxFailures$1.evaluate(TestRuleIgnoreAfterMaxFailures.java:64)
	at org.apache.lucene.util.TestRuleMarkFailure$1.evaluate(TestRuleMarkFailure.java:47)
	at com.carrotsearch.randomizedtesting.rules.StatementAdapter.evaluate(StatementAdapter.java:36)
	at com.carrotsearch.randomizedtesting.ThreadLeakControl$StatementRunner.run(ThreadLeakControl.java:368)
	at com.carrotsearch.randomizedtesting.ThreadLeakControl.forkTimeoutingTask(ThreadLeakControl.java:817)
	at com.carrotsearch.randomizedtesting.ThreadLeakControl$3.evaluate(ThreadLeakControl.java:468)
	at com.carrotsearch.randomizedtesting.RandomizedRunner.runSingleTest(RandomizedRunner.java:943)
	at com.carrotsearch.randomizedtesting.RandomizedRunner$5.evaluate(RandomizedRunner.java:829)
	at com.carrotsearch.randomizedtesting.RandomizedRunner$6.evaluate(RandomizedRunner.java:879)
	at com.carrotsearch.randomizedtesting.RandomizedRunner$7.evaluate(RandomizedRunner.java:890)
	at com.carrotsearch.randomizedtesting.rules.StatementAdapter.evaluate(StatementAdapter.java:36)
	at com.carrotsearch.randomizedtesting.rules.SystemPropertiesRestoreRule$1.evaluate(SystemPropertiesRestoreRule.java:57)
	at org.apache.lucene.util.AbstractBeforeAfterRule$1.evaluate(AbstractBeforeAfterRule.java:45)
	at com.carrotsearch.randomizedtesting.rules.StatementAdapter.evaluate(StatementAdapter.java:36)
	at org.apache.lucene.util.TestRuleStoreClassName$1.evaluate(TestRuleStoreClassName.java:41)
	at com.carrotsearch.randomizedtesting.rules.NoShadowingOrOverridesOnMethodsRule$1.evaluate(NoShadowingOrOverridesOnMethodsRule.java:40)
	at com.carrotsearch.randomizedtesting.rules.NoShadowingOrOverridesOnMethodsRule$1.evaluate(NoShadowingOrOverridesOnMethodsRule.java:40)
	at com.carrotsearch.randomizedtesting.rules.StatementAdapter.evaluate(StatementAdapter.java:36)
	at com.carrotsearch.randomizedtesting.rules.StatementAdapter.evaluate(StatementAdapter.java:36)
	at com.carrotsearch.randomizedtesting.rules.StatementAdapter.evaluate(StatementAdapter.java:36)
	at org.apache.lucene.util.TestRuleAssertionsRequired$1.evaluate(TestRuleAssertionsRequired.java:53)
	at org.apache.lucene.util.TestRuleMarkFailure$1.evaluate(TestRuleMarkFailure.java:47)
	at org.apache.lucene.util.TestRuleIgnoreAfterMaxFailures$1.evaluate(TestRuleIgnoreAfterMaxFailures.java:64)
	at org.apache.lucene.util.TestRuleIgnoreTestSuites$1.evaluate(TestRuleIgnoreTestSuites.java:54)
	at com.carrotsearch.randomizedtesting.rules.StatementAdapter.evaluate(StatementAdapter.java:36)
	at com.carrotsearch.randomizedtesting.ThreadLeakControl$StatementRunner.run(ThreadLeakControl.java:368)
	at java.lang.Thread.run(Thread.java:748)


FAILED:  org.apache.solr.cloud.autoscaling.SystemLogListenerTest.test

Error Message:
wrong number of events added to .system expected:<9> but was:<10>

Stack Trace:
java.lang.AssertionError: wrong number of events added to .system expected:<9> but was:<10>
	at __randomizedtesting.SeedInfo.seed([F153CCAE402B6938:7907F374EED704C0]:0)
	at org.junit.Assert.fail(Assert.java:93)
	at org.junit.Assert.failNotEquals(Assert.java:647)
	at org.junit.Assert.assertEquals(Assert.java:128)
	at org.junit.Assert.assertEquals(Assert.java:472)
	at org.apache.solr.cloud.autoscaling.SystemLogListenerTest.test(SystemLogListenerTest.java:166)
	at sun.reflect.NativeMethodAccessorImpl.invoke0(Native Method)
	at sun.reflect.NativeMethodAccessorImpl.invoke(NativeMethodAccessorImpl.java:62)
	at sun.reflect.DelegatingMethodAccessorImpl.invoke(DelegatingMethodAccessorImpl.java:43)
	at java.lang.reflect.Method.invoke(Method.java:498)
	at com.carrotsearch.randomizedtesting.RandomizedRunner.invoke(RandomizedRunner.java:1737)
	at com.carrotsearch.randomizedtesting.RandomizedRunner$8.evaluate(RandomizedRunner.java:934)
	at com.carrotsearch.randomizedtesting.RandomizedRunner$9.evaluate(RandomizedRunner.java:970)
	at com.carrotsearch.randomizedtesting.RandomizedRunner$10.evaluate(RandomizedRunner.java:984)
	at com.carrotsearch.randomizedtesting.rules.SystemPropertiesRestoreRule$1.evaluate(SystemPropertiesRestoreRule.java:57)
	at org.apache.lucene.util.TestRuleSetupTeardownChained$1.evaluate(TestRuleSetupTeardownChained.java:49)
	at org.apache.lucene.util.AbstractBeforeAfterRule$1.evaluate(AbstractBeforeAfterRule.java:45)
	at org.apache.lucene.util.TestRuleThreadAndTestName$1.evaluate(TestRuleThreadAndTestName.java:48)
	at org.apache.lucene.util.TestRuleIgnoreAfterMaxFailures$1.evaluate(TestRuleIgnoreAfterMaxFailures.java:64)
	at org.apache.lucene.util.TestRuleMarkFailure$1.evaluate(TestRuleMarkFailure.java:47)
	at com.carrotsearch.randomizedtesting.rules.StatementAdapter.evaluate(StatementAdapter.java:36)
	at com.carrotsearch.randomizedtesting.ThreadLeakControl$StatementRunner.run(ThreadLeakControl.java:368)
	at com.carrotsearch.randomizedtesting.ThreadLeakControl.forkTimeoutingTask(ThreadLeakControl.java:817)
	at com.carrotsearch.randomizedtesting.ThreadLeakControl$3.evaluate(ThreadLeakControl.java:468)
	at com.carrotsearch.randomizedtesting.RandomizedRunner.runSingleTest(RandomizedRunner.java:943)
	at com.carrotsearch.randomizedtesting.RandomizedRunner$5.evaluate(RandomizedRunner.java:829)
	at com.carrotsearch.randomizedtesting.RandomizedRunner$6.evaluate(RandomizedRunner.java:879)
	at com.carrotsearch.randomizedtesting.RandomizedRunner$7.evaluate(RandomizedRunner.java:890)
	at com.carrotsearch.randomizedtesting.rules.StatementAdapter.evaluate(StatementAdapter.java:36)
	at com.carrotsearch.randomizedtesting.rules.SystemPropertiesRestoreRule$1.evaluate(SystemPropertiesRestoreRule.java:57)
	at org.apache.lucene.util.AbstractBeforeAfterRule$1.evaluate(AbstractBeforeAfterRule.java:45)
	at com.carrotsearch.randomizedtesting.rules.StatementAdapter.evaluate(StatementAdapter.java:36)
	at org.apache.lucene.util.TestRuleStoreClassName$1.evaluate(TestRuleStoreClassName.java:41)
	at com.carrotsearch.randomizedtesting.rules.NoShadowingOrOverridesOnMethodsRule$1.evaluate(NoShadowingOrOverridesOnMethodsRule.java:40)
	at com.carrotsearch.randomizedtesting.rules.NoShadowingOrOverridesOnMethodsRule$1.evaluate(NoShadowingOrOverridesOnMethodsRule.java:40)
	at com.carrotsearch.randomizedtesting.rules.StatementAdapter.evaluate(StatementAdapter.java:36)
	at com.carrotsearch.randomizedtesting.rules.StatementAdapter.evaluate(StatementAdapter.java:36)
	at com.carrotsearch.randomizedtesting.rules.StatementAdapter.evaluate(StatementAdapter.java:36)
	at org.apache.lucene.util.TestRuleAssertionsRequired$1.evaluate(TestRuleAssertionsRequired.java:53)
	at org.apache.lucene.util.TestRuleMarkFailure$1.evaluate(TestRuleMarkFailure.java:47)
	at org.apache.lucene.util.TestRuleIgnoreAfterMaxFailures$1.evaluate(TestRuleIgnoreAfterMaxFailures.java:64)
	at org.apache.lucene.util.TestRuleIgnoreTestSuites$1.evaluate(TestRuleIgnoreTestSuites.java:54)
	at com.carrotsearch.randomizedtesting.rules.StatementAdapter.evaluate(StatementAdapter.java:36)
	at com.carrotsearch.randomizedtesting.ThreadLeakControl$StatementRunner.run(ThreadLeakControl.java:368)
	at java.lang.Thread.run(Thread.java:748)


FAILED:  org.apache.solr.handler.TestReplicationHandler.doTestIndexAndConfigReplication

Error Message:
Index: 0, Size: 0

Stack Trace:
java.lang.IndexOutOfBoundsException: Index: 0, Size: 0
	at __randomizedtesting.SeedInfo.seed([F153CCAE402B6938:E51B97FB632CD426]:0)
	at java.util.ArrayList.rangeCheck(ArrayList.java:657)
	at java.util.ArrayList.get(ArrayList.java:433)
	at org.apache.solr.handler.TestReplicationHandler.doTestIndexAndConfigReplication(TestReplicationHandler.java:561)
	at sun.reflect.NativeMethodAccessorImpl.invoke0(Native Method)
	at sun.reflect.NativeMethodAccessorImpl.invoke(NativeMethodAccessorImpl.java:62)
	at sun.reflect.DelegatingMethodAccessorImpl.invoke(DelegatingMethodAccessorImpl.java:43)
	at java.lang.reflect.Method.invoke(Method.java:498)
	at com.carrotsearch.randomizedtesting.RandomizedRunner.invoke(RandomizedRunner.java:1737)
	at com.carrotsearch.randomizedtesting.RandomizedRunner$8.evaluate(RandomizedRunner.java:934)
	at com.carrotsearch.randomizedtesting.RandomizedRunner$9.evaluate(RandomizedRunner.java:970)
	at com.carrotsearch.randomizedtesting.RandomizedRunner$10.evaluate(RandomizedRunner.java:984)
	at com.carrotsearch.randomizedtesting.rules.SystemPropertiesRestoreRule$1.evaluate(SystemPropertiesRestoreRule.java:57)
	at org.apache.lucene.util.TestRuleSetupTeardownChained$1.evaluate(TestRuleSetupTeardownChained.java:49)
	at org.apache.lucene.util.AbstractBeforeAfterRule$1.evaluate(AbstractBeforeAfterRule.java:45)
	at org.apache.lucene.util.TestRuleThreadAndTestName$1.evaluate(TestRuleThreadAndTestName.java:48)
	at org.apache.lucene.util.TestRuleIgnoreAfterMaxFailures$1.evaluate(TestRuleIgnoreAfterMaxFailures.java:64)
	at org.apache.lucene.util.TestRuleMarkFailure$1.evaluate(TestRuleMarkFailure.java:47)
	at com.carrotsearch.randomizedtesting.rules.StatementAdapter.evaluate(StatementAdapter.java:36)
	at com.carrotsearch.randomizedtesting.ThreadLeakControl$StatementRunner.run(ThreadLeakControl.java:368)
	at com.carrotsearch.randomizedtesting.ThreadLeakControl.forkTimeoutingTask(ThreadLeakControl.java:817)
	at com.carrotsearch.randomizedtesting.ThreadLeakControl$3.evaluate(ThreadLeakControl.java:468)
	at com.carrotsearch.randomizedtesting.RandomizedRunner.runSingleTest(RandomizedRunner.java:943)
	at com.carrotsearch.randomizedtesting.RandomizedRunner$5.evaluate(RandomizedRunner.java:829)
	at com.carrotsearch.randomizedtesting.RandomizedRunner$6.evaluate(RandomizedRunner.java:879)
	at com.carrotsearch.randomizedtesting.RandomizedRunner$7.evaluate(RandomizedRunner.java:890)
	at com.carrotsearch.randomizedtesting.rules.StatementAdapter.evaluate(StatementAdapter.java:36)
	at com.carrotsearch.randomizedtesting.rules.SystemPropertiesRestoreRule$1.evaluate(SystemPropertiesRestoreRule.java:57)
	at org.apache.lucene.util.AbstractBeforeAfterRule$1.evaluate(AbstractBeforeAfterRule.java:45)
	at com.carrotsearch.randomizedtesting.rules.StatementAdapter.evaluate(StatementAdapter.java:36)
	at org.apache.lucene.util.TestRuleStoreClassName$1.evaluate(TestRuleStoreClassName.java:41)
	at com.carrotsearch.randomizedtesting.rules.NoShadowingOrOverridesOnMethodsRule$1.evaluate(NoShadowingOrOverridesOnMethodsRule.java:40)
	at com.carrotsearch.randomizedtesting.rules.NoShadowingOrOverridesOnMethodsRule$1.evaluate(NoShadowingOrOverridesOnMethodsRule.java:40)
	at com.carrotsearch.randomizedtesting.rules.StatementAdapter.evaluate(StatementAdapter.java:36)
	at com.carrotsearch.randomizedtesting.rules.StatementAdapter.evaluate(StatementAdapter.java:36)
	at com.carrotsearch.randomizedtesting.rules.StatementAdapter.evaluate(StatementAdapter.java:36)
	at org.apache.lucene.util.TestRuleAssertionsRequired$1.evaluate(TestRuleAssertionsRequired.java:53)
	at org.apache.lucene.util.TestRuleMarkFailure$1.evaluate(TestRuleMarkFailure.java:47)
	at org.apache.lucene.util.TestRuleIgnoreAfterMaxFailures$1.evaluate(TestRuleIgnoreAfterMaxFailures.java:64)
	at org.apache.lucene.util.TestRuleIgnoreTestSuites$1.evaluate(TestRuleIgnoreTestSuites.java:54)
	at com.carrotsearch.randomizedtesting.rules.StatementAdapter.evaluate(StatementAdapter.java:36)
	at com.carrotsearch.randomizedtesting.ThreadLeakControl$StatementRunner.run(ThreadLeakControl.java:368)
	at java.lang.Thread.run(Thread.java:748)


FAILED:  org.apache.solr.client.solrj.io.graph.GraphTest.testShortestPathStream

Error Message:
java.util.concurrent.ExecutionException: java.lang.RuntimeException: java.io.IOException: org.apache.solr.common.SolrException: Could not load collection from ZK: collection1

Stack Trace:
java.lang.RuntimeException: java.util.concurrent.ExecutionException: java.lang.RuntimeException: java.io.IOException: org.apache.solr.common.SolrException: Could not load collection from ZK: collection1
	at __randomizedtesting.SeedInfo.seed([28C0D907BFBB07FE:793523DBDFF33BA5]:0)
	at org.apache.solr.client.solrj.io.graph.ShortestPathStream.open(ShortestPathStream.java:365)
	at org.apache.solr.client.solrj.io.graph.GraphTest.getTuples(GraphTest.java:232)
	at org.apache.solr.client.solrj.io.graph.GraphTest.testShortestPathStream(GraphTest.java:219)
	at sun.reflect.NativeMethodAccessorImpl.invoke0(Native Method)
	at sun.reflect.NativeMethodAccessorImpl.invoke(NativeMethodAccessorImpl.java:62)
	at sun.reflect.DelegatingMethodAccessorImpl.invoke(DelegatingMethodAccessorImpl.java:43)
	at java.lang.reflect.Method.invoke(Method.java:498)
	at com.carrotsearch.randomizedtesting.RandomizedRunner.invoke(RandomizedRunner.java:1737)
	at com.carrotsearch.randomizedtesting.RandomizedRunner$8.evaluate(RandomizedRunner.java:934)
	at com.carrotsearch.randomizedtesting.RandomizedRunner$9.evaluate(RandomizedRunner.java:970)
	at com.carrotsearch.randomizedtesting.RandomizedRunner$10.evaluate(RandomizedRunner.java:984)
	at com.carrotsearch.randomizedtesting.rules.SystemPropertiesRestoreRule$1.evaluate(SystemPropertiesRestoreRule.java:57)
	at org.apache.lucene.util.TestRuleSetupTeardownChained$1.evaluate(TestRuleSetupTeardownChained.java:49)
	at org.apache.lucene.util.AbstractBeforeAfterRule$1.evaluate(AbstractBeforeAfterRule.java:45)
	at org.apache.lucene.util.TestRuleThreadAndTestName$1.evaluate(TestRuleThreadAndTestName.java:48)
	at org.apache.lucene.util.TestRuleIgnoreAfterMaxFailures$1.evaluate(TestRuleIgnoreAfterMaxFailures.java:64)
	at org.apache.lucene.util.TestRuleMarkFailure$1.evaluate(TestRuleMarkFailure.java:47)
	at com.carrotsearch.randomizedtesting.rules.StatementAdapter.evaluate(StatementAdapter.java:36)
	at com.carrotsearch.randomizedtesting.ThreadLeakControl$StatementRunner.run(ThreadLeakControl.java:368)
	at com.carrotsearch.randomizedtesting.ThreadLeakControl.forkTimeoutingTask(ThreadLeakControl.java:817)
	at com.carrotsearch.randomizedtesting.ThreadLeakControl$3.evaluate(ThreadLeakControl.java:468)
	at com.carrotsearch.randomizedtesting.RandomizedRunner.runSingleTest(RandomizedRunner.java:943)
	at com.carrotsearch.randomizedtesting.RandomizedRunner$5.evaluate(RandomizedRunner.java:829)
	at com.carrotsearch.randomizedtesting.RandomizedRunner$6.evaluate(RandomizedRunner.java:879)
	at com.carrotsearch.randomizedtesting.RandomizedRunner$7.evaluate(RandomizedRunner.java:890)
	at com.carrotsearch.randomizedtesting.rules.StatementAdapter.evaluate(StatementAdapter.java:36)
	at com.carrotsearch.randomizedtesting.rules.SystemPropertiesRestoreRule$1.evaluate(SystemPropertiesRestoreRule.java:57)
	at org.apache.lucene.util.AbstractBeforeAfterRule$1.evaluate(AbstractBeforeAfterRule.java:45)
	at com.carrotsearch.randomizedtesting.rules.StatementAdapter.evaluate(StatementAdapter.java:36)
	at org.apache.lucene.util.TestRuleStoreClassName$1.evaluate(TestRuleStoreClassName.java:41)
	at com.carrotsearch.randomizedtesting.rules.NoShadowingOrOverridesOnMethodsRule$1.evaluate(NoShadowingOrOverridesOnMethodsRule.java:40)
	at com.carrotsearch.randomizedtesting.rules.NoShadowingOrOverridesOnMethodsRule$1.evaluate(NoShadowingOrOverridesOnMethodsRule.java:40)
	at com.carrotsearch.randomizedtesting.rules.StatementAdapter.evaluate(StatementAdapter.java:36)
	at com.carrotsearch.randomizedtesting.rules.StatementAdapter.evaluate(StatementAdapter.java:36)
	at com.carrotsearch.randomizedtesting.rules.StatementAdapter.evaluate(StatementAdapter.java:36)
	at org.apache.lucene.util.TestRuleAssertionsRequired$1.evaluate(TestRuleAssertionsRequired.java:53)
	at org.apache.lucene.util.TestRuleMarkFailure$1.evaluate(TestRuleMarkFailure.java:47)
	at org.apache.lucene.util.TestRuleIgnoreAfterMaxFailures$1.evaluate(TestRuleIgnoreAfterMaxFailures.java:64)
	at org.apache.lucene.util.TestRuleIgnoreTestSuites$1.evaluate(TestRuleIgnoreTestSuites.java:54)
	at com.carrotsearch.randomizedtesting.rules.StatementAdapter.evaluate(StatementAdapter.java:36)
	at com.carrotsearch.randomizedtesting.ThreadLeakControl$StatementRunner.run(ThreadLeakControl.java:368)
	at java.lang.Thread.run(Thread.java:748)
Caused by: java.util.concurrent.ExecutionException: java.lang.RuntimeException: java.io.IOException: org.apache.solr.common.SolrException: Could not load collection from ZK: collection1
	at java.util.concurrent.FutureTask.report(FutureTask.java:122)
	at java.util.concurrent.FutureTask.get(FutureTask.java:192)
	at org.apache.solr.client.solrj.io.graph.ShortestPathStream.open(ShortestPathStream.java:337)
	... 41 more
Caused by: java.lang.RuntimeException: java.io.IOException: org.apache.solr.common.SolrException: Could not load collection from ZK: collection1
	at org.apache.solr.client.solrj.io.graph.ShortestPathStream$JoinRunner.call(ShortestPathStream.java:461)
	at org.apache.solr.client.solrj.io.graph.ShortestPathStream$JoinRunner.call(ShortestPathStream.java:417)
	at java.util.concurrent.FutureTask.run(FutureTask.java:266)
	at org.apache.solr.common.util.ExecutorUtil$MDCAwareThreadPoolExecutor.lambda$execute$0(ExecutorUtil.java:188)
	at java.util.concurrent.ThreadPoolExecutor.runWorker(ThreadPoolExecutor.java:1149)
	at java.util.concurrent.ThreadPoolExecutor$Worker.run(ThreadPoolExecutor.java:624)
	... 1 more
Caused by: java.io.IOException: org.apache.solr.common.SolrException: Could not load collection from ZK: collection1
	at org.apache.solr.client.solrj.io.stream.CloudSolrStream.constructStreams(CloudSolrStream.java:378)
	at org.apache.solr.client.solrj.io.stream.CloudSolrStream.open(CloudSolrStream.java:274)
	at org.apache.solr.client.solrj.io.stream.PushBackStream.open(PushBackStream.java:71)
	at org.apache.solr.client.solrj.io.stream.ReducerStream.open(ReducerStream.java:200)
	at org.apache.solr.client.solrj.io.stream.UniqueStream.open(UniqueStream.java:151)
	at org.apache.solr.client.solrj.io.graph.ShortestPathStream$JoinRunner.call(ShortestPathStream.java:448)
	... 6 more
Caused by: org.apache.solr.common.SolrException: Could not load collection from ZK: collection1
	at org.apache.solr.common.cloud.ZkStateReader.getCollectionLive(ZkStateReader.java:1172)
	at org.apache.solr.common.cloud.ZkStateReader$LazyCollectionRef.get(ZkStateReader.java:692)
	at org.apache.solr.common.cloud.ClusterState.getCollectionsMap(ClusterState.java:146)
	at org.apache.solr.client.solrj.io.stream.CloudSolrStream.getSlices(CloudSolrStream.java:331)
	at org.apache.solr.client.solrj.io.stream.TupleStream.getShards(TupleStream.java:141)
	at org.apache.solr.client.solrj.io.stream.CloudSolrStream.constructStreams(CloudSolrStream.java:363)
	... 11 more
Caused by: org.apache.zookeeper.KeeperException$SessionExpiredException: KeeperErrorCode = Session expired for /collections/collection1/state.json
	at org.apache.zookeeper.KeeperException.create(KeeperException.java:127)
	at org.apache.zookeeper.KeeperException.create(KeeperException.java:51)
	at org.apache.zookeeper.ZooKeeper.getData(ZooKeeper.java:1212)
	at org.apache.solr.common.cloud.SolrZkClient.lambda$getData$5(SolrZkClient.java:332)
	at org.apache.solr.common.cloud.ZkCmdExecutor.retryOperation(ZkCmdExecutor.java:60)
	at org.apache.solr.common.cloud.SolrZkClient.getData(SolrZkClient.java:332)
	at org.apache.solr.common.cloud.ZkStateReader.fetchCollectionState(ZkStateReader.java:1184)
	at org.apache.solr.common.cloud.ZkStateReader.getCollectionLive(ZkStateReader.java:1170)
	... 16 more


FAILED:  junit.framework.TestSuite.org.apache.solr.client.solrj.io.graph.GraphTest

Error Message:
10 threads leaked from SUITE scope at org.apache.solr.client.solrj.io.graph.GraphTest:     1) Thread[id=772, name=zkCallback-176-thread-4-SendThread(127.0.0.1:42213), state=TIMED_WAITING, group=TGRP-GraphTest]         at java.lang.Thread.sleep(Native Method)         at org.apache.zookeeper.ClientCnxn$SendThread.run(ClientCnxn.java:1051)    2) Thread[id=710, name=Connection evictor, state=TIMED_WAITING, group=TGRP-GraphTest]         at java.lang.Thread.sleep(Native Method)         at org.apache.http.impl.client.IdleConnectionEvictor$1.run(IdleConnectionEvictor.java:66)         at java.lang.Thread.run(Thread.java:748)    3) Thread[id=764, name=zkCallback-176-thread-2, state=TIMED_WAITING, group=TGRP-GraphTest]         at sun.misc.Unsafe.park(Native Method)         at java.util.concurrent.locks.LockSupport.parkNanos(LockSupport.java:215)         at java.util.concurrent.SynchronousQueue$TransferStack.awaitFulfill(SynchronousQueue.java:460)         at java.util.concurrent.SynchronousQueue$TransferStack.transfer(SynchronousQueue.java:362)         at java.util.concurrent.SynchronousQueue.poll(SynchronousQueue.java:941)         at java.util.concurrent.ThreadPoolExecutor.getTask(ThreadPoolExecutor.java:1073)         at java.util.concurrent.ThreadPoolExecutor.runWorker(ThreadPoolExecutor.java:1134)         at java.util.concurrent.ThreadPoolExecutor$Worker.run(ThreadPoolExecutor.java:624)         at java.lang.Thread.run(Thread.java:748)    4) Thread[id=713, name=zkCallback-176-thread-1, state=TIMED_WAITING, group=TGRP-GraphTest]         at sun.misc.Unsafe.park(Native Method)         at java.util.concurrent.locks.LockSupport.parkNanos(LockSupport.java:215)         at java.util.concurrent.SynchronousQueue$TransferStack.awaitFulfill(SynchronousQueue.java:460)         at java.util.concurrent.SynchronousQueue$TransferStack.transfer(SynchronousQueue.java:362)         at java.util.concurrent.SynchronousQueue.poll(SynchronousQueue.java:941)         at java.util.concurrent.ThreadPoolExecutor.getTask(ThreadPoolExecutor.java:1073)         at java.util.concurrent.ThreadPoolExecutor.runWorker(ThreadPoolExecutor.java:1134)         at java.util.concurrent.ThreadPoolExecutor$Worker.run(ThreadPoolExecutor.java:624)         at java.lang.Thread.run(Thread.java:748)    5) Thread[id=765, name=zkCallback-176-thread-3, state=TIMED_WAITING, group=TGRP-GraphTest]         at sun.misc.Unsafe.park(Native Method)         at java.util.concurrent.locks.LockSupport.parkNanos(LockSupport.java:215)         at java.util.concurrent.SynchronousQueue$TransferStack.awaitFulfill(SynchronousQueue.java:460)         at java.util.concurrent.SynchronousQueue$TransferStack.transfer(SynchronousQueue.java:362)         at java.util.concurrent.SynchronousQueue.poll(SynchronousQueue.java:941)         at java.util.concurrent.ThreadPoolExecutor.getTask(ThreadPoolExecutor.java:1073)         at java.util.concurrent.ThreadPoolExecutor.runWorker(ThreadPoolExecutor.java:1134)         at java.util.concurrent.ThreadPoolExecutor$Worker.run(ThreadPoolExecutor.java:624)         at java.lang.Thread.run(Thread.java:748)    6) Thread[id=773, name=zkCallback-176-thread-4-EventThread, state=WAITING, group=TGRP-GraphTest]         at sun.misc.Unsafe.park(Native Method)         at java.util.concurrent.locks.LockSupport.park(LockSupport.java:175)         at java.util.concurrent.locks.AbstractQueuedSynchronizer$ConditionObject.await(AbstractQueuedSynchronizer.java:2039)         at java.util.concurrent.LinkedBlockingQueue.take(LinkedBlockingQueue.java:442)         at org.apache.zookeeper.ClientCnxn$EventThread.run(ClientCnxn.java:501)    7) Thread[id=716, name=Connection evictor, state=TIMED_WAITING, group=TGRP-GraphTest]         at java.lang.Thread.sleep(Native Method)         at org.apache.http.impl.client.IdleConnectionEvictor$1.run(IdleConnectionEvictor.java:66)         at java.lang.Thread.run(Thread.java:748)    8) Thread[id=770, name=zkCallback-176-thread-4, state=TIMED_WAITING, group=TGRP-GraphTest]         at sun.misc.Unsafe.park(Native Method)         at java.util.concurrent.locks.LockSupport.parkNanos(LockSupport.java:215)         at java.util.concurrent.SynchronousQueue$TransferStack.awaitFulfill(SynchronousQueue.java:460)         at java.util.concurrent.SynchronousQueue$TransferStack.transfer(SynchronousQueue.java:362)         at java.util.concurrent.SynchronousQueue.poll(SynchronousQueue.java:941)         at java.util.concurrent.ThreadPoolExecutor.getTask(ThreadPoolExecutor.java:1073)         at java.util.concurrent.ThreadPoolExecutor.runWorker(ThreadPoolExecutor.java:1134)         at java.util.concurrent.ThreadPoolExecutor$Worker.run(ThreadPoolExecutor.java:624)         at java.lang.Thread.run(Thread.java:748)    9) Thread[id=771, name=zkCallback-176-thread-5, state=TIMED_WAITING, group=TGRP-GraphTest]         at sun.misc.Unsafe.park(Native Method)         at java.util.concurrent.locks.LockSupport.parkNanos(LockSupport.java:215)         at java.util.concurrent.SynchronousQueue$TransferStack.awaitFulfill(SynchronousQueue.java:460)         at java.util.concurrent.SynchronousQueue$TransferStack.transfer(SynchronousQueue.java:362)         at java.util.concurrent.SynchronousQueue.poll(SynchronousQueue.java:941)         at java.util.concurrent.ThreadPoolExecutor.getTask(ThreadPoolExecutor.java:1073)         at java.util.concurrent.ThreadPoolExecutor.runWorker(ThreadPoolExecutor.java:1134)         at java.util.concurrent.ThreadPoolExecutor$Worker.run(ThreadPoolExecutor.java:624)         at java.lang.Thread.run(Thread.java:748)   10) Thread[id=717, name=Connection evictor, state=TIMED_WAITING, group=TGRP-GraphTest]         at java.lang.Thread.sleep(Native Method)         at org.apache.http.impl.client.IdleConnectionEvictor$1.run(IdleConnectionEvictor.java:66)         at java.lang.Thread.run(Thread.java:748)

Stack Trace:
com.carrotsearch.randomizedtesting.ThreadLeakError: 10 threads leaked from SUITE scope at org.apache.solr.client.solrj.io.graph.GraphTest: 
   1) Thread[id=772, name=zkCallback-176-thread-4-SendThread(127.0.0.1:42213), state=TIMED_WAITING, group=TGRP-GraphTest]
        at java.lang.Thread.sleep(Native Method)
        at org.apache.zookeeper.ClientCnxn$SendThread.run(ClientCnxn.java:1051)
   2) Thread[id=710, name=Connection evictor, state=TIMED_WAITING, group=TGRP-GraphTest]
        at java.lang.Thread.sleep(Native Method)
        at org.apache.http.impl.client.IdleConnectionEvictor$1.run(IdleConnectionEvictor.java:66)
        at java.lang.Thread.run(Thread.java:748)
   3) Thread[id=764, name=zkCallback-176-thread-2, state=TIMED_WAITING, group=TGRP-GraphTest]
        at sun.misc.Unsafe.park(Native Method)
        at java.util.concurrent.locks.LockSupport.parkNanos(LockSupport.java:215)
        at java.util.concurrent.SynchronousQueue$TransferStack.awaitFulfill(SynchronousQueue.java:460)
        at java.util.concurrent.SynchronousQueue$TransferStack.transfer(SynchronousQueue.java:362)
        at java.util.concurrent.SynchronousQueue.poll(SynchronousQueue.java:941)
        at java.util.concurrent.ThreadPoolExecutor.getTask(ThreadPoolExecutor.java:1073)
        at java.util.concurrent.ThreadPoolExecutor.runWorker(ThreadPoolExecutor.java:1134)
        at java.util.concurrent.ThreadPoolExecutor$Worker.run(ThreadPoolExecutor.java:624)
        at java.lang.Thread.run(Thread.java:748)
   4) Thread[id=713, name=zkCallback-176-thread-1, state=TIMED_WAITING, group=TGRP-GraphTest]
        at sun.misc.Unsafe.park(Native Method)
        at java.util.concurrent.locks.LockSupport.parkNanos(LockSupport.java:215)
        at java.util.concurrent.SynchronousQueue$TransferStack.awaitFulfill(SynchronousQueue.java:460)
        at java.util.concurrent.SynchronousQueue$TransferStack.transfer(SynchronousQueue.java:362)
        at java.util.concurrent.SynchronousQueue.poll(SynchronousQueue.java:941)
        at java.util.concurrent.ThreadPoolExecutor.getTask(ThreadPoolExecutor.java:1073)
        at java.util.concurrent.ThreadPoolExecutor.runWorker(ThreadPoolExecutor.java:1134)
        at java.util.concurrent.ThreadPoolExecutor$Worker.run(ThreadPoolExecutor.java:624)
        at java.lang.Thread.run(Thread.java:748)
   5) Thread[id=765, name=zkCallback-176-thread-3, state=TIMED_WAITING, group=TGRP-GraphTest]
        at sun.misc.Unsafe.park(Native Method)
        at java.util.concurrent.locks.LockSupport.parkNanos(LockSupport.java:215)
        at java.util.concurrent.SynchronousQueue$TransferStack.awaitFulfill(SynchronousQueue.java:460)
        at java.util.concurrent.SynchronousQueue$TransferStack.transfer(SynchronousQueue.java:362)
        at java.util.concurrent.SynchronousQueue.poll(SynchronousQueue.java:941)
        at java.util.concurrent.ThreadPoolExecutor.getTask(ThreadPoolExecutor.java:1073)
        at java.util.concurrent.ThreadPoolExecutor.runWorker(ThreadPoolExecutor.java:1134)
        at java.util.concurrent.ThreadPoolExecutor$Worker.run(ThreadPoolExecutor.java:624)
        at java.lang.Thread.run(Thread.java:748)
   6) Thread[id=773, name=zkCallback-176-thread-4-EventThread, state=WAITING, group=TGRP-GraphTest]
        at sun.misc.Unsafe.park(Native Method)
        at java.util.concurrent.locks.LockSupport.park(LockSupport.java:175)
        at java.util.concurrent.locks.AbstractQueuedSynchronizer$ConditionObject.await(AbstractQueuedSynchronizer.java:2039)
        at java.util.concurrent.LinkedBlockingQueue.take(LinkedBlockingQueue.java:442)
        at org.apache.zookeeper.ClientCnxn$EventThread.run(ClientCnxn.java:501)
   7) Thread[id=716, name=Connection evictor, state=TIMED_WAITING, group=TGRP-GraphTest]
        at java.lang.Thread.sleep(Native Method)
        at org.apache.http.impl.client.IdleConnectionEvictor$1.run(IdleConnectionEvictor.java:66)
        at java.lang.Thread.run(Thread.java:748)
   8) Thread[id=770, name=zkCallback-176-thread-4, state=TIMED_WAITING, group=TGRP-GraphTest]
        at sun.misc.Unsafe.park(Native Method)
        at java.util.concurrent.locks.LockSupport.parkNanos(LockSupport.java:215)
        at java.util.concurrent.SynchronousQueue$TransferStack.awaitFulfill(SynchronousQueue.java:460)
        at java.util.concurrent.SynchronousQueue$TransferStack.transfer(SynchronousQueue.java:362)
        at java.util.concurrent.SynchronousQueue.poll(SynchronousQueue.java:941)
        at java.util.concurrent.ThreadPoolExecutor.getTask(ThreadPoolExecutor.java:1073)
        at java.util.concurrent.ThreadPoolExecutor.runWorker(ThreadPoolExecutor.java:1134)
        at java.util.concurrent.ThreadPoolExecutor$Worker.run(ThreadPoolExecutor.java:624)
        at java.lang.Thread.run(Thread.java:748)
   9) Thread[id=771, name=zkCallback-176-thread-5, state=TIMED_WAITING, group=TGRP-GraphTest]
        at sun.misc.Unsafe.park(Native Method)
        at java.util.concurrent.locks.LockSupport.parkNanos(LockSupport.java:215)
        at java.util.concurrent.SynchronousQueue$TransferStack.awaitFulfill(SynchronousQueue.java:460)
        at java.util.concurrent.SynchronousQueue$TransferStack.transfer(SynchronousQueue.java:362)
        at java.util.concurrent.SynchronousQueue.poll(SynchronousQueue.java:941)
        at java.util.concurrent.ThreadPoolExecutor.getTask(ThreadPoolExecutor.java:1073)
        at java.util.concurrent.ThreadPoolExecutor.runWorker(ThreadPoolExecutor.java:1134)
        at java.util.concurrent.ThreadPoolExecutor$Worker.run(ThreadPoolExecutor.java:624)
        at java.lang.Thread.run(Thread.java:748)
  10) Thread[id=717, name=Connection evictor, state=TIMED_WAITING, group=TGRP-GraphTest]
        at java.lang.Thread.sleep(Native Method)
        at org.apache.http.impl.client.IdleConnectionEvictor$1.run(IdleConnectionEvictor.java:66)
        at java.lang.Thread.run(Thread.java:748)
	at __randomizedtesting.SeedInfo.seed([28C0D907BFBB07FE]:0)


FAILED:  junit.framework.TestSuite.org.apache.solr.client.solrj.io.graph.GraphTest

Error Message:
There are still zombie threads that couldn't be terminated:    1) Thread[id=772, name=zkCallback-176-thread-4-SendThread(127.0.0.1:42213), state=TIMED_WAITING, group=TGRP-GraphTest]         at java.lang.Thread.sleep(Native Method)         at org.apache.zookeeper.client.StaticHostProvider.next(StaticHostProvider.java:101)         at org.apache.zookeeper.ClientCnxn$SendThread.startConnect(ClientCnxn.java:997)         at org.apache.zookeeper.ClientCnxn$SendThread.run(ClientCnxn.java:1060)    2) Thread[id=764, name=zkCallback-176-thread-2, state=TIMED_WAITING, group=TGRP-GraphTest]         at sun.misc.Unsafe.park(Native Method)         at java.util.concurrent.locks.LockSupport.parkNanos(LockSupport.java:215)         at java.util.concurrent.SynchronousQueue$TransferStack.awaitFulfill(SynchronousQueue.java:460)         at java.util.concurrent.SynchronousQueue$TransferStack.transfer(SynchronousQueue.java:362)         at java.util.concurrent.SynchronousQueue.poll(SynchronousQueue.java:941)         at java.util.concurrent.ThreadPoolExecutor.getTask(ThreadPoolExecutor.java:1073)         at java.util.concurrent.ThreadPoolExecutor.runWorker(ThreadPoolExecutor.java:1134)         at java.util.concurrent.ThreadPoolExecutor$Worker.run(ThreadPoolExecutor.java:624)         at java.lang.Thread.run(Thread.java:748)    3) Thread[id=713, name=zkCallback-176-thread-1, state=TIMED_WAITING, group=TGRP-GraphTest]         at sun.misc.Unsafe.park(Native Method)         at java.util.concurrent.locks.LockSupport.parkNanos(LockSupport.java:215)         at java.util.concurrent.SynchronousQueue$TransferStack.awaitFulfill(SynchronousQueue.java:460)         at java.util.concurrent.SynchronousQueue$TransferStack.transfer(SynchronousQueue.java:362)         at java.util.concurrent.SynchronousQueue.poll(SynchronousQueue.java:941)         at java.util.concurrent.ThreadPoolExecutor.getTask(ThreadPoolExecutor.java:1073)         at java.util.concurrent.ThreadPoolExecutor.runWorker(ThreadPoolExecutor.java:1134)         at java.util.concurrent.ThreadPoolExecutor$Worker.run(ThreadPoolExecutor.java:624)         at java.lang.Thread.run(Thread.java:748)    4) Thread[id=765, name=zkCallback-176-thread-3, state=TIMED_WAITING, group=TGRP-GraphTest]         at sun.misc.Unsafe.park(Native Method)         at java.util.concurrent.locks.LockSupport.parkNanos(LockSupport.java:215)         at java.util.concurrent.SynchronousQueue$TransferStack.awaitFulfill(SynchronousQueue.java:460)         at java.util.concurrent.SynchronousQueue$TransferStack.transfer(SynchronousQueue.java:362)         at java.util.concurrent.SynchronousQueue.poll(SynchronousQueue.java:941)         at java.util.concurrent.ThreadPoolExecutor.getTask(ThreadPoolExecutor.java:1073)         at java.util.concurrent.ThreadPoolExecutor.runWorker(ThreadPoolExecutor.java:1134)         at java.util.concurrent.ThreadPoolExecutor$Worker.run(ThreadPoolExecutor.java:624)         at java.lang.Thread.run(Thread.java:748)    5) Thread[id=770, name=zkCallback-176-thread-4, state=TIMED_WAITING, group=TGRP-GraphTest]         at sun.misc.Unsafe.park(Native Method)         at java.util.concurrent.locks.LockSupport.parkNanos(LockSupport.java:215)         at java.util.concurrent.SynchronousQueue$TransferStack.awaitFulfill(SynchronousQueue.java:460)         at java.util.concurrent.SynchronousQueue$TransferStack.transfer(SynchronousQueue.java:362)         at java.util.concurrent.SynchronousQueue.poll(SynchronousQueue.java:941)         at java.util.concurrent.ThreadPoolExecutor.getTask(ThreadPoolExecutor.java:1073)         at java.util.concurrent.ThreadPoolExecutor.runWorker(ThreadPoolExecutor.java:1134)         at java.util.concurrent.ThreadPoolExecutor$Worker.run(ThreadPoolExecutor.java:624)         at java.lang.Thread.run(Thread.java:748)    6) Thread[id=771, name=zkCallback-176-thread-5, state=TIMED_WAITING, group=TGRP-GraphTest]         at sun.misc.Unsafe.park(Native Method)         at java.util.concurrent.locks.LockSupport.parkNanos(LockSupport.java:215)         at java.util.concurrent.SynchronousQueue$TransferStack.awaitFulfill(SynchronousQueue.java:460)         at java.util.concurrent.SynchronousQueue$TransferStack.transfer(SynchronousQueue.java:362)         at java.util.concurrent.SynchronousQueue.poll(SynchronousQueue.java:941)         at java.util.concurrent.ThreadPoolExecutor.getTask(ThreadPoolExecutor.java:1073)         at java.util.concurrent.ThreadPoolExecutor.runWorker(ThreadPoolExecutor.java:1134)         at java.util.concurrent.ThreadPoolExecutor$Worker.run(ThreadPoolExecutor.java:624)         at java.lang.Thread.run(Thread.java:748)

Stack Trace:
com.carrotsearch.randomizedtesting.ThreadLeakError: There are still zombie threads that couldn't be terminated:
   1) Thread[id=772, name=zkCallback-176-thread-4-SendThread(127.0.0.1:42213), state=TIMED_WAITING, group=TGRP-GraphTest]
        at java.lang.Thread.sleep(Native Method)
        at org.apache.zookeeper.client.StaticHostProvider.next(StaticHostProvider.java:101)
        at org.apache.zookeeper.ClientCnxn$SendThread.startConnect(ClientCnxn.java:997)
        at org.apache.zookeeper.ClientCnxn$SendThread.run(ClientCnxn.java:1060)
   2) Thread[id=764, name=zkCallback-176-thread-2, state=TIMED_WAITING, group=TGRP-GraphTest]
        at sun.misc.Unsafe.park(Native Method)
        at java.util.concurrent.locks.LockSupport.parkNanos(LockSupport.java:215)
        at java.util.concurrent.SynchronousQueue$TransferStack.awaitFulfill(SynchronousQueue.java:460)
        at java.util.concurrent.SynchronousQueue$TransferStack.transfer(SynchronousQueue.java:362)
        at java.util.concurrent.SynchronousQueue.poll(SynchronousQueue.java:941)
        at java.util.concurrent.ThreadPoolExecutor.getTask(ThreadPoolExecutor.java:1073)
        at java.util.concurrent.ThreadPoolExecutor.runWorker(ThreadPoolExecutor.java:1134)
        at java.util.concurrent.ThreadPoolExecutor$Worker.run(ThreadPoolExecutor.java:624)
        at java.lang.Thread.run(Thread.java:748)
   3) Thread[id=713, name=zkCallback-176-thread-1, state=TIMED_WAITING, group=TGRP-GraphTest]
        at sun.misc.Unsafe.park(Native Method)
        at java.util.concurrent.locks.LockSupport.parkNanos(LockSupport.java:215)
        at java.util.concurrent.SynchronousQueue$TransferStack.awaitFulfill(SynchronousQueue.java:460)
        at java.util.concurrent.SynchronousQueue$TransferStack.transfer(SynchronousQueue.java:362)
        at java.util.concurrent.SynchronousQueue.poll(SynchronousQueue.java:941)
        at java.util.concurrent.ThreadPoolExecutor.getTask(ThreadPoolExecutor.java:1073)
        at java.util.concurrent.ThreadPoolExecutor.runWorker(ThreadPoolExecutor.java:1134)
        at java.util.concurrent.ThreadPoolExecutor$Worker.run(ThreadPoolExecutor.java:624)
        at java.lang.Thread.run(Thread.java:748)
   4) Thread[id=765, name=zkCallback-176-thread-3, state=TIMED_WAITING, group=TGRP-GraphTest]
        at sun.misc.Unsafe.park(Native Method)
        at java.util.concurrent.locks.LockSupport.parkNanos(LockSupport.java:215)
        at java.util.concurrent.SynchronousQueue$TransferStack.awaitFulfill(SynchronousQueue.java:460)
        at java.util.concurrent.SynchronousQueue$TransferStack.transfer(SynchronousQueue.java:362)
        at java.util.concurrent.SynchronousQueue.poll(SynchronousQueue.java:941)
        at java.util.concurrent.ThreadPoolExecutor.getTask(ThreadPoolExecutor.java:1073)
        at java.util.concurrent.ThreadPoolExecutor.runWorker(ThreadPoolExecutor.java:1134)
        at java.util.concurrent.ThreadPoolExecutor$Worker.run(ThreadPoolExecutor.java:624)
        at java.lang.Thread.run(Thread.java:748)
   5) Thread[id=770, name=zkCallback-176-thread-4, state=TIMED_WAITING, group=TGRP-GraphTest]
        at sun.misc.Unsafe.park(Native Method)
        at java.util.concurrent.locks.LockSupport.parkNanos(LockSupport.java:215)
        at java.util.concurrent.SynchronousQueue$TransferStack.awaitFulfill(SynchronousQueue.java:460)
        at java.util.concurrent.SynchronousQueue$TransferStack.transfer(SynchronousQueue.java:362)
        at java.util.concurrent.SynchronousQueue.poll(SynchronousQueue.java:941)
        at java.util.concurrent.ThreadPoolExecutor.getTask(ThreadPoolExecutor.java:1073)
        at java.util.concurrent.ThreadPoolExecutor.runWorker(ThreadPoolExecutor.java:1134)
        at java.util.concurrent.ThreadPoolExecutor$Worker.run(ThreadPoolExecutor.java:624)
        at java.lang.Thread.run(Thread.java:748)
   6) Thread[id=771, name=zkCallback-176-thread-5, state=TIMED_WAITING, group=TGRP-GraphTest]
        at sun.misc.Unsafe.park(Native Method)
        at java.util.concurrent.locks.LockSupport.parkNanos(LockSupport.java:215)
        at java.util.concurrent.SynchronousQueue$TransferStack.awaitFulfill(SynchronousQueue.java:460)
        at java.util.concurrent.SynchronousQueue$TransferStack.transfer(SynchronousQueue.java:362)
        at java.util.concurrent.SynchronousQueue.poll(SynchronousQueue.java:941)
        at java.util.concurrent.ThreadPoolExecutor.getTask(ThreadPoolExecutor.java:1073)
        at java.util.concurrent.ThreadPoolExecutor.runWorker(ThreadPoolExecutor.java:1134)
        at java.util.concurrent.ThreadPoolExecutor$Worker.run(ThreadPoolExecutor.java:624)
        at java.lang.Thread.run(Thread.java:748)
	at __randomizedtesting.SeedInfo.seed([28C0D907BFBB07FE]:0)


FAILED:  org.apache.solr.common.cloud.TestCollectionStateWatchers.testWaitForStateWatcherIsRetainedOnPredicateFailure

Error Message:
Did not see a fully active cluster after 30 seconds

Stack Trace:
java.lang.AssertionError: Did not see a fully active cluster after 30 seconds
	at __randomizedtesting.SeedInfo.seed([28C0D907BFBB07FE:A0F67B546714EFEC]:0)
	at org.junit.Assert.fail(Assert.java:93)
	at org.junit.Assert.assertTrue(Assert.java:43)
	at org.apache.solr.common.cloud.TestCollectionStateWatchers.testWaitForStateWatcherIsRetainedOnPredicateFailure(TestCollectionStateWatchers.java:250)
	at sun.reflect.NativeMethodAccessorImpl.invoke0(Native Method)
	at sun.reflect.NativeMethodAccessorImpl.invoke(NativeMethodAccessorImpl.java:62)
	at sun.reflect.DelegatingMethodAccessorImpl.invoke(DelegatingMethodAccessorImpl.java:43)
	at java.lang.reflect.Method.invoke(Method.java:498)
	at com.carrotsearch.randomizedtesting.RandomizedRunner.invoke(RandomizedRunner.java:1737)
	at com.carrotsearch.randomizedtesting.RandomizedRunner$8.evaluate(RandomizedRunner.java:934)
	at com.carrotsearch.randomizedtesting.RandomizedRunner$9.evaluate(RandomizedRunner.java:970)
	at com.carrotsearch.randomizedtesting.RandomizedRunner$10.evaluate(RandomizedRunner.java:984)
	at com.carrotsearch.randomizedtesting.rules.SystemPropertiesRestoreRule$1.evaluate(SystemPropertiesRestoreRule.java:57)
	at org.apache.lucene.util.TestRuleSetupTeardownChained$1.evaluate(TestRuleSetupTeardownChained.java:49)
	at org.apache.lucene.util.AbstractBeforeAfterRule$1.evaluate(AbstractBeforeAfterRule.java:45)
	at org.apache.lucene.util.TestRuleThreadAndTestName$1.evaluate(TestRuleThreadAndTestName.java:48)
	at org.apache.lucene.util.TestRuleIgnoreAfterMaxFailures$1.evaluate(TestRuleIgnoreAfterMaxFailures.java:64)
	at org.apache.lucene.util.TestRuleMarkFailure$1.evaluate(TestRuleMarkFailure.java:47)
	at com.carrotsearch.randomizedtesting.rules.StatementAdapter.evaluate(StatementAdapter.java:36)
	at com.carrotsearch.randomizedtesting.ThreadLeakControl$StatementRunner.run(ThreadLeakControl.java:368)
	at com.carrotsearch.randomizedtesting.ThreadLeakControl.forkTimeoutingTask(ThreadLeakControl.java:817)
	at com.carrotsearch.randomizedtesting.ThreadLeakControl$3.evaluate(ThreadLeakControl.java:468)
	at com.carrotsearch.randomizedtesting.RandomizedRunner.runSingleTest(RandomizedRunner.java:943)
	at com.carrotsearch.randomizedtesting.RandomizedRunner$5.evaluate(RandomizedRunner.java:829)
	at com.carrotsearch.randomizedtesting.RandomizedRunner$6.evaluate(RandomizedRunner.java:879)
	at com.carrotsearch.randomizedtesting.RandomizedRunner$7.evaluate(RandomizedRunner.java:890)
	at com.carrotsearch.randomizedtesting.rules.StatementAdapter.evaluate(StatementAdapter.java:36)
	at com.carrotsearch.randomizedtesting.rules.SystemPropertiesRestoreRule$1.evaluate(SystemPropertiesRestoreRule.java:57)
	at org.apache.lucene.util.AbstractBeforeAfterRule$1.evaluate(AbstractBeforeAfterRule.java:45)
	at com.carrotsearch.randomizedtesting.rules.StatementAdapter.evaluate(StatementAdapter.java:36)
	at org.apache.lucene.util.TestRuleStoreClassName$1.evaluate(TestRuleStoreClassName.java:41)
	at com.carrotsearch.randomizedtesting.rules.NoShadowingOrOverridesOnMethodsRule$1.evaluate(NoShadowingOrOverridesOnMethodsRule.java:40)
	at com.carrotsearch.randomizedtesting.rules.NoShadowingOrOverridesOnMethodsRule$1.evaluate(NoShadowingOrOverridesOnMethodsRule.java:40)
	at com.carrotsearch.randomizedtesting.rules.StatementAdapter.evaluate(StatementAdapter.java:36)
	at com.carrotsearch.randomizedtesting.rules.StatementAdapter.evaluate(StatementAdapter.java:36)
	at com.carrotsearch.randomizedtesting.rules.StatementAdapter.evaluate(StatementAdapter.java:36)
	at org.apache.lucene.util.TestRuleAssertionsRequired$1.evaluate(TestRuleAssertionsRequired.java:53)
	at org.apache.lucene.util.TestRuleMarkFailure$1.evaluate(TestRuleMarkFailure.java:47)
	at org.apache.lucene.util.TestRuleIgnoreAfterMaxFailures$1.evaluate(TestRuleIgnoreAfterMaxFailures.java:64)
	at org.apache.lucene.util.TestRuleIgnoreTestSuites$1.evaluate(TestRuleIgnoreTestSuites.java:54)
	at com.carrotsearch.randomizedtesting.rules.StatementAdapter.evaluate(StatementAdapter.java:36)
	at com.carrotsearch.randomizedtesting.ThreadLeakControl$StatementRunner.run(ThreadLeakControl.java:368)
	at java.lang.Thread.run(Thread.java:748)




Build Log:
[...truncated 11694 lines...]
   [junit4] Suite: org.apache.solr.cloud.autoscaling.SystemLogListenerTest
   [junit4]   2> Creating dataDir: /home/jenkins/jenkins-slave/workspace/Lucene-Solr-Tests-master/solr/build/solr-core/test/J2/temp/solr.cloud.autoscaling.SystemLogListenerTest_F153CCAE402B6938-001/init-core-data-001
   [junit4]   2> 237229 WARN  (SUITE-SystemLogListenerTest-seed#[F153CCAE402B6938]-worker) [    ] o.a.s.SolrTestCaseJ4 startTrackingSearchers: numOpens=16 numCloses=16
   [junit4]   2> 237229 INFO  (SUITE-SystemLogListenerTest-seed#[F153CCAE402B6938]-worker) [    ] o.a.s.SolrTestCaseJ4 Using PointFields (NUMERIC_POINTS_SYSPROP=true) w/NUMERIC_DOCVALUES_SYSPROP=false
   [junit4]   2> 237231 INFO  (SUITE-SystemLogListenerTest-seed#[F153CCAE402B6938]-worker) [    ] o.a.s.SolrTestCaseJ4 Randomized ssl (true) and clientAuth (false) via: @org.apache.solr.util.RandomizeSSL(reason=, ssl=NaN, value=NaN, clientAuth=NaN)
   [junit4]   2> 237231 INFO  (SUITE-SystemLogListenerTest-seed#[F153CCAE402B6938]-worker) [    ] o.a.s.SolrTestCaseJ4 SecureRandom sanity checks: test.solr.allowed.securerandom=null & java.security.egd=file:/dev/./urandom
   [junit4]   2> 237231 INFO  (SUITE-SystemLogListenerTest-seed#[F153CCAE402B6938]-worker) [    ] o.a.s.c.MiniSolrCloudCluster Starting cluster of 3 servers in /home/jenkins/jenkins-slave/workspace/Lucene-Solr-Tests-master/solr/build/solr-core/test/J2/temp/solr.cloud.autoscaling.SystemLogListenerTest_F153CCAE402B6938-001/tempDir-001
   [junit4]   2> 237232 INFO  (SUITE-SystemLogListenerTest-seed#[F153CCAE402B6938]-worker) [    ] o.a.s.c.ZkTestServer STARTING ZK TEST SERVER
   [junit4]   2> 237244 INFO  (Thread-87) [    ] o.a.s.c.ZkTestServer client port:0.0.0.0/0.0.0.0:0
   [junit4]   2> 237244 INFO  (Thread-87) [    ] o.a.s.c.ZkTestServer Starting server
   [junit4]   2> 237318 ERROR (Thread-87) [    ] o.a.z.s.ZooKeeperServer ZKShutdownHandler is not registered, so ZooKeeper server won't take any action on ERROR or SHUTDOWN server state changes
   [junit4]   2> 237354 INFO  (SUITE-SystemLogListenerTest-seed#[F153CCAE402B6938]-worker) [    ] o.a.s.c.ZkTestServer start zk server on port:43826
   [junit4]   2> 237485 WARN  (NIOServerCxn.Factory:0.0.0.0/0.0.0.0:0) [    ] o.a.z.s.NIOServerCnxn caught end of stream exception
   [junit4]   2> EndOfStreamException: Unable to read additional data from client sessionid 0x15f7372bf5a0000, likely client has closed socket
   [junit4]   2> 	at org.apache.zookeeper.server.NIOServerCnxn.doIO(NIOServerCnxn.java:239)
   [junit4]   2> 	at org.apache.zookeeper.server.NIOServerCnxnFactory.run(NIOServerCnxnFactory.java:203)
   [junit4]   2> 	at java.lang.Thread.run(Thread.java:748)
   [junit4]   2> 237612 INFO  (jetty-launcher-65-thread-2) [    ] o.e.j.s.Server jetty-9.3.20.v20170531
   [junit4]   2> 237623 INFO  (jetty-launcher-65-thread-1) [    ] o.e.j.s.Server jetty-9.3.20.v20170531
   [junit4]   2> 237637 INFO  (jetty-launcher-65-thread-3) [    ] o.e.j.s.Server jetty-9.3.20.v20170531
   [junit4]   2> 237729 INFO  (jetty-launcher-65-thread-1) [    ] o.e.j.s.h.ContextHandler Started o.e.j.s.ServletContextHandler@166da26f{/solr,null,AVAILABLE}
   [junit4]   2> 237730 INFO  (jetty-launcher-65-thread-1) [    ] o.e.j.s.AbstractConnector Started ServerConnector@3f845d1b{SSL,[ssl, http/1.1]}{127.0.0.1:41300}
   [junit4]   2> 237730 INFO  (jetty-launcher-65-thread-1) [    ] o.e.j.s.Server Started @253004ms
   [junit4]   2> 237730 INFO  (jetty-launcher-65-thread-1) [    ] o.a.s.c.s.e.JettySolrRunner Jetty properties: {hostContext=/solr, hostPort=41300}
   [junit4]   2> 237731 ERROR (jetty-launcher-65-thread-1) [    ] o.a.s.u.StartupLoggingUtils Missing Java Option solr.log.dir. Logging may be missing or incomplete.
   [junit4]   2> 237731 INFO  (jetty-launcher-65-thread-1) [    ] o.a.s.s.SolrDispatchFilter  ___      _       Welcome to Apache Solr? version 8.0.0
   [junit4]   2> 237731 INFO  (jetty-launcher-65-thread-1) [    ] o.a.s.s.SolrDispatchFilter / __| ___| |_ _   Starting in cloud mode on port null
   [junit4]   2> 237731 INFO  (jetty-launcher-65-thread-1) [    ] o.a.s.s.SolrDispatchFilter \__ \/ _ \ | '_|  Install dir: null
   [junit4]   2> 237731 INFO  (jetty-launcher-65-thread-1) [    ] o.a.s.s.SolrDispatchFilter |___/\___/_|_|    Start time: 2017-10-31T17:20:21.292Z
   [junit4]   2> 237855 INFO  (jetty-launcher-65-thread-2) [    ] o.e.j.s.h.ContextHandler Started o.e.j.s.ServletContextHandler@3a36799b{/solr,null,AVAILABLE}
   [junit4]   2> 237855 INFO  (jetty-launcher-65-thread-2) [    ] o.e.j.s.AbstractConnector Started ServerConnector@25f0f894{SSL,[ssl, http/1.1]}{127.0.0.1:44916}
   [junit4]   2> 237855 INFO  (jetty-launcher-65-thread-2) [    ] o.e.j.s.Server Started @253129ms
   [junit4]   2> 237856 INFO  (jetty-launcher-65-thread-2) [    ] o.a.s.c.s.e.JettySolrRunner Jetty properties: {hostContext=/solr, hostPort=44916}
   [junit4]   2> 237864 ERROR (jetty-launcher-65-thread-2) [    ] o.a.s.u.StartupLoggingUtils Missing Java Option solr.log.dir. Logging may be missing or incomplete.
   [junit4]   2> 237864 INFO  (jetty-launcher-65-thread-2) [    ] o.a.s.s.SolrDispatchFilter  ___      _       Welcome to Apache Solr? version 8.0.0
   [junit4]   2> 237865 INFO  (jetty-launcher-65-thread-2) [    ] o.a.s.s.SolrDispatchFilter / __| ___| |_ _   Starting in cloud mode on port null
   [junit4]   2> 237865 INFO  (jetty-launcher-65-thread-2) [    ] o.a.s.s.SolrDispatchFilter \__ \/ _ \ | '_|  Install dir: null
   [junit4]   2> 237865 INFO  (jetty-launcher-65-thread-2) [    ] o.a.s.s.SolrDispatchFilter |___/\___/_|_|    Start time: 2017-10-31T17:20:21.426Z
   [junit4]   2> 237949 INFO  (jetty-launcher-65-thread-3) [    ] o.e.j.s.h.ContextHandler Started o.e.j.s.ServletContextHandler@ff380c6{/solr,null,AVAILABLE}
   [junit4]   2> 237949 INFO  (jetty-launcher-65-thread-3) [    ] o.e.j.s.AbstractConnector Started ServerConnector@3f478ccf{SSL,[ssl, http/1.1]}{127.0.0.1:35005}
   [junit4]   2> 237949 INFO  (jetty-launcher-65-thread-3) [    ] o.e.j.s.Server Started @253223ms
   [junit4]   2> 237949 INFO  (jetty-launcher-65-thread-3) [    ] o.a.s.c.s.e.JettySolrRunner Jetty properties: {hostContext=/solr, hostPort=35005}
   [junit4]   2> 237950 ERROR (jetty-launcher-65-thread-3) [    ] o.a.s.u.StartupLoggingUtils Missing Java Option solr.log.dir. Logging may be missing or incomplete.
   [junit4]   2> 237950 INFO  (jetty-launcher-65-thread-3) [    ] o.a.s.s.SolrDispatchFilter  ___      _       Welcome to Apache Solr? version 8.0.0
   [junit4]   2> 237950 INFO  (jetty-launcher-65-thread-3) [    ] o.a.s.s.SolrDispatchFilter / __| ___| |_ _   Starting in cloud mode on port null
   [junit4]   2> 237950 INFO  (jetty-launcher-65-thread-3) [    ] o.a.s.s.SolrDispatchFilter \__ \/ _ \ | '_|  Install dir: null
   [junit4]   2> 237950 INFO  (jetty-launcher-65-thread-3) [    ] o.a.s.s.SolrDispatchFilter |___/\___/_|_|    Start time: 2017-10-31T17:20:21.511Z
   [junit4]   2> 238014 INFO  (jetty-launcher-65-thread-1) [    ] o.a.s.s.SolrDispatchFilter solr.xml found in ZooKeeper. Loading...
   [junit4]   2> 238123 INFO  (jetty-launcher-65-thread-3) [    ] o.a.s.s.SolrDispatchFilter solr.xml found in ZooKeeper. Loading...
   [junit4]   2> 238123 INFO  (jetty-launcher-65-thread-2) [    ] o.a.s.s.SolrDispatchFilter solr.xml found in ZooKeeper. Loading...
   [junit4]   2> 238168 INFO  (jetty-launcher-65-thread-1) [    ] o.a.s.c.ZkContainer Zookeeper client=127.0.0.1:43826/solr
   [junit4]   2> 238343 INFO  (jetty-launcher-65-thread-3) [    ] o.a.s.c.ZkContainer Zookeeper client=127.0.0.1:43826/solr
   [junit4]   2> 238400 INFO  (jetty-launcher-65-thread-2) [    ] o.a.s.c.ZkContainer Zookeeper client=127.0.0.1:43826/solr
   [junit4]   2> 238491 WARN  (NIOServerCxn.Factory:0.0.0.0/0.0.0.0:0) [    ] o.a.z.s.NIOServerCnxn caught end of stream exception
   [junit4]   2> EndOfStreamException: Unable to read additional data from client sessionid 0x15f7372bf5a0004, likely client has closed socket
   [junit4]   2> 	at org.apache.zookeeper.server.NIOServerCnxn.doIO(NIOServerCnxn.java:239)
   [junit4]   2> 	at org.apache.zookeeper.server.NIOServerCnxnFactory.run(NIOServerCnxnFactory.java:203)
   [junit4]   2> 	at java.lang.Thread.run(Thread.java:748)
   [junit4]   2> 238657 WARN  (NIOServerCxn.Factory:0.0.0.0/0.0.0.0:0) [    ] o.a.z.s.NIOServerCnxn caught end of stream exception
   [junit4]   2> EndOfStreamException: Unable to read additional data from client sessionid 0x15f7372bf5a0006, likely client has closed socket
   [junit4]   2> 	at org.apache.zookeeper.server.NIOServerCnxn.doIO(NIOServerCnxn.java:239)
   [junit4]   2> 	at org.apache.zookeeper.server.NIOServerCnxnFactory.run(NIOServerCnxnFactory.java:203)
   [junit4]   2> 	at java.lang.Thread.run(Thread.java:748)
   [junit4]   2> 239347 INFO  (jetty-launcher-65-thread-1) [n:127.0.0.1:41300_solr    ] o.a.s.c.Overseer Overseer (id=null) closing
   [junit4]   2> 239360 INFO  (jetty-launcher-65-thread-1) [n:127.0.0.1:41300_solr    ] o.a.s.c.OverseerElectionContext I am going to be the leader 127.0.0.1:41300_solr
   [junit4]   2> 239362 INFO  (jetty-launcher-65-thread-1) [n:127.0.0.1:41300_solr    ] o.a.s.c.Overseer Overseer (id=98924653499252743-127.0.0.1:41300_solr-n_0000000000) starting
   [junit4]   2> 239530 INFO  (jetty-launcher-65-thread-1) [n:127.0.0.1:41300_solr    ] o.a.s.c.ZkController Register node as live in ZooKeeper:/live_nodes/127.0.0.1:41300_solr
   [junit4]   2> 239531 DEBUG (OverseerAutoScalingTriggerThread-98924653499252743-127.0.0.1:41300_solr-n_0000000000) [n:127.0.0.1:41300_solr    ] o.a.s.c.a.OverseerTriggerThread Adding .autoAddReplicas trigger
   [junit4]   2> 239680 DEBUG (OverseerAutoScalingTriggerThread-98924653499252743-127.0.0.1:41300_solr-n_0000000000) [n:127.0.0.1:41300_solr    ] o.a.s.c.a.OverseerTriggerThread Refreshing /autoscaling.json with znode version 1
   [junit4]   2> 239714 DEBUG (OverseerAutoScalingTriggerThread-98924653499252743-127.0.0.1:41300_solr-n_0000000000) [n:127.0.0.1:41300_solr    ] o.a.s.c.a.NodeLostTrigger Initial livenodes: []
   [junit4]   2> 239714 DEBUG (OverseerAutoScalingTriggerThread-98924653499252743-127.0.0.1:41300_solr-n_0000000000) [n:127.0.0.1:41300_solr    ] o.a.s.c.a.OverseerTriggerThread Current znodeVersion 1, lastZnodeVersion -1
   [junit4]   2> 239714 DEBUG (OverseerAutoScalingTriggerThread-98924653499252743-127.0.0.1:41300_solr-n_0000000000) [n:127.0.0.1:41300_solr    ] o.a.s.c.a.OverseerTriggerThread Processed trigger updates upto znodeVersion 1
   [junit4]   2> 239714 INFO  (OverseerStateUpdate-98924653499252743-127.0.0.1:41300_solr-n_0000000000) [n:127.0.0.1:41300_solr    ] o.a.s.c.c.ZkStateReader Updated live nodes from ZooKeeper... (0) -> (1)
   [junit4]   2> 239803 DEBUG (OverseerAutoScalingTriggerThread-98924653499252743-127.0.0.1:41300_solr-n_0000000000) [n:127.0.0.1:41300_solr    ] o.a.s.c.a.OverseerTriggerThread -- clean old nodeAdded markers
   [junit4]   2> 240161 DEBUG (OverseerAutoScalingTriggerThread-98924653499252743-127.0.0.1:41300_solr-n_0000000000) [n:127.0.0.1:41300_solr    ] o.a.s.c.a.OverseerTriggerThread Current znodeVersion 1, lastZnodeVersion 1
   [junit4]   2> 240181 DEBUG (ScheduledTrigger-252-thread-1) [n:127.0.0.1:41300_solr    ] o.a.s.c.a.NodeLostTrigger Running NodeLostTrigger: .auto_add_replicas with currently live nodes: [127.0.0.1:41300_solr]
   [junit4]   2> 240456 INFO  (jetty-launcher-65-thread-2) [n:127.0.0.1:44916_solr    ] o.a.s.c.c.ZkStateReader Updated live nodes from ZooKeeper... (0) -> (1)
   [junit4]   2> 240527 INFO  (jetty-launcher-65-thread-2) [n:127.0.0.1:44916_solr    ] o.a.s.c.Overseer Overseer (id=null) closing
   [junit4]   2> 240529 INFO  (jetty-launcher-65-thread-2) [n:127.0.0.1:44916_solr    ] o.a.s.c.ZkController Register node as live in ZooKeeper:/live_nodes/127.0.0.1:44916_solr
   [junit4]   2> 240547 INFO  (zkCallback-80-thread-1-processing-n:127.0.0.1:41300_solr) [n:127.0.0.1:41300_solr    ] o.a.s.c.c.ZkStateReader Updated live nodes from ZooKeeper... (1) -> (2)
   [junit4]   2> 240770 INFO  (jetty-launcher-65-thread-1) [n:127.0.0.1:41300_solr    ] o.a.s.m.r.SolrJmxReporter JMX monitoring for 'solr_41300.solr.node' (registry 'solr.node') enabled at server: com.sun.jmx.mbeanserver.JmxMBeanServer@281e16f
   [junit4]   2> 240779 INFO  (zkCallback-81-thread-1-processing-n:127.0.0.1:44916_solr) [n:127.0.0.1:44916_solr    ] o.a.s.c.c.ZkStateReader Updated live nodes from ZooKeeper... (1) -> (2)
   [junit4]   2> 240860 INFO  (jetty-launcher-65-thread-1) [n:127.0.0.1:41300_solr    ] o.a.s.m.r.SolrJmxReporter JMX monitoring for 'solr_41300.solr.jvm' (registry 'solr.jvm') enabled at server: com.sun.jmx.mbeanserver.JmxMBeanServer@281e16f
   [junit4]   2> 240860 INFO  (jetty-launcher-65-thread-1) [n:127.0.0.1:41300_solr    ] o.a.s.m.r.SolrJmxReporter JMX monitoring for 'solr_41300.solr.jetty' (registry 'solr.jetty') enabled at server: com.sun.jmx.mbeanserver.JmxMBeanServer@281e16f
   [junit4]   2> 240909 INFO  (jetty-launcher-65-thread-3) [n:127.0.0.1:35005_solr    ] o.a.s.c.c.ZkStateReader Updated live nodes from ZooKeeper... (0) -> (2)
   [junit4]   2> 240932 INFO  (jetty-launcher-65-thread-1) [n:127.0.0.1:41300_solr    ] o.a.s.c.CorePropertiesLocator Found 0 core definitions underneath /home/jenkins/jenkins-slave/workspace/Lucene-Solr-Tests-master/solr/build/solr-core/test/J2/temp/solr.cloud.autoscaling.SystemLogListenerTest_F153CCAE402B6938-001/tempDir-001/node1/.
   [junit4]   2> 241165 INFO  (jetty-launcher-65-thread-3) [n:127.0.0.1:35005_solr    ] o.a.s.c.Overseer Overseer (id=null) closing
   [junit4]   2> 241202 INFO  (jetty-launcher-65-thread-2) [n:127.0.0.1:44916_solr    ] o.a.s.m.r.SolrJmxReporter JMX monitoring for 'solr_44916.solr.node' (registry 'solr.node') enabled at server: com.sun.jmx.mbeanserver.JmxMBeanServer@281e16f
   [junit4]   2> 241202 DEBUG (ScheduledTrigger-252-thread-1) [n:127.0.0.1:41300_solr    ] o.a.s.c.a.NodeLostTrigger Running NodeLostTrigger: .auto_add_replicas with currently live nodes: [127.0.0.1:41300_solr, 127.0.0.1:44916_solr]
   [junit4]   2> 241238 INFO  (jetty-launcher-65-thread-2) [n:127.0.0.1:44916_solr    ] o.a.s.m.r.SolrJmxReporter JMX monitoring for 'solr_44916.solr.jvm' (registry 'solr.jvm') enabled at server: com.sun.jmx.mbeanserver.JmxMBeanServer@281e16f
   [junit4]   2> 241255 INFO  (jetty-launcher-65-thread-2) [n:127.0.0.1:44916_solr    ] o.a.s.m.r.SolrJmxReporter JMX monitoring for 'solr_44916.solr.jetty' (registry 'solr.jetty') enabled at server: com.sun.jmx.mbeanserver.JmxMBeanServer@281e16f
   [junit4]   2> 241257 INFO  (jetty-launcher-65-thread-2) [n:127.0.0.1:44916_solr    ] o.a.s.c.CorePropertiesLocator Found 0 core definitions underneath /home/jenkins/jenkins-slave/workspace/Lucene-Solr-Tests-master/solr/build/solr-core/test/J2/temp/solr.cloud.autoscaling.SystemLogListenerTest_F153CCAE402B6938-001/tempDir-001/node2/.
   [junit4]   2> 241560 INFO  (jetty-launcher-65-thread-3) [n:127.0.0.1:35005_solr    ] o.a.s.c.ZkController Register node as live in ZooKeeper:/live_nodes/127.0.0.1:35005_solr
   [junit4]   2> 241662 INFO  (zkCallback-81-thread-1-processing-n:127.0.0.1:44916_solr) [n:127.0.0.1:44916_solr    ] o.a.s.c.c.ZkStateReader Updated live nodes from ZooKeeper... (2) -> (3)
   [junit4]   2> 241735 INFO  (zkCallback-82-thread-1-processing-n:127.0.0.1:35005_solr) [n:127.0.0.1:35005_solr    ] o.a.s.c.c.ZkStateReader Updated live nodes from ZooKeeper... (2) -> (3)
   [junit4]   2> 241776 INFO  (zkCallback-80-thread-1-processing-n:127.0.0.1:41300_solr) [n:127.0.0.1:41300_solr    ] o.a.s.c.c.ZkStateReader Updated live nodes from ZooKeeper... (2) -> (3)
   [junit4]   2> 242086 INFO  (jetty-launcher-65-thread-3) [n:127.0.0.1:35005_solr    ] o.a.s.m.r.SolrJmxReporter JMX monitoring for 'solr_35005.solr.node' (registry 'solr.node') enabled at server: com.sun.jmx.mbeanserver.JmxMBeanServer@281e16f
   [junit4]   2> 242125 INFO  (jetty-launcher-65-thread-3) [n:127.0.0.1:35005_solr    ] o.a.s.m.r.SolrJmxReporter JMX monitoring for 'solr_35005.solr.jvm' (registry 'solr.jvm') enabled at server: com.sun.jmx.mbeanserver.JmxMBeanServer@281e16f
   [junit4]   2> 242140 INFO  (jetty-launcher-65-thread-3) [n:127.0.0.1:35005_solr    ] o.a.s.m.r.SolrJmxReporter JMX monitoring for 'solr_35005.solr.jetty' (registry 'solr.jetty') enabled at server: com.sun.jmx.mbeanserver.JmxMBeanServer@281e16f
   [junit4]   2> 242141 INFO  (jetty-launcher-65-thread-3) [n:127.0.0.1:35005_solr    ] o.a.s.c.CorePropertiesLocator Found 0 core definitions underneath /home/jenkins/jenkins-slave/workspace/Lucene-Solr-Tests-master/solr/build/solr-core/test/J2/temp/solr.cloud.autoscaling.SystemLogListenerTest_F153CCAE402B6938-001/tempDir-001/node3/.
   [junit4]   2> 242399 DEBUG (ScheduledTrigger-252-thread-2) [n:127.0.0.1:41300_solr    ] o.a.s.c.a.NodeLostTrigger Running NodeLostTrigger: .auto_add_replicas with currently live nodes: [127.0.0.1:35005_solr, 127.0.0.1:41300_solr, 127.0.0.1:44916_solr]
   [junit4]   2> 242441 INFO  (SUITE-SystemLogListenerTest-seed#[F153CCAE402B6938]-worker) [    ] o.a.s.c.c.ZkStateReader Updated live nodes from ZooKeeper... (0) -> (3)
   [junit4]   2> 242441 INFO  (SUITE-SystemLogListenerTest-seed#[F153CCAE402B6938]-worker) [    ] o.a.s.c.s.i.ZkClientClusterStateProvider Cluster at 127.0.0.1:43826/solr ready
   [junit4]   2> 243041 INFO  (qtp1347008770-441) [n:127.0.0.1:35005_solr    ] o.a.s.h.a.CollectionsHandler Invoked Collection Action :create with params replicationFactor=3&name=.system&nrtReplicas=3&action=CREATE&numShards=1&wt=javabin&version=2 and sendToOCPQueue=true
   [junit4]   2> 243135 INFO  (OverseerThreadFactory-254-thread-1-processing-n:127.0.0.1:41300_solr) [n:127.0.0.1:41300_solr    ] o.a.s.c.CreateCollectionCmd Create collection .system
   [junit4]   2> 243263 INFO  (OverseerStateUpdate-98924653499252743-127.0.0.1:41300_solr-n_0000000000) [n:127.0.0.1:41300_solr    ] o.a.s.c.o.SliceMutator createReplica() {
   [junit4]   2>   "operation":"ADDREPLICA",
   [junit4]   2>   "collection":".system",
   [junit4]   2>   "shard":"shard1",
   [junit4]   2>   "core":".system_shard1_replica_n1",
   [junit4]   2>   "state":"down",
   [junit4]   2>   "base_url":"https://127.0.0.1:35005/solr",
   [junit4]   2>   "type":"NRT",
   [junit4]   2>   "waitForFinalState":"false"} 
   [junit4]   2> 243337 INFO  (OverseerStateUpdate-98924653499252743-127.0.0.1:41300_solr-n_0000000000) [n:127.0.0.1:41300_solr    ] o.a.s.c.o.SliceMutator createReplica() {
   [junit4]   2>   "operation":"ADDREPLICA",
   [junit4]   2>   "collection":".system",
   [junit4]   2>   "shard":"shard1",
   [junit4]   2>   "core":".system_shard1_replica_n2",
   [junit4]   2>   "state":"down",
   [junit4]   2>   "base_url":"https://127.0.0.1:44916/solr",
   [junit4]   2>   "type":"NRT",
   [junit4]   2>   "waitForFinalState":"false"} 
   [junit4]   2> 243372 INFO  (OverseerStateUpdate-98924653499252743-127.0.0.1:41300_solr-n_0000000000) [n:127.0.0.1:41300_solr    ] o.a.s.c.o.SliceMutator createReplica() {
   [junit4]   2>   "operation":"ADDREPLICA",
   [junit4]   2>   "collection":".system",
   [junit4]   2>   "shard":"shard1",
   [junit4]   2>   "core":".system_shard1_replica_n4",
   [junit4]   2>   "state":"down",
   [junit4]   2>   "base_url":"https://127.0.0.1:41300/solr",
   [junit4]   2>   "type":"NRT",
   [junit4]   2>   "waitForFinalState":"false"} 
   [junit4]   2> 243407 DEBUG (ScheduledTrigger-252-thread-1) [n:127.0.0.1:41300_solr    ] o.a.s.c.a.NodeLostTrigger Running NodeLostTrigger: .auto_add_replicas with currently live nodes: [127.0.0.1:35005_solr, 127.0.0.1:41300_solr, 127.0.0.1:44916_solr]
   [junit4]   2> 243766 INFO  (qtp1347008770-438) [n:127.0.0.1:35005_solr    ] o.a.s.h.a.CoreAdminOperation core create command qt=/admin/cores&coreNodeName=core_node3&collection.configName=.system&newCollection=true&name=.system_shard1_replica_n1&action=CREATE&numShards=1&collection=.system&shard=shard1&wt=javabin&version=2&replicaType=NRT
   [junit4]   2> 243766 INFO  (qtp1347008770-438) [n:127.0.0.1:35005_solr    ] o.a.s.c.TransientSolrCoreCacheDefault Allocating transient cache for 2147483647 transient cores
   [junit4]   2> 244082 INFO  (zkCallback-82-thread-1-processing-n:127.0.0.1:35005_solr) [n:127.0.0.1:35005_solr    ] o.a.s.c.c.ZkStateReader A cluster state change: [WatchedEvent state:SyncConnected type:NodeDataChanged path:/collections/.system/state.json] for collection [.system] has occurred - updating... (live nodes size: [3])
   [junit4]   2> 244098 INFO  (zkCallback-82-thread-2-processing-n:127.0.0.1:35005_solr) [n:127.0.0.1:35005_solr    ] o.a.s.c.c.ZkStateReader A cluster state change: [WatchedEvent state:SyncConnected type:NodeDataChanged path:/collections/.system/state.json] for collection [.system] has occurred - updating... (live nodes size: [3])
   [junit4]   2> 244137 INFO  (qtp1787769937-432) [n:127.0.0.1:44916_solr    ] o.a.s.h.a.CoreAdminOperation core create command qt=/admin/cores&coreNodeName=core_node5&collection.configName=.system&newCollection=true&name=.system_shard1_replica_n2&action=CREATE&numShards=1&collection=.system&shard=shard1&wt=javabin&version=2&replicaType=NRT
   [junit4]   2> 244137 INFO  (qtp1787769937-432) [n:127.0.0.1:44916_solr    ] o.a.s.c.TransientSolrCoreCacheDefault Allocating transient cache for 2147483647 transient cores
   [junit4]   2> 244228 INFO  (qtp293601186-421) [n:127.0.0.1:41300_solr    ] o.a.s.h.a.CoreAdminOperation core create command qt=/admin/cores&coreNodeName=core_node6&collection.configName=.system&newCollection=true&name=.system_shard1_replica_n4&action=CREATE&numShards=1&collection=.system&shard=shard1&wt=javabin&version=2&replicaType=NRT
   [junit4]   2> 244262 INFO  (qtp293601186-421) [n:127.0.0.1:41300_solr    ] o.a.s.c.TransientSolrCoreCacheDefault Allocating transient cache for 2147483647 transient cores
   [junit4]   2> 244407 DEBUG (ScheduledTrigger-252-thread-1) [n:127.0.0.1:41300_solr    ] o.a.s.c.a.NodeLostTrigger Running NodeLostTrigger: .auto_add_replicas with currently live nodes: [127.0.0.1:35005_solr, 127.0.0.1:41300_solr, 127.0.0.1:44916_solr]
   [junit4]   2> 244408 INFO  (zkCallback-82-thread-2-processing-n:127.0.0.1:35005_solr) [n:127.0.0.1:35005_solr    ] o.a.s.c.c.ZkStateReader A cluster state change: [WatchedEvent state:SyncConnected type:NodeDataChanged path:/collections/.system/state.json] for collection [.system] has occurred - updating... (live nodes size: [3])
   [junit4]   2> 244408 INFO  (zkCallback-81-thread-1-processing-n:127.0.0.1:44916_solr) [n:127.0.0.1:44916_solr    ] o.a.s.c.c.ZkStateReader A cluster state change: [WatchedEvent state:SyncConnected type:NodeDataChanged path:/collections/.system/state.json] for collection [.system] has occurred - updating... (live nodes size: [3])
   [junit4]   2> 244408 INFO  (zkCallback-82-thread-1-processing-n:127.0.0.1:35005_solr) [n:127.0.0.1:35005_solr    ] o.a.s.c.c.ZkStateReader A cluster state change: [WatchedEvent state:SyncConnected type:NodeDataChanged path:/collections/.system/state.json] for collection [.system] has occurred - updating... (live nodes size: [3])
   [junit4]   2> 244408 INFO  (zkCallback-80-thread-1-processing-n:127.0.0.1:41300_solr) [n:127.0.0.1:41300_solr    ] o.a.s.c.c.ZkStateReader A cluster state change: [WatchedEvent state:SyncConnected type:NodeDataChanged path:/collections/.system/state.json] for collection [.system] has occurred - updating... (live nodes size: [3])
   [junit4]   2> 244428 INFO  (zkCallback-81-thread-2-processing-n:127.0.0.1:44916_solr) [n:127.0.0.1:44916_solr    ] o.a.s.c.c.ZkStateReader A cluster state change: [WatchedEvent state:SyncConnected type:NodeDataChanged path:/collections/.system/state.json] for collection [.system] has occurred - updating... (live nodes size: [3])
   [junit4]   2> 244428 INFO  (zkCallback-80-thread-2-processing-n:127.0.0.1:41300_solr) [n:127.0.0.1:41300_solr    ] o.a.s.c.c.ZkStateReader A cluster state change: [WatchedEvent state:SyncConnected type:NodeDataChanged path:/collections/.system/state.json] for collection [.system] has occurred - updating... (live nodes size: [3])
   [junit4]   2> 244933 WARN  (qtp1347008770-438) [n:127.0.0.1:35005_solr c:.system s:shard1 r:core_node3 x:.system_shard1_replica_n1] o.a.s.c.Config You should not use LATEST as luceneMatchVersion property: if you use this setting, and then Solr upgrades to a newer release of Lucene, sizable changes may happen. If precise back compatibility is important then you should instead explicitly specify an actual Lucene version.
   [junit4]   2> 244936 INFO  (qtp1347008770-438) [n:127.0.0.1:35005_solr c:.system s:shard1 r:core_node3 x:.system_shard1_replica_n1] o.a.s.c.SolrConfig Using Lucene MatchVersion: 8.0.0
   [junit4]   2> 245064 INFO  (qtp1347008770-438) [n:127.0.0.1:35005_solr c:.system s:shard1 r:core_node3 x:.system_shard1_replica_n1] o.a.s.s.ManagedIndexSchemaFactory The schema is configured as managed, but managed schema resource managed-schema not found - loading non-managed schema schema.xml instead
   [junit4]   2> 245090 INFO  (qtp1347008770-438) [n:127.0.0.1:35005_solr c:.system s:shard1 r:core_node3 x:.system_shard1_replica_n1] o.a.s.s.IndexSchema [.system_shard1_replica_n1] Schema name=_system collection or core
   [junit4]   2> 245140 INFO  (qtp1347008770-438) [n:127.0.0.1:35005_solr c:.system s:shard1 r:core_node3 x:.system_shard1_replica_n1] o.a.s.s.IndexSchema Loaded schema _system collection or core/1.1 with uniqueid field id
   [junit4]   2> 245179 INFO  (qtp1347008770-438) [n:127.0.0.1:35005_solr c:.system s:shard1 r:core_node3 x:.system_shard1_replica_n1] o.a.s.s.ManagedIndexSchema Created and persisted managed schema znode at /configs/.system/managed-schema
   [junit4]   2> 245271 INFO  (qtp1347008770-438) [n:127.0.0.1:35005_solr c:.system s:shard1 r:core_node3 x:.system_shard1_replica_n1] o.a.s.s.ManagedIndexSchemaFactory After upgrading to managed schema in ZooKeeper, renamed the non-managed schema /configs/.system/schema.xml to /configs/.system/schema.xml.bak
   [junit4]   2> 245271 INFO  (qtp1347008770-438) [n:127.0.0.1:35005_solr c:.system s:shard1 r:core_node3 x:.system_shard1_replica_n1] o.a.s.c.CoreContainer Creating SolrCore '.system_shard1_replica_n1' using configuration from collection .system, trusted=true
   [junit4]   2> 245271 INFO  (qtp1347008770-438) [n:127.0.0.1:35005_solr c:.system s:shard1 r:core_node3 x:.system_shard1_replica_n1] o.a.s.m.r.SolrJmxReporter JMX monitoring for 'solr_35005.solr.core..system.shard1.replica_n1' (registry 'solr.core..system.shard1.replica_n1') enabled at server: com.sun.jmx.mbeanserver.JmxMBeanServer@281e16f
   [junit4]   2> 245271 INFO  (qtp1347008770-438) [n:127.0.0.1:35005_solr c:.system s:shard1 r:core_node3 x:.system_shard1_replica_n1] o.a.s.c.SolrCore solr.RecoveryStrategy.Builder
   [junit4]   2> 245271 INFO  (qtp1347008770-438) [n:127.0.0.1:35005_solr c:.system s:shard1 r:core_node3 x:.system_shard1_replica_n1] o.a.s.c.SolrCore [[.system_shard1_replica_n1] ] Opening new SolrCore at [/home/jenkins/jenkins-slave/workspace/Lucene-Solr-Tests-master/solr/build/solr-core/test/J2/temp/solr.cloud.autoscaling.SystemLogListenerTest_F153CCAE402B6938-001/tempDir-001/node3/.system_shard1_replica_n1], dataDir=[/home/jenkins/jenkins-slave/workspace/Lucene-Solr-Tests-master/solr/build/solr-core/test/J2/temp/solr.cloud.autoscaling.SystemLogListenerTest_F153CCAE402B6938-001/tempDir-001/node3/./.system_shard1_replica_n1/data/]
   [junit4]   2> 245393 INFO  (qtp1787769937-432) [n:127.0.0.1:44916_solr c:.system s:shard1 r:core_node5 x:.system_shard1_replica_n2] o.a.s.c.SolrConfig Using Lucene MatchVersion: 8.0.0
   [junit4]   2> 245432 DEBUG (ScheduledTrigger-252-thread-1) [n:127.0.0.1:41300_solr    ] o.a.s.c.a.NodeLostTrigger Running NodeLostTrigger: .auto_add_replicas with currently live nodes: [127.0.0.1:35005_solr, 127.0.0.1:41300_solr, 127.0.0.1:44916_solr]
   [junit4]   2> 245484 INFO  (qtp1787769937-432) [n:127.0.0.1:44916_solr c:.system s:shard1 r:core_node5 x:.system_shard1_replica_n2] o.a.s.s.IndexSchema [.system_shard1_replica_n2] Schema name=_system collection or core
   [junit4]   2> 245520 INFO  (qtp293601186-421) [n:127.0.0.1:41300_solr c:.system s:shard1 r:core_node6 x:.system_shard1_replica_n4] o.a.s.c.SolrConfig Using Lucene MatchVersion: 8.0.0
   [junit4]   2> 245557 INFO  (qtp1787769937-432) [n:127.0.0.1:44916_solr c:.system s:shard1 r:core_node5 x:.system_shard1_replica_n2] o.a.s.s.IndexSchema Loaded schema _system collection or core/1.1 with uniqueid field id
   [junit4]   2> 245557 INFO  (qtp1787769937-432) [n:127.0.0.1:44916_solr c:.system s:shard1 r:core_node5 x:.system_shard1_replica_n2] o.a.s.c.CoreContainer Creating SolrCore '.system_shard1_replica_n2' using configuration from collection .system, trusted=true
   [junit4]   2> 245591 INFO  (qtp1787769937-432) [n:127.0.0.1:44916_solr c:.system s:shard1 r:core_node5 x:.system_shard1_replica_n2] o.a.s.m.r.SolrJmxReporter JMX monitoring for 'solr_44916.solr.core..system.shard1.replica_n2' (registry 'solr.core..system.shard1.replica_n2') enabled at server: com.sun.jmx.mbeanserver.JmxMBeanServer@281e16f
   [junit4]   2> 245591 INFO  (qtp1787769937-432) [n:127.0.0.1:44916_solr c:.system s:shard1 r:core_node5 x:.system_shard1_replica_n2] o.a.s.c.SolrCore solr.RecoveryStrategy.Builder
   [junit4]   2> 245592 INFO  (qtp1787769937-432) [n:127.0.0.1:44916_solr c:.system s:shard1 r:core_node5 x:.system_shard1_replica_n2] o.a.s.c.SolrCore [[.system_shard1_replica_n2] ] Opening new SolrCore at [/home/jenkins/jenkins-slave/workspace/Lucene-Solr-Tests-master/solr/build/solr-core/test/J2/temp/solr.cloud.autoscaling.SystemLogListenerTest_F153CCAE402B6938-001/tempDir-001/node2/.system_shard1_replica_n2], dataDir=[/home/jenkins/jenkins-slave/workspace/Lucene-Solr-Tests-master/solr/build/solr-core/test/J2/temp/solr.cloud.autoscaling.SystemLogListenerTest_F153CCAE402B6938-001/tempDir-001/node2/./.system_shard1_replica_n2/data/]
   [junit4]   2> 245710 INFO  (qtp293601186-421) [n:127.0.0.1:41300_solr c:.system s:shard1 r:core_node6 x:.system_shard1_replica_n4] o.a.s.s.IndexSchema [.system_shard1_replica_n4] Schema name=_system collection or core
   [junit4]   2> 245768 INFO  (qtp293601186-421) [n:127.0.0.1:41300_solr c:.system s:shard1 r:core_node6 x:.system_shard1_replica_n4] o.a.s.s.IndexSchema Loaded schema _system collection or core/1.1 with uniqueid field id
   [junit4]   2> 245768 INFO  (qtp293601186-421) [n:127.0.0.1:41300_solr c:.system s:shard1 r:core_node6 x:.system_shard1_replica_n4] o.a.s.c.CoreContainer Creating SolrCore '.system_shard1_replica_n4' using configuration from collection .system, trusted=true
   [junit4]   2> 245768 INFO  (qtp293601186-421) [n:127.0.0.1:41300_solr c:.system s:shard1 r:core_node6 x:.system_shard1_replica_n4] o.a.s.m.r.SolrJmxReporter JMX monitoring for 'solr_41300.solr.core..system.shard1.replica_n4' (registry 'solr.core..system.shard1.replica_n4') enabled at server: com.sun.jmx.mbeanserver.JmxMBeanServer@281e16f
   [junit4]   2> 245768 INFO  (qtp293601186-421) [n:127.0.0.1:41300_solr c:.system s:shard1 r:core_node6 x:.system_shard1_replica_n4] o.a.s.c.SolrCore solr.RecoveryStrategy.Builder
   [junit4]   2> 245768 INFO  (qtp293601186-421) [n:127.0.0.1:41300_solr c:.system s:shard1 r:core_node6 x:.system_shard1_replica_n4] o.a.s.c.SolrCore [[.system_shard1_replica_n4] ] Opening new SolrCore at [/home/jenkins/jenkins-slave/workspace/Lucene-Solr-Tests-master/solr/build/solr-core/test/J2/temp/solr.cloud.autoscaling.SystemLogListenerTest_F153CCAE402B6938-001/tempDir-001/node1/.system_shard1_replica_n4], dataDir=[/home/jenkins/jenkins-slave/workspace/Lucene-Solr-Tests-master/solr/build/solr-core/test/J2/temp/solr.cloud.autoscaling.SystemLogListenerTest_F153CCAE402B6938-001/tempDir-001/node1/./.system_shard1_replica_n4/data/]
   [junit4]   2> 245990 INFO  (qtp1347008770-438) [n:127.0.0.1:35005_solr c:.system s:shard1 r:core_node3 x:.system_shard1_replica_n1] o.a.s.u.UpdateHandler Using UpdateLog implementation: org.apache.solr.update.UpdateLog
   [junit4]   2> 245990 INFO  (qtp1347008770-438) [n:127.0.0.1:35005_solr c:.system s:shard1 r:core_node3 x:.system_shard1_replica_n1] o.a.s.u.UpdateLog Initializing UpdateLog: dataDir= defaultSyncLevel=FLUSH numRecordsToKeep=100 maxNumLogsToKeep=10 numVersionBuckets=65536
   [junit4]   2> 245991 INFO  (qtp1347008770-438) [n:127.0.0.1:35005_solr c:.system s:shard1 r:core_node3 x:.system_shard1_replica_n1] o.a.s.u.CommitTracker Hard AutoCommit: if 1 uncommited docs 
   [junit4]   2> 245991 INFO  (qtp1347008770-438) [n:127.0.0.1:35005_solr c:.system s:shard1 r:core_node3 x:.system_shard1_replica_n1] o.a.s.u.CommitTracker Soft AutoCommit: disabled
   [junit4]   2> 246091 INFO  (qtp1347008770-438) [n:127.0.0.1:35005_solr c:.system s:shard1 r:core_node3 x:.system_shard1_replica_n1] o.a.s.s.SolrIndexSearcher Opening [Searcher@3e708e3b[.system_shard1_replica_n1] main]
   [junit4]   2> 246092 INFO  (qtp1347008770-438) [n:127.0.0.1:35005_solr c:.system s:shard1 r:core_node3 x:.system_shard1_replica_n1] o.a.s.r.ManagedResourceStorage Configured ZooKeeperStorageIO with znodeBase: /configs/.system
   [junit4]   2> 246093 INFO  (qtp1347008770-438) [n:127.0.0.1:35005_solr c:.system s:shard1 r:core_node3 x:.system_shard1_replica_n1] o.a.s.r.ManagedResourceStorage Loaded null at path _rest_managed.json using ZooKeeperStorageIO:path=/configs/.system
   [junit4]   2> 246109 INFO  (qtp1347008770-438) [n:127.0.0.1:35005_solr c:.system s:shard1 r:core_node3 x:.system_shard1_replica_n1] o.a.s.s.ZkIndexSchemaReader Creating ZooKeeper watch for the managed schema at /configs/.system/managed-schema
   [junit4]   2> 246254 INFO  (qtp1347008770-438) [n:127.0.0.1:35005_solr c:.system s:shard1 r:core_node3 x:.system_shard1_replica_n1] o.a.s.s.ZkIndexSchemaReader Current schema version 0 is already the latest
   [junit4]   2> 246255 INFO  (qtp1347008770-438) [n:127.0.0.1:35005_solr c:.system s:shard1 r:core_node3 x:.system_shard1_replica_n1] o.a.s.h.ReplicationHandler Commits will be reserved for 10000ms.
   [junit4]   2> 246255 INFO  (qtp1347008770-438) [n:127.0.0.1:35005_solr c:.system s:shard1 r:core_node3 x:.system_shard1_replica_n1] o.a.s.u.UpdateLog Could not find max version in index or recent updates, using new clock 1582794465414742016
   [junit4]   2> 246273 INFO  (qtp1347008770-438) [n:127.0.0.1:35005_solr c:.system s:shard1 r:core_node3 x:.system_shard1_replica_n1] o.a.s.c.ShardLeaderElectionContext Waiting until we see more replicas up for shard shard1: total=3 found=1 timeoutin=9999ms
   [junit4]   2> 246287 INFO  (qtp1787769937-432) [n:127.0.0.1:44916_solr c:.system s:shard1 r:core_node5 x:.system_shard1_replica_n2] o.a.s.u.UpdateHandler Using UpdateLog implementation: org.apache.solr.update.UpdateLog
   [junit4]   2> 246287 INFO  (qtp1787769937-432) [n:127.0.0.1:44916_solr c:.system s:shard1 r:core_node5 x:.system_shard1_replica_n2] o.a.s.u.UpdateLog Initializing UpdateLog: dataDir= defaultSyncLevel=FLUSH numRecordsToKeep=100 maxNumLogsToKeep=10 numVersionBuckets=65536
   [junit4]   2> 246288 INFO  (qtp1787769937-432) [n:127.0.0.1:44916_solr c:.system s:shard1 r:core_node5 x:.system_shard1_replica_n2] o.a.s.u.CommitTracker Hard AutoCommit: if 1 uncommited docs 
   [junit4]   2> 246288 INFO  (qtp1787769937-432) [n:127.0.0.1:44916_solr c:.system s:shard1 r:core_node5 x:.system_shard1_replica_n2] o.a.s.u.CommitTracker Soft AutoCommit: disabled
   [junit4]   2> 246289 INFO  (qtp1787769937-432) [n:127.0.0.1:44916_solr c:.system s:shard1 r:core_node5 x:.system_shard1_replica_n2] o.a.s.s.SolrIndexSearcher Opening [Searcher@299e78db[.system_shard1_replica_n2] main]
   [junit4]   2> 246309 INFO  (qtp1787769937-432) [n:127.0.0.1:44916_solr c:.system s:shard1 r:core_node5 x:.system_shard1_replica_n2] o.a.s.r.ManagedResourceStorage Configured ZooKeeperStorageIO with znodeBase: /configs/.system
   [junit4]   2> 246309 INFO  (qtp1787769937-432) [n:127.0.0.1:44916_solr c:.system s:shard1 r:core_node5 x:.system_shard1_replica_n2] o.a.s.r.ManagedResourceStorage Loaded null at path _rest_managed.json using ZooKeeperStorageIO:path=/configs/.system
   [junit4]   2> 246309 INFO  (qtp1787769937-432) [n:127.0.0.1:44916_solr c:.system s:shard1 r:core_node5 x:.system_shard1_replica_n2] o.a.s.s.ZkIndexSchemaReader Creating ZooKeeper watch for the managed schema at /configs/.system/managed-schema
   [junit4]   2> 246320 INFO  (searcherExecutor-261-thread-1-processing-n:127.0.0.1:35005_solr x:.system_shard1_replica_n1 s:shard1 c:.system r:core_node3) [n:127.0.0.1:35005_solr c:.system s:shard1 r:core_node3 x:.system_shard1_replica_n1] o.a.s.c.SolrCore [.system_shard1_replica_n1] Registered new searcher Searcher@3e708e3b[.system_shard1_replica_n1] main{ExitableDirectoryReader(UninvertingDirectoryReader())}
   [junit4]   2> 246344 INFO  (qtp1787769937-432) [n:127.0.0.1:44916_solr c:.system s:shard1 r:core_node5 x:.system_shard1_replica_n2] o.a.s.s.ZkIndexSchemaReader Current schema version 0 is already the latest
   [junit4]   2> 246345 INFO  (qtp1787769937-432) [n:127.0.0.1:44916_solr c:.system s:shard1 r:core_node5 x:.system_shard1_replica_n2] o.a.s.h.ReplicationHandler Commits will be reserved for 10000ms.
   [junit4]   2> 246345 INFO  (qtp1787769937-432) [n:127.0.0.1:44916_solr c:.system s:shard1 r:core_node5 x:.system_shard1_replica_n2] o.a.s.u.UpdateLog Could not find max version in index or r

[...truncated too long message...]

t java.util.concurrent.locks.LockSupport.parkNanos(LockSupport.java:215)
   [junit4]    >         at java.util.concurrent.SynchronousQueue$TransferStack.awaitFulfill(SynchronousQueue.java:460)
   [junit4]    >         at java.util.concurrent.SynchronousQueue$TransferStack.transfer(SynchronousQueue.java:362)
   [junit4]    >         at java.util.concurrent.SynchronousQueue.poll(SynchronousQueue.java:941)
   [junit4]    >         at java.util.concurrent.ThreadPoolExecutor.getTask(ThreadPoolExecutor.java:1073)
   [junit4]    >         at java.util.concurrent.ThreadPoolExecutor.runWorker(ThreadPoolExecutor.java:1134)
   [junit4]    >         at java.util.concurrent.ThreadPoolExecutor$Worker.run(ThreadPoolExecutor.java:624)
   [junit4]    >         at java.lang.Thread.run(Thread.java:748)
   [junit4]    >    6) Thread[id=773, name=zkCallback-176-thread-4-EventThread, state=WAITING, group=TGRP-GraphTest]
   [junit4]    >         at sun.misc.Unsafe.park(Native Method)
   [junit4]    >         at java.util.concurrent.locks.LockSupport.park(LockSupport.java:175)
   [junit4]    >         at java.util.concurrent.locks.AbstractQueuedSynchronizer$ConditionObject.await(AbstractQueuedSynchronizer.java:2039)
   [junit4]    >         at java.util.concurrent.LinkedBlockingQueue.take(LinkedBlockingQueue.java:442)
   [junit4]    >         at org.apache.zookeeper.ClientCnxn$EventThread.run(ClientCnxn.java:501)
   [junit4]    >    7) Thread[id=716, name=Connection evictor, state=TIMED_WAITING, group=TGRP-GraphTest]
   [junit4]    >         at java.lang.Thread.sleep(Native Method)
   [junit4]    >         at org.apache.http.impl.client.IdleConnectionEvictor$1.run(IdleConnectionEvictor.java:66)
   [junit4]    >         at java.lang.Thread.run(Thread.java:748)
   [junit4]    >    8) Thread[id=770, name=zkCallback-176-thread-4, state=TIMED_WAITING, group=TGRP-GraphTest]
   [junit4]    >         at sun.misc.Unsafe.park(Native Method)
   [junit4]    >         at java.util.concurrent.locks.LockSupport.parkNanos(LockSupport.java:215)
   [junit4]    >         at java.util.concurrent.SynchronousQueue$TransferStack.awaitFulfill(SynchronousQueue.java:460)
   [junit4]    >         at java.util.concurrent.SynchronousQueue$TransferStack.transfer(SynchronousQueue.java:362)
   [junit4]    >         at java.util.concurrent.SynchronousQueue.poll(SynchronousQueue.java:941)
   [junit4]    >         at java.util.concurrent.ThreadPoolExecutor.getTask(ThreadPoolExecutor.java:1073)
   [junit4]    >         at java.util.concurrent.ThreadPoolExecutor.runWorker(ThreadPoolExecutor.java:1134)
   [junit4]    >         at java.util.concurrent.ThreadPoolExecutor$Worker.run(ThreadPoolExecutor.java:624)
   [junit4]    >         at java.lang.Thread.run(Thread.java:748)
   [junit4]    >    9) Thread[id=771, name=zkCallback-176-thread-5, state=TIMED_WAITING, group=TGRP-GraphTest]
   [junit4]    >         at sun.misc.Unsafe.park(Native Method)
   [junit4]    >         at java.util.concurrent.locks.LockSupport.parkNanos(LockSupport.java:215)
   [junit4]    >         at java.util.concurrent.SynchronousQueue$TransferStack.awaitFulfill(SynchronousQueue.java:460)
   [junit4]    >         at java.util.concurrent.SynchronousQueue$TransferStack.transfer(SynchronousQueue.java:362)
   [junit4]    >         at java.util.concurrent.SynchronousQueue.poll(SynchronousQueue.java:941)
   [junit4]    >         at java.util.concurrent.ThreadPoolExecutor.getTask(ThreadPoolExecutor.java:1073)
   [junit4]    >         at java.util.concurrent.ThreadPoolExecutor.runWorker(ThreadPoolExecutor.java:1134)
   [junit4]    >         at java.util.concurrent.ThreadPoolExecutor$Worker.run(ThreadPoolExecutor.java:624)
   [junit4]    >         at java.lang.Thread.run(Thread.java:748)
   [junit4]    >   10) Thread[id=717, name=Connection evictor, state=TIMED_WAITING, group=TGRP-GraphTest]
   [junit4]    >         at java.lang.Thread.sleep(Native Method)
   [junit4]    >         at org.apache.http.impl.client.IdleConnectionEvictor$1.run(IdleConnectionEvictor.java:66)
   [junit4]    >         at java.lang.Thread.run(Thread.java:748)
   [junit4]    > 	at __randomizedtesting.SeedInfo.seed([28C0D907BFBB07FE]:0)Throwable #2: com.carrotsearch.randomizedtesting.ThreadLeakError: There are still zombie threads that couldn't be terminated:
   [junit4]    >    1) Thread[id=772, name=zkCallback-176-thread-4-SendThread(127.0.0.1:42213), state=TIMED_WAITING, group=TGRP-GraphTest]
   [junit4]    >         at java.lang.Thread.sleep(Native Method)
   [junit4]    >         at org.apache.zookeeper.client.StaticHostProvider.next(StaticHostProvider.java:101)
   [junit4]    >         at org.apache.zookeeper.ClientCnxn$SendThread.startConnect(ClientCnxn.java:997)
   [junit4]    >         at org.apache.zookeeper.ClientCnxn$SendThread.run(ClientCnxn.java:1060)
   [junit4]    >    2) Thread[id=764, name=zkCallback-176-thread-2, state=TIMED_WAITING, group=TGRP-GraphTest]
   [junit4]    >         at sun.misc.Unsafe.park(Native Method)
   [junit4]    >         at java.util.concurrent.locks.LockSupport.parkNanos(LockSupport.java:215)
   [junit4]    >         at java.util.concurrent.SynchronousQueue$TransferStack.awaitFulfill(SynchronousQueue.java:460)
   [junit4]    >         at java.util.concurrent.SynchronousQueue$TransferStack.transfer(SynchronousQueue.java:362)
   [junit4]    >         at java.util.concurrent.SynchronousQueue.poll(SynchronousQueue.java:941)
   [junit4]    >         at java.util.concurrent.ThreadPoolExecutor.getTask(ThreadPoolExecutor.java:1073)
   [junit4]    >         at java.util.concurrent.ThreadPoolExecutor.runWorker(ThreadPoolExecutor.java:1134)
   [junit4]    >         at java.util.concurrent.ThreadPoolExecutor$Worker.run(ThreadPoolExecutor.java:624)
   [junit4]    >         at java.lang.Thread.run(Thread.java:748)
   [junit4]    >    3) Thread[id=713, name=zkCallback-176-thread-1, state=TIMED_WAITING, group=TGRP-GraphTest]
   [junit4]    >         at sun.misc.Unsafe.park(Native Method)
   [junit4]    >         at java.util.concurrent.locks.LockSupport.parkNanos(LockSupport.java:215)
   [junit4]    >         at java.util.concurrent.SynchronousQueue$TransferStack.awaitFulfill(SynchronousQueue.java:460)
   [junit4]    >         at java.util.concurrent.SynchronousQueue$TransferStack.transfer(SynchronousQueue.java:362)
   [junit4]    >         at java.util.concurrent.SynchronousQueue.poll(SynchronousQueue.java:941)
   [junit4]    >         at java.util.concurrent.ThreadPoolExecutor.getTask(ThreadPoolExecutor.java:1073)
   [junit4]    >         at java.util.concurrent.ThreadPoolExecutor.runWorker(ThreadPoolExecutor.java:1134)
   [junit4]    >         at java.util.concurrent.ThreadPoolExecutor$Worker.run(ThreadPoolExecutor.java:624)
   [junit4]    >         at java.lang.Thread.run(Thread.java:748)
   [junit4]    >    4) Thread[id=765, name=zkCallback-176-thread-3, state=TIMED_WAITING, group=TGRP-GraphTest]
   [junit4]    >         at sun.misc.Unsafe.park(Native Method)
   [junit4]    >         at java.util.concurrent.locks.LockSupport.parkNanos(LockSupport.java:215)
   [junit4]    >         at java.util.concurrent.SynchronousQueue$TransferStack.awaitFulfill(SynchronousQueue.java:460)
   [junit4]    >         at java.util.concurrent.SynchronousQueue$TransferStack.transfer(SynchronousQueue.java:362)
   [junit4]    >         at java.util.concurrent.SynchronousQueue.poll(SynchronousQueue.java:941)
   [junit4]    >         at java.util.concurrent.ThreadPoolExecutor.getTask(ThreadPoolExecutor.java:1073)
   [junit4]    >         at java.util.concurrent.ThreadPoolExecutor.runWorker(ThreadPoolExecutor.java:1134)
   [junit4]    >         at java.util.concurrent.ThreadPoolExecutor$Worker.run(ThreadPoolExecutor.java:624)
   [junit4]    >         at java.lang.Thread.run(Thread.java:748)
   [junit4]    >    5) Thread[id=770, name=zkCallback-176-thread-4, state=TIMED_WAITING, group=TGRP-GraphTest]
   [junit4]    >         at sun.misc.Unsafe.park(Native Method)
   [junit4]    >         at java.util.concurrent.locks.LockSupport.parkNanos(LockSupport.java:215)
   [junit4]    >         at java.util.concurrent.SynchronousQueue$TransferStack.awaitFulfill(SynchronousQueue.java:460)
   [junit4]    >         at java.util.concurrent.SynchronousQueue$TransferStack.transfer(SynchronousQueue.java:362)
   [junit4]    >         at java.util.concurrent.SynchronousQueue.poll(SynchronousQueue.java:941)
   [junit4]    >         at java.util.concurrent.ThreadPoolExecutor.getTask(ThreadPoolExecutor.java:1073)
   [junit4]    >         at java.util.concurrent.ThreadPoolExecutor.runWorker(ThreadPoolExecutor.java:1134)
   [junit4]    >         at java.util.concurrent.ThreadPoolExecutor$Worker.run(ThreadPoolExecutor.java:624)
   [junit4]    >         at java.lang.Thread.run(Thread.java:748)
   [junit4]    >    6) Thread[id=771, name=zkCallback-176-thread-5, state=TIMED_WAITING, group=TGRP-GraphTest]
   [junit4]    >         at sun.misc.Unsafe.park(Native Method)
   [junit4]    >         at java.util.concurrent.locks.LockSupport.parkNanos(LockSupport.java:215)
   [junit4]    >         at java.util.concurrent.SynchronousQueue$TransferStack.awaitFulfill(SynchronousQueue.java:460)
   [junit4]    >         at java.util.concurrent.SynchronousQueue$TransferStack.transfer(SynchronousQueue.java:362)
   [junit4]    >         at java.util.concurrent.SynchronousQueue.poll(SynchronousQueue.java:941)
   [junit4]    >         at java.util.concurrent.ThreadPoolExecutor.getTask(ThreadPoolExecutor.java:1073)
   [junit4]    >         at java.util.concurrent.ThreadPoolExecutor.runWorker(ThreadPoolExecutor.java:1134)
   [junit4]    >         at java.util.concurrent.ThreadPoolExecutor$Worker.run(ThreadPoolExecutor.java:624)
   [junit4]    >         at java.lang.Thread.run(Thread.java:748)
   [junit4]    > 	at __randomizedtesting.SeedInfo.seed([28C0D907BFBB07FE]:0)
   [junit4] Completed [44/146 (2!)] on J1 in 63.44s, 1 test, 3 errors <<< FAILURES!

[...truncated 46572 lines...]

Mime
View raw message